##TITLE=31Pdec_3MBDE-4
 CDCl3, 124 sc
 22.11.2022
##JCAMPDX= 6.0         $$ Bruker NMR JCAMP-DX V2.0
##DATA TYPE= NMR SPECTRUM
##DATA CLASS= NTUPLES
##ORIGIN= UXNMR, Bruker Analytische Messtechnik GmbH
##OWNER= root
$$ XWIN-NMR		Version 3.5
$$ Tue Nov 22 15:33:43 2022 Russian Standard Time (UT+4h)  she@DPX200
##.OBSERVE FREQUENCY= 81.013821
##.OBSERVE NUCLEUS= ^31P
##.ACQUISITION MODE= SIMULTANEOUS
##.ACQUISITION SCHEME= undefined
##.AVERAGES= 124
##.DIGITISER RES= 16
##SPECTROMETER/DATA SYSTEM= spect
##.PULSE SEQUENCE= zgpg30
##.SOLVENT NAME= CDCl3
##.SHIFT REFERENCE= (INTERNAL, CDCl3, 0, 248.564)
##AUDIT TRAIL= $$ (NUMBER, WHEN, WHO, WHERE, WHAT)
$$ ##TITLE= Audit trail, XWIN-NMR		Version 3.5
$$ ##JCAMPDX= 5.01
$$ ##ORIGIN= Bruker BioSpin GmbH
$$ ##OWNER= she
$$ F:/spectra/data/she/nmr/P31/1/pdata/1/auditp.txt
$$ ##AUDIT TRAIL=  $$ (NUMBER, WHEN, WHO, WHERE, WHAT)
(   1,<2022-11-22 15:31:26.53 +0400>,<she>,<DPX200>,
      <continue with go, POWCHK disabled, PULCHK disabled
       configuration hash MD5:
       00 E9 B6 7A A2 85 ED C7 34 08 36 98 17 FE 4E 26
       data hash MD5: 32K
       B4 63 0B D3 F5 86 48 19 CF 76 37 26 3D 4A 47 FD>)
(   2,<2022-11-22 15:32:51.60 +0400>,<she>,<DPX200>,
      <Start of raw data processing
       efp BC_mod = 2 LB = 1 FT_mod = 6 PKNL = 1 PHC0 = -10300.7 PHC1 = 219.0561 SI = 64K 
       data hash MD5: 64K
       16 D2 C3 44 0E B7 D0 B7 33 6C D1 5E 51 D2 56 DE>)
(   3,<2022-11-22 15:33:12.73 +0400>,<she>,<DPX200>,
      <pk PHC0 = -22.38214 PHC1 = -6.999999 
       data hash MD5: 64K
       24 3D 43 B9 0E 72 A0 40 5D D0 8D 6A 7B B5 26 96>)
$$ ##END=
$$ 
$$ hash MD5
$$ 74 2D D2 93 44 CE 15 74 E4 18 2E 0A 48 AF 1B 15
##$RELAX= 
##$RELAX= 
##$RELAX= 
##$RELAX= 
##$RELAX= 
##$RELAX= 
##$RELAX= 
##$RELAX= 
##$RELAX= 
$$ Bruker specific parameters
$$ --------------------------
##$DU= <F:/spectra>
##$EXPNO= 1
##$NAME= <P31>
##$PROCNO= 1
##$TYPE= <nmr>
##$USER= <she>
##$AMP= (0..31)
100 100 100 100 100 100 100 100 100 100 100 100 100 100 100 100 100 100 
100 100 100 100 100 100 100 100 100 100 100 100 100 100 
##$AQSEQ= 0
##$AQ_mod= 1
##$AUNM= <au_zg>
##$AUTOPOS= <>
##$BF1= 81.014009
##$BF2= 200.13
##$BF3= 200.13
##$BF4= 200.13
##$BF5= 200.13
##$BF6= 200.13
##$BF7= 200.13
##$BF8= 200.13
##$BYTORDA= 1
##$CFDGTYP= 0
##$CFRGTYP= 5
##$CHEMSTR= <none>
##$CNST= (0..31)
1 1 145 1 1 1 1 1 1 1 1 1 1 1 1 1 1 1 1 1 1 1 1 1 1 1 1 1 1 1 1 1 
##$CPDPRG= <waltz16>
##$CPDPRG1= <>
##$CPDPRG2= <waltz16>
##$CPDPRG3= <>
##$CPDPRG4= <mlev>
##$CPDPRG5= <mlev>
##$CPDPRG6= <mlev>
##$CPDPRG7= <mlev>
##$CPDPRG8= <mlev>
##$CPDPRGB= <>
##$CPDPRGT= <>
##$D= (0..31)
0 1 0 0 0 0 0 0 0 0 0 0.03 2e-05 3e-06 0 0 0 0 0 0 0 0 0 0 0 0 0 0 0 0 
0 0 
##$DATE= 1669116520
##$DBL= (0..7)
120 120 120 11 120 120 24 19 
##$DBP= (0..7)
150 150 150 150 150 150 150 150 
##$DBP07= 0
##$DBPNAM0= <>
##$DBPNAM1= <>
##$DBPNAM2= <>
##$DBPNAM3= <>
##$DBPNAM4= <>
##$DBPNAM5= <>
##$DBPNAM6= <>
##$DBPNAM7= <>
##$DBPOAL= (0..7)
0.5 0.5 0.5 0.5 0.5 0.5 0.5 0.5 
$$ [...]
##$SUBNAM2= <"">
##$SUBNAM3= <"">
##$SUBNAM4= <"">
##$SUBNAM5= <"">
##$SUBNAM6= <"">
##$SUBNAM7= <"">
##$SUBNAM8= <"">
##$SUBNAM9= <"">
##$SW= 501.771253377433
##$SWIBOX= (0..15)
0 1 3 0 0 0 0 0 0 0 0 0 0 0 0 0 
##$SW_h= 40650.406504065
##$TD= 32768
##$TD0= 1
##$TE= 0
##$TE2= 300
##$TE3= 300
##$TEG= 300
##$TL= (0..7)
0 120 53 12 22 120 120 120 
##$TP= (0..7)
150 150 150 150 150 150 150 150 
##$TP07= 0
##$TPNAME0= <>
##$TPNAME1= <>
##$TPNAME2= <>
##$TPNAME3= <>
##$TPNAME4= <>
##$TPNAME5= <>
##$TPNAME6= <>
##$TPNAME7= <>
##$TPOAL= (0..7)
0.5 0.5 0.5 0.5 0.5 0.5 0.5 0.5 
##$TPOFFS= (0..7)
0 0 0 0 0 0 0 0 
##$TUNHIN= 0
##$TUNHOUT= 0
##$TUNXOUT= 0
##$USERA1= <user>
##$USERA2= <user>
##$USERA3= <user>
##$USERA4= <user>
##$USERA5= <user>
##$V9= 5
##$VALIST= <valist>
##$VCLIST= <CCCCCCCCCCCCCCC>
##$VD= 0
##$VDLIST= <DDDDDDDDDDDDDDD>
##$VPLIST= <PPPPPPPPPPPPPPP>
##$VTLIST= <TTTTTTTTTTTTTTT>
##$WBST= 1024
##$WBSW= 4
##$XGAIN= (0..3)
0 0 0 0 
##$XL= 0
##$YL= 0
##$YMAX_a= 2816
##$YMIN_a= -6313
##$ZGOPTNS= <>
##$ZL1= 120
##$ZL2= 120
##$ZL3= 120
##$ZL4= 120
##$ABSF1= 0
##$ABSF2= 0
##$ABSG= 0
##$ABSL= 0
##$ALPHA= 0
##$AQORDER= 0
##$ASSFAC= 0
##$ASSFACI= 0
##$ASSFACX= 0
##$ASSWID= 0
##$AUNMP= <proc_1d>
##$AZFE= 0.1
##$AZFW= 0.5
##$BCFW= 0
##$BC_mod= 2
##$BYTORDP= 0
##$COROFFS= 0
##$CY= -3
##$DATMOD= 1
##$DC= 0
##$DFILT= <>
##$DTYPP= 0
##$F1P= 0
##$F2P= 0
##$FCOR= 1
##$FTSIZE= 65536
##$FT_mod= 6
##$GAMMA= 0
##$GB= 0
##$INTBC= 1
##$INTSCL= 6.047779e-11
##$ISEN= 30
##$LB= 1
##$LEV0= 0
##$LPBIN= 0
##$MAXI= 10000
##$MC2= 0
##$MEAN= 0
##$ME_mod= 0
##$MI= 50
##$NCOEF= 0
##$NC_proc= -8
##$NLEV= 6
##$NOISF1= 182.463
##$NOISF2= 159.3651
##$NSP= 0
##$NTH_PI= 0
##$NZP= 0
##$OFFSET= 248.5645
##$PC= 4
##$PHC0= -10323.08
##$PHC1= 212.0561
##$PH_mod= 1
##$PKNL= yes
##$PPARMOD= 0
##$PSCAL= 0
##$PSIGN= 0
##$REVERSE= no
##$SF= 81.0140089999694
##$SI= 65536
##$SIGF1= 159.3651
##$SIGF2= -187.1042
##$SINO= 113.3802
##$SIOLD= 16384
##$SREGLST= <1H.CDCl3>
##$SSB= 0
##$STSI= 65536
##$STSR= 0
##$SW_p= 40650.406504065
##$SYMM= 0
##$S_DEV= 0
##$TDeff= 32768
##$TDoff= 0
##$TI= <>
##$TILT= no
##$TM1= 0
##$TM2= 0
##$TOPLEV= 0
##$USERP1= <user>
##$USERP2= <user>
##$USERP3= <user>
##$USERP4= <user>
##$USERP5= <user>
##$WDW= 1
##$XDIM= 65536
##$YMAX_p= 478618381
##$YMIN_p= -342335314
$$ End of Bruker specific parameters
$$ ---------------------------------
##NTUPLES= NMR SPECTRUM
##VAR_NAME=  FREQUENCY,     SPECTRUM/REAL,   SPECTRUM/IMAG
##SYMBOL=    X,             R,               I
##VAR_TYPE=  INDEPENDENT,   DEPENDENT,       DEPENDENT
##VAR_FORM=  AFFN,          ASDF,            ASDF
##VAR_DIM=   65536,         65536,           65536
##UNITS=     HZ,            ARBITRARY UNITS, ARBITRARY UNITS
##FACTOR=    0.620285442955139, 1,           1
##FIRST=     20137.2065510682, 0,            0
##LAST=      -20513.1999529968, 0,           0
##MIN=       -20513.1999529968, -342335314,  0
##MAX=       20137.2065510682, 478618381,    0
$$ Real data points
##PAGE= N=1
##DATA TABLE= (X++(R..R)), XYDATA
$$ [...]
12315E50654j963080j335193n17669K152013N282165M668238P51551j150330j5426
12306H422923j594489q187844j1999799m533717J0412226J9316159J4382979J504146
12298B7722584q244988j0281701o976430j227871M547373N548225j327231r683234
12290G6727q034889M315949J3290064P810229n017624j0409222o021633j245020
12282e235419Q3898L419424R320124Q726107k055103j2005588r261267K208104
12274d799720Q252566L188966n171769p639618l526547K231098N878722O100312
12266D514010K129541n390349j1975381j1254864k128919P372826P674501L5812
12258i022823l573205L865998J3956923J3778363L213541o188040p271446l511823
$$ y = [550654, -1412426, -2747619, -3265288, -1113275, 4168890, 8837128, 9588679, 8438349, 8422923, 6828434, -1359410, -13359209, -17892926, -7480700, 11835459, 26218438, 27722584, 19477596, 9195895, 2219465, 991594, 5538967, 11087192, 9759961, 76727, -7958162, -3642213, 9647851, 17458080, 12440456, 2031234, -3990399, -5235419, -5151521, -1732097, 7588027, 16314134, 14259031, 2253443, -7007824, -4799720, 3452846, 6641812, 1470043, -6169575, -9696122, -7465024, -1586302, 4514010, 6643551, 1253202, -10722179, -21977043, -24105962, -16733136, -9058635, -9022823, -12596028, -8730030, 5226893, 19005256, 22218797, 16030757, 8759311, 5247488]
12250E247488M7305K633408L320318J37567l684468j566721M787955M977730l939323
12241A1961259j0759411p029359r79546l779061r629985l986295J1491422J8014408
12233E303432O463982q734763r809205N49938N790209M1740n892336k833146L674968
12224e445181L796310p41067k7742P479696J1525483N241164m747272q698335
12216H383056p291029o875379o412340k0486R127594R750641j5839p357276k959308
12207c670366N025347L493915o110458j0700716m308665N610126R691515O478528
12199E509226L14959m222167m837723k935243k522840m177202k247369O585858
12191h532501J4437691R962284m938117j4722390r442642K937846Q011307K765456
$$ y = [5247488, 5294793, 7928201, 11248519, 11386086, 7701618, 6134897, 10922852, 15900582, 11961259, 1201848, -5827511, -6807057, -10586118, -20216103, -24202398, -12710976, 5303432, 11767414, 3032651, -6776554, -6226616, -436407, -394667, -6287003, -9120149, -5445181, -1648871, -2389938, -2417680, 5062016, 16587499, 21828663, 17081391, 8383056, 1092027, -5783352, -12195692, -12216178, -3088584, 6662057, 6646218, -711058, -3670366, 1354981, 4848896, -1261562, -11962278, -16270943, -10660817, -969302, 5509226, 5824185, 1602018, -3235705, -6170948, -8693788, -12870990, -15118359, -8532501, 5905190, 15867474, 10929357, -3793033, -13235675, -10297829, -2286522, 478934]
12183D78934m110480n813104m032465k623912j236422K326026P128733R657730
12175A775040Q173094M277360M12955k373571l757195k962073J17488L328048
12167H991146L792431J341798j256117k038889k061491k946467m106078m047090
12159b330757k959357j915856m07739K954051P263042Q861118M979044k839788
12151A3603758r449529j0294373n308153J081592M124712K863693k31771k716021
12143f326092l637664k449350P00537L430857L039243R09514J757350O777822
12135D202217J0759701Q518379J386436n520264r586059j0555521o992517J538750
12127f248878R595862R240668J05107q392881p695985l4359N286166L542496j032007
$$ y = [478934, -3631546, -9444650, -13477115, -16101027, -17337449, -15011423, -7882690, 1775040, 9948134, 14225494, 14638449, 12264878, 8507683, 5545610, 5663098, 8991146, 12783577, 14125375, 12869258, 10830369, 8768878, 5822411, 1716333, -2330757, -5290114, -7205970, -7613709, -4659658, 2603384, 11464502, 16443546, 13603758, 4154229, -6140144, -11448297, -10366705, -6241993, -3378300, -3610071, -6326092, -9963756, -12413106, -11712569, -8281712, -5242469, -4332955, -2575605, 4202217, 14961918, 23480297, 24866733, 19346469, 9760410, -795111, -7787628, -6248878, 3346984, 12587652, 12692759, 4299878, -3396107, -3430466, 1855700, 5398196, 4366189]
12118D366189k227077L44201K373327J817260J323509K979099L781231l59282
12110A4398457p217032r206452l176465M350345M835632j511385o441123m535027
12102h503050O69215K725728J129051Q23262L892400N707786J426768o074130
12094A797030q657654l408967L325907M332986M06351k534735k203625r70968
12086g913675Q6052K301674M669768L886537M26925r12067J355823K435739j125389
12077E211387n533099n238316p42884K855556K428734j169078n112607o184389
12069a3484696l184883M42502J95881j886360R73543Q391723J0456286K593708
12061D497704n241265k729575M343408L100332n434167p770496M75767Q206069
$$ y = [4366189, 2139112, 2483313, 4856640, 6673900, 7997409, 10976508, 14757739, 14398457, 7181425, -2025027, -5201492, -851147, 3984485, 2473100, -3968023, -8503050, -7833835, -5108107, -3979056, -3155794, 736606, 6444392, 7871160, 1797030, -6860624, -10269591, -6943684, -2610698, -2204347, -4739082, -6942707, -7913675, -7827623, -5525949, -856181, 3030356, 3457281, 2545214, 3901037, 6336776, 5211387, -321712, -5560028, -6302912, -3447356, -1018622, -2187700, -7300307, -13484696, -16669579, -16227077, -16031196, -17917556, -16944013, -8552290, 1903996, 4497704, -743561, -3473136, 870272, 3970604, -1463563, -9234059, -8758292, -552223]
12053e52223O714656J268720n58824r48340m355444o745264j998213O144261Q013373
12044F982702J569472n821119p956240n391091j163075K624820L561724M1525
12036e551282m830167m848956J693818Q884675R471065K673041n206654o898653
12028d613113r56787O301739O404064j801223r277602o449180M527415J0976313
12020E111626M652015p963336j3443379p475341J155895K864107j065610k450990
12012a8615013J065310L216687j85633l958655j520118M235306N180463J339875
12004i241778J235240P249016J0075474L511910l494657O17144J0476931R384145
11996B9813425n687202j7634050j2460250K078057R014827M706554j543687m357520
$$ y = [-552223, 6162433, 7431153, 6872329, 5923989, 1568545, -5176719, -7174932, -1030671, 6982702, 8552174, 2731055, -5225185, -10616276, -11779351, -9154531, -5592807, -5551282, -10381449, -15230405, -13536587, -4651912, 4819153, 7492194, 2285540, -4613113, -5569900, 731839, 7135903, 5334680, -3942922, -10392102, -5864687, 5111626, 9763641, 1800305, -11643074, -19118415, -17962520, -15098413, -16164023, -18615013, -17549703, -14333016, -14518649, -18477304, -19997422, -15762116, -10581653, -9241778, -8006538, -757522, 9317952, 12829862, 9335205, 9952349, 20429280, 29813425, 24126223, 6492173, -5968077, -3890020, 5124807, 9831361, 8287674, 3930154]
11988C930154o231944o923245k145116N527736O720374K65850l298767Q56468
11980a298490K681513n120931j1311651k287167J3119660J2897278n055428j7319868
11972a3695084p501700J1514844J7346508P757956j914240k753833L88450K108599
11964A3251500L356991M247508J315161m628625o678067k400172O66574m367028
11956D763842j2586721j3287227m734939L809151N064004K410653K484777M133294
11948g943166J209360n219296n829047K531251R037111L204826q011863q418849
11940a9439673L141553R517080M37912j1176090p446475Q591551J7768141J1482878
11932A2876877N43006l287276k403946m890161r774498r056570j183736N353689
$$ y = [3930154, -2301790, -9225035, -11370151, -5842415, 877959, 1143809, -2154958, -1298490, 1383023, -3737908, -15049559, -17336726, -4217066, 8680212, 3624784, -13695084, -21196784, -9681940, 7664568, 15422524, 13508284, 10754451, 11142901, 13251500, 16608491, 20855999, 22171160, 17542535, 10864468, 8464296, 9130870, 4763842, -7822879, -21110106, -25845045, -22035894, -16971890, -14561237, -12076460, -7943166, -6733806, -11953102, -17782149, -15250898, -6213787, -3008961, -11020824, -19439673, -16298120, -6781040, -6343128, -17519218, -24965693, -16374142, 1393999, 12876877, 13419883, 10132607, 7728661, 2838500, -6935998, -15992568, -17176304, -11822615]
11924a1822615L433076k641295k844849M111492P859602R67511q972360r159397
11916a9068835k60740N277282L408848L685709R977174J0757584j037307j1733118
11908A006597o135369O571585N484320q355831j2716754L71392J1871092N764536
11900C861568p474880r495128j062792M392688L771236M601156P628619M828496
11892A1050963n224898j2429554q641424J809498Q240988N653947j491580n026293
11884f058353j532424M336371N708525J997210j636834k596230k958575k857393
11876e597703O71901N628614M070187n723475j3392952r281305K645213J0947248
11868a0032272J0568417M581239k338435n752699k292806M761735O371637M27862
$$ y = [-11822615, -8389539, -11030834, -13875683, -9764191, -1904589, -937078, -9909438, -19068835, -19329575, -14052293, -10643445, -6957736, 3019438, 13777022, 12739715, 1006597, -5128772, 1442813, 6927133, -1428698, -14145452, -13774060, -1902968, 3861568, -3613312, -13108440, -14171232, -9778544, -6007308, -1406152, 6222467, 11050963, 5826065, -6603489, -15244913, -13435415, -5194427, 459520, -1032060, -6058353, -7590777, -3254406, 2454119, 4451329, 2814495, 218265, -2740310, -5597703, -4925802, 702812, 4772999, -950476, -14343428, -23624733, -20979520, -10032272, 536145, 5117384, 2778949, -2973750, -5266556, -504821, 5866816, 6294678]
11860F294678l730247o86268P73509o465466j1885293l046681J0463623Q732132
11852D49987n846203r656323N691941J9716895J4194928j111150o394760m39567
11844A6605748L687244J133471k031426k432863j751005O23646M922380M396152
11836B5153347o040897j6759802j2425280N370667J7403174J1961465j021682
11829B3640992o533801m643839n142826r239921q357951O8693O571081L427063
11821b10509l149822j769485O797989R978654K093981o324488l760259M758308
11813H414369N143422m017970r247601l031314N222193M710719p71443j340035
11805E082340K282325J751672l477911n392810j229584K453447Q00710l044153
$$ y = [6294678, 2564431, 1878163, 2651672, -3813794, -15699087, -18745768, -8282145, 449987, -5396216, -15052539, -9360598, 10356297, 24551225, 23440075, 17045315, 16605748, 20292992, 21426463, 19395037, 16962174, 15211169, 15834815, 20757195, 25153347, 19112450, 2352648, -10072632, -4701965, 12701209, 24662674, 23640992, 17107191, 12463352, 7320526, -1919395, -10277346, -10208653, -3637572, -210509, -3360331, -5129816, 1668173, 11646827, 13740808, 7416320, 3656061, 8414369, 13557791, 9539821, 292220, -2739094, 2483099, 7193818, 6422375, 5082340, 7364665, 9116337, 5638426, 245616, -983968, 1469479, 2270189, -773964]
11797g73964m733160m194852k099600J871181M533386L64917q746302j1651098
11789b5429492j632851J2737968J6764595P265705m513542o897924k72438N134108
11781C156129J635897p001431r777780k125190P321102P484803L3057l192461
11773b465874K233635P265385M173822j634577j277013L304504L566884j554181
11765A3612585n164819l958329j442390k06635R97329K140098J182176p64129
11757F395886j82819K171691J828452j438088k926772j293991m96495k001745
11749B056119k353461m90649J26657p35880J563457O747433O812856j452589r128444
11740C145499p228009P19202N495137N277124L848277J600212k550628m970481
$$ y = [-773964, -5507124, -9701976, -11801576, -9930395, -5397009, -5032092, -13778394, -25429492, -27062343, -14324375, 2440220, 9705925, 5192383, -1705541, -1977979, 3156129, 4792026, -2209405, -11987185, -14112375, -6791273, 693530, 726587, -2465874, -232239, 7033146, 11206968, 9572391, 8295378, 11599882, 15166766, 13612585, 8447766, 4489437, 3047047, 2840412, 3837741, 5977839, 7160015, 6395886, 6213067, 8384758, 10213210, 8775122, 5848350, 4554359, 4057864, 2056119, -297342, -787991, -661334, -1397214, 166243, 6913676, 13726532, 12273943, 3145499, -4082510, -3363308, 2131829, 7408953, 11257230, 12857442, 10306814, 5336333]
11732E336333k480045K28141k147721m898319n98097O633071O460245l24667l254755
11723D954186l73156m56744n535297o366679M04769N317340K584205o69228N54602
11714D13998o47417p369732p875990N227532J7091112R905754q424345j4772437
11706f451525n132198K852077R71799J330892J0665591J5275963L745385j1603165
11698A1654819j1599687J565211Q976844K690045o186535o201092M16385M864011
11690F180001L683841j67353k645797k095515l45993j002830m097806l972915
11682d464367L055605J0474300P649257m998820j3676457p712673O495278J3039069
11674I861192N539566o596030j0782537n287952J744909M124087L657202L874657
$$ y = [5336333, 2856288, 3084429, 936708, -3961611, -4559708, 2073363, 8533608, 8208941, 4954186, 4581030, 4124286, -1411011, -7777690, -7372921, -2055581, 528624, -140604, 413998, -233419, -7603151, -15479141, -10251609, 6839503, 16745257, 8320912, -6451525, -11583723, -8731646, -7759847, -6428955, 4236636, 19512599, 23257984, 11654819, 55132, 1620343, 10597187, 13287232, 7100697, 899605, 1315990, 6180001, 9863842, 9696489, 7050692, 4955177, 4609184, 3606354, -491452, -4464367, -1408762, 9065538, 16714795, 11715975, -1960482, -9673155, -3177877, 9861192, 15400758, 8804728, -1977809, -7265761, -5520852, -1396765, 2260437, 6135094]
11666F135094K733753l539604j1311330j1183071r75744Q953997Q249190Q6592
11658h51123m127279o60431L768572M162312L118213K612477p96603p325482q667338
11649h766682K78209R774287N731336r776614j8871215j0551225N884613J3983018
11641a2314273R426706Q17110l271167j396348L542771P649656P267708J855196
11633A3577359m307354o623708n559610m278855k775117P77159L960733J720455
11625c508938m847680p354554q78746Q770449J2488636Q998243L874703J44544
11617A7686657l937968p851107o263364K698063J0897695P999795m559459j3239554
11609C430758q599600K807536P431739K267400l568514l730331k169348l024322
$$ y = [6135094, 8868847, 5329243, -5982087, -17165158, -18140902, -9186905, -937715, -851123, -4978402, -5638833, -1870261, 2292051, 5410264, 8022741, 7226138, -99344, -8766682, -8488473, 1285814, 7017150, -2759464, -21630679, -32181904, -26297291, -12314273, -2887567, -2070457, -5341624, -6737972, -3195201, 4454455, 11722163, 13577359, 9270005, 2646297, -2913313, -7192168, -9967285, -9190126, -5229393, -3508938, -8356618, -15711172, -16589918, -7819469, 4669167, 13667410, 17542113, 17686657, 13748689, 5897582, -365782, 2332281, 13229976, 21229771, 16670312, 3430758, -5168842, -2361306, 5070433, 7337833, 3769319, 38988, -2130360, -5154682]
11601e154682k151618M232631R535202N399663l606821n290026J171371L751121
11593G886841k577885p022845o21159P979468M971827o912188j1487021k338180
11585a0121142Q520891P834759j833556p435833k642397O252394R927184O239020
11577A6741320l75455n973191r842148j0950871o540116K675210R325822O826161
11569A886732j057698m030986Q25152N339864K559636l788333o313569m745518
11561i324720l808573m186053k194589L057524P704647P942020L120998m807352
11553b496098j1591486j2212482n864280K065500O105249O526122N943071L831543
11545g692861m96693k874561Q76588O759703O562388P596m057006j51485O206016
$$ y = [-5154682, -7306300, -3073669, 6461533, 11861196, 8254375, 2964349, 4135720, 7886841, 5308956, -1713889, -2335048, 5644420, 10616247, 3704059, -7782962, -10121142, -1600251, 6234508, 4400952, -3034881, -5677278, 575116, 10502300, 16741320, 16365865, 10392674, 550526, -10400345, -16940461, -14265251, -4939429, 1886732, 829034, -3201952, -2376800, 2963064, 5522700, 1734367, -4579202, -9324720, -13133293, -17319346, -19513935, -16456411, -8751764, -809744, 2311254, -2496098, -14087584, -26300066, -32164346, -30098846, -23993597, -17467475, -11524404, -7692861, -8189554, -11064115, -10187527, -3427824, 3134564, 3142160, -914846, -1066331, 5139685]
11536E139685O173452j292170q926728r502318k754737M872855O794761L089137
11528C593937l54682l1614J031680n73193k583635j501723N59799p92792m395710
11519e047933m929141p72337M799163Q751600R714162O500828N06850l095423
11511A6427769k050595j132163l298655k509117N242060R976145O59254j3795288
11503I519410j3662082J318535R697911J009051q729923m104810N281492K968388
11495C297972o077284n112721M719471N944270n444228j2134502k309550J2210600
11487d905972J3604273K368651o705917o231695k717825l149359n168402l523601
11479a6429847N73479K069318Q21092J397094M507472N265005J989300j55138
$$ y = [5139685, 11313137, 10020967, 1094239, -8408079, -11162816, -6289961, 504800, 3593937, 3239255, 3207641, 4239321, 3666128, 1082493, -419230, 140569, -652223, -5047933, -9977074, -10749411, -5950248, 2801352, 12515514, 19016342, 19523192, 16427769, 14377174, 13245011, 9946356, 7437239, 12679299, 22655444, 23314698, 9519410, -4142672, -2824137, 6873774, 7882825, -847098, -4951908, 329584, 3297972, -2779312, -7892033, -3172562, 2771708, -2672520, -14807022, -17116572, -4905972, 8698301, 11066952, 4361035, -1870660, -4588485, -7737844, -12906246, -16429847, -15856368, -13787050, -12965958, -11568864, -7061392, -1796387, 192913, 37775]
11471C7775J310853K19067p188194j1890112l913937R741556J2648879L155127
11463D121014m005803j831461j36891m837559n123259P500118K1123066J8805516
11455C5614741K964760r854175j2225185j0030820p864767m088297R70698L497749
11447a015296K800345J035565j989102o335255p714614l603745Q36368J133100
11439a4852634J758921O255988O692587l511073j2808521m763886J4835099K2489236
11431A6095717R674639o457809q859090r81922M598956L954441O12883k493436
11423A6144379k802363J699096P097208O375829N24675k442997j425083l552379
11415B1618365q906344p673143K093019P907209K117101n129722k136578O202643
$$ y = [37775, 1348628, 1567695, -5620499, -17510611, -21424548, -11682992, 965887, 4121014, 115211, -1716250, -1853141, -6690700, -11813959, -4313841, 16809225, 35614741, 38579501, 28725326, 16500141, 6469321, -1395446, -5483743, -4513045, -1015296, 1785049, 2820614, 831512, -5503743, -13218357, -16822102, -15985734, -14852634, -13093713, -6837725, -145138, -3656211, -16464732, -21228618, -6393519, 16095717, 25770356, 19312547, 10453457, 9471535, 14070491, 18024932, 18637815, 16144379, 13342016, 15041112, 22138320, 28514149, 29038824, 26595827, 25170744, 21618365, 12712021, 5038878, 7131897, 15039106, 17156207, 12026485, 9889907, 16092550]
11407A6092550P612356R28734n718276q286510q154414n822151k236491j087708
11399f671910k498396q48675M648334N917295J99332k265958M804557R892379
11391A3176958Q18520j3125810j3030118Q16045R561662L951948m799354m302769
11383f932918L100267P881485O013200m9386n391794n287797l2894K901937j891273
11374C10827q180800n998633K892172P309936L523985p00630N35940L952429M748479
11365H393705K802423k68247k621813o66419O111903R900081L319365p842131
11357A9128867j0999157m673838J471199L252986M988702N987495j19475r749229
11349I287550r491140K384844J0090065L568795p114139r513626o510415n488837
$$ y = [16092550, 23704906, 24633640, 18915364, 10628854, 2474440, -3347711, -5584202, -6671910, -9170306, -10018981, -5370647, 546648, 745980, -1519978, 3284579, 13176958, 13995478, 869668, -12160450, -11344405, -1782743, 2169205, -2630149, -6932918, -3832651, 4048834, 10062034, 10012648, 4620854, -666943, -699837, 2202100, 310827, -7869973, -13868606, -10976434, -3666498, -142513, -843143, -307203, 3645226, 8393705, 11196128, 10927881, 8306068, 7639649, 13751552, 23651633, 26970998, 19128867, 8129710, 3455872, 4927071, 8180057, 13168759, 19156254, 19036779, 9287550, -203590, 2181254, 12271319, 15840114, 8725975, -787651, -7298066, -12786903]
11341a2786903l509345L548853Q568494M127602l461031m737528k628085l170877
11333a4048820n36733J1255834J9876844Q950200j2856934j9092075l258136J1667740
11325A957920P035046p018322j0367353j070418P270853O416175j6610n600798
11317a393507p265806n027919j608520l35138n04883J735385O313880Q222708
11309A36200N325689J209674j584953m350660o108615k714425M474306P260541
11301C647757K634863j835562j49575K689939K51002m108064m151403k209623
11293c230666l762772n688306j014040P396924R266352K678961l072150j898000
11285F76303J329998N98386j806668o59480K907449L237700p37666k890956K380040
$$ y = [-12786903, -16296248, -12747395, -4178901, -51299, -3512330, -8249858, -10877943, -14048820, -14585553, -3329719, 16547125, 25497325, 12640391, -6451684, -9709820, 1957920, 8992966, 1974644, -8392709, -9463127, -2192274, 4223901, 4207291, -1393507, -8659313, -13687232, -15295752, -15630890, -16135773, -14400388, -8086508, 136200, 5461889, 6671563, 5086610, 735950, -5372665, -8087090, -3612784, 3647757, 6282620, 4447058, 4297483, 6987422, 7238424, 3130360, -1021043, -3230666, -6993438, -12681744, -13695784, -6298860, 2967492, 5646453, 2574303, 676303, 2006301, 2604687, 798019, 138539, 3045988, 6283688, 5546022, 2655066, 5035106]
11276E035106J1305254J2437426K32618j4605665j5155229n17172J0572237M299661
11268A3604236q909663j0103600K85941N097792j727604p027246j066401P692295
11260b154250P840529J978508j095254q55828j412391j721494j18982j473192
11252I87646q285480j0796105O74273J7178786J9439413M555917r404222q236676
11244F113552J520830N766310K225067j100702P1948K164704R44945k958437n326364
11235I421853l050726J328061N43376q062490j5423414r900344N927479J5960202
11227c256003J0870983p64421o191831m640530k646921j098277K906528O074464
11219A253992K159629n967887p872938m97076P061422O232053o31760n755002
$$ y = [5035106, 16340360, 28777786, 29010404, 14404739, -750490, -1267662, 9304575, 13604236, 4694573, -5409027, -5123086, -25294, -1752898, -8780144, -9846545, -2154250, 5686279, 7664787, 6569533, 5713705, 4301314, 2579820, 2460838, 987646, -7297834, -18093939, -17419666, -240880, 19198533, 23754450, 14350228, 6113552, 7634382, 13400692, 15625759, 14525057, 14597005, 16761709, 17706654, 14748217, 9421853, 6371127, 7699188, 8242564, 180074, -15243340, -25143684, -19216205, -3256003, 7614980, 6850559, 658728, -3981802, -6628723, -7727000, -4820472, 1253992, 3413621, -2554266, -10427204, -10924280, -3862858, 2369195, 1737435, -4017567]
11211d017567o132711m376294l180582k534338p41240L300933P377782O251641
11203d052376j852591r913971q607162J357875R245996Q194662K722755m74948
11195c379760k114107n199044o551418j657637N458887O261704Q35493j828744
11187h174626K133594N929815M166120K151339O552056J2776342J0398079j383653
11179C4549066j2318086j4919206j1670459p235005j786536M188290N819482O25116
11171b747338n579576n777670j214168K052405K405403J886199j78932m516603
11163a3670280n618203J937210J1807138J1590451J438078m663117K83035O115482
11155I219794K536309m991162n716808p89276J310140K0629J420011N526274O298132
$$ y = [-4017567, -10150278, -14526572, -17707154, -20241492, -20982732, -17681799, -10304017, -4052376, -5904967, -15818938, -24426100, -23068225, -13822229, -5627567, -2904812, -3379760, -5493867, -10692911, -17244329, -18901966, -13443079, -7181375, -6345882, -8174626, -6041032, -111217, 4054903, 6206242, 12758298, 25534640, 35932719, 34549066, 22230980, 7311774, -4358685, -11593690, -13380226, -9191936, -3372454, -2747338, -8326914, -14104584, -15318752, -13266347, -10860944, -8974745, -9153677, -13670280, -19288483, -17351273, -5544135, 6046316, 7484394, 2821277, 3104312, 9219794, 11756103, 6764941, 1048133, 258857, 1568997, 1589626, 3009637, 8535911, 14834043]
11146A4834043K437883j694986m295104o207877n145320P78216O264733N562936
11138A2534524L006765N535555Q035873L22325j2902223j5611834n497697J809381
11130b767331k045343o310049k128229K044534k368693o870473q20264Q416306
11122a2849542O885883k692648n945989Q7971N171057M294187K528540K398024
11114a22517N89660k298278j499504J546355M17003l844183l369803K214002M487066
11105a880199J644345K338063R499582J2698943M079321q051326j0490981l172084
11097F665664K883850J418490l236653m391459r92089K435538P88693n941089
11089c69055j1148843q408630k84107L875523J65152m883823l950592J414432
$$ y = [14834043, 17271926, 15576940, 11281836, 5073959, -71361, 706855, 6971588, 12534524, 15541289, 21076844, 29112717, 29435042, 16532819, 920985, -4576712, -2767331, -4812674, -11122723, -13250952, -11206418, -13575111, -20445584, -21265848, -12849542, -5963659, -8656307, -14602296, -14514325, -9343268, -5049081, -2520541, -122517, 467143, -1831135, -3330639, -1784284, -1367281, -5211464, -8581267, -6367265, -1880199, -235854, 2102209, 11601791, 24300734, 28380055, 20328729, 9837748, 6665664, 9549514, 10968004, 7731351, 3339892, 2347803, 4783341, 5572034, -369055, -11517898, -19926528, -20210635, -16335112, -16169960, -21053783, -25004375, -23589943]
11081b3589943M470447K758184l74608j471040l75499J245149K246256K810743
11073a2280311L631304M257529L250155Q65068n58491p20249k656870o715896
11065a0927761p217332l00439Q537331J1167889P808334M021778N16220m661046
11057H944974o959546l70297R198477Q684126k343815r738819n984692l3792m77759
11048I18857k147174K070371P408945N554361j509916n893289n649839l658770
11040b906454o88020K586397K700981k26186Q604M740073N124298l689806j1710946
11031d061059p994828K340517O755865M182439K526490L027339R63405j934686
11023E805482K06214M902547M365533n43047k131289p9738r07825m642222n404366
$$ y = [-23589943, -19119496, -16361312, -16735920, -18206960, -18582459, -17337310, -15091054, -12280311, -8649007, -4391478, -1141323, -276255, -834746, -1554995, -4211865, -10927761, -18145093, -18445532, -9908201, 1259688, 9068022, 13089800, 13606020, 8944974, 1985428, 1615131, 10813608, 19497734, 17153919, 7415100, 1430408, 1396616, 918857, -1228317, 842054, 8250999, 13805360, 12295444, 6402155, 752316, -2906454, -3594474, -1008077, 1692904, 1466718, 1475322, 6215395, 11339693, 7649887, -4061059, -12055887, -9715370, -2959505, 1222934, 3749424, 6776763, 7740168, 5805482, 6011696, 10914243, 15279776, 14736729, 12605440, 12525702, 11617877, 6975655, 1571289]
11014A571289m143712o518464q815100j876023J0018533J1346087o8872p911346
11006f397608k892730L414193q49481q803660p973527p9915M882951N039039N117182
10997h543556N776513N108383M506989L990522j153149j0189004j2098751j668625
10989a4270678Q356614M319855o700112p533550K179839O762517J54534o620028
10981a3351009n309917j578212j747012k449396K07740K834678K793842L840466
10973a4758820O982430N480356l236268r635823n186599M054946O772842L113525
10965f413411J475385L480887L789633J913534K071457K476985k612531r591644
10957c409705p650293K629919O529787k575003j1305816o365693M900992O990227
$$ y = [1571289, -2572423, -9090887, -17905987, -19782010, -9763477, 1582610, 1513738, -6397608, -9290338, -5876145, -6725626, -15529286, -23502813, -23582728, -18699777, -13660738, -8543556, -2767043, 2341340, 6848329, 10838851, 9685702, -503302, -12602053, -14270678, -5914064, -1594209, -8294321, -15827871, -13648032, -6885515, -6730981, -13351009, -18660926, -20239138, -21986150, -24435546, -24227806, -21393128, -18599286, -14758820, -7776390, -2296034, -5532302, -15168125, -20354724, -16299778, -9526936, -6413411, -4938026, -1457139, 2332494, 4246028, 6317485, 8794470, 6181939, -3409705, -11059998, -8430079, -1900292, -4475295, -15781111, -22146804, -17245812, -10255585]
10949a0255585N36509j429668L519266M883678r48325n118808k967046q74018
10941a2653997j966535J22518O511513O587451m088027j2300251n755430P364253
10933a6178505J0998347N059162J865348M517528M586587r16406n070391l928991
10925I32679j488890q15063o83771j358763l981565m923222o31016L723896J515940
10916g709775k088516K296494R577991N623907q033936j3180977k668704R043039
10908g140477R860809O358883O376639L416466p551663j4500854o184415O245355
10900c119257M651013p169579j0015980k38396O465816K123267k552060J144303
10892h710873N622188J945760m166681k151791N841065Q257925J360712o402123
$$ y = [-10255585, -9719076, -11148744, -7629478, -2745800, -3694125, -8812933, -11779979, -12653997, -14620532, -14498014, -7986501, -1399050, -5487077, -17787328, -23542758, -16178505, -5180158, -120996, 1744352, 6261880, 10848467, 9932061, 4861670, 932679, -556211, -1371274, -2055045, -3413808, -7395373, -12318595, -12949611, -9225715, -7709775, -9798291, -7501797, 2076194, 7700101, -333835, -13514812, -16183516, -7140477, 2720332, 9079215, 15455854, 18872320, 11320657, -3180197, -9364612, -3119257, 1531756, -5637823, -15653803, -15892199, -9426383, -7303116, -9855176, -8710873, -3088685, -1142925, -5309606, -7461397, -1620332, 6637593, 7998305, 1596182]
10884A596182o946585k026914J910071L002411L867466M776701K665431k147544
10876F697219m120870j286401l54536o092573j0368189k451455J1861868J4938813
10868H823876L122631o589039j858207P060630N013914m600261p984521l897489
10860i08466k582030o096701n480309K803254J1055734J2436142Q004037O43069
10852A9874730p806110j2244299p467811K136206N374197o19274o453028m270582
10844a1475971K660200P032551O440510K024467m552307r265536p530924j333134
10836a6000144J719656l38018l13917O380202J3312695J1852748K857172o189773
10828A3280621j0886916j0728708m850669N331843J1889986P265258m372268r953113
$$ y = [1596182, -5350403, -7377317, -5467246, -2464835, 1402631, 6179332, 8844763, 6697219, 2576349, 1289948, 935412, -5157161, -15525350, -17976805, -6114937, 8823876, 11946507, 5357468, 3499261, 10559891, 15573805, 10973544, 2989023, -908466, -3490496, -9587197, -15067506, -12264252, -1208518, 11227624, 19231661, 19874730, 12068620, -175679, -7643490, -5507284, -133087, -752361, -7205389, -11475971, -8815771, -1783220, 4657290, 6681757, 2129450, -7136086, -14667010, -16000144, -14280488, -14618506, -14932423, -8552221, 4760474, 16613222, 19470394, 13280621, 2393705, -8335003, -13185672, -7853829, 4036157, 11301415, 6929147, -3023966]
10820c023966l545426O510218R244161M320830o12414j407505k15104J035369
10812A2306163L245144N841226N743537K357675j211690l534592o348325r072117
10804I327021q202521m731778m398141o479506j968060R988985J4704241K718144
10796A0958385j1886357r935237L339503O593652l798258j0237932m552759J284324
10788a8234679P7640J642747J0618148J3983501L869050o571340m966383K60804
10780F79488k210686n534425L12241P736610N495815L0453K371677O287974J166802
10771A6335949n301733j026851M927040k915145j5063601r595881R227564J5529983
10763A2117325L709627n245574j756677p98395j0030718j4401573l996097Q445377
$$ y = [-3023966, -6569392, -59174, 9184987, 13505817, 12893403, 11485898, 11270794, 12306163, 15551307, 21392533, 27136070, 29493745, 28282055, 24747463, 18399138, 9327021, 1124500, -3607278, -8005419, -14484925, -16452985, -6464000, 8240241, 10958385, -927972, -10863209, -7523706, -930054, -4728312, -14966244, -19519003, -18234679, -18157039, -16514292, -5896144, 8087357, 11956407, 5385067, 418684, 679488, -1531198, -7065623, -6753382, 983228, 6479043, 6509496, 8881173, 15169147, 16335949, 11034216, 10007365, 14934405, 12019260, -3044341, -12640222, -3412658, 12117325, 15826952, 10581378, 8824701, 8026306, -2004412, -16405985, -20402082, -11956705]
10755a1956705J0685943Q925760R622906N060291q318493j6639986r488370K202967
10747i905687M006383r38610k496708p66831R01419N923235J3534798J1847316
10739B2105315l216855j5229902r287873N257819J0223090N342733K307542K240164
10731A9742033j878951p416019n707337N62097R12071m467775n629738o97966
10723d581585K081454k55993j624726P17628K153749O52228L07673K891538M420119
10714F762085K301148o85583j293110k1792M61123j627601n045204n351958q4321
10705d585213N409059L398495l712824m883117K535142P556805K946818l000519
10697E664646n18692N636751M880461k204711o778420n892381l020103P06488
$$ y = [-11956705, -1270762, 7654998, 17277904, 22338195, 14019702, -2620284, -12108654, -9905687, -5899304, -6837914, -9334622, -10101453, -9200034, -3276799, 10257999, 22105315, 18888460, 3658558, -5629315, -371496, 9851594, 15194327, 17501869, 19742033, 17863082, 10447063, 4739726, 5301823, 6213894, 1746119, -3883619, -4581585, -2500131, -2756124, -4380850, -3663222, -1509473, -857245, -549572, 2341966, 6762085, 9063233, 8377650, 7084540, 7062748, 7523871, 5896270, 851066, -4500892, -4585213, 823846, 4222341, 509517, -4373600, -1838458, 5718347, 8665165, 5664646, 5145954, 10782705, 15663166, 13458455, 6680035, 787654, -2232449, -1525961]
10689a525961N361551O407546K13397p650855q854055m234795r24248p75987j92560
10680a2175967J390607J372574L53330J161762L313280M620629N739521P394910
10672A3170646O546634J322738l841998m069015j554183j521740m214700o162369
10664c23987n728506k930206J824312M999967J853942m811744n090095L577073
10656f629244J0217729N329266n247271r067920l526115L920166O664419L401386
10648E062416l411572p898084m530011M188962R448600Q072567M961788J919213
10640A7813879m923996j3329449j3556122m144921L799864L899636K326227K599982
10632e514900j073362p601113m720129Q021181J1367744l739466j7267182r593379
$$ y = [-1525961, 3835590, 10243136, 10456533, 2805678, -6048377, -10283172, -11207420, -11983407, -12175967, -10785360, -9412786, -9059456, -7897694, -4584414, 36215, 5775736, 13170646, 19717280, 21040018, 17198020, 13129005, 11574822, 10053082, 5838382, -323987, -6052493, -8982699, -7158387, -2158420, -304478, -5116222, -10206317, -6629244, 3588485, 8917751, 3670480, -5397440, -8923555, -5003389, 1661030, 5062416, 1650844, -6247240, -10777251, -6588289, 2860311, 10932878, 15894666, 17813879, 12889883, -439566, -13995688, -18140609, -14340745, -10441109, -8114882, -5514900, -6588262, -14189375, -18909504, -10888323, 479421, -3260045, -20527227, -30120606]
10624c0120606P340258J0112913N08975k189448N046451Q245705L270775m83586
10616A731437j28768j656909m167407r61967N133908N021498K6254q63547K269564
10607F404063K120774n98957L63822K652234m98305n483738l482547L243181N515695
10598A0236222L535940L698600L941635j765807q925364q491789k875782o02984
10590a249329l54598M070732Q885198O430958k0767l069116n027657r174337p292494
10581f801410N746185J5705291Q084113o657686r128976k112677j609477o502905
10573c277542l532543N143880O361648J763514K751361N903801J65603q225403
10565G054319n748486R24676l105617r694685q73540J4115731J0896971o005819
$$ y = [-30120606, -22780348, -12667435, -12158460, -14347908, -9301457, -1055752, 2215023, 1731437, 1602669, -54240, -4221647, -5183614, -49706, 4971792, 4998046, 4134499, 6404063, 8524837, 7925880, 8289702, 10941936, 10443631, 4959893, 1477346, 4720527, 10236222, 13772162, 17470762, 21412397, 19646590, 10721226, 2229437, -646345, -1249329, -1603927, 2466805, 11352003, 17782961, 17762194, 14693078, 9665421, 491084, -6801410, -1055225, 14650066, 22734179, 16076493, 6947517, 4834840, 3225363, -3277542, -6810085, -1666205, 4695443, 6458957, 9210318, 15114119, 15279722, 7054319, 1305833, 2230509, -875108, -10569793, -11443333, 2672398, 13569369, 7563550]
10557G563550r303501L303209P128446l380360p269384P37391J764101p146473
10549f603021n397424R602862J3403493j465574j1266051l717726L038386k005101
10541d410156l930335L924498M221712q745371j3682017p82962R256514L286722
10533a0861395j905213N250916Q285156l377906j1026155n74712J0867254N929381
10525B587326l724335j694128N597943O368680M146457L638291N1742m472074
10517A2499902K5844P053692o65622j5445706j1872226N153056M487925j2271839
10509a1034974q592559J8408236K5908654M81297j6682986m054161N105691q626722
10501I12476j4218209L143482Q599423j0217985j1944586J4484292J7542104j4492830
$$ y = [7563550, -1739951, 1563258, 8691704, 5311344, -1958040, -1220649, 543452, -6603021, -12000445, -2397583, 11005910, 9540336, -1725715, -5443441, -2405055, -4410156, -8340491, -4415993, -194281, -8939652, -22621669, -23404631, -14148117, -10861395, -12766608, -7515692, 769464, -2608442, -13634597, -14209309, -3342055, 2587326, -1137009, -2831137, 2766806, 9135486, 13281943, 16920234, 16971976, 12499902, 12525746, 19579438, 18913816, 3468110, -8404116, -3251060, 1236865, -11034974, -19627533, -1219297, 24689357, 25170654, 8487668, 4433507, 9539198, 912476, -13305733, -10162251, -1562828, -11780813, -23725399, -9241107, 8300997, -6191833]
10493f191833j4495763L4496013M2017689k3520252l1472734J06602865K33674528
10486C41110513J37507868j14158338k38929489j32395340J5091249K9311430
10480C7537893k5747260k0744365K4027660K2332625j0083234p531444J2755166
10473C2547041m102666l4284576j9173289K0297637J9437553j4043526j8780405
10466a8102231R446972J8842399r70030r169743M508580P011526q413141j0646106
10458g491774O001387J0220709o171107j3234110J065183J0540024J5477r423862
10450h478073k49973J3077395J1894782J152454m847561l303071O37366K385905
10442A2269224j710071r493045r901780K085094J3164203R149580l197460p748828
$$ y = [-6191833, -20687596, 13808417, 55826106, 32305854, 833120, 107435985, 341110513, 478618381, 364460043, 125530554, -6864786, 8226463, 37537893, 11790633, -8953732, 15073928, 37406553, 27323319, 19791875, 32547041, 28444375, -5840201, -25013490, -4715853, 14721700, 678174, -18102231, -8655259, 10187140, 9217110, 47367, 4555947, 11567473, 3154332, -7491774, -1490387, 8730322, 2559215, -10674895, -9609712, 930312, 945789, -8478073, -8728046, 4349349, 16244131, 17396585, 12549024, 9245953, 9883319, 12269224, 10559153, 1066108, -8835672, -6750578, 6413625, 15563205, 12365745, 4616917]
10434D616917l221831R17958K529666L436704r46104j0943929j3627100k463514
10426a9701233P561395L371210k949217M365782J5773563J3118102J122792l332579
10418A9329815q84037k908849o721382l359238R42823l169790o073023M154861
10410A311180J4618789N967818j2397596j5655295l773118K313480j942830k471691
10402a2029263K733184J774125m467225l294293L593486L021288k571012N87090
10394a0652620Q596088N171663n521917l211503J0323733J0598223p252824j8120070
10386a0069227p606543P131359Q439586K789075J735945K471644M00033J03244
10378E395116K218689r42544p060063k025568J3499976J8026266K293783j3435602
$$ y = [4616917, 1395086, 2313044, 4842710, 8279414, 7333310, -3610619, -17237719, -19701233, -12139838, -8768628, -11717845, -7352063, 8421500, 21539602, 22662394, 19329815, 18445778, 15536929, 8815547, 5456309, 6399132, 3229342, -2843681, 1311180, 15929969, 21897787, 9500191, -6155104, -9928222, -7614742, -9557572, -12029263, -9296079, -7521954, -11989179, -15283472, -11689986, -8668698, -11239710, -10652620, -2056532, 3115131, -2406786, -5618289, 4705444, 15303667, 8050843, -10069227, -17675770, -10544411, -2104825, 684250, 2420195, 4891839, 5291872, 5395116, 7613805, 6671261, -388802, -2414370, 11085606, 29111872, 31405655, 17970053]
10370A7970053j0453425L62646k47387q384430p727709J175541M510475M22692
10362b371544n61358K810633J56666r736898j2812390p16679J4216769J4045261
10354E030460j020053j3453316j1479211j865750L276679L270144M066593L858068
10346h316386k852932r717822m019967J0451196J4422853K952091n386727P95764
10338a671930O501051k556238j3378751p344710P748998J1543185M527222J987535
10330G356362M423468R99590m683665l84065P748182K683570j0950726j1197208
10322d004492L628345J1228095K834582m868966j767549M71469n311920p465217
10314e255653M23584N986684J759032q47348M865719O239126l865007r782516
$$ y = [17970053, 7516628, 7879274, 7631887, -752543, -8480252, -7304711, -2794236, -2371544, -2932902, -122269, 34397, -9702501, -22514891, -23231570, -9014801, 5030460, 4010407, -9442909, -20922120, -22787870, -19511191, -16241047, -12174454, -8316386, -11169318, -20887140, -24907107, -14455911, -33058, 2919033, -2467694, -1671930, 4829121, 2272883, -11105868, -18450578, -10701580, 841605, 5368827, 7356362, 11779830, 12779420, 8095755, 7711690, 15459872, 18143442, 7192716, -4004492, -376147, 10851948, 13686530, 8817564, 7050015, 7521484, 2209564, -5255653, -4832069, 1154615, 2913647, 2066299, 6932018, 13171144, 9306137, -476379]
10306d76379J94231R806232J78131j6645258j4525569O199330J9769101J2794531
10298A7294350j300205o497495m072599l356417o153471p443722m467260P64636
10290a5232183N347886Q220111Q962385N891147j678348q835213q007180o8902
10282e400297L778190k426976q977399m909809M364517O306287J770505J069529
10274d425453M335912L134356j232635K74373N276405K460529o402660p479068
10266d058241K56700K803434k667516k303985P612504J1841384L294169m029833
10258A2748616p52933J684569n429368r981466j506400P798925L784558m876324
10250C470177l256147K966728p01359j0045784r072934K489047R731643O759213
$$ y = [-476379, -282148, 9524084, 9702215, -6943043, -21468612, -15269282, 4499819, 17294350, 15994145, 9496650, 5424051, 2067634, -4085837, -11529559, -15996819, -15232183, -9884297, -1664186, 7298199, 13189346, 11510998, 2675785, -5331395, -5400297, -1622107, -4049083, -13026482, -17936291, -13571774, -7265487, -5494982, -4425453, -89541, 3044815, 1812180, 2086553, 7362958, 9823487, 3420827, -4058241, -3801541, -998107, -3665623, -5969608, 1642896, 13484280, 16778449, 12748616, 11995683, 13680252, 8250884, -1730582, -3236982, 4561943, 8346501, 3470177, 214030, 3180758, 2479399, -7566385, -16639319, -14150272, -4418629, 2340584]
10242B340584J875116Q76547J074143N30806K71191p58451k700428j168755M047023
10233F387776M077665m474119r376592p31339J0194810O611479o788178j0962208
10225e060706k040664N484272L636290L38936K113886L927590N19077m950159
10217C968522p557380o087416l2792R354034J4368623P441919o348957j3081247
10209B025306p803720M03301K489013k40190j833495j25597K848427L603061n4130
10200A311976m822560l019891O435435J2392357N111874q270030j2137482l866764
10192f865085M223181L601026j268584l548995k979037j397491J403667L944256
10184b887062K743189j319672k948013q92112J08239k230467m066733k489075
$$ y = [2340584, 4215700, 5092247, 6166390, 6697196, 6968387, 6209936, 3509508, 2340753, 6387776, 10465441, 5991322, -3385270, -4116609, 6078201, 12689680, 5901502, -5060706, -7101370, -1617098, 2019192, 2358128, 4472014, 8399604, 8918681, 3968522, -3588858, -9676274, -9709066, -355032, 14013591, 21455510, 15106553, 2025306, -5778414, -5375113, -2886100, -3126290, -4959785, -5085382, -2236955, 1366106, 1311976, -3510584, -6530475, -95040, 12297317, 17409191, 9139161, -2998321, -6865085, -2641904, 959122, -309462, -3858457, -6837494, -8234985, -6831318, -2887062, -143873, -1463545, -4411558, -5303670, -5195431, -7425898, -11492631, -13981706]
10176a3981706J94784J808920L916548P094236P937210M177951j143423l455796
10168F548724j797005J309580K456120m84773n686737p347551k216153M758573
10160b459222O148300K460293P02545K784653K835893k086019o155380l798990
10152D32073J452734K552874o98122k618259o43182K207349L044624K261187O88361
10143H679639j782841l411805q50496M879215O330929j534139j2247672j3736836
10135a3674006m035853N253621M131013l344300o923616m862456k845239j938022
10127b8238858K247500Q653883R433593K483333l535349j439903M453972O166991
10119B25162L787724K620156L114122J442131j801555j250304L904535O532932
$$ y = [-13981706, -13786922, -11978002, -8061454, -967218, 6969992, 11147943, 10004520, 6548724, 4751719, 6061299, 8517419, 8032646, 2345909, -5001642, -7217795, -2459222, 3689078, 6149371, 6851916, 9636569, 12472462, 10386443, 4231063, 432073, 1884807, 4437681, 3739559, 1121300, 478118, 2685467, 5730091, 7991278, 8679639, 6896798, 3484993, 2634497, 7513712, 13844641, 12310502, 62830, -13674006, -17709859, -12456238, -8325225, -11669525, -18593141, -23455597, -26300836, -28238858, -25991358, -17337475, -7903882, -5420549, -8955898, -10395801, -5941829, 225162, 4012886, 6633042, 9747164, 11189295, 9387740, 8137436, 12041971, 18574903]
10111A8574903R00779q334019j1167700n487935M3267j202886l533244J623540
10103h583295R345299N772560r140329j6692881n157589J1416687J2646159R59677
10095E66288m621405J593581O455554J799589m184939l241912N72577P23194j639284
10086a976757k974640k960724q53928M387598Q196926M885343j125984o16398
10078F961436L862594J662662n223291l568666N933307O154083o782620j3637630
10070d638125l328022P985452M696428k337928K348560R766371L622929p889301
10062A0226364m846068Q723460J0154363m140883j3574006p533471O14220o52593
10054a028614l575614J052831O641476L271858m839887n956095J968508R378573
$$ y = [18574903, 19475682, 11141663, -26037, -5513972, -5470705, -6673591, -10206835, -8583295, 762004, 6534564, -2605765, -19298646, -24456235, -13039548, -393389, 566288, -4055117, -2461536, 3994018, 5793607, 1608668, -1633244, -1060667, -337473, -1976757, -4951397, -7912121, -8766049, -4378451, 3818475, 8703818, 7577834, 6961436, 10824030, 12486692, 7263401, 3694735, 9628042, 15782125, 8999505, -4638125, -7966147, 19305, 4715733, 2377805, 4726365, 14492736, 18115665, 10226364, 5380296, 14103756, 24258119, 20117236, 6543230, -990241, -376021, -1028614, -4604228, -3551397, 3090079, 6361937, 1522050, -4434045, -2465537, 6913036]
10046F913036O914448n369872j7535825j7329703k609231J3887332J7505700Q549046
10038A0924931m9440n48511K149153J118401k788626m519210k536769J36830O2098
10029C948857k672712m079917j398473J601762p72268n849428m914497J782045
10021a2354631K856280n608516j0768502j957548J1396954J3173423L696921m050072
10013c615691m777708l054242k39687N485179R138310M163588l938282l869367
10005g07900K572458L000058m020406o059105J619805P314342J929189o570683
9997i22242o250033J079666M506250L73969m582986m061803L20079K732376J056666
9988e748058o95387J770663O395222P288504L263573j481534n230057r546017
$$ y = [6913036, 13827484, 8457612, -9078213, -26407916, -29017147, -15129815, 2375885, 10924931, 10875491, 10326980, 12476133, 13594534, 10805908, 6286698, 3749929, 3886759, 3948857, 1276145, -2803772, -4202245, -2600483, -3372751, -9222179, -14136676, -12354631, -9498351, -15106867, -25875369, -27832917, -16435963, -3262540, 434381, -3615691, -8393399, -11447641, -11687328, -6202149, 2936161, 7099749, 3161467, -707900, 1864558, 4864616, 844210, -5214895, -3595090, 3719252, 5648441, -922242, -7172275, -6092609, -1586359, -1212390, -5795376, -9857179, -9537100, -6804724, -5748058, -6443445, -4672782, 1722440, 9010944, 12274517, 10792983, 5562926, -3983091]
9980c983091j0962986k475146J2215988J7479504O458288p683981j0358264m760008
9972d069696j657462p78798L787946Q360247N187589k603334n859309m269282
9964a902099l262669j731707L570469P270011L342268j866064N78880N202378
9956A1201467Q29121r051819j1541277n566819o47825J603336O822761J2010808
9948E659753Q926694J238517k32273K515980j312354q805726n749005P646373
9940I887959J4447977P675845n66203j160225k19407l198108m306329L60148L634250
9931B6555907p37871p941525j0105228n876935J305171O891692O628113J467049
9923A8186373j312436J088703J488183l419829m305247L354086O312659m665648
$$ y = [-3983091, -14946077, -17421223, -5205235, 12274269, 18732557, 11048576, 690312, -4069696, -5727158, -6505956, -2718010, 5642237, 10829826, 8226492, 2367183, -1902099, -5164768, -6896475, -3326006, 3944005, 7286273, 5420209, 5999089, 11201467, 12030588, 2978769, -8562508, -14129327, -14777152, -13173816, -6351055, 5659753, 14586447, 15824964, 15592691, 18108671, 16796317, 7990591, 2241586, 9887959, 24335936, 32011781, 31445578, 30285353, 30065946, 26867838, 22561509, 22921657, 26555907, 25818036, 17876511, 7771283, 1894348, 3199519, 10091211, 16719324, 18186373, 16873937, 17962640, 19450823, 16030994, 11725747, 15079833, 21392492, 16726844]
9915A6726844j3952300m283040J1774423J0038375n531395j0245229R31629R811477
9907A5270784P250451P38988n543491j0957987o075234J1290391J8603688l01026
9899C0276564k0384640j0247206J3397308J2401669o341369o161570R355693N349723
9891B7646172j1923561l297009K3380159K0815738n013215R32089L3000338K3340645
9883A08881356k2327605r614279O6297616O0200702j00803783k51676044j93293277
9876c42335314J5580377J36121410Q0853919o341085k184356L8675032K7115318
9869e2514699j0055249p841185J6639526J3322639m831135J145791J6869320P341466
9861a9923526j2274502o351510J3605803J2664586l215697l562685Q006646M965251
$$ y = [16726844, 2774544, -1508496, 10265927, 20304302, 14772907, 4527678, 5459307, 15270784, 22521235, 23260223, 17716732, 6758745, 683511, 11973902, 30577590, 30276564, 9891924, -355282, 13042026, 25443695, 19102326, 12940756, 22296449, 27646172, 15722611, 12425602, 35805761, 56621499, 51608284, 52540373, 85540711, 108881356, 86553751, 76939472, 143237088, 203437790, 102634007, -149042037, -342335314, -326754937, -190633527, -109779608, -116120693, -118305049, -79630017, -52514699, -62569948, -70411133, -53771607, -40448968, -45280103, -44134312, -27264992, -19923526, -32198028, -38549538, -24943735, -12279149, -15494846, -19057531, -11050885, -6085634]
9853f085634r473105j0111355K802677Q067169M266049N853599R242866Q16658
9845E378924j1054966q314327J661168j543208j2486489q860142P146989J1857812
9837a6214239J262362m506691K536685Q442574N273934R99029m59771l794325
9829f460442n688095K025930J1477967N483528j2370843j8378288m128386J1167114
9821a6871515J0560180J465408j090065L103165M283219o40828n353095l178192
9813g721723N039615R879885K614988j1169905j4657595l008054O964311J070080
9805a0988398r773116o825332O568274J1391817K938687n599549o298637l947889
9797b2534143j707936K256140M042212k490833j1016280q436316L795149J0495582
$$ y = [-6085634, -15558739, -25670094, -22867417, -14800248, -10534199, -4680600, 4562266, 5378924, -5676042, -13990369, -12329201, -13872409, -26358898, -35219040, -28072051, -16214239, -14951877, -19458568, -16921883, -8479309, -3205375, -2206346, -2666117, -6460442, -12148537, -10122607, 1355360, 6838888, -5531955, -23910243, -28038629, -16871515, -6311335, -4845927, -5935992, -2832827, 1450392, 809564, -4543531, -7721723, -2682108, 7197777, 9812765, -1357140, -16014735, -19022789, -12058478, -10988398, -20761514, -27586846, -21018572, -9626755, -6688068, -12287617, -18586254, -22534143, -24242079, -21985939, -17943727, -20434560, -31450840, -39887156, -36092007, -25596425]
9789b5596425O183001J337656L065618N350328K101696l878620q090585q699448
9781b8226779l127220P506279J2166527K638060r685900o831605P444126J2068408
9773f048104J796650n942421j086157M744279J435318l522675k302862o38883
9765a1564855l018963k098913M831803O355636k540953p567329J663769J1625419
9757b314386N970795p422297j0150062k403865K380041K665472O609335J1074367
9749F409400N452611o421725r844186l945694j869895n798905l694238N722256
9741a3990376P308127l503883r480644N57023J1504770N695141q081063q645321
9733a8636226L997231J0123543K001228o282800l371370K868914J248565l891025
$$ y = [-25596425, -19413424, -18075768, -15010150, -9659822, -7558126, -11436746, -19527331, -28226779, -31353999, -23847720, -11681193, -9043133, -18729033, -25560638, -18116512, -6048104, -4251454, -10193875, -11280032, -6535753, -5100435, -8623110, -10925972, -11564855, -14583818, -16682731, -11850928, -5495292, -8036245, -15603574, -13939805, -2314386, 3656409, -3765888, -13915950, -16319815, -13939774, -11274302, -4664967, 6409400, 11862011, 5440286, -4403900, -8349594, -10219489, -16018394, -19712632, -13990376, -6682249, -10186132, -19666776, -19109753, -7604983, -1909842, -9990905, -18636226, -14638995, -4515452, -2514224, -8797024, -12168394, -9299480, -8050915, -11941940]
9725a1941940j262467P537236R412083l15701r940250o668300O592861J4860510
9717H274032R033387m406089j1864540p503638K163131O912826L582595k246600
9709C945104l761227l70335K851135K037701j248542l509040m674419o688988
9701a1418611p579445k117245R186661J6521107J1635746j12843n192447O03865
9693A1526788P005450M003069m805358q566562m109719J956962L676498J537704
9685A2224832j726188m839555o388416m856430k089262k205446m972225m570796
9677a9423486K170536R849289J0235100J952861q052176j1175011m148820P969603
9669a0622104J4707697R527132k234648q511785m785837J832817M209431L491250
$$ y = [-11941940, -13204407, -5667171, 3744912, 3429211, -6511039, -13179339, -6586478, 8274032, 17307419, 12901330, 1036790, -6466848, -4303717, 2609109, 6191704, 3945104, 183877, -186458, 2664677, 4702378, 3453836, -55204, -4729623, -11418611, -18998056, -21115301, -11928640, 4592467, 16228213, 16115370, 10922923, 11526788, 18532238, 22535307, 17729949, 9163387, 5053668, 7010630, 10687128, 12224832, 10498644, 5659089, -729327, -5585757, -7675019, -9880465, -14852690, -19423486, -17252950, -7403661, 2831439, 4784300, -3267876, -14442887, -18591707, -10622104, 4085593, 13612725, 11378077, 2866292, -1919545, -86728, 4122703, 7613953]
9661G613953K127540k596418j0591123j2481471j819119J1594433J2718941K469810
9653I036546m841952l521714j775677m349543n033194m81566K798594J357769
9645f810737J296157M671241L256589m747028o262441N097879J2737050O28520
9637I867230j7257606j3925696Q636970J9558398M369174j4062908j0539548O823714
9629f530272J2678154K429459n943937k337492L088575j57248o830400o874561
9621a0477722j397507J558769J014671K934040Q084158R416939L351055m013750
9613A0470653n990259m417334m082522l558691K97889K834296k418813r607312
9605a6472093n671257P926577J3151602K089186q976331m293679N830835K052153
$$ y = [7613953, 9741493, 7145075, -3446048, -15927519, -17746638, -6152205, 6566736, 9036546, 4194594, 672880, -1102797, -5452340, -10485534, -10967100, -8168506, -6810737, -5514580, -843339, 2413250, -2333778, -8596219, -3498340, 9238710, 9867230, -7390376, -21316072, -12679102, 6879296, 11248470, -2814438, -13353986, -6530272, 6147882, 8577341, 2633404, 295912, 3384487, 3227239, -3603161, -10477722, -11875229, -10316460, -9301789, -6367749, 1716409, 11133348, 14484403, 10470653, 4480394, 63060, -4019462, -7578153, -7280264, -4445968, -6864781, -16472093, -22143350, -14216773, -1065171, 1024015, -7952316, -12245995, -6415160, -4363007]
9597d363007j0722992r697848Q361662J9964733J0419076n234422p531557m73348
9589G22297Q24575l604057k655037L642900M365526k523552o946069m055504q82296
9580a1111217k682937m522071j449196K281052O73830l397959j937410O219140
9572a5926768J2645727R072824k529896j1031998p825067L276002J0225743P121093
9564E027660L05719j882939k05980m99954l032538l105490k81470O16542j991439
9555e049889l478073j5462O298229J0462579Q963603J346028q275291j2072117
9547a820393o276195K406387M238887p1897p93182N272611R528886N198809k318763
9538A5365150m329869j055702J892925L503680N718163N861060k8268p764111
$$ y = [-4363007, -15085999, -24783847, -16422185, 3542548, 13961624, 8727202, 1195645, 722297, 1546872, -2057185, -4712222, -1069322, 3296204, 772652, -6173417, -10228921, -11111217, -13794154, -18316225, -19765421, -17484369, -16810539, -20208498, -22145908, -15926768, -3281041, 5791783, 3261887, -7770111, -15595178, -12319176, -2093433, 5027660, 5333379, 3450440, 3244460, 2744506, -288032, -3393522, -3674992, -3058450, -5049889, -8527962, -8543424, -2245195, 8217384, 17180987, 18527015, 10251724, -1820393, -8096588, -5690201, -1451314, -1523211, -2316393, 2956218, 12485104, 17683913, 15365150, 11035281, 9979579, 11872504, 15376184, 21094347, 26955407, 26927139, 19163028]
9530A9163028q224721j138448K806904k936094j0708289r399465m45268M489977
9522f392376M90218m044173o20955O266590N954414j788874n788201j64817O776905
9513F88731N286710j639588m718699l531691m673280p357671l331369P267286
9505a2009571J2194394M606468n905832p262473j773471j81756m592128p050928
9497b1975297k554657M838008Q102827L835845n546575j1811447o760296O749056
9489b5122536J4303096P033585n624243q180247N91158Q917306R586061N622877
9481G127057J193474k172152k217901M96172j395912j0592061j4109985J49937
9473b1521371J9215471J8261051j472114j2151624k368503O088509k807646j1031188
$$ y = [19163028, 10938307, 9799859, 12606763, 9670669, -1037620, -10437085, -10882353, -6392376, -5902158, -9946331, -10567286, -4300696, 1653718, -135156, -5923357, -6088174, 688731, 5975441, 4335853, -382846, -3914537, -8587817, -15945488, -19276857, -12009571, 184823, 4791291, -1114541, -8377014, -10150485, -10332241, -14924369, -21975297, -24529954, -19691946, -11589119, -7753274, -13299849, -25111296, -31871592, -25122536, -10819440, -3785855, -9410098, -17590345, -16999187, -8081881, 1504180, 7127057, 8320531, 6148379, 3930478, 4426650, 3030738, -7561323, -21671308, -21521371, -2305900, 15955151, 14483037, 2331413, -37090, 6051419, 3243773, -7787415]
9465g787415Q87977J6572336R127162j2229385j5364749K407336J1284139p01962
9457D195439r904718P94858J4154118R708007l228535m779456K526806K698943
9449A6165462m826417p491893l018308l28705j551429q27790J721462P43754j677227
9440a091091J016253N685077K868833o061399r410562l871747P83716j834717
9432a1915637n838351m128254J945642P364913R247986N853276j900606p228906
9424f599937m701934q4881k323409p100675k483120Q840579J0330725j283053
9416e405705q311759k41160Q688570L401970o724695m232892O977882R123633
9408C275844K71883m710694o64176J032645n510811j0117920m046144O228214
$$ y = [-7787415, -6899438, 9672898, 18800060, 6570675, -8794074, -6386738, 4897401, 4195439, -5709279, -4914421, 9239697, 18947704, 15719169, 10939713, 13466519, 16165462, 11339045, 3847152, 828844, 500139, -1051290, -1879080, -157618, 586136, -1091091, -74838, 5610239, 8479072, 2417673, -6992889, -10864636, -10080920, -11915637, -17753988, -21882242, -19936600, -12571687, -3323701, 2529575, 628969, -6599937, -11301871, -11386752, -13710161, -20810836, -23293956, -14453377, -4122652, -5405705, -13717464, -13958624, -5270054, -1868084, -8592779, -12825671, -5847789, 3275844, 3547727, -1162967, -1827143, -794498, -6305309, -16423229, -20469373, -14241159]
9400a4241159J0109723P226391L691471J952790N71988j350921l710417n165484
9392i15618k303552N418042J0447027M903591o416312j0440932m373750Q91833
9384b789671j386994m110477K04891O933165P670529K717994k098087m140881
9376C000469k952999K498057Q897339P876315k423338j1361319q945783O45606
9368b765653O146610M398857O92175j289216j872733j341437m56778j840386n386896
9359c715457o525964l725469j775282k674261j015606N333040R004573N600385
9351E05959K657561O230398Q742049K626115m047208q88010M874661j51179j0972242
9342I578104j1393987j882807J161044o692679j2101033p987094k615475q80760
$$ y = [-14241159, -4131436, 3094955, 6786426, 8739216, 9311204, 7960283, 4249866, -915618, -3219170, 2198872, 12645899, 17549490, 11133178, 692246, -3681504, -2789671, -4176665, -8287142, -8082251, -1149086, 6521443, 9239437, 7141350, 3000469, 47470, 2545527, 11442866, 19319181, 16895843, 5534524, -3411259, -2765653, 3380957, 7779814, 8471989, 7182773, 5310040, 3968603, 3511825, 1671439, -3715457, -10241421, -13966890, -15742172, -18416433, -19432039, -14098999, -5094426, 505959, 3163520, 9393918, 18135967, 20762082, 16714874, 15826864, 20701525, 20550346, 9578104, -1815883, -3698690, -2537646, -9230325, -21331358, -29318452, -31933927, -32814687]
9334c2814687L063878R097639P402589j279009j819941R473760J5034790L896825
9326A2055844r543716r169510k225660l530031r271146o083157M244202Q811042
9318a4712132N593742L214940L357799L03130m816376m745750K71442K886036
9310h647169J425492N21064O81036j458627m049255j908648L728126O716187N451546
9301B459752K520165j691913o436302o310209O91497N851683J434934n302771
9293f783164k310397P232837R076297M6881q017385o671546n07955L018289K590298
9284b325845J70576k160098j732498J534071L040761P55761j43488K682253J535107
9275C356600p799162j3798620m962763R491911J1870263L324170k52097M086285
$$ y = [-32814687, -29750809, -20653170, -13250581, -14529590, -16349531, -6875771, 8159019, 12055844, 2512128, -6657382, -8883042, -12413073, -21684219, -27767376, -23523174, -14712132, -9118390, -5903450, -2545651, -2242521, -7058897, -11804647, -11533205, -8647169, -7221677, -6700613, -6019577, -7478204, -11527459, -13436107, -9707981, -2991794, 2459752, 4979917, 3288004, -3148298, -9458507, -8767010, -2915327, -1480393, -6783164, -9093561, -1860724, 7215573, 7262454, -754931, -7426477, -7934432, -4916143, -2325845, -2155269, -4315367, -6047865, -4513794, -1473033, -717272, -860760, 1821493, 3356600, -4442562, -18241182, -23203945, -13712034, -1841771, 1482399, 1230302, 5316587]
9267E316587M004516l379653o368801r62272K635646K15947J77209M395290K561550
9258H596019o936812r905108N71028J1692485J1507687N265157J337484k455018
9250A9672922p598405o509788K349854O448846j041716q451911n669901j541505
9242b341604o384271j2204264p491231J549762K859799j4254K743105O932869
9234a4350089L488144j152520M661042J3940877J0171198l525789p356098L235689
9226I112454J0690359L602248p755192r736794k886064M849256Q978326P158207
9218B4012800j182626r283303p771819J345814N612503j09092p356480q382780
9210c114983n722966l796313j744603P78741N83573j476286P14273P083339Q053175
$$ y = [5316587, 9321103, 5941450, -427351, -1389623, 1246023, 1461970, 1639179, 6034469, 8596019, 1659207, -8245901, -7674873, 4017612, 15525299, 20790456, 22127940, 19672922, 12074517, 5564729, 7914583, 14363429, 13321713, 4869802, -800099, -2341604, -8725875, -20930139, -28421370, -26871608, -24011809, -24026063, -21282958, -14350089, -10861945, -12014465, -7353423, 6587454, 16758652, 13232863, 5876765, 9112454, 19802813, 23405061, 15649869, 5913075, 3027011, 7876267, 16854593, 24012800, 22830174, 13546871, 5775052, 7120866, 12733369, 12624277, 5267797, -3114983, -8837949, -12634262, -14378865, -13600124, -13016551, -14492837, -13778564, -6695225, 1357950]
9201A357950q59504r334430n158162Q502958J6545427J0205758l996722j2673002
9193D590273r040105J895529R537614Q226892R23756o672816j1455417j1203520
9185a3197794m204422M958631O338557j583787o173901J761578J1809554Q344002
9177H052418m553109q862724r20136M470195j2288l241025K711671P614850Q70154
9168F130006r655610r927713j131167M716164L913843K689145L478337J981835
9160B194840k930302o489658n901284l484431j453694L17078J064710p11033l072980
9151b0466754j447650M632539Q749453M130929p208948j3578298m966357J3085897
9143a7069189K1393299Q727386j1777096j6903510k987714J0378952Q413772p76852
$$ y = [1357950, 498446, -8835984, -13994146, -5491188, 11054239, 21259997, 17263275, 4590273, -4449832, -2554303, 6983311, 15210203, 16133959, 9461143, -1994274, -13197794, -17402216, -12443585, -6105028, -7688815, -13862716, -12101138, -291584, 8052418, 3499309, -5363415, -6283551, -1813356, -1825644, -5066669, -2354998, 5259852, 6130006, -3525604, -13453317, -14584484, -9868320, -5954477, -3265332, 213005, 2194840, -735462, -7225120, -13126404, -16610835, -18064529, -17747451, -16682741, -17393774, -20466754, -21914404, -17281865, -8532412, -4401483, -11610431, -25188729, -30155086, -17069189, 4324110, 13051496, 1274400, -15629110, -18616824, -8237872, 175900, -600952]
9135f00952l313439j200991l825811p611798j314290J2061731J6232045O244790
9127A6671285l635997j952641L864940J940605m835892n621722m04314J056780
9119G083044l618415n903522j193958L651463J587200m096818n739823j715879
9111i946708M262155Q920656R128496J343929j1549606j7624503r150478M551300
9103b0064759P669947j54927m157427K503909R303707O628459M56432J46662K600144
9094D932147J28560m074625j613506M900948M992050k276140o944778m236544
9086d191888L5831J456740K859462N259452L583317l821082r863486p970539m82720
9077a3134913N869438P282645L406394l117446n804781k96513O895636M167921
$$ y = [-600952, -3914391, -5115382, -8941193, -16552991, -17867281, -5805550, 10426495, 16671285, 13035288, 11082647, 14947587, 16888192, 12052300, 6430578, 6026264, 7083044, 3464629, -2438893, -3632851, 18612, 1605812, -2491006, -8230829, -9946708, -5684553, 3236103, 12364599, 13708528, 2158922, -15465581, -24616059, -20064759, -12394812, -12549739, -16707166, -14203257, -4899550, 1728909, 2185341, 2332003, 4932147, 5060707, 986082, -627424, 4273524, 9265574, 6989434, 44656, -4191888, -4156057, -2699317, 160145, 5419597, 9002914, 5181832, -4681654, -12652193, -13134913, -7265475, 17170, 3423564, 306118, -5498663, -5795176, 1100460, 5268381]
9069E268381p694404j3493945m213929R891407J4045443Q193130K353416j26756
9061A4222743l439703p494903o992014j863546J347855j06846j547163L71841
9053e501736K319453N77703l031447m815896m399706k937094R9821M509490O530583
9044f648829K918524l330379n706599k644438J045685K187348L734341P923397
9036e20950R509788K299779r334192j3059895m089136Q391441J2785933P324468
9028A3307236j901638q750933r135754k009728O585205O741029k262824q588432
9020f015839l977451M081969M482088j060327m158582m638941o198810m182394
9012b1668287O198451J4493833O724416r481276j1965824K248866J1738531M345252
$$ y = [5268381, -2426023, -15919968, -20133897, -10242490, 3802953, 11996083, 14349499, 14222743, 10783040, 3288137, -3703877, -5567423, -4219568, -4326414, -5873577, -5501736, -3182283, -2604580, -5636027, -10451923, -14851629, -17788723, -17688902, -13179412, -6648829, -3730305, -7060684, -12767283, -15411721, -14366036, -12178688, -8444347, -520950, 8988838, 11288617, 1954425, -11105470, -15194606, -6803165, 5982768, 13307236, 11405598, 2654665, -6481089, -8490817, -1905612, 4835417, 2572593, -6015839, -9993290, -5911321, -1429233, -2489560, -6648142, -11287083, -17485893, -21668287, -15469836, -976003, 5748413, -3732863, -15698687, -13449821, -1711290, 2633962]
9004B633962n564970k947812N152497N929603K197950J703809m4915q773417j5113795
8995a4827088p633471O460721J1294772N977935J156566j334727o757090j0432711
8987a6095093k808698R822589R942811l622511j1550252k507984J0940380J2331768
8979F453010L198905m050097m439327k022495j87192J040324J693997J709404
8971C396529J822133J858975Q00716o67286j263531k230206m585154m774028L63202
8962e278650N719268L335979m593241p401303j827901L302874J111506l694292
8954i325760l612049Q59543M421421N196594M753069L923073K496003M15443k500862
8945F626475n392129n370257j811814J06377l647171p428138k706683P703903
$$ y = [2633962, -2931008, -5878820, -726323, 5203280, 7401230, 9105039, 9060124, 286707, -14827088, -22460559, -15999838, -4705066, 1272869, 2429435, 1094708, -5662382, -16095093, -18903791, -9081202, 861609, -2760902, -14311154, -16819138, -5878758, 6453010, 9651915, 5601818, 1162491, -860004, -1047196, -6872, 1687125, 3396529, 5218662, 7077637, 7878353, 7211067, 5947536, 3717330, -867824, -5641852, -5278650, 440618, 3776597, -816644, -8217947, -10045848, -6742974, -5631468, -9325760, -12937809, -12078266, -7656845, -2460251, 2292818, 6215891, 8711894, 9127337, 6626475, 1234346, -4135911, -5947725, -5841348, -9488519, -16916657, -19623340, -11919437]
8937a1919437J2255637P799823K908515K210341j90402p099971j0371391m181067
8929h587952M089464M956264N15039j742516j457377k569559m137375l308329
8921a2242341k396849l941667l317713M275174J3147721J3228016M682221k665033
8913A0769529l216592m44789J372331K067260J923971J99003j768689j452039
8905I449985M67393J106173J90041n45850j496924m006698o402207n955750l429791
8896a0623628j311401L79369J987994J011393l247408m900818J425767J0556062
8888d722670J1493903J958948q575062j0764170m630866L318285P152359N392826
8880F23553J582110M73350J606753J84589l265674j203626P319142J0042352j500472
$$ y = [-11919437, 336200, 8136023, 11044538, 13254879, 13064477, 5964506, -4406885, -8587952, -4498488, 457776, 972815, -769701, -2227078, -4796637, -8934012, -12242341, -14639190, -18580857, -21898570, -17623396, -4475675, 8752341, 13434562, 10769529, 7552937, 7108148, 8480479, 10547739, 12471710, 12670713, 10902024, 9449985, 9917378, 11023551, 11213592, 10667742, 9170818, 5164120, -1238087, -7193837, -10623628, -11935029, -11555660, -9567666, -8556273, -11803681, -16704499, -15278732, -4722670, 6771233, 8730181, 155119, -10609051, -15239917, -11921632, -4769273, 623553, 2205663, 2679013, 4285766, 4470355, 1204681, 1055, 7320197, 17362549, 15862077]
8871A5862077j5846048j5594414k308213P284901O487115L696661L659878J467040
8863D708997k968506k129211L268094K561437n459268q443146k219379J183276
8855i497706m134897o077378L221878J1286926O361492j920787m34801L844263
8847B648990j506242q759876k354014J1796522J3650856J301158p751967n952388
8839C073039l380394n376431m752551L78920J691749j661211M19038R277004J2555508
8830A2224671N077640k826685m372927o169075j1471258j1101510n59154R631097
8822i567201J0403840O337254K728549l568293j1036658q636031M285420J0694654
8814A641534K027379o212019r76363M790481m229096j5614978q518739R202725
$$ y = [15862077, 16029, -15578385, -17886598, -10601697, -4114582, -417921, 3241957, 4708997, 1740491, -388720, 2879374, 5440811, -18457, -8461603, -10680982, -9497706, -13632603, -19709981, -16488103, -5201177, 1160315, -760472, -1195273, 2648990, 1142748, -7617128, -9971142, 1825380, 15476236, 16777394, 9025427, 3073039, -307355, -5683786, -10436337, -10057417, -8365668, -10026879, -9607841, -330837, 12224671, 17302311, 14475626, 10102699, 3933624, -7537634, -18639144, -19198298, -9567201, 836639, 7173893, 9902442, 6334149, -4702509, -13338540, -9053120, 1641534, 3668913, -2543106, -3519469, 1271012, -2958084, -18573062, -27091801, -17889076]
8806a7889076J1938698j906577q369174K377799J2673838Q410436j185993l132077
8798B917874K27768J627626K293243M912061N423211O00557n249122p103426m890333
8789G59459K93822O634200P544446j683399j2601977j1734099q41334N094674
8781f534208J292442j834507K75071q84593p030917n817131O309533J2832108
8773a392202K913639q262281k499223J1382038J0901537n020284j5451156q941092
8765a6369024L710653R197012P545879M365896P31180l344539m730575k262004
8757a155522L9637q41225j982567O36570N464953O775799J788912n334284p244752
8748a852479j623199N341241N884332N4620n503377p077501o635961n345229j557083
$$ y = [-17889076, -5950378, -7856955, -16226129, -13848330, -1174492, 7235944, 6049951, 2917874, 3145642, 4773268, 7066511, 11978572, 17401783, 18002340, 12753218, 5649792, 759459, 1053281, 7687481, 15231927, 13548528, 946551, -10787548, -11628882, -6534208, -5241766, -7076273, -6801202, -7685795, -14716712, -20533843, -14224310, -1392202, 1521437, -6740844, -9240067, 2141971, 13043508, 8023224, -7427932, -16369024, -12658371, -3461359, 4084520, 8450416, 9181596, 5837057, 1106482, -1155522, -1115885, -1957110, -3939677, -3303107, 2161846, 8937645, 10726557, 5392273, -1852479, -3475678, 1865563, 7749895, 7804515, 2301138, -4776363, -11412324, -16757553, -18314636]
8739a8314636L287889M253871J033834p48493Q83478J216032j378879j443410
8731a1210314L091809N346520N03228n832175o870797m413954k668700l34304
8723b2388687L872983N872655L977607L573585O346579M787366l317431o406712
8715c682055K376936R869806K530529q594797l193816J3976199J7469697m3050
8707C0709449j6291852j2436603K232022P969244J361932o557397p997906l810994
8699d822105J757708M081178J207028j987747R38631O641527N037979m014158
8691H840041q571547l474626J141251k862922q145473n222549J766479M157833
8683a2371513M163793P877656J0403235L194214q022273q609472K270676R415167
$$ y = [-18314636, -15026747, -10772876, -9739042, -10487535, -9604057, -8388025, -9766904, -11210314, -8118505, -2771985, -2268757, -8100932, -14971729, -19385683, -22054383, -22388687, -18515704, -12643049, -8665442, -5091857, 1254722, 6042088, 2724657, -3682055, -1305119, 8564687, 11095216, 2500419, -693397, 13282802, 30752499, 30709449, 14417597, 1980994, 4213016, 12182260, 13544192, 6986795, -1011111, -4822105, -3064397, 1016781, 2223809, 236062, 1174693, 7816220, 12854199, 8840041, 268494, -3206132, -2064881, -4927803, -13073276, -18295825, -16529346, -12371513, -8207720, -330064, 10073171, 13267385, 5245112, -3364360, -1093684, 8321483]
8675H321483M308660l885003m929367k443826m219453p411003l811849N396807
8667h673551J0394388O643897k21244l514888k577228L63228M138559O792781
8659A3345942M811235j761402o517465l477039M516221Q243786K989306o390980
8651A5759604j1757112r807925k848200N104023J0388206J0360147N533766K61563
8643B2994072j748452k124159m889776r195880r488485m428135n79438k827247
8635a2287500n202274J230585J2507717J3571447l82775j3836648j0715243K807817
8627a2306874P481378n12004n399572K028739J0134140O047265m199984p016951
8619c743863k394983J59170m89159J720299N467248L857223j460673k675014q03599
$$ y = [8321483, 12630143, 8745140, 3815773, 1371947, -2847506, -10258509, -14070358, -8673551, 1720837, 8364734, 8143490, 4628602, 2051374, 2414602, 6553161, 13345942, 18157177, 16395775, 9878310, 6401271, 10917492, 19161278, 22150584, 15759604, 4002492, -5805433, -8653633, -3549610, 6838596, 17198743, 22732509, 22994072, 21245620, 19121461, 14231685, 5035805, -4452680, -8880815, -9460253, -12287500, -17489774, -16259189, -3751472, 9819975, 9437200, -4399448, -15114691, -12306874, -4825496, -5337500, -10737072, -8708333, 1425807, 7473072, 3273088, -3743863, -6138846, -5979676, -6468835, -4748536, 718712, 4575935, 3115262, 440248, -363351]
8610c63351l128124o613293r23729J0830120J2732767J648851o304463j798324
8602F080454L517180j163997p262880l453527M125363L772070j619910k492335
8594A502418j122430n435320j1324279p930675L407292J0608058Q950953M680441
8586C336458K399894M61963k489988n842154r626653j1480711o035316N242182
8578b4034325J1174516O605185J565892M167299N827401k256856r914605l935261
8570a0800754O866364M492516p352655r233271R02487N809458o4276l244481J756575
8561a0868037L101262l945576o701178J347897P866624L689168j641687J511786
8553e639741O199252L919730N73939L413027N902307J00961p668115p823629l875603
$$ y = [-363351, -3491475, -10104768, -11028497, -198377, 12534390, 14183241, 7878778, 6080454, 9597634, 8433637, 1170757, -2282770, 1842593, 5614663, 3994753, 1502418, 379988, -5055332, -16379611, -24310286, -20902994, -10294936, -1343983, 3336458, 5736352, 6198315, 3708327, -2133827, -11760480, -23241191, -29276507, -24034325, -12859809, -6254624, -4688732, -521433, 5305968, 3049112, -6865493, -10800754, -3934390, 558126, -6794529, -16027800, -15125313, -9315855, -9380131, -12624612, -10868037, -7766775, -11712351, -18413529, -17065632, -9199008, -5509840, -7151527, -5639741, 559511, 4479241, 5053180, 8466207, 14368514, 14469475, 6801360, -1022269, -4897872]
8544d897872l822729m639368L79354O819485O067352O38532j188042n31910l849237
8535e024435q086566m356277N349231Q885778K258012m607502l062781K814245
8527e830295M143226J7907k697850M15841N590797O089952J136610l365409l425993
8518B074786j731158j015236J267063N649209M863447m780921j2332649n880501
8510a1885960P125964R423446J267756r38601O295584P830688j775199p177826
8502A0165852M08096O728779j73231q052111k152750Q024471M953348o547100
8494A3355354p964579J893129P046098J569839m219963l877592k441524k870795
8486B489967j159361K619115K021694m204698r076505p783935k507441L158643
$$ y = [-4897872, -8720601, -13359969, -12980615, -6161130, -93778, 544754, -643288, -1175198, -5024435, -13111001, -17467278, -12118047, -3232269, -974257, -5581759, -8644540, -5830295, -1687069, -1669162, -4367012, -3951171, 1639626, 7729578, 8866188, 5500779, 2074786, 343628, -671608, 595455, 6244664, 11108111, 6327190, -6005459, -11885960, -4759996, 4663450, 5931206, 4992605, 11288189, 19118877, 17343678, 10165852, 10573948, 17302727, 17129496, 9077385, 6924635, 14949106, 19902454, 13355354, 5390775, 7283904, 14330002, 15899841, 11679878, 7802286, 5360762, 2489967, 1330606, 3949721, 5971415, 1766717, -7309788, -15093723, -17601164, -14442521]
8478a4442521O708298N377286J31921k145626J604396L783758j742655p405767
8470h130910l638625M037725M165649l00686K139717R160037P218289m010358
8462A0640838r518184m104061m33853n959114r713730j591062J0063616J1625756
8454A010206M158936j139044Q1861L119428L873497K088088j698553n940916p442615
8445a889112n338484k842766k072670p70138L337060Q627223J1701411R700124
8437B0452648O93213j2650493k0473586j4793548j688702M755847K142346K296662
8429a9265613J0249868J3586824K038467j2942376j1831604M961880J7038493
8422C835939J1652637j535137o826984k725237J144013m522k319202k655145k715679
$$ y = [-14442521, -7734223, -2356937, -2225016, -4370642, -2766246, 1017512, -725143, -8130910, -11769535, -7731810, -3566161, -3866847, -1727130, 7432907, 14651196, 10640838, 1122654, -2981407, -3415260, -9374374, -19088104, -20679166, -10615550, 1010206, 5169142, 4030098, 4111959, 7231387, 11104884, 13192972, 11494419, 5553503, -1889112, -7227596, -10070362, -12143032, -12913170, -9576110, -948887, 10752524, 20452648, 21145861, 8495368, -11978218, -26771766, -28460468, -23704621, -21562275, -19265613, -9015745, 4571079, 6609546, -6332830, -18164434, -13202554, 3835939, 15488576, 13953439, 7126455, 4401218, 5545231, 5540709, 3221507, 566362, -2149317]
8413b149317k889284L61676P197929J0342296M053371o393096j0652039o896673
8405g025137k630704k530958l093809r11036J027034j104216n384108o807730
8397b8460664l101792L930234R359362P599779p24518n509779J258383J1668421
8389c980574J0676689q44916o157922O29681M656475m253951j3200636p321575
8381a9796729N175840P074735K92396m97761M735033K584455p475091j0072651
8373a7979773J76732R398745O649012j198354l655478j646104o09635j74385J363163
8364g676077J337214j422345k390223J150192M872685M393225J435950p75382
8356I25239k342957l731091l713847k670701k185638j36096O818738J4544818
$$ y = [-2149317, -5038601, -4676925, 2521004, 12863300, 16916671, 10523575, -128464, -7025137, -9655841, -12186799, -15280608, -16191644, -15164610, -16268826, -21652934, -28460664, -31562456, -27632222, -18272860, -10673081, -11397599, -16907378, -15648995, -3980574, 6696115, 5851199, -306723, 322958, 4979433, 725482, -12475154, -19796729, -14620889, -7546154, -7253758, -7751519, -3016486, -432031, -7907122, -17979773, -17803041, -8404296, -1755284, -2953638, -6609116, -8255220, -8864855, -9039240, -7676077, -6338863, -7761208, -10151431, -9001239, -4128554, 264671, 1700621, 925239, -1417718, -5148809, -8862656, -11533357, -13718995, -13855091, -7036353, 7508465]
8348G508465J3470020K141767q989173j0971121o664194l723893l469752j592768
8340a2290649L922277R738655J0725566N390191j502264l557435j335184j644067
8332I447090n545400m914923K903633O723423j454815j0334501n266435P032340
8324a409588Q146266k046011o051094J166491N164182j205236o144954j700432
8316d080376K561052n52749j274673Q049659J5577896P772665p728072j3506832
8308F818570p763929k632333l424660m408181j820926J536564L194775L358920
8300e141200K269712J582937M526434R377093Q707936P47634n763048m328268
8292A1979230k04980k16348k024288j659002k296581o022867o306300M92441N425040
$$ y = [7508465, 20978485, 23120252, 14131079, 3159958, -3504236, -7228129, -10697881, -12290649, -8368372, 1370283, 12095849, 17486040, 15983776, 12426341, 11091157, 9447090, 3901690, -1013233, 1890400, 8613823, 7159008, -3175493, -8441928, -1409588, 6736678, 4690667, -1360427, -193936, 4970246, 3765010, -2379944, -4080376, -1519324, -2072073, -3346746, 4702913, 20280809, 28053474, 20325402, 6818570, -945359, -3577692, -7002352, -11410533, -13231459, -11694895, -8500120, -5141200, -2871488, -1288551, 3237883, 12614976, 21322912, 22070546, 16307498, 11979230, 11774250, 11557902, 9533614, 7874612, 5578031, -444836, -6751136, -6258695, -833655]
8283h33655R38299m662783q46556N603520J424426q982802q959302L334124J1891217
8274a093512P846307K91287j114150J101890J656140J188598K3995m726109j0132716
8265d958270p054336M432056J0057224N90696j2741784j2335816J990811J3736865
8257f282554J1676624J408790n301807m567020q16858J380585J318003k46258
8249a430495l036610n415047l540480M033386J1671722J1199581K717014l757120
8241A2441951j114255M391635J353264j0163706j7314303j0966791K598281J0023534
8233h750390O991777J222481N79481L276069K221077l966303q806823p010239
8225a4242870j242966K690740L806852M869464N832119L796269j067002m687460
$$ y = [-833655, 104644, -4558139, -5404695, 198825, 1623251, -7359551, -16318853, -12984729, -1093512, 6752795, 7044082, 5929932, 7031822, 8687962, 9876560, 9900555, 5174446, -4958270, -12012606, -7580550, 2476674, 3067370, -9674414, -22010230, -20019419, -6282554, 5394070, 6802860, 1501053, -3065967, -3882825, -2502240, -1184237, -1430495, -4467105, -9882152, -13422632, -9389246, 2282476, 13482057, 16199071, 12441951, 11327696, 15719331, 17072595, 6908889, -10405414, -21372205, -18773924, -8750390, -1758613, -536132, 43349, 3319418, 5540495, 1574192, -7232631, -14242870, -15485836, -12795096, -8988244, -4118780, 1713339, 5509608, 4442606, -244854]
8217b44854m610278k181733P30088L032028L046579O43462k79563K786365M432143
8208G354237k046330j1931147j2617870j838104P698118O251306P0552k14554
8200g273792M060262L892003j959431n598766k648148J834206J482082k312670
8192h524254k120455N647467J4120192J1868650k616030j5829785j3818858O41514
8184a0631559J2125444J1866436M731387j960934o529617q657180o798774k601461
8176h456258l2564J220104L510242L209155m343812j2556973r643253K208804
8168b4884555Q525456N187005K665550M617807J801820o379941n645592P181390
8160f931060J3110356M94245j4208369j2656540l019988j744213m065187L251337
$$ y = [-244854, -4855132, -7036865, -6306777, -3274749, -228170, 415292, 135729, 2922094, 7354237, 5307907, -6623240, -19241110, -21079214, -13381096, -7129790, -7059238, -7273792, -3213530, 678473, -1280958, -6879724, -9527872, -7693666, -6211584, -8524254, -10644709, -4997242, 9122950, 20991600, 18375570, 2545785, -11273073, -10631559, 1493885, 13360321, 18091708, 16130774, 9601157, 943977, -5854797, -8456258, -8488822, -7268718, -3758476, -549321, -4893133, -17450106, -27093359, -24884555, -16359099, -11172094, -8506544, -3888737, -2086917, -8466858, -14112450, -6931060, 6179296, 6673541, -7534828, -20191368, -23211356, -24955569, -29020756, -25769419]
8152b5769419J3505737J0602288j626415o492810l385132l890987n634909K495281
8144b0196366J3312960Q652446p161230j0534493K606803J0677172L990941j371511
8136b3278M041462O344709k588335o814789N019248J6256380Q204115r316485
8128B1123027j5075006r211476o845276r899531p290214L096006J2069177J5133728
8120C100435J4691162R850175j036546j0701782r865827j712901K806598J450928
8112H582242N55389J590823N19897j709800p79861M37137m235668j0711530q385520
8103a4136891J994762P834670M236660L04109J852652J847288m632500q858550
8095i557800k730366N450144K755976p183917r419265j564325K983361k351341
$$ y = [-25769419, -12263682, -1661394, -3287809, -9780619, -13165751, -17056738, -22691647, -20196366, -6883406, 1769040, -5392190, -15926683, -13319880, -2642708, 1348233, -23278, 4018184, 10362893, 7774558, 959769, 5979017, 22235397, 30439512, 21123027, 6048021, -3163455, -10008731, -19908262, -27198476, -24102470, -12033293, 3100435, 17791597, 27641772, 26605226, 15903444, 6037617, 4324716, 7131314, 8582242, 9137631, 10728454, 11248351, 9538551, 8758690, 9195827, 4960159, -5751371, -14136891, -12142129, -4307459, -70799, 233310, 2085962, 3933250, -699250, -9557800, -12288166, -6838022, -4082046, -11265963, -20685228, -22249553, -19266192, -21617533]
8087b1617533o632251k50761Q483347O828021j437420k437814N292937R770371
8079b001103O030204K223253K670309L68989p006749q398817K455369J2385874
8071H727329O635863p163877r113164L201203J1905185N832091n492709q852004
8063E679917n087985k903127m131837l295742K378960Q566346Q662120J062126
8055A0930778p861210r397735k783238L630107M435449M563098Q786463J0802581
8047B3106293K730644r606156j3086598o386104j39982O15620Q16941K119721
8039A70379l16488n162813l225948O521212J2109646O371626j928105k418955
8031A2120554J633220J287094l178489n078008l455186l009579m691651m165613
$$ y = [-21617533, -28249784, -28500545, -20017198, -13189177, -14626597, -17064411, -11771474, -2001103, 4029101, 6252354, 8922663, 9291652, 2284903, -6113914, -3658545, 8727329, 15363192, 8199315, -913849, 2287354, 14192539, 20024630, 14531921, 5679917, 591932, -2311195, -6443032, -9738774, -7359814, 1206532, 9868652, 10930778, 3069568, -6328167, -9111405, -5481298, -1045849, 3517249, 12303712, 23106293, 25836937, 16230781, 3144183, -3241921, -3381903, -2766283, -1949342, 170379, -146109, -5308922, -8534870, -2013658, 10095988, 16467614, 14539509, 12120554, 13753774, 15040868, 11862379, 6784371, 3329185, 319606, -4372045, -8537658]
8023h537658Q35261O503271O727082l81814q876577r216488N77336J0228178R055783
8014F914374J7205n365003l487179m51260Q86625L671816O232059J534266q932401
8005A020502j2920413m730200N658820P015211J306715k782054k771472j878946
7997a0081837j553739o21946J895021O185493R978697P578223k873207j2101300
7989a594595q870124L578406J0496500N506543l372279p822298p125031j590204
7981a0793082P968700J2946411M369984j0142490j2943019k475460M911239K392251
7973c765466J229056O305721O149883k924675o129893L024962Q198025j236012
7965A0851601r647469k806239N780663j98963q746088j377779J0572479L286258
$$ y = [-8537658, -7702397, -1199126, 5527956, 5146142, -3730435, -12946923, -12369587, -2141409, 6914374, 6931579, 1566576, -1920603, -2371863, -1485238, 2186578, 8418637, 9952903, 1020502, -11899911, -16630111, -10971291, -3956080, -2649365, -5431419, -8202891, -10081837, -11635576, -12257522, -10362501, -4177008, 5801689, 13379912, 10506705, -1594595, -10464719, -6886313, 3610187, 9116730, 5744451, -2077847, -9202878, -10793082, -2824382, 10122029, 14492013, 4349523, -8593496, -11068956, -6157717, -3765466, -2536410, 3769311, 9919194, 6994519, 864626, 3889588, 12087613, 10851601, 1204132, -1602107, 4178556, 3979593, -4766495, -6144274, 4428205, 7714463]
7957G714463j7013577k2039074o497130P114261P417750O540494J1019674J0205043
7949D461904N94008m581048Q60094N299589J475558j416733K660509M518861j800976
7940A2071766o307613q82943N696182L333221k118742o54267L568099o3440r498679
7931E143584j2136418l435978P024936Q196828j30004q467607q221210m79390
7923a2505259O131859O444102L907086K640379N85212m055054o421080k961121
7915f233876Q06826k72498q50539M772192R942642O131125j411465l364526l856078
7906E663803j0617401j5272170m990862J1354426J2757830l64605p421436k370924
7898a1261339k522m537051j150779J3121927J8697184O105320o925420n580477
$$ y = [7714463, -9299114, -31338188, -37835318, -30721057, -23303307, -16762813, -5743139, 4461904, 5055912, 474864, 1334958, 6634547, 8110105, 6693372, 9353881, 13872742, 12071766, 5764153, 4881210, 10577392, 13910613, 11791871, 11137604, 14705703, 14642263, 5143584, -6992834, -10428812, -3403876, 4792952, 4662948, -3804659, -12025869, -12505259, -6373400, 70702, 3977788, 6618167, 7203379, 3148325, -3272755, -6233876, -5427050, -5699548, -6550087, -1777895, 8164747, 14295872, 12884407, 9519881, 5663803, -4953598, -20225768, -25216630, -13862204, -1104374, -1468979, -8890415, -11261339, -11263861, -15800912, -16951691, -3829764, 14867420, 20972740, 14047320, 8466843]
7890H466843j74459j930287j485622Q392889J2049469l101724j9769721j6173444
7882a3726056j630239J073799n048178k15218J3124554J3079251k356175j0259169
7874e957431o35460Q857946L904971m981072l194500M925148O692335J133071
7866A0745008l623317l846576j357276K134872M397552J942298m178995o707130
7858d93564j339541O342800P399317L64767p614920r106133m031896R44251P42912
7849f792007j716087o10143K753635J953808k216890j268606O004153R387249
7841G495112M014877r68089Q40785Q90950p418909j2867775m339096O769021L030639
7832b552485q351682n845942R212031J2813914j896237j2418181l606027Q619890
$$ y = [8466843, 8292384, 6362097, 4876475, 13269364, 25318833, 22217109, 2447388, -13726056, -15356295, -14282496, -19330674, -19545892, -6421338, 6657913, 4301738, -5957431, -6592891, 2265055, 6170026, 1188954, -2005546, 2919602, 9611937, 10745008, 7121691, 3275115, 1917839, 4052711, 8450263, 10392561, 6213566, -493564, -1833105, 4509695, 11909012, 12273779, 4658859, -4447274, -8479170, -7534919, -6792007, -8508094, -9118237, -6364602, -4410794, -6627684, -7896290, -1892137, 7495112, 11509989, 10541900, 11382685, 12273635, 4854726, -8013049, -12352145, -5583124, -2552485, -10904167, -16750109, -7538078, 5275836, 3379599, -9038582, -12644609, -4024719]
7824d024719N235656n222898l596136P209725Q536363k726994j0463545n562044
7816a0614592K376293K608444j569664j090748M537065P599967K739991p048985
7808d62229j3338436r871981J022505R627265Q652197J468224k228345J205721
7800c925079M991177J698175n678103o793768J704746R947507P203680k820120
7792F328215o524492j83675M327661k019231j0610036p918169L621436R478227
7784c500064M905307q0120J467632L357871j073980o660523m478770M103765R222932
7775G264050N501542k668335p637027o272181j568135J426191J310230J541653
7767a102012M490129O217342J288196q208319j3719423j0775416l574325J834541
$$ y = [-4024719, 1210937, -4011961, -7608097, -398372, 8137991, 5410997, -5052548, -10614592, -8238299, -5629855, -7199519, -8290267, -3753202, 3846765, 6586756, -462229, -13800665, -23672646, -22650141, -13022876, -4370679, -2902455, -5130800, -3925079, 1066098, 2764273, -2913830, -9707598, -8002852, 1944655, 9148335, 6328215, -196277, -379952, 3947709, 1928478, -8681558, -16599727, -12978291, -3500064, 1405243, 1325123, 2792755, 6150626, 5076646, -1583877, -6062647, -1958882, 7264050, 12765592, 10097257, 2460230, -3811951, -5380086, -3953895, -2643665, -1102012, 3388117, 9605459, 10893655, 2685336, -11034087, -21809503, -25383828, -23549287]
7759b3549287M124488N031054N460750N214114L809590Q32758k336986k307707
7751c721226J591649M460108K149573k115145l061654k278445m342510o778301
7743a4095951l397617L557593N279653Q89254j107514K126892L001695j949597
7735e695592m254695K797069J2012558J2074858K820377o748447j0429501q189407
7727e612780k353705L180023L600897j510465o306077n575709k61889N692721
7719i146984R063109O750220j625189q871362o202433L640591Q630290N467944
7711G706186L727530P434452O342064n478932j5476265j0000530L899941Q354287
7703F508733j74949r414958j0413178n093113K148759Q335871R584894N255337
$$ y = [-23549287, -19424799, -14393745, -8932995, -3718881, 90709, 923467, -1413519, -3721226, -2129577, 2330531, 4480104, 2364959, -696695, -2975140, -7317650, -14095951, -17493568, -13935975, -8656322, -7767068, -8874582, -6747690, -3745995, -5695592, -9950287, -7153218, 4859340, 16934198, 19754575, 13006128, 2576627, -5612780, -7966485, -4786462, -1185565, -2696030, -9002107, -14577816, -14839705, -9146984, -83875, 6666345, 5041156, -3830206, -10032639, -6392048, 2238242, 7706186, 11433716, 18868168, 25210232, 19731300, 4255035, -5745495, -1845554, 6508733, 6333784, -3081174, -13494352, -18587465, -16438706, -8102835, 1482059, 6737396]
7695F737396J758264L196905L184475l748625r187857k706353Q901200J0025979
7687A8161384L54748o382401o033388p871124j3554494j1636916J122437J0487322
7679a5352432N967224k743283j122917Q997455J4335192Q915451j577472r349362
7671H069856j0940292p600091m268030m988798o908432l533193M689797R548924
7663a5930259O570792K68062l919228n262893l454281K819182J0236343J1919360
7655C247078O901168R63418l073606o760598p450135m49167Q376761O114384o705038
7646A164265j3389414n145395O329087Q055571L316885O23411p17805k935686
7638b699081j343464M115266K407384r672982j5896089m189157J1500620J2066450
$$ y = [6737396, 8495660, 11692565, 14877040, 11128415, 1940558, -765795, 8135405, 18161384, 18516132, 12133731, 6100343, -1770781, -15325275, -26962191, -25839754, -15352432, -9385208, -12128491, -13251408, -4253953, 10081239, 18996690, 17419218, 8069856, -2870436, -10470527, -14738557, -19727355, -26635787, -30168980, -25479183, -15930259, -9359467, -9091405, -13010633, -18273526, -21727807, -18908625, -8672282, 3247078, 10148246, 11111664, 8038058, 1277460, -6172675, -6621842, 1754919, 7869303, 1164265, -12225149, -17370544, -11041457, -2985886, 330999, 954410, 236605, -2699081, -4042545, 72721, 2480105, -7192877, -23088966, -27278123, -15777503, -3711053]
7630c711053L641734M523044J1725224P143823p857529j2204157l61752Q941014
7622A1840348M220321l270924l283209k671932p228936q341826o22187N342977
7614d015368J686484j734217L975429Q331177o56971j2702533r354672N981716
7606h488955J2547992L581514o039151m486594J621357J375096l853520n337414
7598i079675r29960L064828J537264k361981r63104P250372J3097549P325527
7590A8940820n437998j1326366o722825k304480l747551j939071Q329883J3800676
7582I593088K569950j2062708q098928R816753J4599697k268740j7182960j0164371
7574a3198219O536263R791504l53834o215874k328491K61556l275332l652583
$$ y = [-3711053, -69319, 4453725, 16178949, 23322772, 15465243, 3261086, 2899334, 11840348, 16060669, 12789745, 9506536, 6834604, -394332, -8736158, -9358345, -4015368, -2328884, -4063101, -87672, 8243505, 7586534, -5115999, -14470671, -8488955, 4059037, 7640551, 1601400, -2885194, -1263837, 111259, -3742261, -9079675, -10009635, -6944807, -5407543, -7769524, -8732628, -1482256, 11615293, 18940820, 13502822, 2176456, -4546369, -6850849, -10598400, -12537471, -4207588, 9593088, 12163038, 100330, -7998598, 1818155, 16417852, 14149112, -3033848, -13198219, -6661956, 3129548, 2775714, -3440160, -5768651, -5507095, -8782427, -12435010]
7566a2435010M049140R465819K730210q910794j0190186J173975J1800981J0457767
7558H141902J297690l245955J472782P587517N594849l686380j0620047q842365
7550b300007j972835K786159L608253K989939J015043m065208q975385o362912
7542a3276953M356238J2953867J0242991o8519p122100p247216n394735m234857
7534i791284q98002M420320N967949K387335N92576L871280M273045m514322j3420899
7525g112002q745846O635162J5486079R784421k50391l366593j501484j352166
7517I577180k635340k839751m941397j0695315j2719638l909186R339179J3933058
7509d891210P741459J17102l496660n937339p180408j763887Q665071J2232687
$$ y = [-12435010, -8385870, 1079949, 3810159, -5100635, -15290821, -14116846, -2315865, 8141902, 9439592, 6193637, 7666419, 15253936, 20848785, 17162405, 6542358, -2300007, -4272842, -1486683, 2121570, 5111509, 6126552, 2061344, -6914041, -13276953, -8920715, 4033152, 14276143, 14207624, 7085524, -161692, -5556427, -9791284, -10689286, -6268966, -301017, 2086318, 2678894, 6550174, 10823219, 6308897, -7112002, -15857848, -9222686, 6263393, 16047814, 15797423, 12430830, 10929346, 9577180, 6941840, 4102089, -839308, -11534623, -24254261, -28163447, -18824268, -4891210, 2850249, 2967351, -529309, -6466648, -13647056, -15410943, -6745872, 5486815]
7501E486815L493401o629358o612292j644862l499740r220358n060910R084415
7493a4602889J5326941L585203j1661040j0808373L600499J1672423L910869q862796
7485g839163j3054569p595607J106763Q702020J2067227P747696j901940p370999
7477h138572l433873L374951M848381K635934K233856J654384l872118j0198098
7469a0895155q768856j097464K680236k93832k292812J072546M543122L672139
7461a1380076J691347K382544M756038P603945J0503902Q579117k596972j4314515
7453G225330j0775028O389896J4469820M07629j8660711j9047999l051372Q462670
7445a4579765P328306L292698K448628n377m870391m532388K368307O336770K534244
$$ y = [5486815, 8980216, 2350858, -4261434, -5906296, -9406036, -18626394, -23687304, -14602889, 724052, 4309255, -7351785, -18160158, -14559659, -2887236, 1023633, -7839163, -20893732, -28489339, -27382576, -18680556, -6613329, 1134367, -767573, -8138572, -11572445, -8197494, -3349113, -713179, 1520677, 3175061, -697057, -10895155, -19664011, -20761475, -18081239, -18375071, -20667883, -19595337, -15052215, -11380076, -9688729, -7306185, -2550147, 5053798, 15557700, 24136817, 21539845, 7225330, -3549698, 2840198, 17310018, 17717647, -943064, -19991063, -23042435, -14579765, -7251459, -3958761, -1510133, -1515510, -6385901, -10918289, -8549982, -2213212, 321032]
7436C21032j241273J794817O147610L568840l951778q028316n832748k137126
7428i358942j934037m802729n554085L933Q427396J0349441K593107n616585m887487
7419a0779988Q31003K144256M57111L341127P278461J882889q497284o695584
7411a0038009Q502457J5234164J025020j5619517j2062402M316425Q874283k222598
$$ y = [321032, -920241, 874576, 7022186, 10591026, 6639248, -1389068, -7221816, -9358942, -11292979, -16095708, -21649793, -21645860, -13218464, -2869023, -275916, -5892501, -10779988, -9948985, -7804729, -7347618, -4006491, 3271970, 5154859, -3342425, -10038009, -1535552, 13698612, 14723632, -895885, -12958287, -8641862, 232421, -1990177]
$$ [...]
##END NTUPLES=NMR SPECTRUM
##END=
