##TITLE=31Pdec_3MBDE-3
 CDCl3, 24 sc
 22.11.2022
##JCAMPDX= 6.0         $$ Bruker NMR JCAMP-DX V2.0
##DATA TYPE= NMR SPECTRUM
##DATA CLASS= NTUPLES
##ORIGIN= UXNMR, Bruker Analytische Messtechnik GmbH
##OWNER= root
$$ XWIN-NMR		Version 3.5
$$ Tue Nov 22 14:10:13 2022 Russian Standard Time (UT+4h)  she@DPX200
##.OBSERVE FREQUENCY= 81.013821
##.OBSERVE NUCLEUS= ^31P
##.ACQUISITION MODE= SIMULTANEOUS
##.ACQUISITION SCHEME= undefined
##.AVERAGES= 24
##.DIGITISER RES= 16
##SPECTROMETER/DATA SYSTEM= spect
##.PULSE SEQUENCE= zgpg30
##.SOLVENT NAME= CDCl3
##.SHIFT REFERENCE= (INTERNAL, CDCl3, 0, 248.564)
##AUDIT TRAIL= $$ (NUMBER, WHEN, WHO, WHERE, WHAT)
$$ ##TITLE= Audit trail, XWIN-NMR		Version 3.5
$$ ##JCAMPDX= 5.01
$$ ##ORIGIN= Bruker BioSpin GmbH
$$ ##OWNER= she
$$ F:/spectra/data/she/nmr/P31/1/pdata/1/auditp.txt
$$ ##AUDIT TRAIL=  $$ (NUMBER, WHEN, WHO, WHERE, WHAT)
(   1,<2022-11-22 14:09:12.35 +0400>,<she>,<DPX200>,
      <created by zg, POWCHK disabled, PULCHK disabled
       configuration hash MD5:
       00 E9 B6 7A A2 85 ED C7 34 08 36 98 17 FE 4E 26
       data hash MD5: 32K
       01 22 A3 7C 52 9B 60 F5 93 5B BE CD 72 9E F5 3F>)
(   2,<2022-11-22 14:09:16.14 +0400>,<she>,<DPX200>,
      <Start of raw data processing
       efp BC_mod = 2 LB = 1 FT_mod = 6 PKNL = 1 PHC0 = -10311.04 PHC1 = 224.856 SI = 64K 
       data hash MD5: 64K
       89 C9 12 AF 87 83 4C B8 7F 2B D9 C2 31 5A 53 A4>)
(   3,<2022-11-22 14:09:42.10 +0400>,<she>,<DPX200>,
      <pk PHC0 = 87.84583 PHC1 = -210.8 
       data hash MD5: 64K
       50 12 D0 F6 A2 7F 4E 60 09 56 C3 FF 51 C6 1F E7>)
(   4,<2022-11-22 14:09:45.48 +0400>,<she>,<DPX200>,
      <abs ABSG = 5 
       data hash MD5: 64K
       88 82 15 E2 FD B8 AA 24 5C 67 6C 60 1F 20 B1 5F>)
$$ ##END=
$$ 
$$ hash MD5
$$ D5 8B 25 4C 41 82 91 E5 39 32 42 09 4A D5 F7 F1
##$RELAX= 
##$RELAX= 
##$RELAX= 
##$RELAX= 
##$RELAX= 
##$RELAX= 
##$RELAX= 
##$RELAX= 
##$RELAX= 
$$ Bruker specific parameters
$$ --------------------------
##$DU= <F:/spectra>
##$EXPNO= 1
##$NAME= <P31>
##$PROCNO= 1
##$TYPE= <nmr>
##$USER= <she>
##$AMP= (0..31)
100 100 100 100 100 100 100 100 100 100 100 100 100 100 100 100 100 100 
100 100 100 100 100 100 100 100 100 100 100 100 100 100 
##$AQSEQ= 0
##$AQ_mod= 1
##$AUNM= <au_zg>
##$AUTOPOS= <>
##$BF1= 81.014009
##$BF2= 200.13
##$BF3= 200.13
##$BF4= 200.13
##$BF5= 200.13
##$BF6= 200.13
##$BF7= 200.13
##$BF8= 200.13
##$BYTORDA= 1
##$CFDGTYP= 0
##$CFRGTYP= 5
##$CHEMSTR= <none>
##$CNST= (0..31)
1 1 145 1 1 1 1 1 1 1 1 1 1 1 1 1 1 1 1 1 1 1 1 1 1 1 1 1 1 1 1 1 
##$CPDPRG= <waltz16>
##$CPDPRG1= <>
##$CPDPRG2= <waltz16>
##$CPDPRG3= <>
##$CPDPRG4= <mlev>
##$CPDPRG5= <mlev>
##$CPDPRG6= <mlev>
##$CPDPRG7= <mlev>
##$CPDPRG8= <mlev>
##$CPDPRGB= <>
##$CPDPRGT= <>
##$D= (0..31)
0 1 0 0 0 0 0 0 0 0 0 0.03 2e-05 3e-06 0 0 0 0 0 0 0 0 0 0 0 0 0 0 0 0 
0 0 
##$DATE= 1669111751
##$DBL= (0..7)
120 120 120 11 120 120 24 19 
##$DBP= (0..7)
150 150 150 150 150 150 150 150 
##$DBP07= 0
##$DBPNAM0= <>
##$DBPNAM1= <>
$$ [...]
##$SUBNAM3= <"">
##$SUBNAM4= <"">
##$SUBNAM5= <"">
##$SUBNAM6= <"">
##$SUBNAM7= <"">
##$SUBNAM8= <"">
##$SUBNAM9= <"">
##$SW= 501.771253377433
##$SWIBOX= (0..15)
0 1 3 0 0 0 0 0 0 0 0 0 0 0 0 0 
##$SW_h= 40650.406504065
##$TD= 32768
##$TD0= 1
##$TE= 0
##$TE2= 300
##$TE3= 300
##$TEG= 300
##$TL= (0..7)
0 120 53 12 22 120 120 120 
##$TP= (0..7)
150 150 150 150 150 150 150 150 
##$TP07= 0
##$TPNAME0= <>
##$TPNAME1= <>
##$TPNAME2= <>
##$TPNAME3= <>
##$TPNAME4= <>
##$TPNAME5= <>
##$TPNAME6= <>
##$TPNAME7= <>
##$TPOAL= (0..7)
0.5 0.5 0.5 0.5 0.5 0.5 0.5 0.5 
##$TPOFFS= (0..7)
0 0 0 0 0 0 0 0 
##$TUNHIN= 0
##$TUNHOUT= 0
##$TUNXOUT= 0
##$USERA1= <user>
##$USERA2= <user>
##$USERA3= <user>
##$USERA4= <user>
##$USERA5= <user>
##$V9= 5
##$VALIST= <valist>
##$VCLIST= <CCCCCCCCCCCCCCC>
##$VD= 0
##$VDLIST= <DDDDDDDDDDDDDDD>
##$VPLIST= <PPPPPPPPPPPPPPP>
##$VTLIST= <TTTTTTTTTTTTTTT>
##$WBST= 1024
##$WBSW= 4
##$XGAIN= (0..3)
0 0 0 0 
##$XL= 0
##$YL= 0
##$YMAX_a= 4589
##$YMIN_a= -5399
##$ZGOPTNS= <>
##$ZL1= 120
##$ZL2= 120
##$ZL3= 120
##$ZL4= 120
##$ABSF1= 248.5645
##$ABSF2= -253.2056
##$ABSG= 5
##$ABSL= 3
##$ALPHA= 0
##$AQORDER= 0
##$ASSFAC= 0
##$ASSFACI= 0
##$ASSFACX= 0
##$ASSWID= 0
##$AUNMP= <proc_1d>
##$AZFE= 0.1
##$AZFW= 0.5
##$BCFW= 0
##$BC_mod= 2
##$BYTORDP= 0
##$COROFFS= 0
##$CY= -3
##$DATMOD= 1
##$DC= 0
##$DFILT= <>
##$DTYPP= 0
##$F1P= 0
##$F2P= 0
##$FCOR= 1
##$FTSIZE= 65536
##$FT_mod= 6
##$GAMMA= 0
##$GB= 0
##$INTBC= 1
##$INTSCL= 6.047779e-11
##$ISEN= 30
##$LB= 1
##$LEV0= 0
##$LPBIN= 0
##$MAXI= 10000
##$MC2= 0
##$MEAN= 0
##$ME_mod= 0
##$MI= 50
##$NCOEF= 0
##$NC_proc= -8
##$NLEV= 6
##$NOISF1= 182.463
##$NOISF2= 159.3651
##$NSP= 0
##$NTH_PI= 0
##$NZP= 0
##$OFFSET= 248.5645
##$PC= 4
##$PHC0= -10223.19
##$PHC1= 14.056
##$PH_mod= 1
##$PKNL= yes
##$PPARMOD= 0
##$PSCAL= 0
##$PSIGN= 0
##$REVERSE= no
##$SF= 81.0140089999694
##$SI= 65536
##$SIGF1= 159.3651
##$SIGF2= -187.1042
##$SINO= 113.3802
##$SIOLD= 16384
##$SREGLST= <1H.CDCl3>
##$SSB= 0
##$STSI= 65536
##$STSR= 0
##$SW_p= 40650.406504065
##$SYMM= 0
##$S_DEV= 0
##$TDeff= 32768
##$TDoff= 0
##$TI= <>
##$TILT= no
##$TM1= 0
##$TM2= 0
##$TOPLEV= 0
##$USERP1= <user>
##$USERP2= <user>
##$USERP3= <user>
##$USERP4= <user>
##$USERP5= <user>
##$WDW= 1
##$XDIM= 65536
##$YMAX_p= 354639546
##$YMIN_p= -35181330
$$ End of Bruker specific parameters
$$ ---------------------------------
##NTUPLES= NMR SPECTRUM
##VAR_NAME=  FREQUENCY,     SPECTRUM/REAL,   SPECTRUM/IMAG
##SYMBOL=    X,             R,               I
##VAR_TYPE=  INDEPENDENT,   DEPENDENT,       DEPENDENT
##VAR_FORM=  AFFN,          ASDF,            ASDF
##VAR_DIM=   65536,         65536,           65536
##UNITS=     HZ,            ARBITRARY UNITS, ARBITRARY UNITS
##FACTOR=    0.620285442955139, 1,           1
##FIRST=     20137.2065510682, 0,            0
##LAST=      -20513.1999529968, 0,           0
##MIN=       -20513.1999529968, -35181330,   0
##MAX=       20137.2065510682, 354639546,    0
$$ Real data points
##PAGE= N=1
##DATA TABLE= (X++(R..R)), XYDATA
$$ [...]
$$ plain form
39194 -8877339 -11460539 -12320651 -7850539 -82405 4317765 3285998 2111339 4421756
39186 4421756 6372507 3911844 277005 720997 4094137 5682161 5067224 4947054 4760442
39177 4760442 2008386 -1765583 -2801253 -2011293 -3676135 -7447435 -7961924 -3277365
39169 -3277365 1979537 3403671 1935815 531646 -55570 -311422 -304199 -679176 -2333148
39160 -2333148 -3927602 -2822216 438733 1956226 309170 -761038 2253980 7106834
39152 7106834 8324258 4041736 -1774876 -3745225 -866392 2208146 231710 -5993859
39144 -5993859 -9912114 -7611028 -3218070 -2654233 -4659059 -3344032 1596965 3848956
39136 3848956 545838 -3170769 -2431404 260335 330122 -1077803 167695 3557091 4547310
$$ packed form
39194h877339k583200q60112M470112P768134M400170j031767j174659K310417
39186D421756J950751k460663l634839M43992L373140J588024o14937j20170j86612
39177D760442k752056l773969j035670P89960j664842l771300n14489M684559
39169c277365N256902J424134j467856j404169n87216k55852P223l74977j653972
39160b333148j594454J105386L260949J517493j647056j070208L015018M852854
39152G106834J217424m282522n816612j970349K878833L074538j976436o225569
39144e993859l918255K301086M392958N63837k004826J315027M940997K251991
39136C848956l303118l716607P39365K691739O9787j407925J245498L389396R90219
$$ plain form
39127 4547310 1756786 -1231185 -1404882 139564 1042542 1274910 2521545 5310358 7859913
39118 7859913 7794663 5026154 2480523 2896321 5308864 6522491 5590763 3927137 1139229
39109 1139229 -4847510 -12198734 -14773673 -10557958 -5821242 -6179682 -7721385 -3443987
39101 -3443987 4525727 7318727 3240453 456768 3659682 6408711 1677247 -6462648
39093 -6462648 -8458763 -2833048 2853071 3089720 84080 -1749991 -1388649 34891
39085 34891 1678693 2376171 869945 -1605365 -1790853 873222 2717846 1047807 -1626319
39076 -1626319 -1069665 2897023 6832123 8437549 7958456 5835886 2308975 -715765
39068 -715765 -695422 1738752 2675114 -2603 -3561132 -4093937 -1580405 705089 789643
$$ packed form
39127D547310k790524k987971j73697J544446R02978K32368J246635K788813K549555
39118G859913o5250k768509k545631M15798K412543J213627r31728j663626k787908
39109A139229n986739p351224k574939M215715M736716l58440j541703M277398
39101c443987P969714K793000m078274k783685L202914K749029m731464q139895
39093f462648j996115N625715N686119K36649l005640j834071L61342J423540
39085C4891J643802O97478j506226k475310j85488K664075J844624j670039k674126
39076a626319N56654L966688L935100J605426m79093k122570l526911l024740
39068g15765K0343K434174R36362k677717l558529n32805K513532K285494Q4554
$$ plain form
39059 789643 -173863 -483400 -291782 -720723 -1784944 -2366960 -2108102 -2318789 -4171780
39050 -4171780 -6235995 -5227130 -192297 5182686 6348967 3626766 1844416 3755159
39042 3755159 6280481 4899644 -115873 -4074926 -3435936 1170890 6804478 10653473
39034 10653473 10628015 6083110 -825729 -5936873 -6517433 -3453169 383984 3062478
39026 3062478 4288016 4154406 2485533 -502555 -3600136 -5107963 -4076980 -1200764
39018 -1200764 1529112 2329476 1017346 -1037510 -2264158 -2146509 -1298356 -492035 315872
39009 315872 1840481 4147084 5737990 4691187 1001819 -2792333 -3952017 -2419784
39001 -2419784 -914165 -1955822 -5001262 -7018335 -6215004 -4513055 -5060512 -7561709
$$ packed form
39059G89643r63506l09537J91618m28941j064221n82016K58858k10687j852991
39050d171780k064215J008865N034833N374983J166281k722201j782350J910743
39042C755159K525322j380837n015517l959053O38990M606826N633588L848995
39034A0653473k5458m544905o908839n111144n80560L064264L837153K678494
39026C062478J225538j33610j668873k988088l097581j507827J030983K876216
39018a200764K729876Q00364j312130k054856j226648J17649Q48153Q06321Q07907
39009C15872J524609K306603J590906j046803l689368l794152j159684J532233
39001b419784J505619j041657l045440k017073Q03331J701949n47457k501197
$$ plain form
38993 -7561709 -8305615 -5682201 -2991170 -3454759 -4939418 -3500015 -544526 -1208299 -5498334
38984 -5498334 -6905648 -2011686 3892993 4610151 2145910 3033718 8362641 12929249
38976 12929249 13095763 10356056 7216073 4078253 892388 -1660255 -3379349 -4326834
38968 -4326834 -3551606 -898053 600569 -2024364 -6213854 -6083412 -866048 3172499
38960 3172499 873639 -5540404 -10273392 -10643095 -7775513 -3692703 -303557 968679
38952 968679 842396 1599423 3238882 2667438 -1330128 -5004789 -4217604 14230 3402535
38943 3402535 4194834 4218607 5219919 6830016 7631705 6348054 2758357 -1114684 -2170469
38934 -2170469 -238815 942686 -1114074 -3621346 -2553688 1178127 3310975 2851594
$$ packed form
38993g561709p43906K623414K691031m63589j484659J439403K955489o63773m290035
38984e498334j407314M893962N904679P17158k464241Q87808N328923M566608
38976A2929249J66514k739707l139983l137820l185865k552643j719094r47485
38968d326834P75228K653553J498622k624933m189490J30442N217364M038547
38960C172499k298860o414043m732988l69703K867582M082810L389146J272236
38952I68679j26283P57027J639459n71444l997566l674661P87185M231834L388305
38943C402535P92299K3773J001312J610097Q01689j283651l589697l873041j055785
38934b170469J931654J181501k056760k507272J067658L731815K132848m59381
$$ plain form
38926 2851594 2931751 5121146 7037529 6703781 5834460 6968053 9641665 11123975 9457923
38917 9457923 4753568 -925976 -4103964 -2297548 2664561 5357792 2550847 -2836519
38909 -2836519 -5311743 -3411867 -580253 191120 -73078 812810 2023610 953013 -2052674
38900 -2052674 -3133387 -111051 4080138 5175057 3253704 2088304 3633107 6066956
38892 6066956 7296666 7444273 7179963 6315972 5094682 4397157 3660298 1215158 -2295725
38883 -2295725 -4039795 -3921282 -5406414 -8953808 -9157024 -2857630 3813114 2730698
38875 2730698 -4094132 -6743841 -1427447 4910744 5524195 2567588 1466797 2264384
38867 2264384 1546676 -592927 -844762 1596636 4113200 5054810 5453234 6170750 6178795
$$ packed form
38926B851594Q0157K189395J916383l33748q69321J133593K673612J482310j666052
38917I457923m704355n679544l177988J806416M962109K693231k806945n387366
38909b836519k475224J899876K831614P71373k64198Q85888J210800j070597l005687
38900b052674j080713L022336M191189J094919j921353j165400J544803K433849
38892F066956J229710J47607k64310q63991j221290o97525p36859k445140l510883
38883b295725j744070J18513j485132l547394k03216O299394O670744j082416
38875B730698o824830k649709N316394O338191O13451k956607j100791P97587
38867B264384p17708k139603k51835K441398K516564R41610L98424P17516Q045
$$ plain form
38858 6178795 4423510 1769266 525617 2589243 7533678 11973070 12122063 8135519
38850 8135519 4442963 4199476 5046083 2762603 -2144107 -4698064 -2194280 2398869
38842 2398869 4614552 3520608 1229953 -479103 -1023619 151622 3032554 5357263
38834 5357263 3855748 -1606013 -6627370 -6916092 -3750244 -2506647 -5374620 -8228837
38826 -8228837 -6597987 -2311756 -714437 -2435316 -2489638 1714399 6100937 6180207 3708082
38817 3708082 3209952 4545714 3785025 401205 -1488260 395115 3240813 3901491 3109729
38808 3109729 2805903 2469130 893506 -762099 -770520 -100993 -837132 -2376135 -2312027
38799 -2312027 -603623 312780 -314178 -451804 761696 892847 -2162693 -6505383 -8292522
$$ packed form
38858F178795j755285k654244j243649K063626M944435M439392J48993l986544
38850H135519l692556k43487Q46607k283480m906710k553957K503784M593149
38842B398869K215683j093944k290655j709056n44516J175241K880932K324709
38834E357263j501515n461761n021357k88722L165848J243597k867973k854217
38826h228837J630850M286231J597319j720879n4322M204037M386538P9270k472125
38817C708082m98130J335762p60689l383820j889465J883375K845698O60678p91762
38808C109729l03826l36773j575624j655605q421O69527p36139j539003O4108
38799b312027J708404R16403o26958j37626J213500J31151l055540m342690j787139
$$ plain form
38790 -8292522 -6255302 -2258161 1684536 4793278 6281184 5062327 1540069 -1713315
38782 -1713315 -2265417 -486882 792242 -674051 -4120865 -6500751 -5591274 -2161309
38774 -2161309 1084529 2189707 906848 -2302923 -6431754 -8951077 -7080560 -1607021
38766 -1607021 2444520 1365714 -2163616 -2429741 1382490 4054598 1861641 -2207728
38758 -2207728 -2930905 -27911 2207746 1317599 -433594 254545 3703927 7887663 11220022
38749 11220022 13185244 13096211 10091124 4902290 545061 -84155 2565379 4994428
38741 4994428 4856223 3708150 4121042 5069968 2881350 -2983944 -8095098 -8682805 -6664841
38732 -6664841 -6360971 -7778193 -6707344 -1483316 3806838 4406452 863827 -2224492
$$ packed form
38790h292522K037220L997141L942697L108742J487906j218857l522258l253384
38782a713315n52102J778535J279124j466293l446814k379886R09477L429965
38774b161309L245838J105178j282859l209771m128831k519323J870517N473539
38766a607021M051541j078806l529330k66125L812231K672108k192957m069369
38758b207728p23177K902994K235657q90147j751193O88139L449382M183736L332359
38749A1220022J965222q9033l005087n188834m357229o29216K649534K429049
38741D994428j38205j148073M12892R48926k188618n865294n111154n87707K017964
38732f664841L03870j417222J070849N224028N290154N99614l542625l088319
$$ plain form
38724 -2224492 -2208296 -712672 -115207 -167191 522214 1275858 130214 -2230806 -2046452
38715 -2046452 2424976 7381206 7639538 3296574 -774145 -1722160 -1453580 -1932996 -1763995
38706 -1763995 250964 1525709 -754587 -4452696 -4636865 -183698 4996586 6959166
38698 6959166 5045365 595542 -4417377 -7187268 -5670593 -1561728 530363 -1922936
38690 -1922936 -6540739 -8685880 -5704707 1285038 8011533 9621070 4869891 -2007234
38682 -2007234 -5543810 -4979170 -3673157 -3237336 -1961837 473008 1068522 -1600080 -4245501
38673 -4245501 -3676470 -1911805 -2811820 -5450917 -5020907 -14751 5272191 6375784 4078849
38664 4078849 2587083 3813950 5341007 4020178 347586 -1821480 31902 3873026
$$ packed form
38724b224492J6196J495624N97465n1984O89405P53644j145644k361020J84354
38715b046452M471428M956230K58332m342964m070719r48015K68580m79416J69001
38706a763995K014959J274745k280296l698109j84169M453167N180284J962580
38698F959166j913801m449823n012919k769891J516675M108865K092091k453299
38690a922936m617803k145141K981173O989745O726495J609537m751179o877125
38682b007234l536576N64640J306013M35821J275499K434845N95514k668602k645421
38673d245501N69031J764665r00015k639097M30010N006156N286942J103593k296935
38664D078849j491766J226867J527057j320829l672592k169066J853382L841124
$$ plain form
38656 3873026 5696659 4482257 2732581 2350160 2346071 1362147 354278 1326770 4569746
38647 4569746 8231312 9866073 8079242 3836334 296803 -176728 1159875 1490916
38639 1490916 990565 2369463 5669710 7213816 5028003 1721293 144157 -275307
38631 -275307 -724798 -367430 691625 -263922 -3677482 -5050904 -1581773 2250744 1104468
38622 1104468 -2608710 -2989923 -780622 -1466323 -4677193 -4204378 859139 3791922 1383516
38613 1383516 -975925 796603 2258441 -1408315 -6590953 -7171516 -4158567 -2306807
38605 -2306807 -1102774 3087074 8390764 9174786 5696657 4084709 5925475 5432942
38597 5432942 -621090 -6814080 -6751825 -1855633 1858605 2195287 1473104 1176061 505937
$$ packed form
38656C873026J823633j214402j749676l82421m089r83924j007869R72492L242976
38647D569746L661566J634761j786831m242908l539531m73531J336603L31041
38639A490916n00351J378898L300247J544106k185813l306710j577136m19464
38631b75307m49491L57368J059055r55547l413560j373422L469131L832517j146276
38622A104468l713178l81213K209301o85701l210870M72815N063517K932783k408406
38613A383516k359441J772528J461838l666756n182638n80563L012949J851760
38605b306807J204033M189848N303690P84022l478129j611948J840766m92533
38597E432942o054032o192990O2255M896192L714238L36682p22183k97043o70124
$$ plain form
38588 505937 -578120 -773424 17068 474143 487389 1518597 3782931 5183565 4048151
38579 4048151 1480982 -43199 525514 2358572 4345121 5997835 6959016 6714748 5303868
38570 5303868 3809216 3522564 4596449 5845199 5973368 4861086 3645821 3651399 5126985
38561 5126985 6920537 7653846 7338738 7160459 7174243 5328967 320776 -5252970 -6904696
38552 -6904696 -3757361 207843 1264438 55373 -738034 -445725 95476 1094980 2951571
38543 2951571 4130349 2990670 924908 483333 1006058 -177230 -2366617 -1708964 2232864
38534 2232864 4657187 2546495 -536557 36286 2987826 3798899 1957537 824453
38526 824453 1420376 1239108 -618225 -1670383 -553034 576222 -174980 -1487451 -1652174
$$ packed form
38588E05937j084057j95304P90492M57075J3246J031208K264334J400634j135414
38579D048151k567169j524181N68713J833058J986549J652714R61181k44268j410880
38570E303868j494652k86652J073885J248750J28169j112282j215265N578J475586
38561E126985J793552P33309l15108j78279J3784j845276n008191n573746j651726
38552f904696L147335L965204J056595j209065p93407K92309N41201R99504J856591
38543B951571J178778j139679k065762m41575N22725j183288k189387O57653L941828
38534B232864K424323k110692l083052N72843K951540Q11073j841362j133084
38526H24453N95923j81268j857333j052158J117349J129256p51202j312471j64723
$$ plain form
38517 -1652174 -1471144 -2015885 -2075595 -762316 -621735 -4523202 -10305708 -12177976 -7767709
38508 -7767709 -798548 3896655 5225120 4606681 2752192 -48694 -2220112 -2185841 -790732
38499 -790732 -224203 -726717 -399403 1640353 3956668 5146345 5615791 6169834 6495583
38490 6495583 6140324 5527723 4740770 2608326 -1609433 -6745792 -11085835 -13675478 -13138808
38481 -13138808 -7897337 -185018 3124329 -1655692 -8218584 -7175816 783451 5621983
38473 5621983 2916683 -66206 2834982 6018528 1649191 -6437645 -8282134 -3966090
38465 -3966090 -3184021 -8790131 -11950900 -6829997 -57394 228503 -3206720 -2666583 1707096
38456 1707096 3406377 862176 -618721 2424055 7350860 10279132 10320129 8507941
$$ packed form
38517a652174J81030n44741n9710J313279J40581l901467n782506j872268M410267
38508g767709O969161M695203J328465o18439j854489k800886k171418L4271J395109
38499g90732N66529n02514L27314K039756K316315J189677M69446N54043L25749
38490F495583l55259o12601p86953k132444m217759n136359m340043k589643N36670
38481a3138808N241471P712319L309347m780021o562892J042768P959267M838532
38473E621983k705300k982889K901188L183546m369337q086836j844489M316044
38465c966090P82069n606110l160769N120903O772603K85897l435223N40137M373679
38456A707096J699281k544201j480897L042776M926805K928272M0997j812188
$$ plain form
38448 8507941 6374119 5839124 7421632 8894349 8416944 7648577 8569055 9317086 7527220
38439 7527220 5658328 7364906 10093450 8087141 2428148 523051 4335192 6908523
38431 6908523 3582218 -764176 -273857 2624210 2500972 299476 531577 2642170 2304265
38422 2304265 -689996 -2613216 -2659115 -2932451 -2209219 3047728 10544501 12277739 5655543
38413 5655543 -1608274 -1769661 2678958 4024110 977633 -870493 1137197 2957540
38405 2957540 1298623 -507749 2200062 7276770 7771906 1870885 -3612620 -1808493
38397 -1808493 5169273 9145251 6380146 1197721 -825272 898848 3962517 7216476
38389 7216476 10041117 10237158 6435055 1181677 -1794393 -2404642 -3032691 -3582336 -1653880
$$ packed form
38448H507941k133822n34995J582508J472717m77405p68367R20478P48031j789866
38439G527220j868892J706578K728544k006309n658993j905097L812141K573331
38431F908523l326305m346394M90319K898067j23238k201496K32101K110593l37905
38422B304265k994261j923220m5899k73336P23232N256947P496773J733238o622196
38413E655543p263817j61387M448619J345152l046477j848126K007690J820343
38405B957540j658917j806372K707811N076708M95136n901021n483505J804127
38397a808493O977766L975978k765105n182425k022993J724120L063669L253959
38389G216476K824641J96041l802103n253378k976070o10249o28049n49645J928456
$$ plain form
38380 -1653880 2421371 4740779 3062276 -208098 -1388865 548091 4087551 6738190
38372 6738190 6141193 2501988 200225 3343143 8954792 8982271 1012370 -7547622 -9199944
38363 -9199944 -6065511 -5328952 -8273766 -9628579 -6375472 -1369938 1895477 2927790
38355 2927790 1807154 -1988292 -6608591 -7931152 -4991670 -1917705 -2085561 -3569573
38347 -3569573 -3152065 -1789288 -2499259 -5058616 -6804223 -7379706 -8579389 -9958831 -8680058
38338 -8680058 -4216189 267409 2113849 1845109 895344 -286188 -885864 296558 2035044
38329 2035044 1109514 -2442546 -3964421 -1050145 1574884 -1583626 -7940325 -9837945
38321 -9837945 -5661140 -2079878 -4059554 -8049228 -7999473 -4042554 -1220493 -1853939 -3155831
$$ packed form
38380a653880M075251K319408j678503l270374j180767J936956L539460K650639
38372F738190n96997l639205k301763L142918N611649K7479p969901q559992j652322
38363i199944L134433P36559k944814j354813L253107N005534L265415J032313
38355B927790j120636l795446m620299j322561K939482L073965j67856j484012
38347c569573M17508J362777p09971k559357j745607n75483j199683j379442J278773
38338h680058M463869M483598J846440k68740r49765j181532n99676J182422J738486
38329B035044r25530l552060j521875K914276K625029l158510o356699j897620
38321i837945M176805L581262j979676l989674M9755L956919K822061o33446j301892
$$ plain form
38312 -3155831 -1872340 1647336 4208907 2959704 -2029027 -7276617 -8573828 -5119222
38304 -5119222 -207690 2824844 3758924 3547685 1484358 -3190186 -8208893 -9796314
38296 -9796314 -7195143 -3484369 -1774446 -2270994 -3053764 -2165203 1067892 5379862 8210674
38287 8210674 8039245 5815218 3413798 1811972 1851939 4841438 9965987 12697609 9295826
38278 9295826 2543316 -529566 2775319 7594989 7882458 3289124 -1765470 -3626893
38270 -3626893 -2188774 323084 1477811 170033 -2657541 -4832191 -4826814 -2749288 -7821
38261 -7821 1353760 -52478 -3032731 -4223777 -2178147 181759 -454079 -2707702 -2765090
38252 -2765090 -734982 -430567 -2760298 -4137638 -2726426 -1526666 -2885179 -4213055
$$ packed form
38312c155831J283491L519676K561571j249203m988731n247590j297211L454606
38304e119222M911532L032534R34080k11239k063327m674544n018707j587421
38296i796314K601171L710774J709923m96548p82770Q88561L233095M311970K830812
38287H210674j71429k224027k401420j601826L9967K989499N124549K731622l401783
38278I295826o752510l072882L304885M819670K87469m593334n054594j861423
38270c626893J438119K511858J154727j307778k827574k174650N377K077526K741467
38261g821J361581j406238k980253j191046K045630K359906o35838k253623n7388
38252b765090K030108L04415k329731j377340J411212J199760j358513j327876
$$ plain form
38244 -4213055 -2386676 1097324 2964731 3274850 3849412 3958359 1763555 -1454982 -2610356
38235 -2610356 -1506495 -575924 -647158 -577630 -534635 -1788429 -3229126 -1917328 2203467
38226 2203467 5556826 5909055 4933353 4385438 2755241 -1799744 -7025556 -7953389 -2658783
38217 -2658783 5159844 9952307 9805208 7365309 5636513 4457082 2356561 375759
38209 375759 1015787 3585460 4453246 3130444 3798016 7982089 10071610 4970528 -3017753
38200 -3017753 -5173408 -611394 3298536 2655995 1748642 4022497 5522966 1879217
38192 1879217 -3494872 -4005353 268142 2997125 694784 -3568592 -5489646 -4462427
38184 -4462427 -2447844 -1069393 -1079817 -2695650 -5120255 -6500997 -5127013 -930652
$$ packed form
38244d213055J826379L484000J867407L10119N74562J08947k194804l218537j155374
38235b610356J103861R30571p1234O9528M2995j253794j440697J311798M120795
38226B203467L353359L52229r75702n47915j630197m554985n225812r27833N294606
38217b658783P818627M792463j47099k439899j728796j179431k100521j980802
38209C75759O40028K569673Q67786j322802O67572M184073K089521n101082p988281
38200c017753k155655M562014L909930o42541r07353K273855J500469l643749
38192A879217n374089n10481M273495K728983k302341m263376j921054J027219
38184d462427K014583J378451j0424j615833k424605j380742J373984M196361
$$ plain form
38176 -930652 3609200 4335169 -927061 -8914074 -13386096 -12418818 -10760214 -12806912 -16038804
38167 -16038804 -15013682 -9745997 -5334105 -4020976 -2860380 79747 2506322 3025243
38159 3025243 4517633 8637799 10860726 6243310 -1879815 -4709485 400961 6383185
38151 6383185 6147114 1294408 -1896183 -1657177 -1396448 -2719879 -2895435 -296765 1772722
38142 1772722 -424626 -4960597 -6082218 -1827422 3272430 4220932 2054153 2036724 6090934
38133 6090934 9704603 7580586 616741 -5046423 -5496721 -2848099 -791670 558119
38125 558119 2615034 3448167 -327590 -6801000 -8981513 -4052340 1817149 1697882 -2216152
38116 -2216152 -2056281 3852959 8422475 5980535 -133903 -2863394 -822008 991699
$$ packed form
38176i30652M539852P25969n262230p987013m472022R67278J658604k046698l231892
38167a6038804J025122N267685M411892J313129J160596K940127K426575N18921
38159C025243J492390M120166K222927m617416q123125k829670N110446N982224
38151F383185k36071m852706l190591K39006K60729j323431j75556K598670K069487
38142A772722k197348m535971j121621M254796N099852R48502k166779j7429M054210
38133F090934L613669k124017o963845n663164m50298K648622K056429J349789
38125E58119K056915Q33133l775757o473410k180513M929173N869489j19267l914034
38116b216152J59871N909240M569516k441940o114438k729491K041386J813707
$$ plain form
38108 991699 -1747856 -7738771 -11777682 -10015357 -3920775 661073 -280803 -3673735
38100 -3673735 -2836138 3337076 8313099 6939836 2555873 1390207 3187877 2846312
38092 2846312 -215320 -719207 3552630 7258954 4779653 -2033887 -6819601 -6725416 -3909795
38083 -3909795 -714381 2814464 6617585 8857012 7610808 3170798 -1869309 -4399958
38075 -4399958 -3094654 310648 2539015 2353134 1916613 3646057 6633825 7744985
38067 7744985 5818242 3094945 2355832 3985435 6194724 7097394 6110998 3965560 1809625
38058 1809625 358677 151739 2300572 7432906 13175547 14623937 9416506 1258964
38050 1258964 -3914730 -4500081 -3420410 -2747804 -1855674 -903709 -1609920 -2977306 -722260
$$ packed form
38108I91699k739555n990915m038911J762325O094582M581848r41876l392932
38100c673735Q37597O173214M976023j373263m383963j165666J797670l41565
38092B846312l061632n03887M271837L706324k479301o813540m785714R4185K815621
38083c909795L195414L528845L803121K239427j246204m440010n040107k530649
38075d399958J305304L405302K228367j85881m36521J729444K987768J111160
38067G744985j926743k723297p39113J629603K209289R02670r86396k145438k155935
38058A809625j450948k06938K148833N132334N742641J448390n207431q157542
38050A258964n173694n85351J079671O72606Q92130R51965p06211j367386K255046
$$ plain form
38041 -722260 6011050 11223969 9525518 4102537 2267835 4999532 6630599 4289580
38033 4289580 1410830 787454 160745 -2517286 -4455763 -2502147 1389283 3200637
38025 3200637 2684257 2204795 1951606 481240 -1437094 -1597915 -37648 1788229 4387098
38016 4387098 8603480 11521655 9021051 2650566 -1152617 77064 1710777 -140257
38008 -140257 -2527078 -902320 3385341 5259100 3267429 408967 -1115350 -1801622
38000 -1801622 -1905011 -493464 2047754 3660935 3604591 3391864 4004102 4420571 3893478
37991 3893478 3663645 5070196 7407525 9007414 9400173 9143408 8388090 7074006 6111087
37982 6111087 6782074 8661833 9327985 6934464 2492816 -1185435 -2451746 -1821155 -320675
$$ packed form
38041g22260O733310N212919j698451n422981j834702K731697J631067k341019
38033D289580k878750o23376o26709k678031j938477J953616L891430J811354
38025C200637n16380m79462k53189j470366j918334j60821J560267J825877K598869
38016D387098M216382K918175k500604o370485l803183J229681J633713j851034
38008a40257k386821J624758M287661J873759j991671k858462j524317o86272
38000a801622j03389J411547K541218J613181n6344k12727O12238M16469n27093
37991C893478k29833J406551K337329J599889L92759k56765p55318j314084r62919
37982F111087O70987J879759O66152k393521m441648l678251j266311O30591J500480
$$ plain form
37973 -320675 1608372 3052398 2205870 -1383826 -5197352 -6312627 -5035192 -3918299
37965 -3918299 -3620975 -2370693 305960 2304998 2413393 2265773 3269635 4104921 3174411
37956 3174411 1137577 -1137384 -4542300 -8784994 -10030442 -5451724 1532682 5029562
37948 5029562 4832934 5999846 10227714 12891198 10287780 5185524 2429236 2623486
37940 2623486 3254587 3155962 2423744 172874 -3788728 -6431764 -4616071 -316902 1073103
37931 1073103 -1822610 -4114961 -1331550 4413760 7308896 5384122 2432708 2396555
37923 2396555 4206856 3718907 -256341 -3984490 -3490392 365850 3063050 1980083
37915 1980083 -981440 -2203302 -6315 4625160 9007340 9975576 6356363 1302631
$$ packed form
37973c20675J929047J444026q46528l589696l813526j115275J277435J116893
37965c918299K97324J250282K676653J999038J08395j47620J003862Q35286r30510
37956C174411k036834k274961l404916m242694j245448M578718O984406L496880
37948E029562j96628J166912M227868K663484k603418n102256k756288J94250
37940B623486O31101r8625p32218k250870l961602k643036J815693M299169J390005
37931A073103k895713k292351K783411N745310K895136j924774k951414l6153
37923B396555J810301m87949l975248l728149M94098L856242K697200j082967
37915A980083k961523j221862K196987M631475M382180R68236l619213n053732
$$ plain form
37907 1302631 18623 3635531 7471494 7362140 5384893 6116060 8945322 8552940 3064140
37898 3064140 -2723913 -3938638 -1870300 -918072 -1849926 -1627136 1010352 3328440 2680126
37889 2680126 312991 -439735 1405384 3361667 2578989 -968416 -4671818 -6105333
37881 -6105333 -5166115 -3510664 -2421646 -1716919 -634192 896033 2270302 3015159 2790958
37872 2790958 759808 -3806485 -9523991 -12563099 -10097306 -4122649 -49807 -807986
37864 -807986 -4079999 -6420290 -7793799 -9579549 -10123353 -6461939 -148549 3215290
37856 3215290 1498304 -1159939 -1203160 -976721 -3556299 -6073234 -3578959 2440984 5316203
37847 5316203 2690143 -795664 -1148959 -27180 -72372 -50332 2025476 4311760 3443738
$$ packed form
37907A302631j284008L616908L835963j09354j977247P31167K829262l92382n488800
37898C064140n788053j214725K068338R52228r31854K22790K637488K318088o48314
37889B680126k367135p52726J845119J956283p82678l547405l703402j433515
37881f105333R39218J655451J089018P04727J082727J530225J374269P44857k24201
37872B790958k031150m566293n717506l039108K465793N974657M072842p58179
37864h07986l272013k340291j373509j785750n43804L661414O313390L363839
37856C215290j716986k658243m3221K26439k579578k516935K494275O019943K875219
37847E316203k626060l485807l53295J121779m5192K2040K075808K286284q68022
$$ plain form
37838 3443738 -367872 -3621997 -3857070 -1506378 1492307 3207933 3048492 2927214 5477950
37829 5477950 9903277 11862182 9081692 4458871 1572044 205574 -814289 213653
37821 213653 4453908 7970680 6100738 1108959 -281739 3177513 5615922 3190256
37813 3190256 -834596 -2146696 -1317480 -760842 -260404 847091 579005 -2681604 -6681820
37804 -6681820 -8429495 -8453661 -8288497 -6229910 -284101 6250985 7513277 3415164 327425
37795 327425 2267668 5619651 4614262 -1251487 -7704202 -11211450 -11436266 -9628714
37787 -9628714 -6955960 -3950865 -290312 4115748 7045881 4952255 -1918916 -7182810
37779 -7182810 -4546962 3922008 9473436 7646804 3916455 5791405 12320915 15778781
$$ packed form
37838C443738l811610l254125k35073K350692K998685J715626j59441j21278K550736
37829E477950M425327J958905k780490m622821k886827j366470j019863J027942
37821B13653M240255L516772j869942m991779j390698L459252K438409k425666
37813C190256m024852j312100Q29216N56638N00438J107495k68086l260609m000216
37804f681820j747675k4166J65164K058587N945809O535086J262292m098113l087739
37795C27425J940243L351983j005389n865749o452715l507248k24816J807552
37787i628714K672754L005095L660553M406060K930133k093626o871171n263894
37779g182810K635848Q468970N551428j826632l730349J874950O529510L457866
$$ plain form
37771 15778781 12513609 6977703 4075557 2486205 -1407531 -6710546 -9477829 -8979088
37763 -8979088 -7960952 -7360298 -5182523 -1012914 2363425 2981154 2090301 1429474 1144293
37754 1144293 1441172 2979636 4252959 2207280 -2438403 -4080169 615432 7420102
37746 7420102 9718563 6586909 2412041 667702 1562592 3881956 5488097 3821715
37738 3821715 -283756 -1276472 4184960 10832959 10644120 3880128 -1712397 -2263585 -1483904
37729 -1483904 -2105208 -1113969 3205092 6076425 3194996 -1802493 -2386444 1504763 4612719
37720 4612719 4663713 3969419 3843507 2961373 1584604 2596766 6915537 11304859 12225453
37711 12225453 9446576 4952641 739287 -1272374 419710 4918335 8767313 9282814
$$ packed form
37771A5778781l265172n535906k902146j589352l893736n303015k767283M98741
37763h979088J018136O00654K177775M169609L376339O17729q90853o60827k85181
37754A144293K96879J538464J273323k045679m645683j641766M695601O804670
37746G420102K298461l131654m174868j744339Q94890K319364J606141j666382
37738C821715m105471r92716N461432O647999j88839o763992n592525n51188P79681
37729a483904o21304R91239M319061K871333k881429m997489n83951L891207L107956
37720D612719N0994o94294j25912q82134j376769J012162M318771M389322R20594
37711A2225453k778877m493935m213354k011661J692084M498625L848978N15501
$$ plain form
37703 9282814 7220632 5201822 4394269 3727646 1788104 -1346631 -3897409 -3682183 -133289
37694 -133289 4650628 7382414 6502004 3358499 518721 -443382 637253 3294987 6712608
37685 6712608 9527986 10300934 8555366 5072834 1005980 -2932866 -6165761 -7729957
37677 -7729957 -6963683 -4652893 -2546586 -1540480 -1367199 -2322634 -5624134 -10846289 -14491539
37668 -14491539 -13171382 -7639120 -1859282 1367709 1858834 -196772 -4947113 -10672380
37660 -10672380 -13458028 -10727212 -4004306 2649792 5997510 5312199 2322839 -91144
37652 -91144 -603348 -1062739 -3878351 -8001569 -9856995 -8411819 -6464576 -6075087 -5638144
37643 -5638144 -3005308 1013382 4045069 5019341 4137495 2082133 745993 2462506
$$ packed form
37703I282814k062182k018810q07553o66623j939542l134735k550778K15226L548894
37694a33289M783917K731786q80410l143505k839778r62103J080635K657734L417621
37685F712608K815378P72948j745568l482532m066854l938846l232895j564196
37677g729957P66274K310790K106307J006106J73281r55435l301500n222155l645250
37668a4491539J320157N532262N779838L226991M91125k055606m750341n725267
37660a0672380k785648K730816O722906O654098L347718o85311k989360k413983
37652i1144n12204m59391k815612m123218j855426J445176J947243L89489M36943
37643e638144K632836M018690L031687R74272q81846k055362j336140J716513
$$ plain form
37635 2462506 6667735 9337273 7590018 3124247 -360495 -1216865 -180947 905502
37627 905502 -407647 -4940365 -8941421 -7275080 -1349906 865183 -4244416 -10091981
37619 -10091981 -9405677 -4623247 -2693245 -3668506 -2168343 2164474 3983479 1637008
37611 1637008 -560918 -353466 -680152 -2987393 -3856356 -928314 3119176 5104817 5185946
37602 5185946 3866030 -90845 -5943669 -9451841 -8275650 -5502692 -4833875 -5239350
37594 -5239350 -3314756 1386746 5928770 7268822 4517165 -286903 -3053982 -1631104
37586 -1631104 1038361 717340 -1720172 -1983386 15278 116131 -1832634 -528897 5481861
37577 5481861 9720714 6997814 1127488 -1018673 1668941 6081262 10500011 13748965
$$ packed form
37635B462506M205229K669538j747255m465771l484742q56370J035918J086449
37627I05502j313149m532718m001056J666341N925174K215089n109599n847565
37619a0091981O86304M782430J930002r75261J500163M332817J819005k346471
37611A637008k197926K07452l26686k307241q68963K928042M047490J985641Q1129
37602E185946j319916l956875n852824l508172J176191K772958O68817m05475
37594e239350J924594M701502M542024J340052k751657m804068k767079J422878
37586a631104K669465l21021k437512k63214J998664J00853j948765J303737O010758
37577E481861M238853k722900n870326k146161K687614M412321M418749L248954
$$ plain form
37569 13748965 13032183 7948324 3292294 3064900 4949588 4951529 3457692 2111944 -595575
37560 -595575 -5080941 -6870091 -3524836 -589266 -3146946 -6107234 -1899873 5941530
37552 5941530 7292099 1408786 -2585809 -721529 1455897 642994 808506 3572126
37544 3572126 3902591 -219872 -2924668 -224792 3380323 3288689 2231922 3619772 4509820
37535 4509820 1709421 -1190319 224986 3235716 2881313 567537 968072 3900202
37527 3900202 5955211 7163958 9512776 11467157 10284854 7344747 5184362 2234181
37519 2234181 -2783152 -4487515 2601964 12942098 14804433 6535070 -1083072 -474518
37511 -474518 3453487 3102721 -640820 -2270454 -848211 580195 1081288 1855223 2294241
$$ packed form
37569A3748965p16782n083859m656030k27394J884688J941j493837j345748k707519
37560e95575m485366j789150L345255K935570k557680k960288M207361P841403
37552E941530J350569n883313l994595J864280K177426q12903J65512K763620
37544C572126L30465m122463k704796K699876L605115r1634j056767J387850Q90048
37535D509820k800399k899740J415305L010730l54403k313776M00535K932130
37527C900202K055009J208747K348818J954381j182303k940107k160385k950181
37519B234181n017333j704363P089479J0340134J862335q269363p618142O08554
37511d74518L928005l50766l743541j629634J422243J428406N01093P73935M39018
$$ plain form
37502 2294241 734138 -1845068 -2452288 26853 3860686 6614057 6704079 4222436 1636301
37493 1636301 1765196 3533397 2313159 -3152877 -6980749 -3125663 5506889 9480280
37485 9480280 4488104 -3451977 -5821466 -1425752 3834370 4898490 2354988 -138649
37477 -138649 -424474 1226955 3911139 6795874 8538319 8149636 6993982 7956968 11228230
37468 11228230 12533356 7785444 -1220012 -8026457 -8311259 -3504667 2147160 5758249
37460 5758249 6809498 6480590 6816135 8517306 8944133 4698776 -2923815 -7831550 -6116024
37451 -6116024 -621198 3368499 4303895 3638345 1756211 -1322219 -2909345 -156950
37443 -156950 4567144 5399221 954347 -3569313 -3767350 -1552440 -983816 -2189044 -2714881
$$ packed form
37502B294241j560103k579206o07220K479141L833833K753371R0022k481643k586135
37493A636301J28895J768201j220238n466036l827872L855086Q632552L973391
37485I480280m992176p940081k369489M395714N260122J064120k543502k493637
37477a38649k85825J651429K684184K884735J742445l88683j155654R62986L271262
37468A1228230J305126m747912r005456o806445k84802M806592N651827L611089
37460E758249J051249l28908L35545J701171M26827m245357p622591m907735J715526
37451f116024N494826L989697R35396o65550j882134l078430j587126K752395
37443a56950M724094Q32077m444874m523660j98037K214910N68624j205228n25837
$$ plain form
37434 -2714881 -2101455 -1181186 1201784 6291306 11147498 11044619 6481199 3193716 3849663
37425 3849663 4275285 626210 -3760232 -2966086 2486044 6098853 4219764 -186611
37417 -186611 -3073355 -4317362 -5414873 -5652283 -3440929 370095 3161668 3701371 2718566
37408 2718566 1114105 -512965 -1051375 478617 3304642 5227004 4799247 2463454
37400 2463454 -258045 -1875584 -1595310 58077 1333426 854839 -789162 -1602962 -220939
37391 -220939 2989263 6415134 8229075 7424301 4563172 1308384 -1057307 -2130672
37383 -2130672 -1499219 1127419 4233104 4748056 1582658 -2403425 -3802903 -2945651 -2683038
37374 -2683038 -3788222 -4160964 -2438559 158036 2042669 3214633 4286243 5202718
$$ packed form
37434b714881O13426R20269K382970N089522M856192j02879m563420l287483O55947
37425C849663M25622l649075m386442P94146N452130L612809j879089m406375
37417a86611k886744j244007j097511k37410K211354L811024K791573N39703r82805
37408B718566j604461j627070n38410J529992K826025J922362m27757k335793
37400B463454k721499j617539K80274J653387J275349m78587j644001q13800J382023
37391b20939L210202L425871J813941q04774k861129l254788k365691j073365
37383b130672O31453K626638L105685N14952l165398l986083j399478Q57252K62613
37374b683038j105184l72742J722405K596595J884633J171964J071610R16475
$$ plain form
37366 5202718 5646182 5594661 5188912 4958538 5779260 7281579 7127941 3967043 355364
37357 355364 -100257 1800595 1673256 -1749387 -4462333 -3130405 330589 2272647 2353304
37348 2353304 2346840 2374053 1356008 -411702 -1906240 -3324515 -5039269 -6057914 -5791027
37339 -5791027 -5527658 -5502638 -2711538 4579922 11843695 12524471 6844588 1642506 981060
37330 981060 1746432 142618 -2147494 -1414823 1846253 3989837 3780995 3426070 4685649
37321 4685649 6796443 8233985 8371068 7134153 4621282 1494014 -1163143 -2596107
37313 -2596107 -2649886 -1730984 -950956 -1445591 -2680219 -2284477 1197880 5933815 8426845
37304 8426845 7230788 4003831 1311233 598596 1886561 3879392 4466671 2806125
$$ packed form
37366E202718M43464n1521m05749k30374Q20722J502319j53638l160898l611679
37357C55364m55621J900852j27339l422643k712946J331928L460994J942058Q0657
37348B353304o464K7213j018045j767710j494538j418275j714754j018645K66887
37339e791027K63369K5020K791100P291460P263773O80776n679883n202082o61446
37330I81060P65372j603814k290112P32671L261076K143584k08842l54925J259579
37321D685649K110794J437542J37083j236915k512871l127268k657157j432964
37313b596107n3779R18902P80028m94635j234628L95742L482357M735935K493030
37304H426845j196057l226957k692598p12637J287965J992831N87279j660546
$$ plain form
37296 2806125 1079670 2309454 5895747 7549603 5115820 2349220 4284866 10075300
37288 10075300 13757706 12129757 8325288 6335562 5420142 2658780 -1457248 -3600470
37280 -3600470 -2594599 -302855 1876170 3787869 4069964 1138915 -2744586 -2909632
37272 -2909632 592710 1941898 -1600787 -4509170 -1108376 5023174 5689241 -145053
37264 -145053 -5630793 -6259615 -4233732 -2204932 598376 3941329 4538868 1930331 1232796
37255 1232796 5790416 11285272 11886031 8756241 7072522 7192012 4941946 -332603
37247 -332603 -4198757 -4135152 -2641961 -2001695 -953261 1172968 1624008 -984924 -2585085
37238 -2585085 1165382 7465437 8834349 2916786 -4236530 -5785810 -1713211 3087248
$$ packed form
37296B806125j726455J229784L586293J653856k433783k766600J935646N790434
37288A0075300L682406j627949l804469j989726r15420k761362m116028k143222
37280c600470J005871K291744K179025J911699K82095k931049l883501j65046
37272b909632L502342J349188l542685k908383L400794O131550O66067n834294
37264a45053n485740o28822K025883K028800K803308L342953N97539k608537o97535
37255A232796M557620N494856O00759l129790j683719J19490k250066n274549
37247c32603l866154O3605J493191O40266J048434K126229M51040k608932j600161
37238b585085L750467O300055J368912n917563p153316j549280M072599M800459
$$ plain form
37230 3087248 5680634 7022059 8194776 8165496 5979517 2706396 -142342 -2428839
37222 -2428839 -4251123 -4607295 -3019294 -1164441 -669147 -277358 2195145 5763621 7184922
37213 7184922 5835515 4343736 3979797 3177516 1826687 2894697 7190575 10165915
37205 10165915 7669209 2371420 361388 2885122 5616511 5443655 3943285 3837160
37197 3837160 5260201 6257313 4896023 917010 -2947847 -2378554 3274485 8461533
37189 8461533 7581440 2685547 1084463 5762499 12439722 16073166 15683790 12396617
37181 12396617 7711281 4772877 6219411 9133112 7405989 1210692 -1762640 2256783
37173 2256783 6680920 4599805 -372199 -62918 5602375 9727221 9791382 9575929 10376303
$$ packed form
37230C087248K593386J341425J172717k9280k185979l273121k848738k286497
37222b428839j822284l56172J588001J854853M95294L91789K472503L568476J421301
37213G184922j349407j491779l63939q02281j350829J068010M295878K975340
37205A0165915k496706n297789k010032K523734K731389j72856j500370j06125
37197C837160J423041R97112j361290l979013l864857N69293N653039N187048
37189H461533q80093m895893j601084M678036O677223L633444l89376l287173
37181A2396617m685336k938404J446534K913701j727123o195297k973332M019423
37173B256783M424137k081115m972004L09281N665293M124846O4161k15453Q00374
$$ plain form
37164 10376303 8643290 3834053 1207835 3852706 7789596 8416464 7126622 7942195
37156 7942195 11221204 14124581 14555724 11891444 6539493 1276953 151895 3385609
37148 3385609 6088275 4614135 1242811 -222514 -105104 -437655 -193690 2322497 4801855
37139 4801855 4017668 2044840 3668017 8165847 9700666 6525781 3824836 5406414
37131 5406414 8010878 7071652 3729203 2151620 3039996 3976267 4151650 4622282 4985696
37122 4985696 3658916 1154710 -260817 -359575 -1547677 -5103981 -9046040 -10409763
37114 -10409763 -8073127 -3082489 2200724 5115772 4635323 2785634 2791250 5496307 8801347
37105 8801347 10522970 10259547 8642741 6861306 7067059 10699855 15540417 16944533
$$ packed form
37164A0376303j733013m809237k626218K644871L936890O26868j289842Q15573
37156G942195L279009K903377M31143k664280n351951n262540j125058L233714
37148C385609K702666j474140l371324j465325J17410l32551K43965K516187K479358
37139D801855p84187j972828J623177M497830J534819l174885k700945J581578
37131E406414K604464r39226l342449j577583Q88376R36271J75383M70632L63414
37122D985696j326780k504206j415527r8758j188102l556304l942059j363723
37114a0409763K336636M990638N283213K915048m80449j849689N616K705057L305040
37105H801347J721623k63423j616806j781435K05753L632796M840562J404116
$$ plain form
37097 16944533 13477873 8992906 7159213 6253839 2356089 -3841615 -7175649 -4877032
37089 -4877032 163656 3876082 5754524 7446907 8951689 8663809 6207970 3108573
37081 3108573 880598 -76400 82120 936049 1553655 1169191 325224 491687 2423945
37072 2423945 5571408 8988404 11938698 13647956 13528190 11917969 9764904 7457686
37064 7457686 4993802 3428611 4635555 8749774 13090117 14876237 14166616 12808054
37056 12808054 11334931 8771135 5259191 2821517 2881663 4562528 6317845 8025023
37048 8025023 10290728 12436339 12564184 9799521 5776414 3467828 4389358 6921382
37040 6921382 7798933 5647557 2474903 938916 987608 709386 -88336 628788 3872256
$$ packed form
37097A6944533l466660m484967j833693r05374l897750o197704l334034K298617
37089d877032N040688L712426J878442J692383J504782k87880k455839l099397
37081C108573k227975r56998J58520Q53929O17606l84464q43967J66463J932258
37072B423945L147463L416996K950294J709258j19766j610221k153065k307218
37064G457686k463884j565191J206944M114219M340343J786120p09621j358562
37056A2808054j473123k563796l511944k437674O0146J680865J755317J707178
37048H025023K265705K145611J27845k764663m023107k308586R21530K532024
37040F921382Q77551k151376l172654j535987M8692k78222p97722P17124L243468
$$ plain form
37031 3872256 8070780 11287893 12778793 11762539 7527694 2180303 230868 3042911
37023 3042911 6369700 6277169 4791278 5866701 8278048 7716360 4621864 3925136 6759248
37014 6759248 8560719 7113294 6519036 9857430 13052956 10824520 5198129 2747470
37006 2747470 5233890 8217409 8451873 7740160 8457189 9118452 6591564 868525 -4246398
36997 -4246398 -4845392 -558313 5459276 9887112 12043588 12923502 12741349 11478690 10976758
36988 10976758 13179876 16260411 16409422 14191456 14367518 17653868 18307974 13521617
36980 13521617 9433459 12020264 16938261 16054994 10660316 9151487 12986061 14746842
36972 14746842 11112732 7915163 8936283 8743816 2328852 -5365566 -6493331 -1695794
$$ packed form
37031C872256M198524L217113J490900j016254m234845n347391j949435K812043
37023C042911L326789r2531j485891J075423K411347n61688l094496o96728K834112
37014F759248J801471j447425n94258L338394L195526k228436n626391k450659
37006B747470K486420K983519K34464p11713P17029O61263k526888n723039n114923
36997d246398n98994M287079O017589M427836K156476Q79914j82153j262659n01932
36988A0976758K203118L080535J49011k217966J76062L286350O54106m786357
36980A3521617m088158K586805M917997q83267n394678j508829L834574J760781
36972A4746842l634110l197569J021120j92467o414964p694418j127765M797537
$$ plain form
36964 -1695794 2829903 5917589 11206006 18043080 20559580 16704152 11896533 11561785
36956 11561785 14596792 16615716 16121231 14571628 12585330 9364261 5601071 4411212
36948 4411212 7987406 14072343 17483603 15920030 12852552 12885489 15354154 15460528 11634607
36939 11634607 8144290 9076733 12992781 15768367 16142609 15811636 15874982 15849974 15152905
36930 15152905 13582743 11251254 9172685 8383101 7733761 5136971 2009395 2806429
36922 2806429 8052820 11988628 10589340 7956768 10078673 15617725 18575579 17639034
36914 17639034 16492136 16250337 14477777 11645543 11650207 14680602 16021454 14079160 13526657
36905 13526657 17350343 21238110 20082663 15847208 14258421 16511803 18895195 19028555
$$ packed form
36964a695794M525697L087686N288417O837074K516500l855428m807619l34748
36956A1561785L035007K018924m94485j549603j986298l221069l763190j189859
36948D411212L576194O084937L411260j563573l067478L2937K468665J06374l825921
36939A1634607l490317R32443L916048K775586L74242l30973O3346k5008o97069
36930A5152905j570162k331489k078569p89584o49340k596790l127576P97034
36922B806429N246391L935808j399288k632572K121905N539052K957854r36545
36914A7639034j146898k41799j772560k832234M664L030395J340852j942294n52503
36905A3526657L823686L887767j155447m235455j588787K253382K383392J33360
$$ plain form
36897 19028555 18268688 18485480 19781676 21414916 22692405 22959965 22192565 21298351 20910168
36888 20910168 20611322 19935248 18865420 16948012 13866270 11460536 12560696 16716581
36880 16716581 20080442 21161400 23191831 28043123 31388227 28270768 21018028 16385324
36872 16385324 15864817 14399620 9345021 5398922 8071353 15842044 21984118 22423206
36864 22423206 19181105 16850259 17735817 20473556 22243108 21889731 20753218 20350997
36856 20350997 20241789 19432798 18980085 20898054 24547458 26638513 25539125 23281073
36848 23281073 22244142 22121480 21642328 21077851 20970644 20246778 18081841 16227285 16769605
36839 16769605 18665419 19442274 19403717 20567721 21860847 19812473 14956049 12941014
$$ packed form
36897A9028555p59867K16792J296196J633240J277489K67560p67400q94214l88183
36888B0910168k98846o76074j069828j917408l081742k405734J100160M155885
36880A6716581L363861J080958K030431M851292L345104l117459p252740m632704
36872A6385324n20507j465197n054599l946099K672431P770691O142074M39088
36864B2423206l242101k330846Q85558K737739J769552l53377j136513m02221
36856B0350997j09208q08991m52713J917969L649404K091055j099388k258052
36848B3281073j036931j22662m79152n64477j07207p23866k164937j854556N42320
36839A6769605J895814P76855l8557J164004J293126k048374m856424k015035
$$ plain form
36831 12941014 16805491 22091096 23145589 21059658 20890593 23249752 23985098 21570720
36823 21570720 19382654 19708195 20270689 18690893 16616953 17027021 20262747 24857972
36815 24857972 29682842 33237935 33574616 31324181 30216734 31937174 33042480 30115681
36807 30115681 25496014 24011909 25995962 28059272 29525280 32817114 37304405 38197360
36799 38197360 33631704 28673692 29202130 34256602 37372655 34300351 27178405 21689520
36791 21689520 21621580 25794904 29357403 28569641 24834431 23159298 26111357 30463184
36783 30463184 30878640 26155636 20623445 19575108 24250405 31340557 36512435 37830703
36775 37830703 36370460 34889281 36246673 41361319 47077049 47546683 40618774 32205349
$$ packed form
36831A2941014L864477N285605J054493k085931j69065K359159P35346k414378
36823B1570720k188066L25541N62494j579796k073940M10068L235726M595225
36815B4857972M824870L555093L36681k250435j107447J720440J105306k926799
36807C0115681m619667j484105J984053K063310J466008L291834M487291Q92955
36799C8197360m565656m958012N28438N054472L116053l072304p121946n488885
36791B1689520o7940M173324L562499p87762l735210j675133K952059M351827
36783C0463184M15456m723004n532191j048337M675297P090152N171878J318268
36775C7830703j460243j481179J357392N114646N715730M69634o927909q413425
$$ plain form
36767 32205349 30647462 36464957 41942510 42089768 40886666 43558037 47817898 48245732
36759 48245732 45716157 45662081 48542229 49070557 45193343 41331413 41087752 42361895 42172372
36750 42172372 41610260 42884371 45016305 45856510 46140146 48461224 53144828 57164509
36742 57164509 57043120 52455718 47374348 46765085 50940113 54850422 55026294 54659894 58112840
36733 58112840 63007755 63354509 59091895 56109685 57102266 59101448 60452873 62949806
36725 62949806 65647518 64219382 59170200 57349669 61808417 67208230 69189822 70855553
36717 70855553 75022002 77682667 75711854 74107314 77849358 82588051 81918407 78594033
36709 78594033 79092648 81560417 79831172 76402143 79725417 89326965 95142150 92802111
$$ packed form
36767C2205349j557887N817495N477553J47258j203102K671371M259861M27834
36759D8245732k529575n4076K880148N28328l877214l861930k43661J274143j89523
36750D2172372n62112J274111K131934Q40205K83636K321078M683604M019681
36742E7164509j21389m587402n081370o09263M175028L910309J75872l66400L452946
36733E8112840M894915L46754m262614k982210R92581J999182J351425K496933
36725F2949806K697712j428136n049182j820531M458748N399813J981592J665731
36717G0855553M166449K660665j970813j604540L742044M738693o69644l324374
36709G8594033M98615K467769j729245l429029L323274R601548N815185k340039
$$ plain form
36701 92802111 88725542 87640391 85716354 80352845 77094314 80768082 87393809 91282831
36693 91282831 93830919 98659225 103538599 104504681 103927434 106786381 111476452 112116206
36685 112116206 109056116 109394313 115981353 122650335 123146659 119698368 118968624 122812597
36677 122812597 127169807 128549243 127669999 126777882 126774238 128055434 131499303 136704988 141020626
36668 141020626 142501626 142632949 143856493 145664868 146192873 146684947 150212273 155928397
36660 155928397 159409640 159826807 161474719 165766119 167442872 163109034 158318415 159992764
36652 159992764 165593291 167009183 162864826 159202029 158827627 158199427 155943682 156599956
36644 156599956 162806939 169914249 172109142 169393060 165193749 161123869 157577131 156132927
$$ packed form
36701I2802111m076569j085151j924037n363509l258531L673768O625727L889022
36693I1282831K548088M828306M879374R66082n77247K858947M690071O39754
36685A12116206l060090L38197O587040O668982M96324l448291p29744L843973
36677A22812597M357210J379436q79244q92117l644J281196L443869N205685M315638
36668A41020626J481000J31323J223544J808375N28005M92074L527326N716124
36660A55928397L481243M17167J647912M291400J676753m333838m790619J674349
36652A59992764N600527J415892m144357l662797l74402o28200k255745O56274
36644A56599956O206983P107310K194893k716082m199311m069880l546738j444204
$$ plain form
36636 156132927 157640862 159946879 160315010 158612058 156504997 155473928 156647636 159910865
36628 159910865 162131782 159590173 153610757 150147363 151836410 154314530 153037561 149820850
36620 149820850 148880809 149626750 148047690 143526228 139706399 138964210 139739222 139668674 138493500
36611 138493500 137108200 135672354 133666713 131161488 129510866 130396576 133491972 135508729
36603 135508729 133132232 126981684 121059796 118260894 118188148 119113073 119614475 118323356
36595 118323356 114971929 112036975 112267839 114090979 112864177 107516347 102348463 101069167
36587 101069167 102696876 104693207 106147252 106092211 102969226 98268650 96565493 98965099
36579 98965099 100505627 97413623 92891491 91616507 92270737 90485398 86296606 83338160
$$ packed form
36636A56132927J507935K306017L68131j702952k107061j031069J173708L263229
36628A59910865K220917k541609n979416l463394J689047K478120j276969l216711
36620A49820850r40041P45941j579060m521462l819829p42189P75012p0548j175174
36611A38493500j385300j435846k005641k505225j650622Q85710L095396K016757
36603A35508729k376497o150548n921888k798902p2746R24925N01402j291119
36595A18323356l351427k934954K30864J823140j226802n347830n167884j279296
36587A01069167J627709J996331J454045n5041l122985m700576j703157K399606
36579I8965099J540528l092004m522132j274984O54230j785339m188792k958446
$$ plain form
36571 83338160 82484356 81403690 79310798 77598397 76614139 75870827 76432590 79211821 82218839
36562 82218839 83506043 85106983 89301771 92631901 89433046 80713302 73532014 71343428
36554 71343428 70929931 69635908 69151978 70042012 68807466 63931212 59632592 59489189 60761025
36545 60761025 59656355 58264859 60589409 64475071 64016778 59067779 55863614 57522834
36537 57522834 60109123 60276369 60933231 65088442 68608154 65134288 56243126 50472571
36529 50472571 52083286 56419494 57795297 56531095 55358892 53920143 51384010 50702274
36521 50702274 54513095 58961825 57709567 51392427 47039985 47709154 48795768 46324308
36513 46324308 43084306 43322298 45878392 46504869 44030110 40683133 38353791 37458638
$$ packed form
36571H3338160q53804j080666k092892j712401r84258p43312N61763K779231L007018
36562H2218839J287204J600940M194788L330130l198855q719744p181288k188586
36554G1343428m13497j294023m83930Q90034j234546m876254m298620j43403J271836
36545F0761025j104670j391496K324550L885662m58293m948999l204165J659220
36537E7522834K586289J67246O56862M155211L519712l473866q891162n770555
36529E0472571J610715M336208J375803j264202j172203j438749k536133o81736
36521E0702274L810821M448730j252258o317140m352442O69169J086614k471460
36513D6324308l240002K37992K556094O26477k474759l346977k329342q95153
$$ plain form
36505 37458638 37967418 39308896 40464114 41247576 41808135 40806369 37217137 33976523
36497 33976523 35274268 39448330 40147645 36298819 34401380 37663923 39904971 35565925
36489 35565925 29214548 27980721 30013473 28902287 25461825 25602682 28805764 28732412
36481 28732412 24963505 24316072 28960879 32218745 29182868 23891542 22224486 24049342
36473 24049342 26369604 28766597 31429348 32184522 29756630 26718008 25583526 24857168
36465 24857168 22282875 19451046 19810589 23768475 28401936 30803150 29975986 26804734
36457 26804734 23439556 21442568 20073717 17984643 16116859 16193398 16966806 15840205
36449 15840205 14018384 15243996 18758180 18953644 14022152 9729760 11540037 17478806
$$ packed form
36505C7458638N08780J341478J155218P83462N60559j001766l589232l240614
36497C3976523J297745M174062O99315l848826j897439L262543K241048m339046
36489C5565925o351377j233827K032752j111186l440462J40857L203082p3352
36481B8732412l768907o47433M644807L257866l035877n291326j667056J824856
36473B4049342K320262K396993K662751P55174k427892l038622j134482p26358
36465B4857168k574293k831829L59543L957886M633461K401214q27164l171252
36457B6804734l365178j996988j368851k089074j867784P6539P73408j126601
36449A5840205j821821J225612L514184J95464m931492m292392J810277N938769
$$ plain form
36441 17478806 22285038 24567568 25849139 26000947 24184742 21993687 21360463 20918451
36433 20918451 18236468 14435612 13101971 15409763 19200252 22162501 23558951 23690266
36425 23690266 23708066 24946042 26806456 26775014 23959845 20491213 17837451 14658325 10680671
36416 10680671 9301641 12547237 16248890 15078209 10780704 10164741 15147694 19866252
36408 19866252 18778021 13389290 8927578 7521598 7359743 6902705 7099401 9169693
36400 9169693 11772014 11736314 7965831 3613322 2836776 5647857 8091481 7851311 6953101
36391 6953101 7640460 8533905 7420608 5520383 5679764 7702609 8925980 8870309 9940197
36382 9940197 13237956 16565190 17404025 15764992 13266995 11130080 10008569 10503656
$$ packed form
36441A7478806M806232K282530J281571J51808j816205k191055o33224m42012
36433B0918451k681983l800856j333641K307792L790489K962249J396450J31315
36425B3690266J7800J237976J860414l1442k815169l468632k653762l179126l977654
36416A0680671j379030L245596L701653j170681m297505o15963M982953M718558
36408A9866252j088231n388731m461712j405980j61855m57038J96696K070292
36400I169693K602321l5700l770483m352509p76546K811081K443624k40170q98210
36391F953101O87359Q93445j113297j900225J59381K022845J223371n5671J069888
36382I940197L297759L327234Q38835j639033k497997k136915j121511M95087
$$ plain form
36374 10503656 12694998 15586884 17704506 18294204 17817706 17135677 16189867 14130497 11249752
36365 11249752 9576964 10002462 10086201 7441844 4405598 5409751 9580235 10764610
36357 10764610 6711843 3415143 6869033 14332609 18120980 15472693 10253846 6719832
36349 6719832 5982669 7502385 9885102 10707613 8976624 7058086 7221111 7897347 7029432
36340 7029432 7105389 11760635 18431934 20217627 15505597 10369419 10113038 13288037 15873389
36331 15873389 16910748 17530484 17926357 17868367 17735372 17257950 15545129 13411425 12884212
36322 12884212 13504993 12424506 9246097 7053255 7171985 6949326 4735013 2858640
36314 2858640 2995472 2822535 751614 -53602 3239333 7410477 7551038 4689380 3868783
$$ packed form
36374A0503656K191342K891886K117622N89698m76498o82029r45810k059370k880745
36365A1249752j672788M25498Q3739k644357l036246J004153M170484J184375
36357A0764610m052767l296700L453890P463576L788371k648287n218847l534014
36349F719832p37163J519716K382717Q22511j730989j918538J63025O76236q67915
36340G029432P5957M655246O671299J785693m712030n136178k56381L174999K585352
36331A5873389J037359O19736L95873n7990j32995m77422j712821k133704n27213
36322A2884212O20781j080487l178409k192842J18730k22659k214313j876373
36314B858640J36832j72937k070921q05216L292935M171144J40561k861658q20597
$$ plain form
36305 3868783 6290734 8566036 8745424 8012977 7051569 5862807 6832146 12433261 19474062
36296 19474062 21278370 16875114 12557531 12405794 12818735 9488007 4637964 3120507
36288 3120507 5346010 8607533 12042101 15413882 15942152 12051700 8370602 10802699
36280 10802699 17252874 19489246 14747065 9309982 8850967 11207264 11934341 11794892
36272 11794892 14078780 18026938 19978205 19149808 17776664 16784916 15630468 15567209 18522724
36263 18522724 22638625 23225887 19053784 14025430 11561517 10965554 10873045 12497711 16680836
36254 16680836 20634724 21116954 19214087 18585435 19799906 19761891 16787480 13215350 12130371
36245 12130371 13800549 16473338 18863204 20476360 20843103 20045057 19259982 19272588 18887727
$$ packed form
36305C868783K421951K275302J79388p32447r61408j188762R69339N601115P040801
36296A9474062J804308m403256m317583j51737M12941l330728m850043j517457
36288C120507K225503L261523L434568L371781N28270l890452l681098K432097
36280A0802699O450175K236372m742181n437083m59015K356297P27077j39449
36272A1794892K283888L948158J951267q28397j373144r91748j154448o3259K955515
36263A8522724M115901N87262m172103n028354k463913n95963r2509J624666M183125
36254A6680836L953888M82230j902867o28652J214471l8015k974411l572130j084979
36245A2130371J670178K672789K389866J613156L66743p98046p85075J2606l84861
$$ plain form
36236 18887727 16411653 12603678 10330153 10708015 11385034 9992342 7800834 7822941 10170722
36227 10170722 12075238 12541394 13782886 16752675 18351711 15753952 11360102 10075422
36219 10075422 12703518 15481349 15793590 14701398 13415406 11177882 8356463 8201079
36211 8201079 12553549 17878380 18830891 15013639 11324239 11639519 14705216 16897456
36203 16897456 16840934 15827863 14979137 13904497 12080805 10002984 8380557 7315975
36195 7315975 7134840 8865199 12276422 14306789 11986786 7031918 4612503 6452082
36187 6452082 8120449 5290006 -41810 -2611377 -1098136 1294620 2136959 1884181
36179 1884181 1363443 824897 1294913 3559537 6058183 6888021 7047074 8044928 7644111
$$ packed form
36236A8887727k476074l807975k273525L77862O77019j392692k191508K2107K347781
36227A0170722J904516M66156J241492K969789J599036k597759m393850j284680
36219A0075422K628096K777831L12241j092192j285992k237524k821419j55384
36211H201079M352470N324831R52511l817252l689400L15280L065697K192240
36203A6897456n6522j013071q48726j074640j823692k077821j622427j064582
36195G315975j81135J730359L411223K030367k320003m954868k419415J839579
36187F452082J668367k830443n331816k569567J513241K392756Q42339k52778
36179A884181n20738n38546M70016K264624K498646Q29838J59053R97854m00817
$$ plain form
36170 7644111 2984644 -2898480 -3784583 344228 3299049 3063689 4630457 9983723
36162 9983723 13339025 10944340 7956868 9160584 9744149 3664124 -4120643 -3692786
36154 -3692786 4292512 9263324 6552863 3030890 5308674 10646676 12779298 10446830
36146 10446830 6741732 4676255 6061999 10672184 14489158 12934764 7578330 5134010
36138 5134010 7918904 10337174 7597820 2860587 1698734 3657796 4209222 2321094
36130 2321094 1119714 2430245 4995000 7474593 9595429 10647220 9961213 8702725
36122 8702725 8391058 7762144 4001522 -2381710 -6522746 -4431677 2206494 7856337
36114 7856337 9131884 7729640 7259143 8265034 7732396 3654163 -1491224 -3236188
$$ packed form
36170G644111m659467n883124q86103M128811K954821k35360J566768N353266
36162I983723L355302k394685k987472J203716N83565o080025p784767M27857
36154c692786P985298M970812k710461l521973K277784N338002K132622k332468
36146A0446830l705098k065477J385744M610185L816974j554394n356434k444320
36138E134010K784894K418270k739354m737233j161853J959062N51426j888128
36130B321094j201380J310531K564755K479593K120836J051791o86007j258488
36122H702725l11667o28914l760622o383232m141036K091069O638171N649843
36114G856337J275547j402244m70497J005891n32638m078233n145387j744964
$$ plain form
36106 -3236188 -382858 3737853 4962317 2027621 -2801751 -5416477 -2974350 2859096
36098 2859096 6633692 5183272 1836116 1769427 4515097 5267482 3047019 2198202 4769641
36089 4769641 7069534 6477584 6395407 10201344 14573375 14180322 10140240 7948187 8471561
36080 8471561 7073094 1764769 -3457645 -4881919 -3925613 -3393790 -2653088 436205 5156769
36071 5156769 8557031 9336518 8702572 7885745 6809255 5262651 3888346 3380180 3266351
36062 3266351 2194135 -115136 -1427446 1177249 7150548 11521866 10085448 4806940
36054 4806940 1569050 2687811 4563722 3310578 -476976 -4013394 -6184686 -6752507
36046 -6752507 -4660456 -513819 1620345 -878006 -4078680 -2333933 2397284 1984808
$$ packed form
36106c236188K853330M120711J224464k934696m829372k614726K442127N833446
36098B859096L774596j450420l347156o6689K745670P52385k220463q48817K571439
36089D769641K299893n91950q2177L805937M372031l93053m040082k192053N23374
36080H471561j398467n308325n222414j424274R56306N31823P40702L089293M720564
36071E156769L400262P79487o33946q16827j076490j546604j374305n08166j13829
36062C266351j072216k309271j312310K604695N973299M371318j436418n278508
36054D806940l237890J118761J875911j253144l787554l536418k171292n67821
36046f752507K092051M146637K134164k498351l200674J744747M731217m12476
$$ plain form
36038 1984808 -5871574 -12965145 -11053990 -2224421 5237569 7357380 6069822 3527022
36030 3527022 574490 -747078 1092229 3374846 2166064 -1253346 -2033897 456997
36022 456997 2155828 1939670 3472061 7808368 10337301 7991507 4182336 3188265 4261404
36013 4261404 4705607 4423881 3953047 2370424 743917 2938545 8758694 11151651 5482631
36004 5482631 -2729944 -5059187 -1195185 3316492 6334603 8967314 9495729 5611401
35996 5611401 913621 1235342 5487760 7646167 6750340 6953086 8394809 6801774 2500590
35987 2500590 975687 3192744 3980281 1708288 788305 2362655 1772409 -1533782 -1164756
35978 -1164756 4615884 7918669 3798853 -1129673 154360 3622080 2498349 -239743
$$ packed form
36038A984808p856382p093571J911155Q829569P461990K119811j287558k542800
36030C527022k952532j321568J839307K282617j208782l419410p80551K490894
36022D56997J698831k16158J532391M336307K528933k345794l809171r94071J073139
36013D261404M44203k81726m70834j582623j626507K194628N820149K392957n669020
36004E482631q212575k329243L864002M511677L018111K632711N28415l884328
35996E611401m697780L21721M252418K158407q95827K02746J441723j593035m301184
35987B500590j524903K217057P87537k271993r19983J574350n90246l306191L69026
35978a164756N780640L302785m119816m928526J284033L467720j123731k738092
$$ plain form
35970 -239743 2227636 7476469 7462167 2167677 -801177 1082383 2656643 1095911 -228371
35961 -228371 1132020 3168500 4178538 4687226 3814893 -185346 -5049522 -6072441 -3236407
35952 -3236407 -994910 -500146 1628282 5834475 7583839 4733272 820637 -1269297
35944 -1269297 -3015508 -5115366 -4727353 -1306360 539366 -1674605 -3283386 220043
35936 220043 5136032 4620780 -1149560 -5817711 -6136087 -4686436 -4016445 -3545353 -2732641
35927 -2732641 -2536453 -2588329 -978324 1691274 1759948 -1945411 -5267189 -4138323 -296567
35918 -296567 1753341 1729144 3326945 7130507 8170635 2601204 -6200007 -11149110 -9585690
35909 -9585690 -5102323 -2092305 -1419179 -1586190 -1519379 -1269508 -1606899 -3470045 -6530134
$$ packed form
35970b39743K467379N248833j4302n294490k968854J883560J574260j560732j324282
35961b28371J360391K036480J010038N08688q72333m000239m864176j022919K836034
35952c236407K241497M94764K128428M206193J749364k850567l912635k089934
35944a269297j746211k099858L88013L420993J845726k213971j608781L503429
35936B20043M915989n15252n770340m668151l18376J449651O69991M71092Q12712
35927b732641J96188n1876J610005K669598O8674l705359l321778J128866L841756
35918b96567K049908k4197J597801L803562J040128n569431q801211m949103J563420
35909i585690M483367L010018O73126j67011O6811K49871l37391j863146l060089
$$ plain form
35900 -6530134 -8483389 -7553270 -5266805 -4284620 -3881640 -1005945 3857613 5926825 2742610
35891 2742610 -2171189 -4391462 -3937680 -3140196 -2619603 -2397912 -3777747 -6471969 -6595614
35882 -6595614 -1572434 4985058 7248205 4376017 112078 -2892079 -4291033 -3403118
35874 -3403118 -37377 3025485 2844948 1000391 1367787 4012161 5543051 4805365 3745872
35865 3745872 3155909 2082601 1043063 1315341 1693892 749993 1177583 5889797 10618147
35856 10618147 7812351 -1531950 -7908338 -6995848 -4876792 -6112745 -5541489 1657693
35848 1657693 9282034 8303065 1152563 -1540896 3381133 8087392 6267878 1325393
35840 1325393 -267953 2142606 4524879 4454704 2946706 1769415 1403519 1245291 771936
$$ packed form
35900f530134j953255R30119K286465R82185M02980K875695M863558K069212l184215
35891B742610m913799k220273M53782P97484N20593K21691j379835k694222j23645
35882f595614N023180O557492K263147k872188m263939l004157j398954Q87915
35874c403118L365741L062862j80537j844557L67396K644374J530890p37686j059493
35865C745872n89963j073308j039538K72278L78551r43899M27590M712214M728350
35856A0618147k805796r344301o376388R12490K119056j235953N71256P199182
35848A657693P624341r78969p150502k693459M922029M706259j819514m942485
35840A325393j593346K410559K382273p0175j507998j177291l65896j58228m73355
$$ plain form
35831 771936 499022 1480473 3507676 4962509 5416525 6694754 9525087 10815131 7047792
35822 7047792 -453235 -6495435 -8040587 -6770733 -5712543 -5683739 -5361446 -3038113 1699000
35813 1699000 6484316 7128824 2365475 -3071810 -3167075 1669674 5014315 3168935 -182361
35804 -182361 164219 3731662 5963097 4791888 2121108 -258285 -2600065 -4709316
35796 -4709316 -4741151 -2167273 60083 -1470056 -6068205 -9326897 -8260587 -4564386
35788 -4564386 -2036744 -1983564 -2629080 -2598573 -2985348 -5074850 -7528354 -7712135 -5442675
35779 -5442675 -3374485 -3110556 -2832871 -290851 3236249 4261951 2027807 -377914
35771 -377914 -456633 526002 323476 -375197 655618 2835666 2684003 -1631810 -7742178
$$ packed form
35831G71936k72914R81451K027203J454833M54016J278229K830333J290044l767339
35822G047792p501027o042200j545152J269854J058190K8804L22293K323333M737113
35813A699000M785316O44508m763349n437285r5265M836749L344641j845380l351296
35804a82361L46580L567443K231435j171209k670780k379393k341780k109251
35796d709316l1835K573878K227356j530139m598149l258692J066310L696201
35788d564386K527642N3180o45516L0507l86775k089502k453504j83781K269460
35779e442675K068190K63929K77685K542020L527100J025702k234144k405721
35771c77914p8719R82635k02526o98673J030815K180048j51663m315813o110368
$$ plain form
35762 -7742178 -11644136 -11391726 -8103004 -4876630 -4714325 -7690882 -10158639 -8765122
35754 -8765122 -5055307 -3369577 -4239845 -3659176 85179 3101882 1808826 -1643102
35746 -1643102 -3068224 -2049429 -328516 2421792 6490699 8278028 4221699 -2449537
35738 -2449537 -4482862 -141569 5093343 6627943 5354989 3310682 196492 -3673785
35730 -3673785 -5750591 -5388695 -5709216 -8392251 -10092462 -7371809 -2358381 169950
35722 169950 -557841 -1097090 821361 3791883 5252911 4113003 908540 -2972733 -6066825
35713 -6066825 -7546450 -7020005 -3958064 1226970 5725860 6399279 3942237 2472013
35705 2472013 3919654 5456196 3976000 479780 -1999854 -2395882 -1220265 1487820
$$ packed form
35762g742178l901958K52410L288722L226374J62305k976557k467757J393517
35754h765122L709815J685730q70268N80669L744355L016703j293056l451928
35746a643102j425122J018795J720913K750308M068907J787329m056329o671236
35738b449537k033325M341293N234912J534600j272954k044307l114190l870277
35730c673785k076806L61896l20521k683035j700211K720653N013428K528331
35722A69950p27791n39249J918451K970522J461028j139908l204463l881273l094092
35713f066825j479625N26445L061941N185034M498890O73419k457042j470224
35705B472013J447641J536542j480196l496220k479634l96028J175617K708085
$$ plain form
35697 1487820 4982514 6463149 4180066 757502 137733 1824510 1621776 -1716947
35689 -1716947 -4160150 -2312187 1157560 962330 -2986115 -4776388 -759312 4446732
35681 4446732 3779502 -1723179 -3330167 3076559 10458685 10335529 4511856 1076175
35673 1076175 1893620 1942674 -12081 830870 5170582 6028560 -425080 -7815841 -8873190
35664 -8873190 -5757430 -4773182 -5807367 -4356663 -666034 819780 -549989 -1269150
35656 -1269150 -598160 -1320835 -3624741 -4317963 -2750722 -2045331 -3517327 -4828605 -4680201
35647 -4680201 -4617210 -5036890 -4061681 -1892255 -1820559 -4939771 -7868329 -7968625 -7164530
35638 -7164530 -8011136 -9215026 -8123309 -5362438 -3895180 -4664512 -5649819 -4732291 -1939416
$$ packed form
35697A487820L494694J480635k283083l422564o19769J686777k02734l338723
35689a716947k443203J847963L469747j95230l948445j790273M017076N206044
35681D446732o67230n502681j606988O406726P382126j23156n823673l435681
35673A076175Q17445M9054j954755Q42951M339712Q57978o453640p390761j057349
35664h873190L115760R84248j034185J450704L690629J485814j369769p19161
35656a269150O70990p22675k303906o93222J567241P05391j471996j311278J48404
35647d680201O2991m19680R75209K169426P1696l119212k928558j00296Q04095
35638g164530q46606j203890J091717K760871J467258p69332r85307R17528K792875
$$ plain form
35629 -1939416 787139 1389436 -31785 -674296 1876104 6067824 7854803 5919395
35621 5919395 3036107 1598869 489741 -2044027 -4631977 -4190850 -173653 4367347
35613 4367347 5816207 3359248 -359970 -1755466 297 2037080 1323167 -1709845
35605 -1709845 -4590140 -6681957 -8907362 -10195773 -7897310 -2489726 1692304 2130674
35597 2130674 1436448 2793729 4946144 4728964 2436133 1027295 1096945 488034 -1057346
35588 -1057346 -631895 3126023 7078926 7628010 5757902 5283543 6969033 7546859 5056233
35579 5056233 2135203 2106154 3923809 3717820 235204 -4176232 -7454525 -9375734 -9140566
35570 -9140566 -5282636 698331 4328919 4052344 3809412 6866802 10243795 9153831
$$ packed form
35629a939416K726555O02297j421221o42511K550400M191720J786979j935408
35621E919395k883288j437238j109128k533768k587950M41127M017197M541000
35613D367347J448860k456959l719218j395496J755763K036783p13913l033012
35605a709845k880295k091817k225405j288411K298463N407584M182030M38370
35597B130674o94226J357281K152415k17180k292831j408838O9650o08911j545380
35588a057346M25451L757918L952903N49084j870108m74359J685490N77826k490626
35579E056233k921030k9049J817655k05989l482616m411436l278293j921209K35168
35570i140566L857930N980967L630588k76575k42932L057390L376993j089964
$$ plain form
35562 9153831 4501839 1331810 1265354 1333330 -220398 -1844877 -2695069 -4107413 -5990185
35553 -5990185 -5840628 -2909748 69125 819738 168683 -459834 -1008898 -966957 964899
35544 964899 3647834 3432363 -375955 -3251107 -1555773 1890484 1793004 -2082168 -5010065
35535 -5010065 -3883803 -303775 2567008 3295443 2109031 -93151 -1905620 -1912023 317266
35526 317266 3934426 7191307 8037416 5507438 1114500 -2251531 -3324474 -3062939 -2049201
35517 -2049201 483112 4102481 6161333 5100026 2769221 1685840 2043592 3318694
35509 3318694 6241919 10359458 12135185 9361685 5738082 6541624 10478100 10630702
35501 10630702 3872090 -5240648 -10993126 -12466745 -11288545 -8046358 -3999911 -2525207
$$ packed form
35562I153831m651992l170029o6456O7976j553728j624479q50192j412344j882772
35553e990185J49557K930880K978873P50613o51055o28517n49064M1941J931856
35544I64899K682935k15471l808318k875152J695334L446257r7480l875172k927897
35535e010065J126262L580028K870783P28435j186412k202182j812469o403K229289
35526C17266L617160L256881Q46109k529978m392938l366031j072943K61535J013738
35517b049201K532313L619369K058852j061307k330805j083381L57752J275102
35509C318694K923225M117539J775727k773500l623603Q03542L936476J52602
35501A0630702o758612r112738n752478j473619J178200L242187M046447J474704
$$ plain form
35493 -2525207 -4838984 -6897509 -4651652 -384904 484546 -2717845 -6102297 -8134859
35485 -8134859 -10536080 -12182986 -8872417 -1462888 2278701 -1650601 -6474414 -4239882
35477 -4239882 1914290 2716912 -2423470 -4465497 938098 6944029 6591788 2917085
35469 2917085 2726688 5699247 6084822 2283851 -1469329 -1961162 -448303 674492 732559
35460 732559 58419 -698958 -503155 753389 1435831 427650 -1093327 -1971171 -3122099
35451 -3122099 -4905467 -5023634 -2378652 -521829 -3071439 -7713200 -9364586 -7575055
35443 -7575055 -5698664 -4212216 -818206 3356484 4000322 640554 -2516469 -3768436
35435 -3768436 -5915602 -9378544 -9437317 -3447727 4034433 6674731 3365410 -2443686
$$ packed form
35493b525207k313777k058525K245857M266748Q69450l202391l384452k032562
35485h134859k401221j646906L310569P409529L741589l929302m823813K234532
35477d239882O154172Q02622n140382k042027N403595O005931l52241l674703
35469B917085j90397K972559L85575l800971l753180m91833J512859J122795N8067
35460G32559o74140p57377J95803J256544O82442j008181j520977q77844j150928
35451c122099j783368j18167K644982J856823k549610m641761j651386J789531
35443g575055J876391J486448L394010M174690O43838l359768l157023j251967
35435c768436k147166l462942n8773N989590P482160K640298l309321n809096
$$ plain form
35427 -2443686 -6655264 -5942566 324525 7336845 8464001 3850156 597994 2130501
35419 2130501 3359460 107359 -3070026 -276934 5659901 7452625 4205607 982948
35411 982948 -153336 -1582949 -3677881 -3705528 -1414679 -46725 -1163146 -3189504 -5403670
35402 -5403670 -8652485 -11504458 -10317790 -4559847 1414627 3084823 -257140 -6235395
35394 -6235395 -11048041 -10729387 -4631963 1970634 2561075 -2540359 -6337763 -4333129
35386 -4333129 200663 1773422 56350 -911620 1286813 4982048 7127908 6463003
35378 6463003 3942927 1120071 -1319003 -3267488 -4056964 -3056809 -1583406 -2098474
35370 -2098474 -4541525 -5862859 -4741110 -3950049 -5677174 -7547031 -6701144 -4898317
$$ packed form
35427b443686m211578P12698O267091P012320J127156m613845l252162J532507
35419B130501J228959l252101l177385K793092N936835J792724l247018l222659
35411I82948j136284j429613k094932k7647K290849J367954j116421k026358k214166
35402e403670l248815k851973J186668N757943N974474J670196l341963n978255
35394f235395m812646L18654O097424O602597N90441n101434l797404K004634
35386d333129M533792J572759j717072r67970K198433L695235K145860o64905
35378F463003k520076k822856k439074j948485p89476J000155J473403n15068
35370b098474k443051j321334J121749P91061j727125j869857Q45887J802827
$$ plain form
35362 -4898317 -5091074 -5402253 -2024179 3406776 5519463 3945550 3918012 7254600 9122891
35353 9122891 6083973 1707379 857302 2886026 4189295 4020175 3911718 3743057 2031377
35344 2031377 -1096010 -3812847 -4601682 -2954489 468742 3333330 3182202 464339
35336 464339 -2037476 -3334118 -5014922 -7385387 -8500030 -8227151 -9119895 -11300784 -10936827
35327 -10936827 -6659765 -2946234 -3147686 -3516561 535862 5820819 5612660 517701
35319 517701 -2107070 491629 2789443 459660 -2811510 -1603557 2698100 4151290
35311 4151290 666076 -3960542 -5539018 -3744689 -970477 559306 63202 -1740491
35303 -1740491 -3182480 -3029110 -1606570 -125249 879570 1703268 2276142 1908568 613206
$$ packed form
35362d898317j92757l11179L378074N430955K112687j573913k7538L336588J868291
35353I122891l038918m376594q50077K028724J303269j69120j08457j68661j711680
35344B031377l127387k716837p88835J647193L423231K864588j51128k717863
35336D64339k501815j296642j680804k370465j114643K72879q92744k180889L63957
35327a0936827M277062L713531k01452l68875M052423N284957k08159n094959
35319E17701k624771K598699K297814k329783l271170J207953M301657J453190
35311D151290l485214m626618j578476J794329K774212J529783m96104j803693
35303a740491j441989J53370J422540J481321J004819Q23698N72874l67574j295362
$$ plain form
35294 613206 -262594 360575 1553546 1506138 505700 1279784 5250942 9508792 9424839
35285 9424839 4336483 -1138109 -2300601 277333 1729099 -1345629 -7270543 -11598934
35277 -11598934 -12226757 -11356677 -12107527 -13999627 -13359471 -8566117 -3088347 -1698032 -4734623
35268 -4734623 -8029192 -7881840 -4143734 1045479 5097851 5644554 2132801 -2494320
35260 -2494320 -3972994 -1467779 1650009 2115249 -426237 -5134707 -11098508 -15360995
35252 -15360995 -13486506 -5137741 3332493 5326644 1750667 -873895 796591 3435313
35244 3435313 2586061 -1270311 -3578867 -1262903 3756239 6456298 4013941 -951994
35236 -951994 -3248945 -1211961 1672008 1791935 -42056 -570822 1253186 3659901 4866221
$$ packed form
35294F13206q75800O23169J192971m7408j000438P74084L971158M257850q3953
35285I424839n088356n474592j162492K577934J451766l074728n924914m328391
35277a1598934o27823Q70080p50850j892100O40156M793354N477770J390315l036591
35268d734623l294569J47352L738106N189213M052372N46703l511753m627121
35260b494320j478674K505215L117788M65240k541486m708470n963801m262487
35252a5360995J874489Q348765Q470234J994151l575977k624562J670486K638722
35244C435313q49252l856372k308556K315964N019142K700059k442357m965935
35236i51994k296951K036984K883969J19927j833991n28766J824008K406715J206320
$$ plain form
35227 4866221 4418736 2612504 376844 -1032788 -1572987 -2387161 -3109690 -1581199 1676743
35218 1676743 1772963 -3890992 -9657205 -7577962 1523916 8617095 8484507 5299914 4371229
35209 4371229 4311525 1484558 -2420539 -2958701 -807747 -1257732 -5935982 -9989023 -8791583
35200 -8791583 -3708855 719263 2493334 2709964 2416048 1732369 1321723 2065941 3224719
35191 3224719 3235966 2721618 4091895 6937828 6684352 691109 -6324325 -7070381 -1393779
35182 -1393779 3293378 2148396 -1212277 -1269080 1468448 3113103 3471194 5088206 7035655
35173 7035655 5468241 360053 -3612134 -3959689 -3515801 -5020321 -6740056 -5880299 -3074080
35164 -3074080 -827165 107345 385373 -5742 -1327610 -2995369 -4417804 -5503928 -5447905
$$ packed form
35227D866221m47485j806232k235660j409632n40199q14174p22529J528491L257942
35218A676743R6220n663955n766213K079243R101878P093179j32588l184593r28685
35209D371229n9704k826967l905097n38162K150954m49985m678250m053041J197440
35200h791583N082728M428118J774071K16630k93916o83679m10646P44218J158778
35191C224719J1247n14348J370277K845933k53476n993243p015434p46056N676602
35182a393779M687157j144982l360673n6803K737528J644655L58091J617012J947449
35173G035655j567414n108188l972187l47555M43888j504520j719735Q59757K806219
35164c074080K246915R34510K78028l91115j321868j667759j422435j086124N6023
$$ plain form
35155 -5447905 -3132837 230828 1432787 -352427 -2152358 -1776454 -891732 -1457860 -2152285
35146 -2152285 -1101762 584884 1133576 1441812 2715232 3175895 1022501 -1355488 -438995
35137 -438995 2618386 3727003 2364834 1655275 2450767 2251801 388772 -362507 1592325
35128 1592325 4332459 5745447 5610631 3585498 -980615 -5972961 -7050581 -3047606
35120 -3047606 2197258 4756844 4334837 2156042 -1064544 -3517028 -2617748 796993
35112 796993 2103966 -845706 -4372763 -4349334 -1580051 997381 3122112 5771852 7736996
35103 7736996 7350283 5574351 4113078 2507558 151085 -1189168 -193339 1078171
35095 1078171 603956 205693 1972783 3511888 1495504 -2234063 -3335258 -2091456
$$ packed form
35155e447905K315068L363665J201959j785214j799931L75904Q84722n66128o94425
35146b152285J050523J686646N48692L08236J273420M60663k153394k377989R16493
35137d38995L057381J108617j362169p09559P95492j98966j863029p51279J954832
35128A592325K740134J412988j34816k025133m566113m992346j077620M002975
35120c047606N244864K559586m22007k178795l220586k452484Q99280L414741
35112G96993J306973k949672l527057K3429K769283K577432K124731K649740J965144
35103G736996l86713j775932j461273j605520k356473j340253R95829J271510
35095A078171m74215l98263J767090J539105k016384l729567j101195J243802
$$ plain form
35087 -2091456 -2336400 -4423889 -5130209 -4033130 -3928279 -4771233 -3360103 166704 1663350
35078 1663350 179517 -306784 1618203 1758924 -2237818 -6178049 -5971410 -3947080 -4097252
35069 -4097252 -5368664 -4639680 -2913610 -3276700 -5013923 -4752295 -1978799 947151 2975044
35060 2975044 4415946 4023526 392996 -4175245 -5303863 -2361184 550408 -96088
35052 -96088 -3364028 -5543543 -3944645 818156 4957353 4779442 1144431 -928330 1190777
35043 1190777 3809653 2168009 -2558596 -5113986 -3652394 -1510878 -2001579 -4921621
35035 -4921621 -8121025 -9482876 -7432405 -2285307 2938334 5362667 5422427 5045353 4066493
35026 4066493 1444292 -1411752 -2310238 -2228955 -3507500 -4986461 -3597305 -235558 1320919
$$ packed form
35087b091456k44944k087489p06320J097079J04851q42954J411130L526807J496646
35078A663350j483833m86301J924987J40721l996742l940231K06639K024330j50172
35069d097252j271412P28984J726070l63090j737223K61628K773496K925950K027893
35060B975044J440902l92420l630530m568241j128618K942679K911592o46496
35052i6088l267940k179515J598898M762801M139197j77911l635011k072761K119107
35043A190777K618876j641644m726605k555390J461592K141516m90701k920042
35035d921621l199404j361851K050471N147098N223641K424333N9760l77074r78860
35026D066493k622201k856044q98486Q1283j278545j478961J389156L361747J556477
$$ plain form
35017 1320919 1478442 4670835 10681386 12607187 6913771 -114179 -873627 2805780
35009 2805780 3191668 -1618760 -5793193 -5176795 -2714199 -2746269 -4321955 -3377385 693093
35000 693093 4174001 4555745 3919251 5277711 7501540 6711141 2318620 -1672730 -2507769
34991 -2507769 -2448112 -4241805 -5940417 -4146034 -264945 1311726 351284 1031443 4920526
34982 4920526 8608359 9169659 7408962 4671511 1161287 -1308648 -116665 2637298
34974 2637298 1001599 -5353920 -8261219 -2301107 6077225 6703431 -629760 -7302131
34966 -7302131 -8513578 -7641350 -8238855 -8618585 -6378714 -3168273 -1997436 -2845491 -3506720
34957 -3506720 -3073081 -2635145 -3316280 -4755206 -5435673 -4497318 -3208741 -3596409 -5255988
$$ packed form
35017A320919J57523L192393O010551J925801n693416p027950p59448L679407
35009B805780L85888m810428m174433O16398K462596l2070j575686R44570M070478
35000F93093L480908L81744o36494J358460K223829p90399m392521l991350q35039
34991b507769N9657j793693j698612J794383L881089J576671r60442O80159L889083
34982D920526L687833N61300j760697k737451l510224k469935J191983K753963
34974B637298j635699o355519k907299N960112Q378332O26206p333191o672371
34966g302131j211447Q72228n97505l79730K239871L210441J170837q48055o61229
34957c506720M33639M37936o81135j438926o80467R38355J288577l87668j659579
$$ plain form
34948 -5255988 -5389315 -3059230 -1124905 -2114800 -4471840 -5301297 -4586925 -3719523 -2008035
34939 -2008035 1659667 5283266 5881298 4182208 3288946 3409385 1952136 -1472216 -4142584
34930 -4142584 -4354086 -2833711 -176839 3388544 5806209 4695497 1119201 -1969873
34922 -1969873 -4734816 -9397893 -14278035 -14191112 -7796942 331502 5973554 8604319
34914 8604319 7810499 2727810 -3013322 -2612977 4209110 9294377 7906049 5690703
34906 5690703 8228443 10634787 5745958 -2750153 -5387908 -2167051 -1970658 -7198525
34898 -7198525 -9873998 -5471912 -719233 -2678006 -7806251 -8196873 -3365452 825381
34890 825381 1800961 2443684 4774936 6769156 5929112 2774602 207597 933038 4991272
$$ packed form
34948e255988j33327K330085J934325r89895k357040q29457P14372Q67402J711488
34939b008035L667702L623599N98032j699090q93262J20439j457249l424352k670368
34930d142584k11502J520375K656872L565383K417665j110712l576296l089074
34922a969873k764943m663077m880142Q6923O394170Q128444N642052K630765
34914H604319p93820n082689n741132M00345O822087N085267j388328k215346
34906E690703K537740K406344m888829q496111k637755L220857J96393n227867
34898g198525k675473M402086M752679j958773n128245l90622M831421M190833
34890H25381R75580O42723K331252J994220q40044l154510k567005P25441M058234
$$ plain form
34881 4991272 8817990 8284011 3944481 1140734 3140668 6708857 7047095 4643190
34873 4643190 3674682 5312935 6600475 5321870 2279148 -1192854 -4574673 -6689927
34865 -6689927 -5902214 -2495306 1361909 4287801 6303220 7153075 6635120 6299134 7751753
34856 7751753 9312086 7783132 3840982 1806594 3186185 4641729 4064537 4178680
34848 4178680 7080365 9253462 6401995 508575 -2793047 -2410950 -2426191 -4846647 -6527646
34839 -6527646 -4447843 -337270 1723822 -101739 -4601374 -9229717 -11249522 -8918485
34831 -8918485 -3288184 1866518 3113096 383331 -3117297 -3692553 -275859 4501718
34823 4501718 6797805 5649006 3538807 2272231 460117 -3045923 -5774059 -5135095
$$ packed form
34881D991272L826718n33979m339530k803747J999934L568189L38238k403905
34873D643190r68508J638253J287540j278605l042722l472002l381819k115254
34865f689927P87713L406908L857215K925892K015419Q49855n17955l35986J452619
34856G751753J560333j528954l942150k034388J379591J455544n77192J14143
34848D178680K901685K173097k851467n893420l301622L82097j5241k420456j680999
34839f527646K079803M110573K061092j825561m499635m628343k019805K331037
34831h918485N630301N154702J246578k729765l500628n75256L416694M777577
34823D501718K296087j148799k110199j266576j812114l506040k728136O38964
$$ plain form
34815 -5135095 -3319390 -4028400 -5398064 -2000028 5635743 9950846 7220352 3174539
34807 3174539 3455462 4243723 -958850 -9185692 -11074308 -5093485 -113266 -1896454
34799 -1896454 -4729933 -874876 7526153 12039181 10027277 6611288 5703122 5510257
34791 5510257 3984899 3086228 4683908 6251634 4493204 855720 -598863 414090
34783 414090 266609 -2434547 -4600366 -3604455 -973667 666826 1420341 2601191 3791263
34774 3791263 4070157 4275437 5145526 4832325 1660429 -1675765 -549259 4908204 9127016
34765 9127016 7877344 2722266 -2180037 -4801005 -5477328 -5073545 -4675084 -5231797 -5997576
34756 -5997576 -4900223 -1575170 1783221 3717587 5494382 8127693 9490303 6848743
$$ packed form
34815e135095J815705p09010j369664L398036P635771M315103k730494m045813
34807C174539K80923P88261n202573q226842j888616N980823M980219j783188
34799a896454k833479L855057Q401029M513028k011904l415989r08166j92865
34791E510257j525358q98671J597680J567726j758430l637484j454583J012953
34783D14090j47481k701156k165819R95911K630788J640493P53515J180850J190072
34774C791263K78894K05280Q70089l13201l171896l336194J126506N457463M218812
34765I127016j249672n155078m902303k620968o76323M03783L98461n56713p65779
34756e997576J097353L325053L358391J934366J776795K633311J362610k641560
$$ plain form
34748 6848743 1163338 -3561747 -4965731 -4540981 -5076896 -7235208 -9101967 -8597082 -5920631
34739 -5920631 -3300239 -2245103 -2010723 -1652188 -2281381 -5237790 -8825270 -9611857 -7093053
34730 -7093053 -4541887 -4788585 -7340344 -9860723 -10186532 -6999903 -1368672 2451925
34722 2451925 1166601 -2470191 -2622086 1217528 3454396 1024301 -2561887 -3828977
34714 -3828977 -4234487 -5058460 -3042044 3880658 10957773 12296720 8809743 5139249
34706 5139249 1931493 -2883066 -7886087 -9823921 -9701577 -10800842 -12011461 -9784198
34698 -9784198 -5674715 -4633521 -5895663 -3346064 3732338 7904612 4366197 -2197450
34690 -2197450 -5113732 -4254183 -2889324 -1117284 2487440 6164647 6879362 4811924
$$ packed form
34748F848743n685405m725085j403984M24750n35915k158312j866759N04885K676451
34739e920631K620392J055136K34380L58535o29193k956409l587480p86587K518804
34730g093053K551166k46698k551759k520379l25809L186629N631231L820597
34722B451925j285324l636792j51895L839614K236868k430095l586188j267090
34714c828977m05510q23973K016416O922702P077115J338947l486977l670494
34706E139249l207756m814559n003021j937834J22344j099265j210619K227263
34698i784198M109483J041194j262142K549599P078402M172274l538415o563647
34690b197450k916282Q59549J364859J772040L604724L677207P14715k067438
$$ plain form
34682 4811924 1956237 -1679829 -6510651 -9806438 -8064817 -2412206 2052516 2391142
34674 2391142 393401 -1117581 -1768124 -2584277 -3479693 -3121417 -624902 3316501 6808642
34665 6808642 8163075 7193739 5235794 3931049 4066948 5307604 6613909 7020635 6320210
34656 6320210 4922203 3204114 1640378 1240288 2395567 3332784 1830670 -1110955
34648 -1110955 -2005840 -258021 478734 -1798975 -3823127 -2401272 114590 -116374 -1878957
34639 -1878957 -1467016 441622 150064 -2139880 -2677689 -911725 -155 -574570 -36216
34630 -36216 1234557 -862722 -6888209 -11310875 -9576626 -3440726 2460789 5234532
34622 5234532 3897879 -275968 -2495845 1089673 6339820 4678634 -4153365 -9688355
$$ packed form
34682D811924k855687l636066m830822l295787J741621N652611M464722L38626
34674B391142j997741j510982o50543q16153q95416L58276K496515L941403L492141
34665F808642J354433r69336j957945j304745J35899J240656J306305M06726p00425
34656F320210j398007j718089j563736m00090J155279R37217j502114k941625
34648a110955q94885J747819P36755k277709k024152J421855K515862k30964j762583
34639a878957M11941J908638k91558k289944n37809J765964R11570n74415N38354
34630c6216J270773k097279o025487m422666J734249O135900N901515K773743
34622E234532j336653m173847k219877L585518N250147j661186q831999n534990
$$ plain form
34614 -9688355 -4728975 4748019 8675578 6128831 3319271 2884195 2293618 563459
34606 563459 -197471 523148 549438 -1288779 -3982290 -6558492 -8598564 -9254380 -8282212
34597 -8282212 -7212226 -7455804 -8378092 -8738073 -8286067 -6716905 -3588122 -622416 -900107
34588 -900107 -4113431 -6246334 -5744041 -5549427 -6646685 -5011564 1028849 5699341 3547548
34579 3547548 -1884441 -3273574 -227210 1524092 -663099 -4271071 -7343322 -10274462
34571 -10274462 -12528517 -12816303 -12114340 -12055054 -11212961 -7346127 -2150265 643378 581768
34562 581768 -478095 -2762390 -6874841 -9454917 -6461620 42 3777098 3081956
34554 3081956 1430778 886907 183310 -712500 -135216 943946 -186296 -2479318 -2268903
$$ packed form
34614i688355M959380R476994L927559k546747k809560m35076n90577j730159
34606E63459p60930P20619K6290j838217k693511k576202k040072o55816R72168
34597h282212J069986k43578r22288l59981M52006J569162L128783K965706k77691
34588i00107l213324k132903N02293J94614j097258J635121O040413M670492k151793
34579C547548n431989j389133L046364J751302k187191l607972l072251k931140
34571a0274462k254055k87786P01963N9286Q42093L866834N195862K793643o1610
34562E81768j059863k284295m112451k580076K993297O461662L777056o95142
34554C081956j651178n43871p03597q95810N77284J079162j130242k293022K10415
$$ plain form
34545 -2268903 -165095 -591293 -3657151 -4098279 -104010 3187571 1674173 -2030365
34537 -2030365 -4106324 -5442693 -8095811 -10087328 -8204833 -3477690 -102615 -232854
34529 -232854 -2223940 -2955546 -671809 3095927 4119261 50340 -5751377 -7829534
34521 -7829534 -5815385 -4351224 -5782065 -7230245 -5816468 -2540364 443947 2532632
34513 2532632 3183742 1467341 -1351537 -2320548 -1279305 -1229863 -2990999 -3549700 -1451520
34504 -1451520 369558 -436529 -1629270 -287808 2240856 2348404 -784191 -4533589
34496 -4533589 -5977188 -4271137 -978591 1457961 2488474 3733857 4996394 2721032
34488 2721032 -3965310 -8873169 -6343347 -800507 -1094157 -6645957 -8430872 -4069544
$$ packed form
34545b268903K103808m26198l065858m41128L994269L291581j513398l704538
34537b030365k075959j336369k653118j991517J882495M727143L375075j30239
34529b32854j991086p31606K283737L767736J023334m068921n801717k078157
34521g829534K014149J464161j430841j448180J413777L276104K984311K088685
34513B532632O51110j716401k818878r69011J041243M9442j761136n58701K098180
34504a451520J821078q06087j192741J341462K528664J07548l132595l749398
34496d533589j443599J706051L292546K436552J030513J245383J262537k275362
34488B721032o686342m907859K529822N542840k93650n551800j784915M361328
$$ plain form
34480 -4069544 -1486305 -4770065 -7058634 -2860337 2256726 1557964 -1526230 -440969
34472 -440969 2816969 2324474 -537830 -103460 2739321 2155332 -2211619 -5275433 -5790151
34463 -5790151 -7141901 -9286601 -8060278 -3167359 362389 -282564 -2967659 -6009577
34455 -6009577 -9838520 -12382914 -9539792 -2254223 2905822 2745554 1585481 3540815
34447 3540815 5732535 3106318 -3634831 -9099306 -10234133 -8818046 -7881079 -8317819
34439 -8317819 -8966872 -8401187 -6162606 -2596370 1909574 6432838 8412052 5514303
34431 5514303 -155424 -2600986 797659 5302207 5470931 3044090 3492670 6755799
34423 6755799 7380748 3537357 -205565 -362074 577296 -965343 -4114939 -5606077 -4353340
$$ packed form
34480d069544K583239l283760k288569M198297N117063o98762l084194J085261
34472d40969L257938m92495k862304M34370K842781n83989m366951l063814n14718
34463e790151j351750k144700J226323M892919L529748o44953k685095l041918
34455f009577l828943k544394K843122P285569N160045j60268j160073J955334
34447C540815K191720k626217o741149n464475j134827J416087R36967m36740
34439h317819o49053N65685K238581L566236M505944M523264J979214k897749
34431E514303n669727k445562L398645M504548J68724k426841M48580L263129
34423F755799O24949l843391l742922j56509R39370j542639l149596j491138J252737
$$ plain form
34414 -4353340 -1611994 1016560 1892559 986 -2934384 -3174532 525127 5122514
34406 5122514 7460276 8013961 8682763 9010764 7194731 3778719 1818667 3227838 6431581
34397 6431581 8085076 6537865 3257056 806652 -234547 -1455686 -3550932 -4596317
34389 -4596317 -2565409 1669004 5361393 6891295 6237789 3790068 688543 -891655
34381 -891655 -235413 56559 -2728960 -7096638 -8897862 -6629992 -2493283 1167661 3376832
34372 3376832 2971846 -797280 -5733777 -8174061 -7812430 -7934233 -9896874 -10625114 -7309480
34363 -7309480 -1924215 1141071 344643 -1964272 -2763867 -1255679 844058 1142105 -839432
34354 -839432 -2833287 -2296262 670213 3914004 5981433 6602668 5219205 1486501 -2733181
$$ packed form
34414d353340K741346K628554Q75999j891573k935370k40148L699659M597387
34406E122514K337762N53685O68802L28001j816033l416012j960052J409171L203743
34397F431581J653495j547211l280809k450404j041199j221139k095246j045385
34389d596317K030908M234413L692389J529902o53506k447721l101525j580198
34381h91655O56242K91972k785519m367678j801224K267870M136709L660944K209171
34372C376832m04986l769126m936497k440284L61631j21803j962641p28240L315634
34363g309480N385265L065286p96428k308915p99595J508188K099737K98047j981537
34354h39432j993855N37025K966475L243791K067429O21235j383463l732704m219682
$$ plain form
34345 -2733181 -4218264 -1823254 2487045 6114310 7702009 6763463 3648241 316410
34337 316410 -683542 1273477 4401998 6605571 7172786 6778701 6745574 7625461 7815325
34328 7815325 5126324 763498 -712488 2496040 5931610 4568984 -313741 -3631505
34320 -3631505 -3803228 -3255363 -3234335 -2957723 -3014824 -4646713 -6053696 -4350698 -1013132
34311 -1013132 -325387 -2436226 -3404649 -2560671 -3869768 -8468810 -11494972 -8787891 -2233367
34302 -2233367 3660360 6349596 4944827 132033 -3708921 -1296103 6167219 10939094
34294 10939094 8386365 2056880 -2961802 -6170560 -8108376 -6577132 -1010222 4120761
34286 4120761 5083757 4150972 4722682 5447567 4144768 3402221 6381778 10319115 10359176
$$ packed form
34345b733181j485083K395010M310299L627265J587699r38546l115222l331831
34337C16410r99952J957019L128521K203573N67215l94085l3127Q79887J89864
34328G815325k689001m362826j475986L208528L435570j362626m882725l317764
34320c631505j71723N47865K1028K76612n7101j631889j406983J702998L337566
34311a013132O87745k110839r68423Q43978j309097m599042l026162K707081O554524
34302b233367N893727K689236j404769m812794l840954K412818P463322M771875
34294A0939094k552729o329485n018682l208758j937816J531244N566910N130983
34286D120761R62996r32785N71710P24885j302799p42547K979557L937337M0061
$$ plain form
34277 10359176 7410052 6045193 6525916 5264241 2100987 711167 1735563 1276175
34269 1276175 -2947662 -8637116 -12883081 -15028520 -14973783 -12493736 -9024995 -6771135
34261 -6771135 -5359432 -2425072 1973299 4500899 2887928 -1202686 -4246279 -4159337
34253 -4159337 -1662550 199503 -1254365 -4613209 -4980750 -327940 5068681 6480555
34245 6480555 5430212 6322580 8516620 7249425 1825849 -2754567 -3076121 -1194501
34237 -1194501 184457 1877694 5247160 8442232 8323231 4419951 -666553 -3642707
34229 -3642707 -2872892 -8503 704037 -3127764 -8262696 -8948665 -4084868 1248174 1922895
34220 1922895 -1942236 -6437659 -8314065 -7013878 -4034094 -1411313 -188159 -162111
$$ packed form
34277A0359176k949124j364859M80723j261675l163254j389820J024396m59388
34269A276175m223837n689454m245965k145439N4737K480047L468741K253860
34261f771135J411703K934360M398371K527600j612971m090614l043593Q6942
34253d159337K496787J862053j453868l358844l67541M652810N396621J411874
34245F480555j050343Q92368K194040j267195n423576m580416l21554J881620
34237a194501J378958J693237L369466L195072j19001l903280n086504k976154
34229c642707P69815K864389P12540l831801n134932o85969M863797N333042O74721
34220A922895l865131m495423j876406J300187K979784K622781J223154K6048
$$ plain form
34212 -162111 -1276471 -3941316 -7092133 -7995465 -5825744 -3296819 -2491196 -1745489 188613
34203 188613 102055 -4616508 -9335258 -6950063 1416725 6989250 5206788 790094 -573615
34194 -573615 485205 886798 1045672 2985579 5812923 6713961 4733498 1336714 -1358094
34185 -1358094 -1956121 -1222957 -2109223 -5681948 -7833059 -4261683 1869272 2998187 -1709243
34176 -1709243 -5081548 -3552720 -2430769 -5667980 -7884226 -2953873 5321860 8784721
34168 8784721 7192547 6862831 9433389 10299855 7686302 5245242 4500304 1958379 -3618282
34159 -3618282 -7059606 -3746024 3228787 6636464 3527965 -2859855 -7744850 -8610424
34151 -8610424 -5674544 -1312921 1130386 -129639 -3553284 -5788589 -4886888 -1466989
$$ packed form
34212a62111j114360k664845l150817r03332K169721K528925Q05623P45707J934102
34203A88613q6558m718563m718750K385195Q366788N572525j782462m416694j363709
34194e73615J058820M01593J58874J939907K827344R01038j980463l396784k694808
34185a358094n98027P33164q86266l572725k151111L571376O130955J128915m707430
34176a709243l372305J528828J121951l237211k216246M930353Q275733L462861
34168H784721j592174l29716K570558Q66466k613553k441060p44938k541925n576661
34159c618282l441324L313582O974811L407677l108499o387820m884995q65574
34151h610424K935880M361623K443307j260025l423645k235305R01701L419899
$$ plain form
34143 -1466989 2830750 6765484 9011297 7680641 2295284 -3708781 -4846611 258879
34135 258879 6178201 6587527 1812051 -2463755 -3147275 -2458405 -2709695 -3094069 -3125641
34126 -3125641 -4578948 -7278843 -7177002 -2296952 2856874 2955055 -919774 -3978525 -4965669
34117 -4965669 -5697015 -5637183 -2990245 -256867 -2230362 -7775854 -9738575 -5129814 -113609
34108 -113609 -1666949 -8285619 -12684973 -11100646 -6234954 -2415959 -1196996 -1532191
34100 -1532191 -1932841 -2011947 -2861473 -5794561 -10211196 -13310494 -12544253 -7939874 -1823803
$$ packed form
34143a466989M297739L934734K245813j330656n385357o004065j137830N105490
34135B58879N919322M09326m775476m275806o83520O88870k51290l84374l1572
34126c125641j453307k699895J01841M880050N153826R8181l874829l058751r87144
34117d965669p31346N9832K646938K733378j973495n545492j962721M608761N016205
34108a13609j553340o618670m399354J584327M865692L818995J218963l35195
34100a532191m00650p9106q49526k933088m416635l099298P66241M604379O116071
$$ [...]
##END NTUPLES=NMR SPECTRUM
##END=
