##TITLE=31Pdec_3MBDE-2
 CDCl3, 124 sc
 22.11.2022
##JCAMPDX= 6.0         $$ Bruker NMR JCAMP-DX V2.0
##DATA TYPE= NMR SPECTRUM
##DATA CLASS= NTUPLES
##ORIGIN= UXNMR, Bruker Analytische Messtechnik GmbH
##OWNER= root
$$ XWIN-NMR		Version 3.5
$$ Tue Nov 22 15:45:02 2022 Russian Standard Time (UT+4h)  she@DPX200
##.OBSERVE FREQUENCY= 81.013821
##.OBSERVE NUCLEUS= ^31P
##.ACQUISITION MODE= SIMULTANEOUS
##.ACQUISITION SCHEME= undefined
##.AVERAGES= 124
##.DIGITISER RES= 16
##SPECTROMETER/DATA SYSTEM= spect
##.PULSE SEQUENCE= zgpg30
##.SOLVENT NAME= CDCl3
##.SHIFT REFERENCE= (INTERNAL, CDCl3, 0, 248.564)
##AUDIT TRAIL= $$ (NUMBER, WHEN, WHO, WHERE, WHAT)
$$ ##TITLE= Audit trail, XWIN-NMR		Version 3.5
$$ ##JCAMPDX= 5.01
$$ ##ORIGIN= Bruker BioSpin GmbH
$$ ##OWNER= she
$$ F:/spectra/data/she/nmr/P31/1/pdata/1/auditp.txt
$$ ##AUDIT TRAIL=  $$ (NUMBER, WHEN, WHO, WHERE, WHAT)
(   1,<2022-11-22 15:44:06.29 +0400>,<she>,<DPX200>,
      <continue with go, POWCHK disabled, PULCHK disabled
       configuration hash MD5:
       00 E9 B6 7A A2 85 ED C7 34 08 36 98 17 FE 4E 26
       data hash MD5: 32K
       F2 19 22 D1 D6 72 56 B2 31 17 DF FA E5 75 96 A4>)
(   2,<2022-11-22 15:44:08.28 +0400>,<she>,<DPX200>,
      <Start of raw data processing
       efp BC_mod = 2 LB = 1 FT_mod = 6 PKNL = 1 PHC0 = -10323.08 PHC1 = 212.0561 SI = 64K 
       data hash MD5: 64K
       AE 99 73 F5 17 A4 1A 5C 09 5C 3E 16 4D 24 17 BC>)
(   3,<2022-11-22 15:44:28.71 +0400>,<she>,<DPX200>,
      <pk PHC0 = 113.4406 PHC1 = -236.2001 
       data hash MD5: 64K
       94 86 E8 69 FA 6F 74 83 F2 72 7A F3 A7 61 78 EE>)
(   4,<2022-11-22 15:44:32.09 +0400>,<she>,<DPX200>,
      <abs ABSG = 5 
       data hash MD5: 64K
       AC 4F C0 AC 33 FE 51 56 E1 C5 4F E9 8F CC 56 67>)
$$ ##END=
$$ 
$$ hash MD5
$$ 8C EA F0 21 01 16 1E 9E 85 57 53 8D AA 90 9A AB
##$RELAX= 
##$RELAX= 
##$RELAX= 
##$RELAX= 
##$RELAX= 
##$RELAX= 
##$RELAX= 
##$RELAX= 
##$RELAX= 
$$ Bruker specific parameters
$$ --------------------------
##$DU= <F:/spectra>
##$EXPNO= 1
##$NAME= <P31>
##$PROCNO= 1
##$TYPE= <nmr>
##$USER= <she>
##$AMP= (0..31)
100 100 100 100 100 100 100 100 100 100 100 100 100 100 100 100 100 100 
100 100 100 100 100 100 100 100 100 100 100 100 100 100 
##$AQSEQ= 0
##$AQ_mod= 1
##$AUNM= <au_zg>
##$AUTOPOS= <>
##$BF1= 81.014009
##$BF2= 200.13
##$BF3= 200.13
##$BF4= 200.13
##$BF5= 200.13
##$BF6= 200.13
##$BF7= 200.13
##$BF8= 200.13
##$BYTORDA= 1
##$CFDGTYP= 0
##$CFRGTYP= 5
##$CHEMSTR= <none>
##$CNST= (0..31)
1 1 145 1 1 1 1 1 1 1 1 1 1 1 1 1 1 1 1 1 1 1 1 1 1 1 1 1 1 1 1 1 
##$CPDPRG= <waltz16>
##$CPDPRG1= <>
##$CPDPRG2= <waltz16>
##$CPDPRG3= <>
##$CPDPRG4= <mlev>
##$CPDPRG5= <mlev>
##$CPDPRG6= <mlev>
##$CPDPRG7= <mlev>
##$CPDPRG8= <mlev>
##$CPDPRGB= <>
##$CPDPRGT= <>
##$D= (0..31)
0 1 0 0 0 0 0 0 0 0 0 0.03 2e-05 3e-06 0 0 0 0 0 0 0 0 0 0 0 0 0 0 0 0 
0 0 
##$DATE= 1669117282
##$DBL= (0..7)
120 120 120 11 120 120 24 19 
##$DBP= (0..7)
150 150 150 150 150 150 150 150 
##$DBP07= 0
##$DBPNAM0= <>
$$ [...]
##$SUBNAM3= <"">
##$SUBNAM4= <"">
##$SUBNAM5= <"">
##$SUBNAM6= <"">
##$SUBNAM7= <"">
##$SUBNAM8= <"">
##$SUBNAM9= <"">
##$SW= 501.771253377433
##$SWIBOX= (0..15)
0 1 3 0 0 0 0 0 0 0 0 0 0 0 0 0 
##$SW_h= 40650.406504065
##$TD= 32768
##$TD0= 1
##$TE= 0
##$TE2= 300
##$TE3= 300
##$TEG= 300
##$TL= (0..7)
0 120 53 12 22 120 120 120 
##$TP= (0..7)
150 150 150 150 150 150 150 150 
##$TP07= 0
##$TPNAME0= <>
##$TPNAME1= <>
##$TPNAME2= <>
##$TPNAME3= <>
##$TPNAME4= <>
##$TPNAME5= <>
##$TPNAME6= <>
##$TPNAME7= <>
##$TPOAL= (0..7)
0.5 0.5 0.5 0.5 0.5 0.5 0.5 0.5 
##$TPOFFS= (0..7)
0 0 0 0 0 0 0 0 
##$TUNHIN= 0
##$TUNHOUT= 0
##$TUNXOUT= 0
##$USERA1= <user>
##$USERA2= <user>
##$USERA3= <user>
##$USERA4= <user>
##$USERA5= <user>
##$V9= 5
##$VALIST= <valist>
##$VCLIST= <CCCCCCCCCCCCCCC>
##$VD= 0
##$VDLIST= <DDDDDDDDDDDDDDD>
##$VPLIST= <PPPPPPPPPPPPPPP>
##$VTLIST= <TTTTTTTTTTTTTTT>
##$WBST= 1024
##$WBSW= 4
##$XGAIN= (0..3)
0 0 0 0 
##$XL= 0
##$YL= 0
##$YMAX_a= 2725
##$YMIN_a= -7715
##$ZGOPTNS= <>
##$ZL1= 120
##$ZL2= 120
##$ZL3= 120
##$ZL4= 120
##$ABSF1= 248.5645
##$ABSF2= -253.2056
##$ABSG= 5
##$ABSL= 3
##$ALPHA= 0
##$AQORDER= 0
##$ASSFAC= 0
##$ASSFACI= 0
##$ASSFACX= 0
##$ASSWID= 0
##$AUNMP= <proc_1d>
##$AZFE= 0.1
##$AZFW= 0.5
##$BCFW= 0
##$BC_mod= 2
##$BYTORDP= 0
##$COROFFS= 0
##$CY= -3
##$DATMOD= 1
##$DC= 0
##$DFILT= <>
##$DTYPP= 0
##$F1P= 0
##$F2P= 0
##$FCOR= 1
##$FTSIZE= 65536
##$FT_mod= 6
##$GAMMA= 0
##$GB= 0
##$INTBC= 1
##$INTSCL= 6.047779e-11
##$ISEN= 30
##$LB= 1
##$LEV0= 0
##$LPBIN= 0
##$MAXI= 10000
##$MC2= 0
##$MEAN= 0
##$ME_mod= 0
##$MI= 50
##$NCOEF= 0
##$NC_proc= -7
##$NLEV= 6
##$NOISF1= 182.463
##$NOISF2= 159.3651
##$NSP= 0
##$NTH_PI= 0
##$NZP= 0
##$OFFSET= 248.5645
##$PC= 4
##$PHC0= -10209.64
##$PHC1= -24.144
##$PH_mod= 1
##$PKNL= yes
##$PPARMOD= 0
##$PSCAL= 0
##$PSIGN= 0
##$REVERSE= no
##$SF= 81.0140089999694
##$SI= 65536
##$SIGF1= 159.3651
##$SIGF2= -187.1042
##$SINO= 113.3802
##$SIOLD= 16384
##$SREGLST= <1H.CDCl3>
##$SSB= 0
##$STSI= 65536
##$STSR= 0
##$SW_p= 40650.406504065
##$SYMM= 0
##$S_DEV= 0
##$TDeff= 32768
##$TDoff= 0
##$TI= <>
##$TILT= no
##$TM1= 0
##$TM2= 0
##$TOPLEV= 0
##$USERP1= <user>
##$USERP2= <user>
##$USERP3= <user>
##$USERP4= <user>
##$USERP5= <user>
##$WDW= 1
##$XDIM= 65536
##$YMAX_p= 339204117
##$YMIN_p= -85731503
$$ End of Bruker specific parameters
$$ ---------------------------------
##NTUPLES= NMR SPECTRUM
##VAR_NAME=  FREQUENCY,     SPECTRUM/REAL,   SPECTRUM/IMAG
##SYMBOL=    X,             R,               I
##VAR_TYPE=  INDEPENDENT,   DEPENDENT,       DEPENDENT
##VAR_FORM=  AFFN,          ASDF,            ASDF
##VAR_DIM=   65536,         65536,           65536
##UNITS=     HZ,            ARBITRARY UNITS, ARBITRARY UNITS
##FACTOR=    0.620285442955139, 1,           1
##FIRST=     20137.2065510682, 0,            0
##LAST=      -20513.1999529968, 0,           0
##MIN=       -20513.1999529968, -85731503,   0
##MAX=       20137.2065510682, 339204117,    0
$$ Real data points
##PAGE= N=1
##DATA TABLE= (X++(R..R)), XYDATA
$$ [...]
13028D099787k047670k679992n327940m921827K277760R308357O934518j779006
13020E863987n227756n91209K882827o64277m960670k463047M228902P465743
13012F534500N141554N39945l844460o802613o279619k065552J927079K507168
13004b341998J738538K623955L468809J267398k308575l615388l182973l526893
12996e877127l122893R88744N981658N653074J38837l446010j212959K672551
12988A775875L110518N50681j884688k916477k194178Q54548M468684M508699
12980H273662j61749n201755o162378l552989m56907J704540K502449Q88117k388143
12971d555153l349228M11383N140993M915817n06460n261574m835695r62310J745418
$$ plain form
13028 4099787 2052117 -627875 -5955815 -10877642 -8599882 708475 7642993 5863987
13020 5863987 636231 45022 2927849 2263572 -2697098 -5160145 -931243 6534500
13012 6534500 11676054 12215999 8371539 1568926 -4710693 -6776245 -4849166 -2341998
13004 -2341998 -603460 2020495 5489304 6756702 4448127 832739 -2350234 -5877127
12996 -5877127 -9000020 -8011276 -2029618 3623456 3762293 316283 -896676 1775875
12988 1775875 4886393 5437074 3552386 635909 -1558269 -703721 3764963 8273662
12980 8273662 8111913 2910158 -3252220 -6805209 -7262116 -5557576 -3055127 -2167010 -4555153
12971 -4555153 -7904381 -7492998 -2352005 2563812 2057352 -3204222 -8039917 -9002227 -7256809
12962g256809J755071J427650K590541L362228R27316l238460l848360R90964
12954c289859N891112M768543p13124l692111j952473J56639k96758r89217j72527
12945b89775l02000k548247l016534J081766N711005N456827J417335j505109
12937F005268k426021l810372m821845j819972M376452P525859L918641k803319
12929F144691o523858n357219k008141J65553l4109j335010j567517j63701J216124
12920i463187J262285Q75677J068373R33318j6987L85589L515238O032725L736469
12911H329500j458480l141135N79172M204887K497560k746858n742504l972584
12903a450442k19552J323139n01912k795660j919757J750318L782176J740727
$$ plain form
12962 -7256809 -5501738 -4074088 -1483547 1878681 2805997 -432463 -4280823 -3289859
12954 -3289859 2601253 7369796 6656672 2964561 1012088 1168727 871969 -117248 -289775
12945 -289775 -591775 -3140022 -6156556 -5074790 636215 6093042 7510377 6005268
12937 6005268 3579247 -231125 -5052970 -6872942 -2496490 5029369 8948010 6144691
12929 6144691 -379167 -5736386 -7744527 -7578974 -7613083 -8948093 -10515610 -10679311 -9463187
12920 -9463187 -8200902 -7325225 -6256852 -5323534 -5340521 -4954932 -1439694 4593031 8329500
12911 8329500 6871020 3729885 4309057 8513944 11011504 8264646 2522142 -1450442
12903 -1450442 -1669994 -346855 -848767 -3644427 -5564184 -3813866 -31690 1709037
12895A709037j087475q46658O61274n59342l092782k035689K194095L774508R25929
12886A642897j514260p82168k59025j762958j158802L424015N831669J078384
12878F499752n131031l999219K897118O133521K462661k074262k580332p61026
12870C447182Q72484K689450L848998J301047m250002p088594m329044p5694J301600
12861b282573J129092K028291K282912n78857m011986l479625O67621L929514
12853c15611L996407K241186o0609k785005m547110l242794L07768K258652L12028
12844a835088l438195m883248k089117K807821N260479K834186j347428j719353
12836d409943K115758M130948O90510l206986j144204M301067M904990n05260
$$ plain form
12895 1709037 621562 -225096 436178 -123164 -3215946 -5251635 -3057540 716968 1642897
12886 1642897 128637 -653531 -912556 -2675514 -3834316 -410301 5421368 6499752
12878 6499752 1368721 -2630498 266620 6400141 8862802 6788540 4208208 3447182
12870 3447182 4319666 7009116 10858114 12159161 7909159 820565 -3508479 -3584173 -2282573
12861 -2282573 -1153481 874810 3157722 2578865 -1433121 -4912746 -4245125 -315611
12853 -315611 3680796 5921982 5861373 3076368 -1470742 -4713536 -4405768 -2147116 -1835088
12844 -1835088 -5273283 -10156531 -12245648 -9437827 -4177348 -1343162 -2690590 -4409943
12836 -4409943 -2294185 1836763 2527273 -679713 -1823917 2477150 7382140 6876880
12828F876880m048974p73561M288374M313104K70370k206359j497248n23567q96484
12819E802535j208967l27015J068464J791911Q30241k145621n127885m623913
12811c940250m34979K741563J310061k068772k750866j019947l19132o39302R09484
12802f212140L812086M165692J289428j129710j468729k355205m692793m874702
12794a1466073r02212L310251L410630P99820m11973L86260J091609J389751K274955
12785a16982K821301J551996j61198L6474J209656O74551r80186p39849J168325
12776E464088J095781j725197l196288n75311L077427L239430j17286l565012
12768C697632m908002m017002r54392L300708N255874J761676n076363q837663
$$ plain form
12828 6876880 2827906 2054345 6342719 10655823 10926193 8719834 7222586 6699019 5802535
12819 5802535 4593568 4266553 5335017 7126928 7957169 5811548 683663 -3940250
12811 -3940250 -4375229 -1633666 -323605 -2392377 -5143243 -6163190 -6482322 -7121624 -6212140
12802 -6212140 -2400054 1765638 3055066 1925356 456627 -1898578 -6591371 -11466073
12794 -11466073 -12368285 -9058034 -5647404 -4847584 -5259557 -4873297 -3781688 -2391937 -116982
12785 -116982 2704319 4256315 4095117 4131591 5341247 6015798 5035612 4295763 5464088
12776 5464088 6559869 4834672 1638384 1063073 4140500 7379930 7262644 3697632
12768 3697632 -1210370 -5227372 -6181764 -2881056 2374818 4136494 -939869 -9777532
12760i777532n900834M43377M375292M285691L101724K897492K053874j243322
12752B35762m841607m523541J14904M238690L620027J30352r85736J480759L161935
12743B631545P33087k992658k976149R74254M186043L521884N66380j877293l227916
12734A539177l725657k546232K98089K320192J711149O13127J888342L626717
12726E724904J187316m859217p527795k582057M893266O829140K587098j430034
12718D822621j358154O4470l41694r98891O64599K832455J722127k193485m421518
12709G92530k813365j24836O30069J39195K76760M14186q00024j814900j89900
12700c490285K305166J070499l673843n157077P76929Q285292Q171870K55782
$$ plain form
12760 -9777532 -15678366 -15234989 -10859697 -6574006 -3472282 -574790 1479084 235762
12752 235762 -4605845 -9129386 -9014482 -4775792 -1155765 -1025413 -2011149 -530390 2631545
12743 2631545 3364632 371974 -2604175 -1629921 2556122 6078006 6644386 4767093 1539177
12734 1539177 -2186480 -4732712 -4434623 -2114431 -403282 209845 2098187 5724904
12726 5724904 6912220 2053003 -5474792 -8056849 -3163583 3665557 6252655 4822621
12718 4822621 3464467 3528937 3187243 2188352 2852951 5685406 7407533 5214048 792530
12709 792530 -2020835 -2145671 -1515602 -1376407 -1099647 -685461 -1485485 -3300385 -3490285
12700 -3490285 -1185119 -114620 -3788463 -8945540 -8168611 116681 8288551 8544333
12692H544333o327506n320613n00198J171064j066131k491720j18370M190929
12684a918212O431050M048672j864623o528949n538462l04784L049363J688467
12676i37478l53272J181922M347016M690706J929257j332908m411468p097534
12668a983759o278852r5491O343222N998306j2914l866496k402326j80678n33678
12659c012666r29008N27298R50384j343140k623099J15874L530423L066087L9304
12650C21457j032971N37939J674175Q99291j75636J04849J540022K612966J690716
12641H172808j121564l118990k271273r65168k671773n197910k881143L550221
12633f504792O084344J265531l826582j996054L723679N866903L540503J080235
$$ plain form
12692 8544333 2216827 -3103786 -3603984 -2432920 -3499051 -5990771 -6109141 -1918212
12684 -1918212 4512838 8561510 6696887 167938 -5370524 -5675308 -2625945 -937478
12676 -937478 -1290750 -108828 4238188 8928894 10858151 9525243 5113775 -1983759
12668 -1983759 -8262611 -8358102 -2014880 3983426 3970512 104016 -2298310 -2478988 -3012666
12659 -3012666 -3941674 -3414376 -2463992 -3807132 -6430231 -6314357 -2783934 282153 321457
12650 321457 -711514 -173575 1500600 2399891 2224255 2329104 3869126 6482092 8172808
12641 8172808 7051244 3932254 1660981 695813 -1975960 -7173870 -10055013 -6504792
12633 -6504792 -420448 845083 -2981499 -4977553 -1253874 4613029 8153532 9233767
12625I233767k29142j996501l052569j023681J940427J469870j855895l419238
12617A067038j978052p34845j347991j889421q35636J013954K489091K739920
12609E24058R76187j654808j983154M15980J493478o76954j796745J286497L927449
12600B511988J105524l018211j372314L714373M153181r9547j410602J845960
12592G430352K829509j204280m269162k344790P05003J316864J601220K705197
12584H769913J150189l691076o071370k682443J808211K655196J761625J798463
12576E498708N36373l355297n271866j737868K901036L126262P58137N45309J681179
12567D681973L50436k718571l669042k011569k57301O61676J064878K83010j259414
$$ plain form
12625 9233767 9004625 7008124 3955555 2931874 4872301 6342171 4486276 1067038
12617 1067038 -911014 -1645859 -2993850 -4883271 -5718907 -4704953 -2215862 524058
12609 524058 1500245 -154563 -2137717 -1721737 -228259 -905213 -2701958 -1415461 2511988
12600 2511988 3617512 599301 -773013 2941360 7094541 6994994 5584392 7430352
12592 7430352 10259861 9055581 4786419 2441629 3146632 4463496 6064716 8769913
12584 8769913 9920102 6229026 157656 -2524787 -716576 1938620 3700245 5498708
12576 5498708 6035081 2679784 -2592082 -4329950 -1428914 1697348 2455485 3000794 4681973
12567 4681973 5032409 2313838 -1355204 -3366773 -3624074 -2962398 -1897520 -1614510 -2873924
12558b873924j000144J067758R92921j901701j957156L396821P302758L630507
12550H657840k312400j980637K313268J802431l374576m628750n315K654521o46431
12541B479951l781317j524167K132614J697898r10180r26896R02387M14744k507714
12532b022680l714272q05960M154875P321334O309631J605810l661943n987376
12524C199419m518244j500300K51226l81563k426273l532980j914035J234815
12516i587935K559413J090354j13746J203976K646193J149797j608738j666296
12508d326982J073637L129217K682834P91155j515625l721063m506189l276328
12500i669344j663608o52208J340953M307740M337229J51396k283397J831409
$$ plain form
12558 -2873924 -3874068 -2806310 -1813389 -3715090 -5672246 -2275425 5027333 8657840
12550 8657840 6345440 4364803 6678071 8480502 5105926 477176 471861 3126382 2479951
12541 2479951 -1301366 -2825533 -692919 1004979 94799 -832097 70290 485034 -2022680
12532 -2022680 -5736952 -6542912 -2388037 4933297 11242928 12848738 9186795 3199419
12524 3199419 -1318825 -2819125 -2567899 -2949462 -5375735 -8908715 -10822750 -9587935
12516 -9587935 -7028522 -5938168 -6051914 -4847938 -2201745 -1051948 -2660686 -4326982
12508 -4326982 -3253345 -124128 2558706 3349861 1834236 -1886827 -6393016 -9669344
12500 -9669344 -11332952 -11985160 -10644207 -6336467 -1999238 -1847842 -4131239 -2299830
12492b299830O983657M761619k531073n163321j300164J411620l86167j459145
12484A7196O24335Q76326k446648l007488K259042O322091L239382k033048k397790
12475C453398M1330m74824k600836j548064J103378L44996k598973k352950Q04593
12466c827952J635017n63982j232478P56658J361418p47927j660005M95657J931317
12457a852277k82995k963336j520736L152034N672692K679407l539722p284015
12449e938948m834954J529615N286250K730319k576958m331297j382417J765282
12441g753108J963839J378162L073977N397127L714747k508474p149547m188241
12433f071518L884956P953779L848870j994074k072127R99735n49142n940333
$$ plain form
12492 -2299830 4683827 9445446 6914373 1751052 450888 1862508 1476341 17196
12484 17196 641531 1517857 -928791 -3936279 -1677237 4644854 7884236 5851188 3453398
12475 3453398 3494728 3019904 419068 -1128996 -25618 319378 -2279595 -4632545 -3827952
12466 -3827952 -2192935 -2756917 -3989395 -3232737 -1871319 -2619246 -4279251 -3783594 -1852277
12457 -1852277 -2135272 -5098608 -6619344 -3467310 2205382 4884789 1345067 -5938948
12449 -5938948 -10773902 -9244287 -3958037 -1227718 -3804676 -8135973 -9518390 -7753108
12441 -7753108 -5789269 -4411107 -1337130 4059997 7774744 5266270 -1883277 -6071518
12433 -6071518 -2186562 5767217 9616087 7622013 5549886 6549621 6000479 60146
12425F0146o292716N08774N385152K439174j721748L15671M021593J014466o007809
12416b77297o993857l12468N433537M704574J022185q75730q82866l08309M06305
12407A916074l41015l593079n688039k195173L785009M423070q59472l919146
12399f471771m37757L800720K652325j324882k117428R33865M211481N364865
12391F611418L698868r46483n861849n960917n59372M025515K671080j318966
12383B359294j584596J859853L589577J200170k121188k833253j022767Q71223
12375B318313Q59154r63794k358486j398065N74152N25817j342944j530596Q95302
12366b421147K368880P68275q67421M94458K819726K697637Q09491j82409m43091
$$ plain form
12425 60146 -6232570 -5723796 -338644 2100530 378782 694453 4716046 5730512 -277297
12416 -277297 -7271154 -7583622 -2150085 2554489 3576674 2700944 1818078 1509769 1916074
12407 1916074 1575059 -2018020 -7706059 -9901232 -6116223 -1693153 -2552625 -6471771
12399 -6471771 -6909528 -3108808 -456483 -1781365 -3898793 -2964928 1246553 6611418
12391 6611418 10310286 9363803 3501954 -2458963 -3018335 1007180 3678260 2359294
12383 2359294 774698 2634551 6224128 7424298 5303110 2469857 1447090 2318313
12375 2318313 3177467 2213673 -144813 -1542878 -968726 -442909 -1785853 -3316449 -2421147
12366 -2421147 -52267 716008 -151413 343045 3162771 5860408 6669899 6487490 6044399
12357F044399j606458k794989j980258K16628J462656J065402k16225j759928
12349D31227k160661M75818M622248N090761J09045m908235m693668j563359p04847
12340c301671j676926n46609K380505L538344K836326K767270K292167j367488
12332F921918n676911m905958N39066M082686L047001J636453K539322K849665
12324A1033242P55890p04895N5020m85182m154820o274244k588527L374772N036619
12315F047875J742858j721909k270405q83566M72551O59194o42458k054750j207280
12306A42110J542970K451399j80970k777523j759127Q15703P57210j441167j775843
12297b225238O38137K659160K452755J549315J230306N37153j121640k248405
$$ plain form
12357 6044399 4437941 1642952 -337306 -120678 1341978 2407380 2191155 431227
12349 431227 -1729434 -1253616 3368632 8459393 8568438 3660203 -1033465 -2596824 -3301671
12340 -3301671 -4978597 -5525206 -3144701 393643 3229969 5997239 8289406 6921918
12332 6921918 1245007 -3660951 -3121885 960801 4007802 5644255 8183577 11033242
12324 11033242 11789132 11084237 11139257 10654075 6499255 225011 -2363516 1011256 6047875
12315 6047875 7790733 6068824 3798419 2914853 3387404 4046598 3404140 1349390 142110
12306 142110 1685080 4136479 3955509 1177986 -581141 234562 991772 -449395 -2225238
12297 -2225238 -1587101 1072059 3524814 5074129 6304435 6841588 5719948 3471543
12289C471543j471591L45361J244046L14580j695598k986569k047014N36856K045326
12280b43060P91617j187770n26637K491830L711409P97055k955880k627530J495377
12271A746411L893250J265491k708635k438595J574225L588636J173729j651195
12263F443317j290172Q8323p29173k167899j394674k31156j734507l414863p58571
12254e189375L802640L241044k396489m786011l5321N055419L311902k738556
12246B65253n914113m339727j307001Q52520J938682J942798J931704M053430
12238e76454P479151P721312L052572k279691m362505m645542n199067m144946
12230b955170k95994K835476K824463K945811N329604N155986j250944p907274
$$ plain form
12289 3471543 1999952 2345313 3589359 3903939 2208341 -778228 -2825242 -2288386 -243060
12280 -243060 548557 -639213 -1165850 1325980 5037389 5834444 2878564 251034 1746411
12271 1746411 5639661 6905152 4196517 1757922 3332147 6920783 8094512 6443317
12263 6443317 5153145 5241468 4512295 2344396 949722 718566 -1015941 -4430804 -5189375
12254 -5189375 -1386735 1854309 -542180 -5328191 -5363512 -308093 3003809 265253
12246 265253 -5648860 -9988587 -11295588 -10443068 -8504386 -6561588 -4629884 -576454
12238 -576454 6902697 14624009 17676581 15396890 11034385 6388843 1189776 -2955170
12230 -2955170 -3251164 -415688 2408775 5354586 10684190 15840176 14589232 6681958
12222F681958p226049k160126r35553l216061j925445L216486M970914J233524
12214F39648j952587j032417Q52039J525481K566968L083133j63889m769433m149241
12205c400298J051399K747961r28859k303492J829760L988301m96640m487812
12197a999680j206058M104901L636361O1010K83409K788673J740113j344658q36101
12188G227970J597249k68042m953354m540815J844733N769168K303927l346382
12180E634454m535224j647348R52536J152480m17045k327426k864637j313410
12172e365620O20560J051063Q74656J654047K185611R75895J72712K171463M041389
12163H381776J140815m647352o489407k383815K580301M135558L249109K019093
$$ plain form
12222 6681958 -544091 -2704217 -3639770 -6855831 -8781276 -5564790 -593876 639648
12214 639648 -1312939 -2345356 -1493317 32164 2599132 5682265 5518376 748943 -3400298
12205 -3400298 -2348899 399062 -529797 -2833289 -1003529 2984772 2488132 -1999680
12197 -1999680 -3205738 899163 4535524 4596534 4879943 7668616 9408729 8064071 7227970
12188 7227970 8825219 8557177 3603823 -936992 907741 6676909 8980836 5634454
12180 5634454 1099230 -548118 404418 1556898 1139853 -1187573 -4052210 -5365620
12172 -5365620 -4745060 -3693997 -2819341 -1165294 1020317 1996212 2168924 4340387 8381776
12163 8381776 9522591 4875239 -1614168 -3997983 -1417682 2717876 5966985 7986078
12155G986078Q13588K78363Q02581l04087n148643q913357m779422M019049O130519
12146H84669j095550o366777j358894O414779N712079j147781l467331L54296
12138g0510K156250q99495k152447K074536N829880L292451k372916m644508k700947
12129E12294k11435R05293J055853J34678j874403l312688k958439k007426j533226
12120i289499k62446K429847L874797J915566q19224m33629K081978K637881R46955
12111C082226O20339K283767J922103k157330n367207l010570K659162N088006
12103E120496J711596l340257m485821p77053L355964K918635j821989n032422
12095b350851k389236K736124L481015p52253l649226j969141l38240k977018
$$ plain form
12155 7986078 8799666 9078029 9880610 9576523 4427880 -4485477 -9264899 -5245850 884669
12146 884669 -210881 -6577658 -7936552 -1521773 4190306 3042525 -424806 -70510
12138 -70510 2085740 1186245 -966202 1108334 6938214 10230665 7857749 3213241 512294
12129 512294 300859 1206152 2262005 2396683 522280 -2790408 -5748847 -7756273 -9289499
12120 -9289499 -9551945 -7122098 -3247301 -1331735 -2150959 -2584588 -502610 2135271 3082226
12111 3082226 3702565 5986332 7908435 5751105 383898 -2626672 32490 5120496
12103 5120496 6832092 3491835 -993986 -1771039 1584925 4503560 2681571 -2350851
12095 -2350851 -4740087 -2003963 1477052 724799 -2924427 -4893568 -5231808 -8208826
12087h208826o160174m060415J860144N182196L761385R72570m10120q1942K287193
12078d857989N634445N276737j385122q211542o818767O55480L635670r64902
12070g035990l948937J564364R186191Q789519Q63466n282604l974083J945242
12062B107168O312630N184408q25720o304175n444149O52330M348163J768233
12054G798888j792321n52088K682684J774583k537383m585055l356546k826218
12046c393456l704003k110819K746589N903348L749821q02635k617396o03906
12038h32457K312140L224328J601425r66427k280309j519981J5780O07461J8480
12029B180440q51298j223315p00696N43523J363251Q42764p3967j09913k30287
$$ plain form
12087 -8208826 -14369000 -18429415 -16569271 -11387075 -7625690 -6653120 -7063240 -7145182 -4857989
12078 -4857989 776456 6053193 4668071 -3543471 -10362238 -9706758 -6071088 -7035990
12070 -7035990 -10984927 -9420563 -234372 8555147 9418613 4136009 161926 2107168
12062 2107168 8419798 13604206 12778486 6474311 1030162 1682492 6030655 7798888
12054 7798888 6006567 5454479 8137163 9911746 7374363 2789308 -567238 -3393456
12046 -3393456 -7097459 -9208278 -6461689 -558341 3191480 2388845 -228551 -832457
12038 -832457 1479683 4704011 6305436 5339009 3058700 1538719 1554499 2161960 2180440
12029 2180440 1329142 105827 -594869 -51346 1311905 2154669 2080702 1970789 1740502
12020A740502j653540k271196K37279K484630p03269o094731m472039M195163
12012f537201P972205R34293o212584k386896N996831N456106k769132n660172
12004c206550j64777L098972j324172n499077k693626K185644K825759J992392
11996b785435M364889O719574L493451k917221n273853k164848J116215J032967
11988C585739n32261j092582j477231l337324n178612l406372K253279O418469
11980b766895M133791j290633j532609M141193O101501j289440r477202p747143
11972i727437L19115L034923n39875p72079M412327N664597p29446n520237k134067
11963e992179K394521K73850l454269k30111O699248P320956P33389m544669l974951
$$ plain form
12020 1740502 86962 -2184234 -1946955 537675 -165594 -6260325 -10732364 -6537201
12012 -6537201 1435004 2369297 -3843287 -6230183 -233352 5222754 2453622 -3206550
12004 -3206550 -3371327 -272355 -1596527 -7095604 -9789230 -7603586 -4777827 -2785435
11996 -2785435 1579454 8299028 11792479 8875258 3601405 1436557 2552772 3585739
11988 3585739 3053478 1960896 483665 -2853659 -8032271 -11438643 -9185364 -2766895
11980 -2766895 1366896 76263 -1456346 2684847 8786348 7496908 -1980294 -9727437
11972 -9727437 -9408322 -6373399 -6913274 -7685353 -3273026 2391571 1662125 -3858112 -5992179
11963 -5992179 -3597658 -3323808 -6778077 -7008188 -308940 7012016 7745405 3200736 -774215
11954g74215j291657p654R97131K507740K405859l8474k112739j748990l49700
11945d12699p2151o55870l10219J412410K656648J426888j308562k068755P4661
11936G42351R27747k810379o743885l634174N069430R177541L260027n839250
11928A49408q235410k771325L968830O176973K852158l062136o378966l619626
11920a0920094K362653M934441K268027q82719j141525n88601r38903p9513K466608
11911b519626K996865L13354j294181K72741Q99371j582009k475914Q40724K601880
11902E3205j381248m547291M50790Q277523P866977o04266o257208l688893J160062
11893A329651J651859j350515l324038j952607J912882M823134K798161l273556
$$ plain form
11954 -774215 -2065872 -2073526 -1076395 1431345 3837204 3798730 1685991 -62999 -412699
11945 -412699 -484850 -1140720 -1450939 -38529 2618119 4045007 2736445 667690 742351
11936 742351 1670098 -1140281 -7884166 -11518340 -6448910 2728631 5988658 149408
11928 149408 -8086002 -10857327 -6888497 -711524 2140634 -921502 -7300468 -10920094
11920 -10920094 -8557441 -3623000 -1354973 -2237692 -3379217 -3967818 -4906721 -4986234 -2519626
11911 -2519626 477239 790593 -503588 -230847 668524 -913485 -3389399 -2548675 53205
11902 53205 -1328043 -5875334 -5424544 2852979 10719956 10115690 3858482 169589 1329651
11893 1329651 2981510 1630995 -1693043 -3645650 -1732768 3090366 5888527 2614971
11885B614971o463731k589847K992465L085783m43227o98894K342871K579124
11877C419515j029937k848348l14880K630818K760584J330588j24786j498332
11869D325222j234414K034401M794764J993680m571252p522898m036250J365853
11861b850894M306982M567783K593708j221991l410261n41448L919967K990954
11853A0354800k836622n572100k053060J636121M19756k800418l618622k457816
11845f927961q59744J872210M471271K646628l359501o290502k054598L158776
11837g343421J841952l318951l686081K258140O985146M762133j249955m234529
11829c985566k366901L22719M44000k60133J507086M351371L577951p85175k709618
$$ plain form
11885 2614971 -3848760 -6438607 -3446142 -360359 -803586 -1502480 840391 3419515
11877 3419515 2389578 -458770 -773650 1857168 4617752 5948340 5823554 4325222
11869 4325222 3090808 5125209 9919973 11913653 7342401 -180497 -4216747 -2850894
11861 -2850894 1456088 6023871 8617579 7395588 3985327 3443879 7363846 10354800
11853 10354800 7518178 1946078 -106982 1529139 1948895 -851523 -4470145 -6927961
11845 -6927961 -7787705 -5915495 -1444224 1202404 -2157097 -8447599 -10502197 -7343421
11837 -7343421 -5501469 -8820420 -12506501 -10248361 -3263215 1498918 248963 -3985566
11829 -3985566 -6352467 -6029748 -5585748 -5845881 -4338795 12576 3590527 2805352 95734
11820I5734K90608K189239j742308n863766k704947M004554M775192J25933m36233
11811G34006N127770P779340K422193m516841o302433m747300l388590j137879
11803d029734K052566J831829k469666m258450m3027M123649K585743r76912j045050
11794b229052O09825M03828M95349L026480L477458j533343n791952k345617M166189
11785B79165M179207j554937l939310m48429K493205J361774k86562k67405j296837
11776E19871l997333m005414R38189O457767O852789J613096m594966o164642
11768b380643j403906M615937M376926k216826o340379k686744K126602K35306
11760c673727m123713j710063N320144O140877p69051n065634j587308K421745
$$ plain form
11820 95734 386342 2575581 833273 -5030493 -7735440 -3730886 1044306 1170239 734006
11811 734006 5861776 13641116 16063309 11546468 5244035 496735 -2891855 -4029734
11803 -4029734 -1977168 -145339 -2615005 -6873455 -6916482 -2792833 -207090 -1184002 -2229052
11794 -2229052 -1619227 -1215399 -720050 2306430 5783888 4250545 -1541407 -3887024 279165
11785 279165 4458372 2903435 -1035875 -1484304 1008901 2370675 2084113 1816708 519871
11776 519871 -3477462 -7482876 -6544687 -86920 6765869 8378965 3783999 -2380643
11768 -2380643 -3784549 831388 5208314 2991488 -3348891 -6035635 -3909033 -3673727
11760 -3673727 -7797440 -9507503 -4187359 1953518 1184467 -3881167 -5468475 -3046730
11752c046730J170359k94355K902190N222417L06726o665860o131258Q28721M439234
11743a268556J271766j939712j8308L251393K386800r74846j121883K556325M206420
11734H349399j77133o456447p108177j146429M359323L682286m53251k114700
11726a065129j064613j431402l487077l033166Q32732L450012J894484o39801
11718d543960l11896J830786K693906J990677J252640O92923k34974j182740j754409
11709D32953k081052j510305O90098K651046J453196j692685k058993J271279
11701h44463L394689J181599k035367k431781j441293j714832k065924r37139
11693f894511m42045j952793k024254J650802M566030K260304j259649K42631
$$ plain form
11752 -3046730 -1876371 -2170726 731464 5953881 6260607 -405253 -6536511 -5707790 -1268556
11743 -1268556 3210 -1936502 -1954810 1296583 3683383 2708537 1586654 4142979 8349399
11734 8349399 8172266 1715819 -5392358 -6538787 -2179464 1502822 1049571 -1065129
11726 -1065129 -2129742 -3561144 -7048221 -10081387 -9248655 -5798643 -3904159 -4543960
11718 -4543960 -4855856 -3025070 -331164 1659513 2912153 3605076 3370102 2187362 432953
11709 432953 -1648099 -3158404 -2468306 182740 1635936 -56749 -2115742 -844463
11701 -844463 2550226 3731825 1696458 -735323 -2176616 -3891448 -5957372 -6894511
11693 -6894511 -7336556 -9289349 -11313603 -9662801 -5096771 -2836467 -4096116 -3853485
11685c853485L998340K341146m023218o781871l562065n00115m11679J037595
11677a1755352M885000N293494P30912j536934J959651L603890k299882q211170
11669g330391m796939L517786N562561Q66650j714435L17781J009998j421201
11661c988190j866655P50302R84154k330384l097175R40698L790088J917396O6134
11652b833632J495012J530790k890289n742332j682686L896334L254616j069004
11644d041191j344285K041380K273647j495885l343065j322067K44318k94910
11636g282058P73678M574917O427382L218795j776551m016387l110965j183540
11628b374729K84073N55046k3644P40323L882678N963523L076954k436221m510903
$$ plain form
11685 -3853485 144855 2486001 -1537217 -8319088 -11881153 -12381268 -12792947 -11755352
11677 -11755352 -6870352 -1576858 -845946 -2382880 -423229 3180661 880779 -7330391
11669 -7330391 -12127330 -8609544 -3046983 -2180333 -3894768 -3576987 -2566989 -3988190
11661 -3988190 -5854845 -5104543 -4120389 -6450773 -9547948 -8607250 -4817162 -2899766 -2833632
11652 -2833632 -1338620 192170 -2698119 -8440451 -10123137 -6226803 -2972187 -4041191
11644 -4041191 -5385476 -3344096 -1070449 -2566334 -5909399 -7231466 -6987148 -7282058
11636 -7282058 -6508380 -1933463 4493919 7712714 5936163 1919776 -1191189 -2374729
11628 -2374729 -2090656 -1535610 -1559254 -818931 3063747 9027270 12104224 9668003 5157100
11619E157100k294895o40807j441164j134604J739257L204245P03541k567022
11611B725651l164848k079634j130776K13643J631015P86864j602416r28361L671549
11602A22687O318430L009135k209813m170958m117253m880364m018459J262343
11594h684252O563068N496821m7954k438160L16826L012438K451280Q98201j55912
11585G412356k618196o224623o423306j051006N097031N795353J028751l678208
11577f61848m187352j754673l12696j079441j038546K341806O065652M549941
11569C922843j925411o034592l042304K672772M449545K534250J271922P42501
11561D591526k001701n373164m431402N06197L467095J957527j2436M76653J027824
$$ plain form
11619 5157100 2862205 2221398 780234 -354370 1384887 4589132 5292673 2725651
11611 2725651 -439197 -2518831 -3649607 -3435964 -1804949 -1018085 -2620501 -3548862 122687
11602 122687 6441117 9450252 7240439 3069481 -1047772 -5928136 -9946595 -8684252
11594 -8684252 -2121184 3375637 3327683 889523 1206349 4218787 6670067 7568268 7412356
11585 7412356 4794160 -1430463 -7853769 -8904775 -3807744 1987609 3016360 -661848
11577 -661848 -4849200 -6603873 -6916569 -7996010 -9034556 -6692750 -627098 3922843
11569 3922843 1997432 -4037160 -7079464 -4406692 42853 2577103 3849025 4591526
11561 4591526 2589825 -2783339 -7214741 -6708544 -3241449 -1283922 -1296358 -819705 208119
11552B08119l28081j173457K22578J109747o39185k119354l02162K381553J886854
11543A246612q67068j839188l11654Q84683L92330l44299j19087Q86389K323463
11534B252181L273788J708551k643810o075417n053671j707164j155894l692263
11526a3093699m207793k78686L825702L564123O84330j06071J627810K296843
11518e687441N94770p37047J44414J231595L34323j084867k58091K263977L206833
11509H466J547441J63130J482331L574059K697956j078381l428211j639082J411058
11500D738767J269716j611047k700711n54038R05377r91264k841388q24976K080028
11491e29536L83572l875331k672200N152449J0031014M786127m496347o776240
$$ plain form
11552 208119 -119962 -1293419 -1070841 38906 -600279 -2719633 -3021795 -640242 1246612
11543 1246612 379544 -1459644 -1771298 -886615 -494285 -838584 -957671 -71282 2252181
11534 2252181 5525969 7234520 4590710 -1484707 -6538378 -8245542 -9401436 -13093699
11526 -13093699 -17301492 -17580178 -13754476 -10190353 -9506023 -9612094 -7984284 -5687441
11518 -5687441 -5092671 -5829718 -5685304 -4453709 -4119386 -5204253 -5462344 -3198367 8466
11509 8466 1555907 1719037 3201368 6775427 9473383 8395002 4966791 3327709 4738767
11500 4738767 6008483 4397436 1696725 1142687 2048064 1056800 -1784588 -2609564 -529536
11491 -529536 -145964 -4021295 -6693495 -1541046 8489968 13276095 8779748 2003508
11483B003508j119343L524513J584323l057781m232296r43494L236307M114100
11475E109837J9274n542692n591342J629727P678870L850029n481714p558307
11467e886318N72775P810485N491709j143587l057608q38364q09851l531520m157305
11458e549584j166540K132213L095535J648196j254676k953616n3509N630557
11450A528576O367571p44509p090721l991975L377560K983780n513726r972936
11442a3056380l987439M636753O566261K896920o2709l07066Q77819L228382N237023
11433F029564K815213l997980p679035l015405L710126K791152m337783p110643
11425a0794791j759505L791831K956784j88920O49239L303024J962329j937674
$$ plain form
11483 2003508 884165 4408678 5993001 2935220 -1297076 -2240570 995737 5109837
11475 5109837 5129111 -413581 -6004923 -4375196 3303674 7153703 1671989 -5886318
11467 -5886318 -5313543 2496942 7988651 6845064 3787456 2949092 2139241 -1392279 -5549584
11458 -5549584 -6716124 -4583911 -1488376 159820 -1094856 -4048472 -4101981 1528576
11450 1528576 7896147 7151638 60917 -3931058 -553498 2430282 -3083444 -13056380
11442 -13056380 -17043819 -12407066 -5840805 -2943885 -3006594 -3313660 -2435841 792541 6029564
11433 6029564 8844777 4846797 -2832238 -5847643 -2137517 653635 -3684148 -10794791
11425 -10794791 -12554296 -8762465 -5805681 -5994601 -5345362 -2042338 -80009 -2017683
11417b017683j981087J963306L296593n7623k327061l00840R77777k384375n153937
11408g984930j170750N820811P434743L135475p79201k064950l401669l904768
11400b915239J85760N979729N472776j206665m313235O6318L349243j076137o489246
11391i46696l969341L092128N106272J280006j307784j07178P85492q02698k542662
11382E87539k823683k055921J82954L724265N294223K729081p22496j558071j994038
11373C363853m695469n791995r97282N023049M547268n94145k099314R15447J696618
11364A368030j061857j240749K301857K675154k319774m838881M25214O965867
11356D274861O000671j080771n838567l926003J789332N880565M603130j424596
$$ plain form
11417 -2017683 -3998770 -2035464 1261129 1203506 -1123555 -1424395 -446618 -2830993 -7984930
11408 -7984930 -9155680 -3334869 4099874 7235349 6456148 4391198 989529 -2915239
11400 -2915239 -2729479 3250250 8723026 7516361 3203126 3269444 6618687 5542550 -946696
11391 -946696 -4916037 -1823909 3282363 4562369 3254585 3147407 3932899 3130201 587539
11382 587539 -2236144 -4292065 -4109111 -384846 4909377 7638458 6915962 5357891 3363853
11373 3363853 -1331616 -7123611 -8120893 -3097844 1449424 855279 -1244035 -328588 1368030
11364 1368030 306173 -934576 1367281 4042435 1722661 -3116220 -2691006 4274861
11356 4274861 10275532 9194761 3356194 -569809 1219523 7100088 11703218 10278622
11348A0278622o454822m860155J485016N048304K582305j767027l932190m370753
11340a990700l702332o74239L106706L027572r47464k935139n75214R12087j851508
11331e630231l778640K81816O222616O346328O41245l798948k466439K448010
11323B65757O159611N692960J364181l540106n686332n236649m415879l011533
11315h407990N28846L880131K691870j659566k956756k25467P06874j886083j875294
11306i203435L293656O282953J480261m783273l588008K968926N875691K542848
11298D869619j966007l784140l044545n12214K213770J877158j503145k487097
11290d336601J526011M696154J887869k075223m81478L235745J565373l143312
$$ plain form
11348 10278622 3823800 -1036355 448661 5496965 8079270 6312243 2380053 -1990700
11340 -1990700 -5693032 -6367271 -3260565 -232993 -1180457 -4115596 -4690810 -3778723 -5630231
11331 -5630231 -9408871 -9127055 -2904439 3441889 4083134 284186 -2182253 265757
11323 265757 6425368 12118328 13482509 9942403 4256071 -980578 -5396457 -8407990
11315 -8407990 -7879144 -3999013 -1307143 -2966709 -5923465 -6148932 -5442058 -7328141 -9203435
11306 -9203435 -5909779 373174 1853435 -2929838 -6517846 -3548920 2326771 4869619
11298 4869619 2903612 -880528 -3925073 -4437287 -2223517 -346359 -1849504 -4336601
11290 -4336601 -2810590 1885564 3773433 1698210 1216732 4452477 6017850 2874538
11282B874538k394372K992107L474731k963061p200460l859299J247516K183748
11274c644552J372668K204656K105427j037189k890227K75193M231935L139364
11266E757275j100532k452392o11642n16550l373206m529694j015212L621486
11258d220467M092513L45442k631913j378062J719650J963505q40305k030601
11250b980238O46964L078108J061821k691209k643635N44120J060161k394522
11242d318430m354519j368821K776256L225905O70756j325040j683512j158438
11234g535843M54289K954693M035256K283434L6255K34242K038207K450930R20704
11225G872167n28063p73621n80275p63264j506181k706529l162606q45660L640494
$$ plain form
11282 2874538 480166 3472273 6947004 3983943 -3216517 -7075816 -5828300 -3644552
11274 -3644552 -2271884 -67228 2038199 1001010 -1889217 -1614024 2617911 5757275
11266 5757275 4656743 2204351 1592709 1076159 -2297047 -6826741 -7841953 -4220467
11258 -4220467 -127954 217488 -2414425 -3792487 -2072837 -109332 -949637 -2980238
11250 -2980238 -2333274 744834 1806655 -884554 -3528189 -2984069 -1923908 -4318430
11242 -4318430 -8672949 -10041770 -7265514 -4039609 -3368853 -4693893 -6377405 -7535843
11234 -7535843 -7081554 -4126861 -91605 2191829 2228084 2462326 4500533 6951463 7872167
11225 7872167 7344104 6570483 5990208 5226944 3720763 1014234 -2148372 -2994032 646462
11216F46462N629052J992759l002356k197531L846346O209149L3903p586390o964060
11207a392666O34734N408473L390992M74758Q59701J1959n845896j0332555n228886
11198a2019386N665597J0295890N054357j461050k513898j725911l761311n147501
11190e613213j116032M422417L834072k227037n383425j423625M748084O657749
11182C898990L768473J43880q90606O64272K285298J621239p86505k144867j400931
11173G159243n95081j048225j099200K41882O68604j284541k723782j026952R25013
11164A216961j008281m957860n352302j206163L131883M726045M353409K508523
11156C412215j395709n310103n176623p49309L155637K657462q76620l224447
$$ plain form
11216 646462 6275514 8268273 5265917 3068386 6914732 13123881 13157784 5571394 -1392666
11207 -1392666 -757932 4650541 8041533 8516291 9375992 9387951 3542055 -6790500 -12019386
11198 -12019386 -6353789 3942101 8996458 7535408 5021510 3295599 -465712 -5613213
11190 -5613213 -6729245 -2306828 1527244 -699793 -6083218 -7506843 -2758759 3898990
11182 3898990 7667463 7811343 6920737 7585009 9870307 11491546 10705041 8560174 7159243
11173 7159243 6564162 5515937 4416737 4658619 5327223 4042682 1318900 291948 1216961
11164 1216961 208680 -4749180 -10101482 -11307645 -8175762 -3449717 903692 3412215
11156 3412215 2016506 -3293597 -8470220 -9219529 -6063892 -3406430 -4283050 -7507497
11148g507497j485352L940153Q827725P568103m11203p877048p583056j518818
11140f046993K518536K111955J554370K559728J513997k260782l244737J357412
11132F3486N755757L687420k247262m667314j632185K351981L554200K514934
11124I381017J129012N7562q72022j978174l326764l924549k389251O38775K441272
11115A156878J689381R3413n24479o41972j189239j546545j001068j92221L98817
11106a757035J406440K657796K463294L10020j845567k354046j781938r33980
11098a835016L99815J527211Q55549o06983N69261M234825M911118l06478n780665
11089C968637m298441K347757N426894J237306m513725n191970j385713J623484
$$ plain form
11148 -7507497 -8992849 -5052696 3775029 11343132 10931929 3054881 -4528175 -6046993
11140 -6046993 -3528457 -1416502 137868 2697596 4211593 1950811 -1293926 63486
11132 63486 5819243 9506663 7259401 2592087 959902 3311883 6866083 9381017
11124 9381017 10510029 10567591 9695569 7717395 4390631 466082 -1923169 -1284394 1156878
11115 1156878 2846259 2939672 2415193 1773221 583982 -962563 -1963631 -2155852 -1757035
11106 -1757035 -350595 2307201 4770495 5080515 3234948 880902 -901036 -1835016
11098 -1835016 -1435201 92010 947559 340576 909837 5144662 10055780 9749302 3968637
11089 3968637 -329804 2017953 7444847 8682153 4168428 -1023542 -2409255 -785771
11081g85771J288089j84795P0850J897613K828795J399659j146628k668059k755993
11072e6240k380084j661327k00976O67970q78442l114158j857551K663739M372771
11063b444298P3622m513414k439333L899276O189390K571887n55893O37353K124059
11054E542649m8436l062745k712899m65213j21163r45101M38791L332953L588062
11045E546898L20658k836755l449622k956609k771523j637136J311321L743994
11037b728774K754490j038185l692836j958277L185534O612934L754080l322998
11029C565968o313892l52210Q139963Q182714j159812q824077o420094J163263
11021b018177L956983M45849l148047l516132k950362k698202q33762K523529
$$ plain form
11081 -785771 502318 317523 388373 2285986 5114781 6514440 5367812 2699753 -56240
11072 -56240 -2436324 -4097651 -4298627 -3630657 -4509099 -7623257 -9480808 -6817069 -2444298
11063 -2444298 -2370676 -6884090 -9323423 -5424147 765243 3337130 2781237 3418590 5542649
11054 5542649 5494213 2431468 -281431 -746644 -867807 -1812908 -1374117 1958836 5546898
11045 5546898 5867556 3030801 -418821 -3375430 -6146953 -7784089 -6472768 -2728774
11037 -2728774 25716 -1012469 -4705305 -6663582 -3478048 3134886 6888966 3565968
11029 3565968 -2747924 -3100134 5039829 13222543 12062731 3238654 -3181440 -2018177
11021 -2018177 1938806 2384655 -763392 -4279524 -7229886 -9928088 -10761850 -8238321
11013h238321L956034K318669N75021M70621J03699j372984j402316J094400K869654
11004C74477J505153l77651M83206K645432K749691R33209m63308j357679k885092
10995C607438l535831r52084K939824L177694j047223m330100k084503L100028
10987H75243M790095J159715k890318k679687j29586m73834l838416m476332L63843
10978g299277N495911N355872K441847K563175M587086K375279l974585p125228
10970D420080l970175J3690N74060Q04231L241564L656437j112960n655388l667297
10961a695758J778611L255013L94503j556994j487377k276127k809495R23596
10953c474028O814523P281328O51484n397542m469704M31146K578210N64113j932104
$$ plain form
11013 -8238321 -4282287 -1963618 -1388597 -917976 -814277 -2187261 -3589577 -2495177 374477
11004 374477 1879630 1501979 1985185 4630617 7380308 8313517 7850209 6492530 3607438
10995 3607438 71607 -880477 2059347 5237041 4189818 -140282 -2224785 875243
10987 875243 5665338 6825053 3934735 1255048 1125462 651628 -3186788 -7663120 -7299277
10978 -7299277 -1803366 3552506 5994353 8557528 13144614 15519893 11545308 4420080
10970 4420080 449905 463595 1037655 1841886 5083450 8739887 7626927 1971539 -1695758
10961 -1695758 82853 3337866 3732369 2175375 687998 -1588129 -4397624 -3474028
10953 -3474028 3340495 10621823 11273307 5875765 1406061 1837207 4415417 4979530 3047426
10944C047426k257121j171644m61647n16142k07393J353747L022771K687471O71511
10935F168979j09182J216145J560765r90594l342035k202044K78934J62429j473044
10926A270353n98437K444632L150885K2629l240806l013813L36182L705295L814537
10917G891457l28909n156927n098165j13824K908788r7195l895316k432449J284583
10908e037957J043165j458827m79508K179632J01842m747036l466244M467400
10900g397533Q607362L306959l975557m567332k35040K191449R44786j110834
10892b235740j752464P63L998528O589566L040231m915564r094795n225517J748063
10883g846929N199188M332925J708042j061620k200311K03432M075071M328318
$$ plain form
10944 3047426 790305 -381339 -842986 -1359128 -1566521 -212774 2809997 5497468 6168979
10935 6168979 6059797 7275942 8836707 7846113 4504078 2302034 2580968 2743397 1270353
10926 1270353 671916 3116548 6267433 6290062 3049256 35443 371625 4076920 7891457
10917 7891457 7562548 2405621 -2692544 -2806368 102420 5225 -3890091 -6322540 -5037957
10908 -5037957 -3994792 -5453619 -5933127 -3753495 -3651653 -8398689 -11864933 -7397533
10900 -7397533 1209829 4516788 541231 -4026101 -4261141 -2069692 -1124906 -2235740
10892 -2235740 -3988204 -3987441 11087 6600653 9640884 4725320 -4369475 -9594992 -7846929
10883 -7846929 -2647741 1685184 3393226 2331606 131295 334727 4409798 8738116
10875H738116M04327k558753k123990j762999l225596k883260P14898K735676
10867C8419o5l480473l564938k258863k129098r43587K705649M749983K528690
10858b354283K74679J524092K251551j349740m371622j015359M128682K351235
10850A439235m679935o640171J2123P206317O755417k61815o824712p433833j590379
10841a2017753N917949Q247432L671598j507135r46561K870890K656532k614787
10833F278165o609119n133907q68299K132053L449754M067128L170204j79833
10825F306146m142933n130739j789832K750702L604524l1892l192955j667674
10817c294653J560709P88345k800957k485575K744530N952768L415966J1901j74178
$$ plain form
10875 8738116 9142443 6583690 4459700 2696701 -528895 -3412155 -2697257 38419
10867 38419 38354 -3442119 -7007057 -9265920 -11395018 -12338605 -9632956 -4882973 -2354283
10858 -2354283 -2079604 -555512 1696039 346299 -4025323 -5040682 -912000 1439235
10850 1439235 -3240700 -9880871 -9868748 -2662431 4092986 3831171 -2993541 -10427374 -12017753
10841 -12017753 -6099804 2147628 5819226 4312091 3365530 6236420 8892952 6278165
10833 6278165 -330954 -5464861 -6333160 -4201107 -751353 3315775 6485979 6306146
10825 6306146 2163213 -2967526 -4757358 -2006656 1597868 1565976 -1626979 -3294653
10817 -3294653 -1733944 -945599 -3746556 -6232131 -3487601 2465167 5881133 5893034 5718856
10808E718856l38911k836701k955616J975889M974112p0912o579241m293036M441515
10799C5955Q191688L392351k841869n177340m869307k779628K074373O441192
10791D467415M904624q02260l328475j438925j163227m137382m682359r07130
10783g087719J273939r37580j831576K186039N441689K752561j545220j527494
10775a275361K49303j290779l508748r31324L770673L515128o79362r72768L706728
10766B583490N380171M42315l945289j325137L920699M031594l29973k881823
10758G876047k362358k442551l060208l87016M299714M170497k256609p373744
10750a536228n572919j143900P8178K50738L521016O170583K128832m971473n504968
$$ plain form
10808 5718856 5379945 2543244 -412372 1563517 6537629 6466717 -112524 -4405560 35955
10799 35955 8227643 11619994 8778125 3600785 -1268522 -4048150 -1973777 4467415
10791 4467415 9372039 8569779 5241304 3802379 2639152 -1498230 -6180589 -7087719
10783 -7087719 -5813780 -6751360 -8582936 -6396897 -955208 1797353 252133 -1275361
10775 -1275361 -1026058 -2316837 -5825585 -6756909 -2986236 528892 -150470 -1123238 2583490
10766 2583490 7963661 8405976 4460687 3135550 7056249 11087843 10757870 7876047
10758 7876047 5513689 3071138 10930 -376086 3923628 8094125 5837516 -1536228
10750 -1536228 -7109147 -8253047 -8174869 -7924131 -4403115 1767468 3896300 -1075173 -6580141
10741f580141J232175N793123L056079j607672k609972j400537l99190J600172
10733i15963M020980K640319k414889m553759j298642R38618k018123m514960
10725h116419j324159K574295P87992k917364j250126M001488N792253L804354
10717C352314K710284K130403j412823n201866l506756J446898K017569j992268
10709d56245l196523N35748L291772K285275J772977L533335L052766j285084
10701I534021l975208j789843L66369j845993m430527k012978K734410L293222
10693A873473l36478k007140R38235L946931K005145l522807o679905m249839
10685h032385M79470K013318k55665j548557J227627M972225N093334J888270
$$ plain form
10741 -6580141 -5347966 445157 3501236 1893564 -716408 -2116945 -2516135 -915963
10733 -915963 3105017 5745336 3330447 -1223312 -2521954 -1583336 -3601459 -8116419
10725 -8116419 -9440578 -6866283 -6078291 -8995655 -10245781 -6244293 -452040 3352314
10717 3352314 6062598 8193001 6780178 1578312 -1928444 -481546 1536023 -456245
10709 -456245 -3652768 -3117020 174752 2460027 4233004 7766339 10819105 9534021
10701 9534021 5558813 3768970 4135339 2289346 -2141181 -4154159 -1419749 1873473
10693 1873473 1536995 -470145 468090 4415021 6420166 2897359 -3782546 -8032385
10685 -8032385 -7552915 -5539597 -5795262 -7343819 -6116192 -1143967 3949367 5837637
10677E837637j008910k250261k886747k488705L55393M106874M950778J858950
10669H475009j987489l214516j611272M09147J83497k701373n364264m650917
10661a0462178j631190o9484Q4064K757908P546409P747790P27899n868827m234592
10652c402201K344432N173651K810549M23276j86430j604870l609956l009772
10644a061321k85480N01774j571117l381036l079393j259782J863842N384358
10636b888155N859365J972938j505396k90994K051209J38459l321415j982935
10628C3076K606081L367163r3285j564855Q3703l85285l486333l009513K500745
10619E1497N783361K051792l839573n445579l294617j430583q87461m05261M19300
$$ plain form
10677 5837637 4828727 2578466 -308281 -2796986 -2441593 1665281 6616059 8475009
10669 8475009 6487520 3273004 1661732 2070879 2254376 -446997 -5811261 -10462178
10661 -10462178 -12093368 -12162852 -12078788 -9320880 -1774471 5973319 6701218 832391 -3402201
10652 -3402201 -1057769 4115882 6926431 7349707 7163277 5558407 1948451 -1061321
10644 -1061321 -1346801 -845027 -2416144 -5797180 -8876573 -10136355 -8272513 -2888155
10636 -2888155 2971210 4944148 3438752 3147758 5198967 5337426 2016011 33076
10628 33076 2639157 6006320 5913035 4348180 4431883 4046598 560265 -2449248 51497
10619 51497 5834858 7886650 4047077 -1398502 -4693119 -6123702 -7011163 -7416424 -6997124
10610f997124J506271K704726K614350J84855k492423k686084j530739j709482
10602h405650k029817L93176L872285M036776J094314p72219m41255l45079q86088
10593c483557l40246P01188M98300J13556O31184n97491m491037n150044J472600
10584a0645547Q059714N308606k690113m219337J296449L441171q33176k953391
10576c235624J236623M566590J686137k615791l153016k302777l138536l314045
10568a0270439p31124J969689K619096K830373L352249K407442M74063L43419
10560B994768J442482O43760j275568j056357R0867j097424k195494J080636N178900
10551E806570L287230k069221k501526J494136J746034k356945l147142O03597
$$ plain form
10610 -6997124 -5490853 -2786127 -171777 13078 -2479345 -5165429 -6696168 -8405650
10602 -8405650 -10435467 -10042291 -6170006 -2133230 -1038916 -1811135 -2252390 -2597469 -3483557
10593 -3483557 -3823803 -3122615 -2624315 -2510759 -1879575 -2477066 -6968103 -12118147 -10645547
10584 -10645547 -2585833 2722773 32660 -4186677 -2890228 550943 -282233 -3235624
10576 -3235624 -1999001 2567589 4253726 1637935 -1515081 -3817858 -6956394 -10270439
10568 -10270439 -11001563 -9031874 -6412778 -3582405 -230156 2177286 2651349 2994768
10560 2994768 4437250 5081010 3805442 2749085 2839952 1742528 -452966 627670 5806570
10551 5806570 9093800 7024579 4523053 6017189 7763223 5406278 2259136 2862733
10543B862733J787216j342306k955814j990927l074393m475203L23041Q000308
10535h65345P647889o80654n238013k323357n59056l082962k494734K872842M543678
10526a79712N5846k609952n86796o2658j804006L33103M201186R64778o119580
10517e807791m350755N005698P411970J226859k70076M521358K675584n959780
10509D453067o338719K270021L764098k811687r92605P843634L360274j1962473
10501d14390j0770684Q451022J3548596l555145j0694810L579463Q004875o807816
10493A341111m363642K1592862J8825800k1780418j4933681Q4421975J64298333
10486B49402340Q9801777q4659183j67926280r1776239J2818426K2797091k1201091
$$ plain form
10543 2862733 4649949 3307643 351829 -1639098 -4713491 -9188694 -8865653 -865345
10535 -865345 6782544 6101890 863877 -1459480 -2018536 -5101498 -7596232 -4723390 -179712
10526 -179712 -123866 -2733818 -3320614 -3383272 -5187278 -4854175 -652989 311789 -5807791
10517 -5807791 -10158546 -5152848 2259122 3485981 3215905 7737263 10412847 4453067
10509 4453067 -1885652 384369 4148467 1336780 344175 8187809 11548083 -414390
10501 -414390 -11185074 -2734052 10814544 7259399 -3435411 144052 8148927 1341111
10493 1341111 -3022531 18570331 37396131 15615713 682032 85104007 249402340
10486 249402340 339204117 254544934 86618654 -5157585 7660841 30457932 9256841
10479I256841k3483516J1516700J8896515n124407j3320880J225364N084510o046864
10471a995737o014401O096684O499021m682762m720888O948685Q661381k282927
10463H509056o984058j098522J025231l404492k704663L237358K640243l565572
10455b345419l024651L458835L100639m432732o746727j608536J295696n8442
10447a0361337J104246L890844J519429k754944k39265N462820L865853k412455
10439G5191k028791L585775K539552n379596q015210j974968L383388L274580
10431d540079K302584J955685j132738m657024k981871J053589P10036r36931
10423h226749L100750P644297K344419p792740p539186L421848R392088M011334
$$ plain form
10479 9256841 -14226675 -2709975 16186540 11062133 -2258747 -1033383 4051127 -1995737
10471 -1995737 -8010138 -1913454 4585567 -97195 -4818083 2130602 10791983 8509056
10463 8509056 1524998 426476 1451707 -1952785 -4657448 -1420090 1220153 -2345419
10455 -2345419 -5370070 -1911235 1189404 -3243328 -9990055 -11598591 -10302895 -10361337
10447 -10361337 -9257091 -5366247 -3846818 -6601762 -6841027 -1378207 2487646 75191
10439 75191 -1953600 1632175 4171727 -1207869 -9223079 -11198047 -7814659 -4540079
10431 -4540079 -2237495 -281810 -1414548 -6071572 -9053443 -7999854 -7289818 -8226749
10423 -8226749 -5125999 2518298 4862717 -2930023 -10469209 -7047361 2344727 6356061
10415F356061j911272j033934P2400l641581o081408k566158J520622J219696
10407f065574k30030M23513Q18491K876J203963L881661K810337j677143k502448
10398a334354J857379L897830m07848n145137m474234n34455K330078L423870
10390c86871K800105K7181j861757J223291O302002N558204j592433o830697n172195
10381F6830p86114J273813J142149P9000j878753k552871N12812L836050J669297
10372C362213l595910l756496J700041M497804J590047o17300R18575J68972n662895
10363a394949q666121k353291P032086R349264M659642P00923N43762L62650k445285
10354G788681n274053m615370o80377K951788L142996O17557q95101M14322K228228
$$ plain form
10415 6356061 4444789 3410855 3483255 -158326 -6239734 -8805892 -7285270 -6065574
10407 -6065574 -6295604 -5872091 -5053600 -5050724 -3846761 34900 2845237 1168094 -1334354
10398 -1334354 523025 4420855 4013007 -1132130 -5606364 -6140819 -3810741 -386871
10390 -386871 2413234 2440415 578658 1801949 8103951 13662155 12069722 5239025 66830
10381 66830 -719284 554529 1696678 1775678 -103075 -2655946 -2143134 1692916 3362213
10372 3362213 -233697 -3990193 -2290152 2207652 3797699 3180399 4098974 4267946 -1394949
10363 -1394949 -10061070 -12414361 -5382275 3966989 8626631 9327554 9871316 10233966 7788681
10354 7788681 2514628 -2100742 -2781119 170669 3313665 3931222 3036121 3450443 5678671
10345E678671K280569J578259R07391j507974m822962l393074M108250Q909806
10337A3738936L713044m959571o069274j476309j847511p608936p965995L49230
10329a2126386P193962N320542K54766r13385L06463M14130J016566L227709L287704
10320G982071j86948j948033J031115L283384m49157o137062o394802j120131
10312c939563L409337L045743p70250l673000k162583K712682N024899J067202
10304D714467m133482l145813K245931L623513l49177k422346j6469P06362k914229
10295a691243m460244k5498M533280L908769J768286K240616J720739l088486
10287D906219o762444l519084K225706K566237j433051k640844L69007K646254
$$ plain form
10345 5678671 7959240 9537499 10444890 8936916 4113954 720880 4829130 13738936
10337 13738936 17451980 12492409 6423135 4946826 3099315 -4509621 -12475616 -12126386
10329 -12126386 -4932424 388118 642884 -270501 35962 450092 1466658 4694367 7982071
10320 7982071 7795123 5847090 6878205 10161589 9712432 3575370 -2819432 -3939563
10312 -3939563 -530226 2515517 1745267 -1927733 -4090316 -1377634 3647265 4714467
10304 4714467 580985 -2564828 -318897 3304616 2955439 533093 516624 1222986 -1691243
10295 -1691243 -6151487 -6176985 -1643705 2265064 4033350 6273966 7994705 4906219
10287 4906219 -1856225 -5375309 -3149603 -583366 -2016417 -4657261 -4288254 -1642000
10279a642000J610773o34772k059645k106418l06453J854560N92734m092016n770578
10270a2553815l80270O170940N505818j152776n148415k688110J682159L136041
10262e428428J985217N80087l29346q24757m23751J227572L234057L370513j32806
10253C258358n213345n978295J65163O767358N447330j766381m524857N87543
10245a257126N441104L699462l07514q45524j56722j885218k847194N16778L676886
10236F034932Q19061m505614m407888R00357M157959K329943r67733k683592k820996
10227a143571j072206K420606M185737J453297k310518j862262J395955J678116
10219D745154j769892l921050k160100O73187J558619P22929l82851q16434k74353
$$ plain form
10279 -1642000 -31227 -665999 -2725644 -4832062 -5138515 -3283955 -2691221 -6783237 -12553815
10270 -12553815 -12934085 -6763145 -1257327 -2410103 -7558518 -10246628 -8564469 -5428428
10262 -5428428 -3443211 -2863124 -3192470 -4017227 -4440978 -3213406 20651 3391164 3258358
10253 3258358 -1954987 -7933282 -7768119 -1000761 4446569 2680188 -1844669 -1257126
10245 -1257126 4183978 7883440 7575926 6730402 6573680 4688462 1841268 2358046 6034932
10236 6034932 6853993 2348379 -2059509 -1159152 2998807 5328750 4361017 1677425 -1143571
10227 -1143571 -2215777 204829 4390566 5843863 3533345 1671083 3067038 4745154
10219 4745154 2975262 -945788 -3105888 -2432701 -874082 -151153 -534004 -1350438 -1624791
10210a624791j11556k355043n375285m246972J392007M826857K125473j201717
10202f571027N77850L703513K365798j48351K106425N088179P24289p353876p413901
10193f921101J311131O628498K493570k881344k088539N20348r17088l212368
10185e066893j493915J341704P05984p75014J439599M756540L695352n76172k509433
10176A517752j339437r67387k378024k602381n19867J708867K689403K898601
10168A007527K224527K66800j505883j420480o41808j180372j950279o14206J532821
10159b281353R11338k112257k865618N35065L775159K467280j270215j755102
10151b595703K005584M726023K317890k116332k526667J276040L097026m02965
$$ plain form
10210 -1624791 -1736347 -4091390 -9466675 -13713647 -12321640 -7494783 -5369310 -6571027
10202 -6571027 -5993177 -2289664 76134 -72217 2034208 7122387 7846676 492800 -6921101
10193 -6921101 -5609970 1018528 3512098 630754 -1457785 -937437 -1854525 -5066893
10185 -5066893 -6560808 -5219104 -4513120 -5288134 -3848535 908005 4603357 4027185 1517752
10176 1517752 178315 -789072 -3167096 -5769477 -6289344 -4580477 -1891074 1007527
10168 1007527 3232054 3498854 1992971 572491 -69317 -1249689 -3199968 -3814174 -2281353
10159 -2281353 -1370015 -3482272 -6347890 -5812825 -2037666 429614 -840601 -2595703
10151 -2595703 -590119 4135904 6453794 4337462 1810795 3086835 6183861 5780896
10143E780896m172396k091537L166648L371232k686148o473807k058422M742660
10135d20874M619798j743284n151003j593402K814775K300162J44900K183409
10127C154481O177613M708653k499428o666383k665144K801236Q41424o152379
10119b99927p710829n48504O885550O583133J059193k277532j608859n80945r43480
10110E57800p57504J076376K885913K879374R19574k030988m137347l354498M0269
10101a921031K865519K940345J685798P69893r52652l986530m919484j252012
10093d770154L094081K698954p16688r26501K348672K714359k309965o896888
10085d764130n597698o42019K617147K853473K032372J355146J153718J836859
$$ plain form
10143 5780896 1608500 -483037 2683611 6054843 3368695 -3105112 -5163534 -420874
10135 -420874 4198924 2455640 -2695363 -4288765 -1473990 826172 971072 3154481
10127 3154481 9332094 14040747 11541319 4874936 2209792 5011028 5852452 -299927
10119 -299927 -8010756 -8559260 -1673710 4909423 5968616 3691084 2082225 1501280 557800
10110 557800 -199704 876672 3762585 6641959 7561533 5530545 1393198 -1961300 -1921031
10101 -1921031 944488 3884833 5570631 6340524 5387872 1401342 -3518142 -4770154
10093 -4770154 -1676073 1022881 306193 -620308 1728364 4442723 2132758 -4764130
10085 -4764130 -10361828 -11003847 -8386700 -5533227 -3500855 -2145709 -991991 844868
10077H44868K469932J333513m49387L48301L072791K904866r59716k720301L85511
10068G230378K158996k493230p287552l309754N566902O828718j510778p230951
10060d7271k487797M502373K861090m322631n992758o75931K518072p40804l805028
10051h190685n68417N082493O012765K346718l50510m9599K62016j168356k146894
10042A229531n68718K266362L411174J558431j817258l631819k072175R08485
10034A284013J532028l84226p65759J896408K891000j358780n893893l582154
10026d381363L213161N126373j16938m421931k161517J877704J476077j313681
10018g02115j224170R75084Q20595j855030l410132k464261k92340K525558N072316
$$ plain form
10077 844868 3314800 4648313 4198926 4547227 7620018 10524884 9565168 6844867 7230378
10068 7230378 9389374 6896144 -391408 -3701162 1865740 8694458 7183680 -47271
10060 -47271 -2535068 1967305 4828395 505764 -5486994 -6162925 -3644853 -4385657 -8190685
10051 -8190685 -8759102 -3676609 2336156 4682874 4332364 4282765 4544781 3376425 1229531
10042 1229531 660813 2927175 6338349 7896780 6079522 2447703 375528 1284013
10034 1284013 2816041 2431815 1666056 3562464 6453464 5094684 -799209 -4381363
10026 -4381363 -1168202 3958171 3841233 -580698 -2742215 -864511 611566 -702115
10018 -702115 -1926285 -951201 -130606 -1985636 -5395768 -7860029 -8152369 -5626811 -554495
10009e54495M338333m42935m287531k702785J032581P95435k373514k131219K301699
10000d024431M560945J286742k804487k305193J468365L290638J093999k196549
9992C70029k472778Q99336L819264J954090k926482m289601l98717K054202k077551
9983c068208p536758n987434J436635O250644M960031J666994j79589q66929m3858
9974c368472K953494M707319J348816l640952l257035J580998L188922K1569j381174
9965B153485J141051J453562k959587n447811j718889K380097J030230j654551
9957c622413P09398N590356N884809J170982k585494k034083N25524J426966q45893
9948F220152m674769n882418k091307K811916L028877j75631k84476L180902L635042
$$ plain form
10009 -554495 3783838 3340903 -946628 -3649413 -2616832 -1821397 -4194911 -6326130 -4024431
10000 -4024431 536514 1823256 -981231 -3286424 -1818059 1472579 2566578 370029
9992 370029 -2102749 -1203413 2615851 4569941 1643459 -2646142 -3044859 -990657 -3068208
9983 -3068208 -10604966 -16592400 -15155765 -8905121 -3945090 -2278096 -2457685 -3324614 -3368472
9974 -3368472 -414978 4292341 5641157 2000205 -1256830 324168 3513090 3534659 2153485
9965 2153485 3294536 4748098 1788511 -3659300 -5378189 -2998092 -1967862 -3622413
9957 -3622413 -2913015 2677341 8562150 9733132 7147638 5113555 5639079 7066045 6220152
9948 6220152 1545383 -4337035 -6428342 -3616426 -587549 -763180 -1047656 2133246 5768288
9939E768288l36610j496814L135625N807214O75230o105444o436630k503335q34459
9930b326935j137972L13069K012183O05576j723571j132720Q18365Q43748Q0171
9921a648086L15651m96077k770709j771623L727286O426936J716223l681815k670650
9912h52864N97203m98427k866639j036345J379144o11596k004773K908475P358079
9903D372257K466021n874228n708948J129469L604929P21887p5566J053140j158271
9894E30690k990139K266850Q552356N606531j443011q07138L160374j605168r276330
9885C995015n276216L693596l71906r633740m18772J7438740N453993l6166049
9877b1285339n2471230j1974934M0226105M4639988R881133j0755045j366639
$$ plain form
9939 5768288 5431678 3934864 7070489 12877703 13552933 7447489 1010859 -1492476 -2326935
9930 -2326935 -3464907 -3151838 -1139655 -534079 -2257650 -3390370 -2572005 -1728257 -1648086
9921 -1648086 -1332435 -1828512 -4599221 -6370844 -2643558 3783378 5499601 1817786 -852864
9912 -852864 -255661 -754088 -3620727 -4657072 -3277928 -3889524 -5894297 -2985822 4372257
9903 4372257 6838278 964050 -4744898 -3615429 -10500 711387 635821 1688961 530690
9894 530690 -2459449 -192599 8359757 13966288 12523277 11716139 14876513 13271345 3995015
9885 3995015 -1281201 2412395 2040489 -7593251 -8012023 9426717 14880710 -21285339
9877 -21285339 -73756569 -85731503 -45505398 -865410 9015723 -1739322 -3105961
9870c105961P215282j214938p438503M58203O611403r7007o910812k881754L250603
9861d113484K469545J24222Q76273o60200m947943k472269P226322R991957J08867
9852H603290q681399n421486J462010R37715k661904q17344L180023K152380j530838
9843b777553k108850j139170j834982j107323L335204O032440K691822j848070
9835A243518k607841k905343n598643n046369K605552R520808P100922j47088
9827D165516k221008Q54142J724648q78413j980532m37152L03018o55984j536193
9818f61958k522181l871306k691273J860139M192507K37857m378891k115998M163267
9809e787837N381294L17264l494223k057180L92340k79704k212987j876223P12210
$$ plain form
9870 -3105961 4109321 2894383 -4544120 -4085917 2525486 2428479 -4482333 -7364087 -4113484
9861 -4113484 -1643939 -1519717 -643444 -1303644 -6251587 -8723856 -1497534 8494423 8603290
9852 8603290 -78109 -5499595 -4037585 -3099870 -5761774 -6579118 -3399095 -1246715 -2777553
9843 -2777553 -4886403 -6025573 -7860555 -8967878 -5632674 399766 3091588 1243518
9835 1243518 -1364323 -4269666 -9868309 -14914678 -12309126 -2788318 4312604 4165516
9827 4165516 1944508 2798650 4523298 3644885 1664353 1227201 1530219 874235 -661958
9818 -661958 -3184139 -7055445 -9746718 -7886579 -3694072 -3456215 -7835106 -9951104 -5787837
9809 -5787837 -406543 -89279 -3583502 -5640682 -5248342 -5528046 -7741033 -9617256 -8905046
9800h905046K979259L085950J309833l03330o9207P99901l37139k970706l521210
9791g931695r28248J754434K448124K279515J817167M07218k0278K903266N312781
9782H042284J027428o394469o023150K665812O370267j601226r825334o633870
9774a2372258K169932M812857K392753K873093M816870J884819k773520j742286
9766B062260J759919o83912o111104m661081J986514K949154k179611k753437
9758g631298L151664N341254N29615j942630J972509L491366k061283n795815
9750b944618j079968M592171L078170q15358M41643L414235J303226k950759k390860
9741B647882J314808J609800j260400k051996k74113O54479O34430J246748M12649
$$ plain form
9800 -8905046 -5925787 -2839837 -1530004 -1833334 -1902541 -1102640 -1439779 -4410485 -7931695
9791 -7931695 -8859943 -7105509 -4657385 -2377870 -560703 -153485 -173763 2729503 8042284
9782 8042284 9069712 2675243 -3347907 -682095 5688172 4086946 -5738388 -12372258
9774 -12372258 -10202326 -5389469 -2996716 -123623 4693247 6578066 3804546 2062260
9766 2062260 3822179 3138267 -2972837 -7633918 -5647404 -2698250 -4877861 -7631298
9758 -7631298 -4479634 861620 1391235 -551395 1421114 4912480 2851197 -2944618
9750 -2944618 -4024586 567585 3645755 2830397 3272040 6686275 7989501 5038742 2647882
9741 2647882 3962690 5572490 4312090 2260094 1985981 2640460 3274890 4521638 4934287
9732D934287l368879n109118j71296O176501N242410j248556l518194P50277L210846
9723F898278j353365p163623o942990k083932J399375K022958K658709L918046
9715f46544K920294j298461m826328l231658K396200N976963L584292j828650
9707C046108m574491l364825j324943k17342J006156K086291R55497j563106j630119
9698e580774J155209K281584j79415j989488j70299J438857j084633m342282l026695
9689a1497936J031826K043491k2475j19192K555491L186911j15825k952692j733893
9680g624294J135898J802875P05022P65888K354901K902400O28226l082827m894026
9671e305937k777226J577275M091804K823177K37140k67122J054739J081994j525677
$$ plain form
9732 4934287 1565408 -3543710 -3715006 2461495 7703905 6455349 2937155 3687432 6898278
9723 6898278 5544913 -1618710 -8561700 -10645632 -9246257 -7223299 -4564590 -646544
9715 -646544 2273750 975289 -3851039 -7082697 -4686497 1290466 4874758 3046108
9707 3046108 -1528383 -4893208 -6218151 -6435493 -5429337 -3343046 -2387549 -3950655 -5580774
9698 -5580774 -4425565 -2143981 -2323396 -4312884 -4483183 -3044326 -4128959 -8471241 -11497936
9689 -11497936 -10466110 -8422619 -8445094 -8564286 -6008795 -2821884 -2937709 -5890401 -7624294
9680 -7624294 -6488396 -4685521 -3980499 -3214611 -859710 2042690 2670916 -411911 -5305937
9671 -5305937 -8083163 -6505888 -2414084 409093 646233 379111 1433850 2515844 990167
9662I90167m552198n025388k350540J276305K799925J252346p95656r6751K581331
9653c920459L089717L08650j418756J137419M324457K581421k896224n422062
9645b215837k199634K403862L642767K113408R80315R07778J94255j977152m469628
9636f19866n363944l177231J730567O088080N875556J124952l015095k174242
9628D68777J384400J702457k238460m509243o72786N190250N819015J099158k348192
9619E895376j647935j179439l449685l586028J699647N828288J322357o812471
9611a929890o794670J851890O789643J381607n967153n752647j021178K33682
9603a1208716j366344J49944M118664M304626K3531k694437j068495R13496J16014
$$ plain form
9662 990167 -3562031 -8587419 -10937959 -9661654 -6861729 -5609383 -6405039 -6501790 -3920459
9653 -3920459 -830742 -522092 -1940848 -803429 3521028 6102449 3206225 -2215837
9645 -2215837 -4415471 -2011609 1631158 3744566 4724881 5632659 5826914 3849762 -619866
9636 -619866 -5983810 -9161041 -7430474 -1342394 4533162 5658114 2643019 468777
9628 468777 1853177 3555634 1317174 -3192069 -3864855 1325395 7144410 8243568 5895376
9619 5895376 4247441 3068002 -381683 -3967711 -2268064 3560224 4882581 -1929890
9611 -1929890 -8724560 -6872670 -83027 1298580 -4668573 -10421220 -11442398 -11208716
9603 -11208716 -12575060 -12425116 -8306452 -4001826 -3978295 -6672732 -7741227 -6827731 -6711717
9594f711717r67247Q06984M126862N407823L236303p02576l151830j602083K849656
9585C292175N490049L148787j524930l482617j772491L21787M20475r27156k346420
9576B619659k568794l54140L348636M614564J397796k592569k905635j164971
9568B394546j753269l549168j581083L497978M865577q703m994495m222307J65989
9559e184935K556938J552729m63056j644969j051255K013266N605152N201325
9551H585195k46046n174430m287999j01877Q29922k537906m861171k497267K253682
9542h037897N443672N746630L318370j559730o520729p130498j986884M234268
9534f492798N980357L638777J724455J369064o39910m672303n482631k2315O115192
$$ plain form
9594 -6711717 -7678964 -6871980 -2745118 2662705 5899008 5196432 2044602 442519 3292175
9585 3292175 8782224 11931011 10406081 6923464 5150973 5472760 5893235 4966079 2619659
9576 2619659 50865 -303275 3045361 7659925 9057721 6465152 3559517 2394546
9568 2394546 641277 -2907891 -4488974 -990996 3874581 3865878 -1128617 -5350924 -5184935
9559 -5184935 -2627997 -1075268 -1538324 -3183293 -4234548 -2221282 3383870 8585195
9551 8585195 8339149 3164719 -1123280 -1225157 -395235 -2933141 -7794312 -10291579 -8037897
9542 -8037897 -2594225 3152405 6470775 4911045 -1609684 -8740182 -10727066 -6492798
9534 -6492798 -512441 3126336 4850791 6219855 5579945 907642 -4574989 -4597304 1517888
9525A517888N362895p91018l511864O94196N175621L076869l250931o495483m330779
9516b552606p35179O64202L55611M18381J329050J842912P72731j246235j886569
9507a037702k04342J091074q20575l561871k120096K798887M504954N02260l016703
9498a864114o27985M092317M972251K663370J241636m1180l858090p015999m276755
9489d714549J785531L682442J203621J431372N738378O439002m71169p970575
9481G124053q255035l301048K97874J295464K461699L525906J959016j352906
9473C755023k828426j688489m44009n33089r92590r79181o46835J07216J309348
9464b941032J715448J13631k422856l347233j580445J574453M139683N078470
$$ plain form
9525 1517888 6880783 6089765 2577901 3272097 8447718 11524587 8273656 1778173 -2552606
9516 -2552606 -3287785 -2623583 -2267972 -1849591 -520541 1322371 2095102 848867 -1037702
9507 -1037702 -1242044 -150970 -971545 -4533416 -6653512 -3854625 650329 1152589 -1864114
9498 -1864114 -2492099 1600218 6572469 9235839 10477475 10436295 6578205 -437794 -4714549
9489 -4714549 -2929018 753424 1957045 3388417 9126795 15565797 15094628 7124053
9481 7124053 -1130982 -4432030 -4134156 -2838692 -376993 3148913 5107929 3755023
9473 3755023 926597 -761892 -1205901 -1738990 -2731580 -3710761 -4357596 -4250380 -2941032
9464 -2941032 -1225584 -1111953 -3534809 -6882042 -8462487 -6888034 -2748351 2330119
9456B330119M500430L035848J062174j295883l101424k568271M90513L096449
9448G549955K153633j388650l753776l390150k168289j633154j039787L88798
9440c281420J974431K994643L187683J661819j853806m501322k623776K444906
9432C158M642656J086166l632169l669486J52891J923882j084093m917343m249780
9423i744118O66574L964803J452247l334559k864636M156273R773242O632781
9415A0702607k193030p333206m950957M11168L488164L281448O95164l026899
9407A074459m661758j271140M337216N436698N91440l756632k271524K262009
9399A740768L931766J834757l30520k21283Q72529M60132k345853n588896n765264
$$ plain form
9456 2330119 6830549 9866397 10928571 9632688 6531264 3962993 4453506 7549955
9448 7549955 9703588 8314938 4561162 1171012 -997277 -2630431 -3670218 -3281420
9440 -3281420 -1306989 1687654 4875337 6537156 4683350 182028 -2441748 3158
9432 3158 4645814 5731980 2099811 -1569675 -1416784 507098 -576995 -5494338 -9744118
9423 -9744118 -9077544 -5112741 -3660494 -6995053 -9859689 -5703416 4069826 10702607
9415 10702607 8509577 1176371 -3774586 -3363418 124746 3406194 4101358 1074459
9407 1074459 -3587299 -4858439 -521223 4915475 5506915 1750283 -521241 1740768
9399 1740768 5672534 7507291 7176771 6955488 7828017 8288149 5942296 353400 -5411864
9390e411864j941416K201097L050367K275138L267301M148346M59189n794429
9382B253729p179483k048849K707202K373480N00166J068013J894344L04128j252291
9373F20439l89161K68021j382051k006143R04581L226478Q79547k557255j636351
9364b071895J738352J910782j114296k859595k171992j037733Q24061M307553
9356d74763O113993K662599k836225m061932r57794J258661R91015J018126J414641
9347E128321n90042l704911l154630Q81154K529515m85306l410270k371350M09025
9338d768494J771831K304067K833691J356825k732379n215353j991566M674927
9330a766451Q229917N273023j098321m861377l060993J328089K658079p16198
$$ plain form
9390 -5411864 -7353280 -5152183 -2101816 173322 3440623 7588969 8048158 2253729
9382 2253729 -4925754 -6974603 -4267401 -1893921 -1393755 -325742 1568602 1872730 620439
9373 620439 231278 499299 -882752 -2888895 -1984314 1242164 2121711 -435544 -2071895
9364 -2071895 -333543 1577239 462943 -2396652 -4568644 -5606377 -4782316 -474763
9356 -474763 5639230 8301829 5465604 1403672 445878 1704539 2695554 3713680 5128321
9347 5128321 4538279 833368 -2321262 -1440108 1089407 604101 -2806169 -5177519 -4768494
9338 -4768494 -2996663 -692596 2141095 3497920 765541 -4449812 -6441378 -1766451
9330 -1766451 6463466 11736489 10638168 5776791 2715798 4043887 6701966 5985768
9322E985768m401366m008034r94814L47051l94901j24171J953341L428039L271473
9313E062386K933406K611766N82182k982142n154520m236555j757771P6202L79311
9304b485735r99152l269629l963770j265936K902015M760960L405598J146215
9296B30566j91945n58071j53299M17139n31430l240518m605452k124902J756453
9287i001459K939885J648635J021312J483953J129884J19745j60789p27211k708505
9278d254550l416352m42713K600882J319568p64938K719331Q612510P114971k199607
9269A1289102q024374m079539J980612J437452k884997l549942o07316Q69606
9261c569396J29336K07404J387508J488119L57895p18364j709382k240484n21371
$$ plain form
9322 5985768 1584402 -2423632 -3418446 -3071395 -3466296 -3590467 -1637126 1790913 5062386
9313 5062386 7995792 10607558 11189740 8207598 3053078 -1183477 -2941248 -2865046 -2485735
9304 -2485735 -3484887 -6754516 -10718286 -11984222 -9082207 -4321247 -915649 230566
9296 230566 38621 -519450 -672749 -255610 -787040 -4027558 -8633010 -10757912 -9001459
9287 -9001459 -6061574 -4412939 -3391627 -1907674 -777790 -658045 -818834 -1546045 -4254550
9278 -4254550 -7670902 -8113615 -5512733 -4193165 -4958103 -2238772 6373738 13488709 11289102
9269 11289102 3264728 -814811 1165801 2603253 -281744 -3831686 -4439002 -3569396
9261 -3569396 -3440060 -3232656 -1845148 -357029 866 -717498 -2426880 -4667364 -5188735
9252e188735K688732L088966l80635k394393N49751L712383J673438k299403j539370
9243h9266K768117L510694q51548m461014l570161q36336P54248J988685L627170
9234B840589L652518Q62688k315760k971533j457922l31240r94344k416432k404169
9225e535605o5607K467558J840638j951251m467020k193419K513619M275438J454980
9216a660669k385446l274884r08502J998222K897688J759740O49210P54027O51581
9207D80967r12090j895550K4257K298448L83792m071547m138252J498091N344995
9198i86889K485982j558030L9518M324593L949058o78884l016819j767476j911087
9189H79966m695506m931856m5572N034343N069673J726645L07919K312726M250946
$$ plain form
9252 -5188735 -2500003 588963 208328 -2186065 -1636314 2076069 3749507 1450104 -89266
9243 -89266 2678851 6189545 5337997 876983 -2693178 -3529514 -2775266 -786581 2840589
9234 2840589 6493107 7355795 5040035 2068502 610580 279340 -715004 -3131436 -5535605
9225 -5535605 -5601212 -3133654 -1293016 -3244267 -7711287 -9904706 -7391087 -3115649 -1660669
9216 -1660669 -4046115 -7320999 -8229501 -6231279 -3333591 -1573851 -924641 -170614 480967
9207 480967 -431123 -2326673 -2302416 -3968 379824 -3691723 -7829975 -6331884 -986889
9198 -986889 1499093 -58937 -19419 4305174 8254232 7575348 4558529 2791053 879966
9189 879966 -3815540 -8747396 -8792968 -3758625 1311048 3037693 3345612 5658338 9909284
9180I909284K683655j440610l783552k033327N30174p25552m318916l991098J215743
9171a954199M201200O55402l683065k352049J271503N80756k118837J28500N648935
9162B378146N977045Q1498m042778k718821j038114k116565k282399j26032k46315
9153d134335l527046l286397L167444Q006076M735636j324635k154848L75295
9145A857190j13304k217925P1088N205920N365749o91903n089174k438644L085339
9136E034336M481844P07115l559587l958313p99996J366406j034749n139167m115497
9127g017608L146829Q921718O688108m9088l871592m069457m615340n164222k320109
9118h350761J945130J970061j583290k055812J802804L495681L07746j538029
$$ plain form
9180 9909284 12592939 11152329 7368777 5335450 5865624 5140072 821156 -3169942 -1954199
9171 -1954199 2247001 2902403 -780662 -3132711 -1861208 -1280452 -3399289 -3270789 2378146
9162 2378146 8355191 8436689 4393911 1675090 636976 -1479589 -3761988 -3888020 -4134335
9153 -4134335 -7661381 -10947778 -7780334 225742 4961378 3636743 1481895 1857190
9145 1857190 1743886 -474039 -402951 4802969 10168718 9476815 4387641 1948997 5034336
9136 5034336 9516180 10223295 6663708 2705395 1905399 3271805 2237056 -2902111 -7017608
9127 -7017608 -3870779 5050939 11739047 11689959 7818367 3748910 -866430 -6030652 -8350761
9118 -8350761 -6405631 -4435570 -6018860 -8074672 -6271868 -2776187 -2468441 -4006470
9110d006470K352463O370990L577833l371673o681514m579481j353386O86830
9102g004408K488716L330092J284468j875548k144912K57186J302495K71605P18385
9093a371921L192050L053097j593229n213336k605289K627438K946029j925928
9085h91089m715972j331288L929580N435488L369202R10159j373899m036499m788212
9076c492530j417271K733865J947074l061524n176778j182432L515774L286148
9068b847674K24086o01590L89055p61417l665047l754281K72601M372130M779543
9059a592594J733549k249682m200517j692931L865250O240969J647968m443279
9051f91267l954655J610612L495709r6247j810659J056168J529459l472822n593424
$$ plain form
9110 -4006470 -1654007 4716983 8294816 4923143 -1758371 -6337852 -7691238 -7004408
9102 -7004408 -4515692 -1185600 98868 -1776680 -3921592 -3664406 -2361911 -2090306 -1371921
9093 -1371921 1820129 4873226 3279997 -1933339 -4538628 -1911190 1034839 -891089
9085 -891089 -5607061 -6938349 -3008769 2426719 5795921 6706080 5332181 1295682 -3492530
9076 -3492530 -4909801 -2175936 -228862 -3290386 -8467164 -9649596 -6133822 -2847674
9068 -2847674 -2623588 -3225178 -2836123 -3597540 -7262587 -11016868 -10744267 -6372137 -1592594
9059 -1592594 140955 -2108727 -6309244 -8002175 -4136925 2104044 3752012 -691267
9051 -691267 -4645922 -3035310 460399 364152 -1446507 -390339 1139120 -2333702 -7927126
9042g927126Q70168P158172L233046m912916m150160M507399P792196J557460
9034H128239m229149l034124m34650j531753k323812O07582K699778N14374j157635
9025g61150J401334K980302j038767n058629k326136K872111K117576k934142
9017b747501l810872M33192K716389M98894j069813J159150M046287M446637K737275
9008H409638k38699l358111l134886J582421M336461j051604q594119o489989
9000h538888M335900R699397K891210n951666o466943k642576k786393m738076
8992a4198035j560218M665037N857898J296943k028360p41318J812200K785785
8984b110068K588339J121419j880231l480900j006370K141862Q36065k819883
$$ plain form
9042 -7927126 -7056958 101214 3334260 -1578656 -5728816 -1221417 6570779 8128239
9034 8128239 3899090 864966 430316 -1101437 -3425249 -2817667 -117889 396485 -761150
9025 -761150 640184 3620486 2581719 -2476910 -4803046 -1930935 186641 -2747501
9017 -2747501 -6558373 -6125181 -3408792 -2909898 -3979711 -2820561 1225726 5672363 8409638
9008 8409638 8170939 4812828 1677942 3260363 7596824 6545220 -2048899 -8538888
9000 -8538888 -4202988 5496409 8387619 2435953 -4030990 -6673566 -9459959 -14198035
8992 -14198035 -15758253 -11093216 -5235318 -3938375 -5966735 -6708053 -4895853 -2110068
8984 -2110068 478271 1599690 -280541 -3761441 -4767811 -2625949 -1789884 -4609767
8976d609767k455277J394298J807547k103250k681541L385008Q509713N591015
8968H837746j363785m204173k433593j057116r49668Q08663L157954J516474l821529
8959D90973o564689l406223J333110K544482J327938J719840L683481L710696
8951D839608J071097r36299m59704n6752k244833m855089l887102L47326L407945
8942b773803K987221J509670J513187J889175Q85062j55021O78022J619413n66629
8933G586297m926511o742319l931363K80167J941044R26393k09829K00651J726383
8924c149087K770459J974958k24433j413208M6325K394892K497287J80229j753864
8915C323558j767081j228999j494424j985780j920201j575545j054849K2335R81236
$$ plain form
8976 -4609767 -7065044 -5670746 -3863199 -5966449 -8647990 -5262982 3246731 8837746
8968 8837746 7473961 3269788 836195 -220921 -1170589 -361926 2796028 4312502 490973
8959 490973 -6073716 -9479939 -8146829 -5602347 -4274409 -2554569 1128912 4839608
8951 4839608 5910705 4974406 4514702 4457950 2213117 -2641972 -6529074 -6181748 -2773803
8942 -2773803 213418 1723088 3236275 5125450 6010512 5855491 6533513 8152926 7586297
8933 7586297 2659786 -4082533 -8013896 -7733729 -5792685 -4866292 -5076121 -4875470 -3149087
8924 -3149087 -378628 1596330 1371897 -41311 5014 2399906 4897193 5077422 3323558
8915 3323558 1556477 327478 -1166946 -3152726 -5072927 -6648472 -7703321 -7680986 -6699750
8906f699750N29394p31680p39750M88469N47324j230228k234733m56834K732148
8897g795640M909379N136800L222919n01126l590594l176503o18612m98975l204697
8888f117049l275704J908588O827207N654951R39318j093338j43320k23928j300379
8879C176346p1537K269358J026613l037690l610894P27631L570025J063871j933332
8870C180391l49663K783547K049398j346542k607188j701319j881645k246324
8862b119345Q70496N720825N737585l27509n339012l649270J265554K769419M09757
8853E338500j434091j398611k020889l523369k384381K256125N286086K127198
8845D246568l982176n300931K84313O246586N729709o3581m137555k644208J358107
$$ plain form
8906 -6699750 -6170356 -6902036 -7641786 -7153317 -6605993 -7836221 -10070954 -10527788 -7795640
8897 -7795640 -2886261 2250539 5473458 4972332 1381738 -1794765 -2413377 -2912352 -6117049
8888 -6117049 -9392753 -7484165 -656958 4997993 5937311 4843973 4700653 4476725 3176346
8879 3176346 3104809 5374167 6400780 3363090 -247804 479827 4049852 5113723 3180391
8870 3180391 2830728 5614275 7663673 6317131 3709943 2008624 126979 -2119345
8862 -2119345 -1248849 4471976 10209561 9882052 4543040 893770 2159324 4928743 5338500
8853 5338500 3904409 2505798 484909 -3038460 -5422841 -3166716 2119370 4246568
8845 4246568 264392 -5036539 -4752226 1494360 7224069 7160488 3022933 378725 1736832
8836A736832K772821L41852l153951m515301k613621J402413M935869N674996
8828F581910L647402J079633m50568j699051l610529m885904l611219m39951K165963
8819a222314L432785M345038M329826J412338l165441m362609k82763L546876
8811H033736J187252m593193n807388j233508J745499r83450l458373N76893O681472
8802B148940N746774j859275o415178l094102J916290J897857r81524j208600
8794a848818P46226O35095j465966j647633O29931J679525j11795k124949k194584
8785e702968j049146O47452L273973N056759K544144l327469n941811j531838
8777f030904M218291K941628m543562q486268l099019N527697P375107J481173
$$ plain form
8836 1736832 4509653 4851505 1697554 -2817747 -5431368 -4028955 906914 6581910
8828 6581910 10229312 11308945 10858377 9159326 5548797 662893 -2948326 -3388277 -1222314
8819 -1222314 2210471 6555509 10885335 12297673 9132232 4769623 4486860 8033736
8811 8033736 9220988 4627795 -1179593 -2413101 -667602 -1651052 -5109425 -4532532 2148940
8802 2148940 7895714 6036439 -378739 -3472841 -1556551 341306 -640218 -1848818
8794 -1848818 -1102592 -467497 -1933463 -3581096 -2951165 -1271640 -1383435 -3508384 -5702968
8785 -5702968 -6752114 -6104662 -2830689 2226070 4770214 1442745 -4499066 -6030904
8777 -6030904 -1812613 1129015 -3414547 -11900815 -14999834 -9472137 -2097030 -615857
8769f15857l349249o56898N112160M890389k513102q561991o149338J447713N490046
8760d906127K960240j123434j621226P50629K216328J309577m23309j052570L9521
8751a850371J773605J749761j404873n253038n185470k47001M677497M518837
8743a221053L39187k415396j109882J325946J084005j420939k585730p37401J650042
8734e091221J513968l17510k37990K551054M341590K421731n23775p02776M25546
8725D380617j183409m353920l545677J872056N491099L312430o58264j745527
8717C569405j654874l212706l524516P35697N153415K798599m259419o931392
8709g325791k427129K430170K411779O55592J466377L244983K730667R57866M74962
$$ plain form
8769 -615857 -3965106 -4622004 490156 5380545 2867443 -5694548 -11843886 -10396173 -4906127
8760 -4906127 -1945887 -3069321 -4690547 -3939918 -1723590 -414013 -837322 -1889892 -1850371
8751 -1850371 -76766 1672995 268122 -4984916 -10170386 -10417387 -5739890 -1221053
8743 -1221053 -881866 -3297262 -4407144 -3081198 -1997193 -3418132 -6003862 -6741263 -5091221
8734 -5091221 -3577253 -3894763 -4132753 -1581699 2759891 5181622 4657847 3955071 4380617
8725 4380617 3197208 -1156712 -4702389 -2830333 2660766 5973196 5314932 3569405
8717 3569405 1914531 -1298175 -4822691 -4086994 1066421 3865020 -394399 -7325791
8709 -7325791 -9752920 -7322750 -4910971 -4255379 -2789002 455981 3186648 4144514 4619476
8700D619476O25129j52152o40901M43627R85515j147584l656801k910292L47522
8691a486461K350230J868571N67492q94076l087559m829096l880273o86340J716162
8682h361350J585748k21974k264350l149521j151518L431815O322777L701769
8674a06604j595627k820967J150801L923105J034382l562002l821878l45796J790455
8665d354131J166070O16601R68507p1062k290292j850341K012748M097992P82908
8656A079000l430941k039832L153182M105068j254300n475334k629509K935312
8648c557354L510471m14867j731808J766277M135050P95603m276247m261686R00807
8639c133754M664687K642468k258525m272682k102806K89338r8811q78436J748904
$$ plain form
8700 4619476 5244605 5092453 4451552 4895179 5880694 4733110 1076309 -1833983 -1486461
8691 -1486461 863769 2732340 3299832 2405756 -681803 -5510899 -9391172 -10077512 -8361350
8682 -8361350 -6775602 -6997576 -9261926 -12411447 -13562965 -10131150 -3808373 -106604
8674 -106604 -1702231 -4523198 -3372397 550708 1585090 -1976912 -5798790 -6144586 -4354131
8665 -4354131 -3188061 -2571460 -1602953 -1674015 -3964307 -5814648 -3801900 296092 1079000
8656 1079000 -2351941 -4391773 -1238591 2866477 1612177 -3863157 -6492666 -3557354
8648 -3557354 -46883 -461750 -2193558 -427281 3707769 4503372 227125 -4034561 -3133754
8639 -3133754 1530933 4173401 1914876 -2357806 -4460612 -4171274 -4270085 -5148521 -3399617
8630c399617O079482O154072P46227l541824j284017L701871M080553k40664l170641
8621I125442k541442k094299l319524k682213J020223L259843J114005j593908
8613B288127m86953K610867L316143J329677p18907j943034k741580k316985l03407
8604A033948J395951J364098P80400M63009p69738k367819j120175K824602M029557
8595G633833J17024l243510j133887K152364L83666l664986l050300R88974J102467
8586A285645l275706m885487q82336L038973K570936O90272Q66128J315239o15904
8577A07760l659231n120091m086378o11765M147427O391762L161814k218443l505481
8568e392626m82415J545454J170661K207505M582268K605392m528127q807200
$$ plain form
8630 -3399617 2679865 8833937 9580164 6038340 4754323 8456194 12536747 12296083 9125442
8621 9125442 6584000 4489701 1170177 -1512036 -491813 2768030 3882035 2288127
8613 2288127 1801174 4412041 7728184 9057861 8338954 6395920 3654340 1337355 1033948
8604 1033948 2429899 3793997 4574397 5037406 4267668 1899849 779674 3604276 7633833
8595 7633833 7750857 4507347 3373460 5525824 5909490 2244504 -805796 183178 1285645
8586 1285645 -1990061 -6875548 -7757884 -4718911 -2147975 -1457703 -591575 723664 107760
8577 107760 -3551471 -8671562 -12757940 -13369705 -9222278 -2830516 331298 -1887145 -5392626
8568 -5392626 -5875041 -4329587 -3158926 -951421 3630847 6236239 1708112 -7099088
8560g099088m718860K542685N417975M235073L358382K704087k47651l916517
8552B276086m552985k287108o8969J251963K409893K633865J237044J41216J065995
8543D107000K252750J232480j306917l173687l719600k926550n12432J882570
8535b164386J324717j349847j472814J927203L675001Q20042k180126j057896
8527d78106J092982j64434k420433p97786L252181M260493J336881j615059k402253
8518B064466k065563j649664j684466k718040l086118L26883N903453P004827
8510D095778J990094j795143L74939K203386k616382q099568n113037K693896
8502f266037M294907n91892j770761L701613O874484K022632m754792n706641
$$ plain form
8560 -7099088 -11817948 -9275263 -3857288 377785 3736167 6440254 6192603 2276086
8552 2276086 -2276899 -4564007 -4632976 -3381013 -971120 1662745 2899789 3041005 4107000
8543 4107000 6359750 7592230 6285313 3111626 -607974 -3534524 -4046956 -2164386
8535 -2164386 -839669 -2189516 -3662330 -1735127 1939874 2759916 579790 -478106
8527 -478106 614876 450442 -1969991 -2767777 484404 4744897 6081778 4466719 2064466
8518 2064466 -1097 -1650761 -3335227 -6053267 -9139385 -8812502 -2909049 4095778
8510 4095778 6085872 4290729 4665668 6869054 4252672 -3846896 -8959933 -6266037
8502 -6266037 -1971130 -2563022 -4333783 -632170 6242314 8264946 3510154 -2196487
8494b196487j460834K740690L940203J824776k016492l617795p10545K696995
8486A200511J560848j732578j335334J486442P02605k950184l115808Q0956M81184
8477c621358j306255J735786Q182928P600470j250883n986763p22942L579695
8469H210678k087175q905383m991171M878684P841266L182406M0300O15228l21403
8460H463430k706558j599048J348960l42925n094228m380083K384079N894120
8452C967747K216475j310749M92413J806174l216785r055701o708339K007702
8444i801063O544715K373678l670685l611285J704409N480926M330367J039224
8436D390286q81176j458371j953221j606164N17229K567562K276700R53932J380734
$$ plain form
8494 -2196487 -3657321 -916631 3023572 4848348 2831856 -785939 -1496484 1200511
8486 1200511 2761359 1028781 -306553 1179889 1882494 -1067690 -4183498 -4102542 -3621358
8477 -3621358 -4927613 -3191827 4991101 12591571 11340688 5353925 4630983 8210678
8469 8210678 6123503 -2781880 -7773051 -2894367 4946899 8129305 8169605 8784833 8463430
8460 8463430 5756872 4157824 5506784 5163859 69631 -4310452 -1926373 3967747
8452 3967747 6184222 4873473 5365886 7172060 3955275 -5100426 -11808765 -9801063
8444 -9801063 -3256348 -882670 -4553355 -8164640 -6460231 -979305 3351062 4390286
8436 4390286 3509110 2050739 97518 -1508646 -991417 1576145 3852845 4806777 6187511
8427F187511K835311K511942Q68949L67284l20087m359999q991608p394565J00321
8418h194941M806775K665334L8129K114875M149670P72441l747104k795843J131117
8409I40453J208326k033637k775717l13460J305441J443275K269529K229268j441995
8400B831483n369558l629486K368548N601231M079943J870641N31985k036103
8392F248684m733348l934850j109424j135753k724543K71400O873120Q057274
8384G812560O44796o940230o787521j525799K069052K413999J452241j01307j087440
8375b049649J179816N849088P184881K420439l566784n287173l827005l078328
8367a174715l163108j907113O29274K867823L977070K825365j608139o531411
$$ plain form
8427 6187511 9022822 11534764 12403713 12770997 12450910 8090911 -900697 -8295262 -8194941
8418 -8194941 -3388166 -722832 -684703 1430172 5579842 6352283 2605179 -190664 940453
8409 940453 2148779 115142 -2660575 -2974035 -1668594 -225319 2044210 4273478 2831483
8400 2831483 -2538075 -6167561 -3799013 1802218 5882161 7752802 8284787 6248684
8392 6248684 1515336 -2419514 -3528938 -4664691 -7389234 -7117834 -244714 7812560
8384 7812560 8457356 1517126 -5270395 -6796194 -4727142 -2313143 -860902 -962209 -2049649
8375 -2049649 -869833 4979255 12164136 14584575 11017791 5730618 1903613 -1174715
8367 -1174715 -4337823 -6244936 -5615662 -2747839 1229231 4054596 2446457 -4084954
8359d084954o732555k312612K80631j853512l168197Q57311N488485M182437p97850
8350h140816k400181K24306K161313J690597J355535J454678k22588k404917r75305
8341g257378L582805N460102J827170l138042m313191j598578J863964L831933
8333B58785L582562J384654r86993j471861n05507m76507j973293l123806l033234
8324f345200k791304k314050K76968M480050O107356K883691j397348j730831
8316h30668R42302J346767k113470n122494l896764j61116J998741J286569r47065
8307g497198l359006m345461j471750N030752R642273O904204q36939n477641
8299a410766l384466R90504K636882J964107J175189m6945j827143j791449M77578
$$ plain form
8359 -4084954 -10817509 -13130121 -12849490 -14703002 -17871199 -17013888 -11525403 -7342966 -8140816
8350 -8140816 -10540997 -10316691 -8155378 -6464781 -5109246 -3654568 -3877156 -6282073 -7257378
8341 -7257378 -3674573 1785529 3612699 474657 -3838534 -5437112 -3573148 258785
8333 258785 3841347 5226001 4239008 2767147 2261640 1785133 -188160 -3311966 -6345200
8324 -6345200 -9136504 -11450554 -11173586 -6693536 -586180 2297511 900163 -830668
8316 -830668 111634 1458401 -655069 -5777563 -9674327 -9835443 -7836702 -6550133 -7497198
8307 -7497198 -10856204 -15201665 -16673415 -11642663 -2000390 4903814 4066875 -1410766
8299 -1410766 -4795232 -3804728 -1167846 796261 1971450 1924505 97362 -1694087 -1216509
8290a216509J062167j730684l008215R64740N156168K940102k725043l496511
8282b053785J220935M105913J963065r95892k127065l606007n321964l362869
8274a0177669J823837L949788Q11624j883754j59297K157702J114924o61354K75152
8265b749047J990000J647082O22335N62294k42896k262847k205520O21042J548310
8256d69247j309462k813728J52816K609999O53417q21616K699374N674732J441186
8247G817471n213051m977398R04661L405918N18385j639583o44703L7371j98313
8238A0758J529429L728969K025241j488559m49971L856336L339265k810163n735367
8229D005938j396698L086641J696262j662324j838434j145222l132444m953955
$$ plain form
8290 -1216509 -154342 -1885026 -4893241 -3928501 1227667 4167769 1442726 -2053785
8282 -2053785 -832850 3273063 5236128 4240236 2113171 -1492836 -6814800 -10177669
8274 -10177669 -8353832 -4404044 -3592420 -5476174 -5635471 -3477769 -2362845 -3024199 -2749047
8265 -2749047 -759047 888035 1510370 2072664 1829768 -433079 -2638599 -2017557 -469247
8256 -469247 -1778709 -4592437 -4439621 -1829622 -1176205 -1997821 701553 6376285 7817471
8247 7817471 2604420 -2372978 -1468317 1937601 2455986 816403 171700 209071 10758
8238 10758 1540187 5269156 7294397 5805838 5355867 9212203 12551468 9741305 4005938
8229 4005938 2609240 5695881 7392143 5729819 3891385 2746163 -386281 -5340236
8221e340236k650605J534329L271746K923636K709532J519156j898473m322371
8213b253286k165986K447692M376056K103583j841170m698361m715064j359889
8205h106425K890856L893636J393798j00640J773486L546221J837217j419696
8197E708453k966852l169744l348750k302136N82665K604538K064855J516887
8189F89916K863693L362644P73597j837062j311674k00925j918485m123610k980651
8180d682557l28903L3082j34487K826002N978297L437830k710666m053020J015264
8171A380842M442469J178054l162341j506550L789842M706624r36573o689359
8163C203008n574441J937353Q422967P209586n24451p071361p060093k908772
$$ plain form
8221 -5340236 -7990841 -6456512 -3184766 -261130 2448402 3967558 2069085 -2253286
8213 -2253286 -4419272 -1971580 2404476 4508059 2666889 -2031472 -6746536 -8106425
8205 -8106425 -5215569 -1321933 71865 -28775 1744711 5290932 7128149 5708453
8197 5708453 2741601 -428143 -3776893 -6079029 -5496364 -2891826 -826971 689916
8189 689916 3553609 6916253 7689850 5852788 4541114 4340189 2421704 -1701906 -4682557
8180 -4682557 -5011460 -4978378 -5112865 -2286863 3691434 7129264 4418598 365578 1380842
8171 1380842 5823311 7001365 3839024 2332474 6122316 10828940 9892367 3203008
8163 3203008 -2371433 -434080 7988887 15198473 14674022 7602661 542568 -2366204
8155b366204J78004J488097L329742M964361L469027l43924k434088j933642j707879
8146D643494k255010q07487K358861K696420j147592m047995j848388K476814
8138B069117L766996J884023j2916j133392k567833l390425j745573J235005K423625
8129B528627J095519p66699j992020k960120l080126p43038L432222N747721L309560
8120F571646k239232n988274m701286q4586L198664K816490J137164J329071K375717
8111D415374O49635l733327n724363k183174L091730M058894L45955k820057j924717
8102c824050Q97363J815269M30414p64274n38633l05447j273381k097193q23809
8093f483741J620741K070788k75350k189086r92776J254676Q77258j565907k149168
$$ plain form
8155 -2366204 -2188200 -700103 2629639 7594000 11063027 10719103 8285015 6351373 4643494
8146 4643494 2388484 1580997 3939858 6636278 5488686 1440691 -407697 2069117
8138 2069117 5836113 7720136 7707220 6573828 4005995 615570 -1130003 105002 2528627
8129 2528627 3624146 2857447 865427 -2094693 -5174819 -5917857 -2485635 3262086 6571646
8120 6571646 4332414 -1655860 -6357146 -6441732 -3243068 -426578 710586 2039657 4415374
8111 4415374 5065009 1331682 -4392681 -6575855 -3484125 574769 920724 -1899333 -3824050
8102 -3824050 -2926687 -1111418 -681004 -1445278 -1983911 -2289358 -3562739 -5659932 -6483741
8093 -6483741 -4863000 -2792212 -3067562 -5256648 -6249424 -4994748 -4117490 -5683397 -7832565
8084g832565K02036K444841K873707L475989N120957M702118K85662m268134m004970
8075B999641j52236J757201J72767o40812K280266N626144M148949k167711p632517
8066F391692p179706j827431K659015K355870l54951j17223L890241O304139K824891
8057A4946537l416242n731327k660256Q89869J124405o9101N46326K125722J488440
8048I244373j599886m022305l781599k288515j733983k115333j862533k36800
8040h396581J992683L619937L750468K009589o62853j586839J419935O459394
8032H605733P924825K516370n856455r620568o155955m63418J557187r6772j344935
8023b933988m47820N22493l9266q14823k75920N43232l00580k386758l031724
$$ plain form
8084 -7832565 -7630529 -5185688 -2311981 1164008 6284965 10987083 11272745 7004611 2999641
8075 2999641 2847405 4604606 4777373 4136561 6416827 12042971 16191920 14024209 6391692
8066 6391692 -788014 -2615445 43570 2399440 2044489 1927266 5817507 12121646 14946537
8057 14946537 11530295 5798968 3138712 4028581 5152986 5083885 5630211 7755933 9244373
8048 9244373 7644487 3622182 -159417 -2447932 -4181915 -6297248 -8159781 -8396581
8040 -8396581 -6403898 -2783961 966507 2976096 2313243 726404 2146339 8605733
8032 8605733 16530558 19046928 13190473 3569905 -2586050 -3049468 -1492281 -1589053 -2933988
8023 -2933988 -3381808 -2859315 -2898581 -3713404 -3989324 -3446092 -3746672 -6133430 -9165154
8014i165154o04705L308159N448476M263331J351978o17157j064555j705862l394953
8005b180442m118890j610556K722588M658548K482606n21139l54831K329825L323554
7996F731263P93635k413516k990310j292053K90286J042897J581022J206008j111397
7987C837835l462886k393337J629248L717410J229120k483857l366141k214954
7979c507562j556221l98805K966017N465889K759971k747771m139423o34205J077062
7970g15048j929322l635246O82396N694145L919145k204168l733245J324914N471110
7961D874681K978447k587152m162543k99179L980146L427148j752945n769787
7953F88816l233343L890791P344827K674184m429413n508589n90610L039404J828154
$$ plain form
8014 -9165154 -9769859 -6461700 -1013224 3250107 4602085 3984928 2920373 1214511 -2180442
8005 -2180442 -6299332 -7909888 -5187300 -528752 1953854 1432715 1077884 3407709 6731263
7996 6731263 7524898 5111382 2121072 829019 1119305 2162202 3743224 4949232 3837835
7987 3837835 374949 -2018388 -389140 3328270 4557390 2073533 -1292608 -3507562
7979 -3507562 -5063783 -5462588 -2496571 2969318 5729289 2981518 -1157905 -1792110 -715048
7970 -715048 -2644370 -6279616 -5597220 96925 4016070 1811902 -1921343 -596429 4874681
7961 4874681 7853128 5265976 1103433 804254 4784400 8211548 6458603 688816
7953 688816 -2544527 1346264 8691091 11365275 6935862 1427273 836663 3876067 5704221
7944E704221m66148m13944J63848j043860k433229j828566k90237L63312O63733
7935D19130J418341J393866k26105j562357q26978P71286J231301P05245N3303
7926C377032j169335k877956l074805j074134L05024r73661j960300J117471N993839
7917c36825O395426Q76491m813289n317289j951966M44211J5525j298685j626956
7908g613357r33736N72807L067859N429809N085767J246832k913354l508833r60098
7899e26304P68294J48170M9477K250969L626482J146774k265035j678977J744618
7890E264468K304002q54029k113301J309378M397195J910937l838310o851103
$$ plain form
7944 5704221 5238073 4824129 4987977 3944117 1510888 -317678 -607915 -244603 419130
7935 419130 1837471 3231337 3005232 1442875 615897 1387183 2618484 3323729 3377032
7926 3377032 2207697 -670259 -3745064 -4819198 -4514174 -5487835 -7448135 -6330664 -336825
7917 -336825 6058601 6935092 2121803 -3195486 -5147452 -4703241 -4687716 -5986401 -7613357
7908 -7613357 -8547093 -7974286 -4906427 523382 5609149 6855981 3942627 433794 -526304
7899 -526304 241990 390160 439637 2690606 6317088 7463862 5198827 3519850 5264468
7890 5264468 7568470 6714441 4601140 5910518 10307713 12218650 8380340 1529237
$$ [...]
##END NTUPLES=NMR SPECTRUM
##END=
