##TITLE=31Pdec_3MBDE 2-7
 CDCl3, 148 sc
 13.12.2022
##JCAMPDX= 6.0         $$ Bruker NMR JCAMP-DX V2.0
##DATA TYPE= NMR SPECTRUM
##DATA CLASS= NTUPLES
##ORIGIN= UXNMR, Bruker Analytische Messtechnik GmbH
##OWNER= root
$$ XWIN-NMR		Version 3.5
$$ Tue Dec 13 14:01:18 2022 Russian Standard Time (UT+4h)  she@DPX200
##.OBSERVE FREQUENCY= 81.013821
##.OBSERVE NUCLEUS= ^31P
##.ACQUISITION MODE= SIMULTANEOUS
##.ACQUISITION SCHEME= undefined
##.AVERAGES= 24
##.DIGITISER RES= 16
##SPECTROMETER/DATA SYSTEM= spect
##.PULSE SEQUENCE= zgpg30
##.SOLVENT NAME= CDCl3
##.SHIFT REFERENCE= (INTERNAL, CDCl3, 0, 248.564)
##AUDIT TRAIL= $$ (NUMBER, WHEN, WHO, WHERE, WHAT)
$$ ##TITLE= Audit trail, XWIN-NMR		Version 3.5
$$ ##JCAMPDX= 5.01
$$ ##ORIGIN= Bruker BioSpin GmbH
$$ ##OWNER= she
$$ F:/spectra/data/she/nmr/P31/1/pdata/1/auditp.txt
$$ ##AUDIT TRAIL=  $$ (NUMBER, WHEN, WHO, WHERE, WHAT)
(   1,<2022-12-13 14:00:15.81 +0400>,<she>,<DPX200>,
      <created by zg, POWCHK disabled, PULCHK disabled
       configuration hash MD5:
       00 E9 B6 7A A2 85 ED C7 34 08 36 98 17 FE 4E 26
       data hash MD5: 32K
       B9 12 64 1E 29 E2 A9 DE B8 55 D3 E0 23 5B 6F 70>)
(   2,<2022-12-13 14:00:18.40 +0400>,<she>,<DPX200>,
      <Start of raw data processing
       efp BC_mod = 2 LB = 1 FT_mod = 6 PKNL = 1 PHC0 = -10502.1 PHC1 = -45.54432 SI = 64K 
       data hash MD5: 64K
       F9 86 30 BD A5 2C 3A B4 7B 7B 50 23 AD 66 F2 65>)
(   3,<2022-12-13 14:00:46.40 +0400>,<she>,<DPX200>,
      <pk PHC0 = -310.8905 PHC1 = 563.8002 
       data hash MD5: 64K
       34 1B C6 91 2F B5 D5 6E BF 52 67 97 02 C3 E3 9F>)
(   4,<2022-12-13 14:00:49.35 +0400>,<she>,<DPX200>,
      <abs ABSG = 5 
       data hash MD5: 64K
       18 F6 5B AC D1 33 91 A1 BF BB 0D 90 3C A3 7C 0D>)
$$ ##END=
$$ 
$$ hash MD5
$$ A4 CE D8 A4 F8 C8 64 E1 A3 DA C7 76 E0 33 AB 69
##$RELAX= 
##$RELAX= 
##$RELAX= 
##$RELAX= 
##$RELAX= 
##$RELAX= 
##$RELAX= 
##$RELAX= 
##$RELAX= 
$$ Bruker specific parameters
$$ --------------------------
##$DU= <F:/spectra>
##$EXPNO= 1
##$NAME= <P31>
##$PROCNO= 1
##$TYPE= <nmr>
##$USER= <she>
##$AMP= (0..31)
100 100 100 100 100 100 100 100 100 100 100 100 100 100 100 100 100 100 
100 100 100 100 100 100 100 100 100 100 100 100 100 100 
##$AQSEQ= 0
##$AQ_mod= 1
##$AUNM= <au_zg>
##$AUTOPOS= <>
##$BF1= 81.014009
##$BF2= 200.13
##$BF3= 200.13
##$BF4= 200.13
##$BF5= 200.13
##$BF6= 200.13
##$BF7= 200.13
##$BF8= 200.13
##$BYTORDA= 1
##$CFDGTYP= 0
##$CFRGTYP= 5
##$CHEMSTR= <none>
##$CNST= (0..31)
1 1 145 1 1 1 1 1 1 1 1 1 1 1 1 1 1 1 1 1 1 1 1 1 1 1 1 1 1 1 1 1 
##$CPDPRG= <waltz16>
##$CPDPRG1= <>
##$CPDPRG2= <waltz16>
##$CPDPRG3= <>
##$CPDPRG4= <mlev>
##$CPDPRG5= <mlev>
##$CPDPRG6= <mlev>
##$CPDPRG7= <mlev>
##$CPDPRG8= <mlev>
##$CPDPRGB= <>
##$CPDPRGT= <>
##$D= (0..31)
0 1 0 0 0 0 0 0 0 0 0 0.03 2e-05 3e-06 0 0 0 0 0 0 0 0 0 0 0 0 0 0 0 0 
0 0 
##$DATE= 1670925615
##$DBL= (0..7)
120 120 120 11 120 120 24 19 
##$DBP= (0..7)
150 150 150 150 150 150 150 150 
##$DBP07= 0
##$DBPNAM0= <>
##$DBPNAM1= <>
$$ [...]
##$SUBNAM3= <"">
##$SUBNAM4= <"">
##$SUBNAM5= <"">
##$SUBNAM6= <"">
##$SUBNAM7= <"">
##$SUBNAM8= <"">
##$SUBNAM9= <"">
##$SW= 501.771253377433
##$SWIBOX= (0..15)
0 1 3 0 0 0 0 0 0 0 0 0 0 0 0 0 
##$SW_h= 40650.406504065
##$TD= 32768
##$TD0= 1
##$TE= 0
##$TE2= 300
##$TE3= 300
##$TEG= 300
##$TL= (0..7)
0 120 53 12 22 120 120 120 
##$TP= (0..7)
150 150 150 150 150 150 150 150 
##$TP07= 0
##$TPNAME0= <>
##$TPNAME1= <>
##$TPNAME2= <>
##$TPNAME3= <>
##$TPNAME4= <>
##$TPNAME5= <>
##$TPNAME6= <>
##$TPNAME7= <>
##$TPOAL= (0..7)
0.5 0.5 0.5 0.5 0.5 0.5 0.5 0.5 
##$TPOFFS= (0..7)
0 0 0 0 0 0 0 0 
##$TUNHIN= 0
##$TUNHOUT= 0
##$TUNXOUT= 0
##$USERA1= <user>
##$USERA2= <user>
##$USERA3= <user>
##$USERA4= <user>
##$USERA5= <user>
##$V9= 5
##$VALIST= <valist>
##$VCLIST= <CCCCCCCCCCCCCCC>
##$VD= 0
##$VDLIST= <DDDDDDDDDDDDDDD>
##$VPLIST= <PPPPPPPPPPPPPPP>
##$VTLIST= <TTTTTTTTTTTTTTT>
##$WBST= 1024
##$WBSW= 4
##$XGAIN= (0..3)
0 0 0 0 
##$XL= 0
##$YL= 0
##$YMAX_a= 3185
##$YMIN_a= -5640
##$ZGOPTNS= <>
##$ZL1= 120
##$ZL2= 120
##$ZL3= 120
##$ZL4= 120
##$ABSF1= 248.5645
##$ABSF2= -253.2056
##$ABSG= 5
##$ABSL= 3
##$ALPHA= 0
##$AQORDER= 0
##$ASSFAC= 0
##$ASSFACI= 0
##$ASSFACX= 0
##$ASSWID= 0
##$AUNMP= <proc_1d>
##$AZFE= 0.1
##$AZFW= 0.5
##$BCFW= 0
##$BC_mod= 2
##$BYTORDP= 0
##$COROFFS= 0
##$CY= -3
##$DATMOD= 1
##$DC= 0
##$DFILT= <>
##$DTYPP= 0
##$F1P= 0
##$F2P= 0
##$FCOR= 1
##$FTSIZE= 65536
##$FT_mod= 6
##$GAMMA= 0
##$GB= 0
##$INTBC= 1
##$INTSCL= 6.047779e-11
##$ISEN= 30
##$LB= 1
##$LEV0= 0
##$LPBIN= 0
##$MAXI= 10000
##$MC2= 0
##$MEAN= 0
##$ME_mod= 0
##$MI= 50
##$NCOEF= 0
##$NC_proc= -8
##$NLEV= 6
##$NOISF1= 182.463
##$NOISF2= 159.3651
##$NSP= 0
##$NTH_PI= 0
##$NZP= 0
##$OFFSET= 248.5645
##$PC= 4
##$PHC0= -10812.99
##$PHC1= 518.2559
##$PH_mod= 1
##$PKNL= yes
##$PPARMOD= 0
##$PSCAL= 0
##$PSIGN= 0
##$REVERSE= no
##$SF= 81.0140089999694
##$SI= 65536
##$SIGF1= 159.3651
##$SIGF2= -187.1042
##$SINO= 113.3802
##$SIOLD= 16384
##$SREGLST= <1H.CDCl3>
##$SSB= 0
##$STSI= 65536
##$STSR= 0
##$SW_p= 40650.406504065
##$SYMM= 0
##$S_DEV= 0
##$TDeff= 32768
##$TDoff= 0
##$TI= <>
##$TILT= no
##$TM1= 0
##$TM2= 0
##$TOPLEV= 0
##$USERP1= <user>
##$USERP2= <user>
##$USERP3= <user>
##$USERP4= <user>
##$USERP5= <user>
##$WDW= 1
##$XDIM= 65536
##$YMAX_p= 415777137
##$YMIN_p= -96006408
$$ End of Bruker specific parameters
$$ ---------------------------------
##NTUPLES= NMR SPECTRUM
##VAR_NAME=  FREQUENCY,     SPECTRUM/REAL,   SPECTRUM/IMAG
##SYMBOL=    X,             R,               I
##VAR_TYPE=  INDEPENDENT,   DEPENDENT,       DEPENDENT
##VAR_FORM=  AFFN,          ASDF,            ASDF
##VAR_DIM=   65536,         65536,           65536
##UNITS=     HZ,            ARBITRARY UNITS, ARBITRARY UNITS
##FACTOR=    0.620285442955139, 1,           1
##FIRST=     20137.2065510682, 0,            0
##LAST=      -20513.1999529968, 0,           0
##MIN=       -20513.1999529968, -96006408,   0
##MAX=       20137.2065510682, 415777137,    0
$$ Real data points
##PAGE= N=1
##DATA TABLE= (X++(R..R)), XYDATA
$$ [...]
13034b773571M552537O08865m450075n343893j491582K723958L465309J431974
13026a276478l11061o86156r60286j635364j347486O33664K621160K494590N80033
13017A12616p70520k73251P36123K22622j676308k419208k9424L964727N479808
13008E347185K483380k091546l511290j074998J284803P20043q51141o21332J18876
12999A803980j588395m313353l264382K053411N791927L631822j109840k583309
12991D21861o36474L63098q92691j293722N96991J964844O32413j423429j545378
12982a812487l53765Q7342l35027o04105q28656j269249p91818J213728K836136
12973a857901K192080O50802O05751J231914L9278j963749r67590L043176M694346
$$ plain form
13034 -2773571 1778966 2387831 -2062244 -7406137 -8897719 -6173761 -2708452 -1276478
13026 -1276478 -1587539 -2273695 -3233981 -4869345 -6216831 -5583167 -2962007 -467417 112616
13017 112616 -657904 -931155 -195032 27590 -1648718 -4067926 -4097350 -132623 5347185
13008 5347185 7830565 5739019 2227729 1152731 2437534 3157577 2306436 1685104 1803980
12999 1803980 215585 -4097768 -7362150 -5308739 483188 4115010 3005170 421861
12991 421861 -214613 148485 -744206 -2037928 -1440937 523907 1156320 -267109 -1812487
12982 -1812487 -2166252 -2078910 -2413937 -3018042 -3846698 -5115947 -5907765 -4694037 -1857901
12973 -1857901 334179 984981 1590732 2822646 2861924 898175 -69415 2973761 7668107
12964G668107N44085n262686n905213o83806M323783L876982p90426m203823k802914
12955c235911J613760L946387J413919k856606l206222J154564M525645K310280
12947E665816k287385k595371J942622M881358J699321m475945p459433n081195
12939g710212J1271L863648L792229M6870l268441j540292M107912O819960K828998
12930H951943k854610l265857P37314K399429p41041m013531l039934R38361M191280
12921C303354M847943K852909q03917l457352k575827N79330K046926O21848j143933
12912F271281j818710k624185l174198r07052L165517L682680p87772m121951
12904c14390j714302K072120J321756j314343N29775N121573M487834k513362
$$ plain form
12964 7668107 8212192 2949506 -2955707 -3639513 684270 4561252 3770826 -432997 -3235911
12955 -3235911 -1622151 2324236 3738155 881549 -2324673 -1170109 3355536 5665816
12947 5665816 3378431 783060 2725682 7607040 9306361 4830416 -2629017 -7710212
12939 -7710212 -7698941 -3835293 -43064 3806 -3264635 -4804927 -697015 6122945 8951943
12930 8951943 6097333 2831476 3568790 5968219 5227178 1213647 -1826287 -887926 3303354
12921 3303354 8151297 11004206 10200289 6742937 4167110 4746440 6793366 7415214 6271281
12912 6271281 4452571 1828386 -1345812 -2252864 912653 4595333 3807561 -314390
12904 -314390 -2028692 43428 1365184 50841 580616 5702189 10190023 7676661
12896G676661p566868m966867J002186L567153K319843R74107Q64070O28049m16623
12887D081711j700010k460777j768432M77616J880885j28520l606793l534222
12879f758542P96808M049413K538542o22201r64466P27617R48925o49983j985499
12870a919386k608267k948296j629846K107311M920857L013704j424737k150374
12862b639034K392342O542631M948475q25342n106296n050565k536183m66078
12854b740050N15851J418347K381118K003671m48413l100005l206030p35886J532118
12845b379279J834013J288691J162804O59459r85724k441074k457795k154956
12837e473861k611558k025185J467451N353072M996118L65234l099542j380990
$$ plain form
12896 7676661 109793 -4857074 -3854888 -287735 2032108 3006215 3870285 4498334 4081711
12887 4081711 2381701 -79076 -1847508 -1369892 510993 382473 -3224320 -6758542
12879 -6758542 -5961734 -1912321 626221 4020 -960446 -232829 716096 66113 -1919386
12870 -1919386 -4527653 -7475949 -9105795 -6998484 -2077627 936077 -488660 -2639034
12862 -2639034 -246692 6295939 11244414 10419072 5312776 262211 -2273972 -2740050
12854 -2740050 -2224199 -805852 1575266 3578937 3130524 30519 -3175511 -3911397 -2379279
12845 -2379279 -545266 743425 1906229 2565688 1579964 -861110 -3318905 -5473861
12837 -5473861 -8085419 -10110604 -8643153 -3290081 1706037 2071271 -1028271 -2409261
12829b409261L163493N189776K678248j644507l830750k337473J017544K789880
12821D616950J215261j761936k562384k89945K281445K543459J294094Q59785
12813H196729J303057O35158j537390k990784k305224j178311j557855k080847
12805a515467q6723L478528M519384J756483j172592j282057o02859k106498m140456
12796a152257l036845M91921K264423J316910Q21492J923344J546733j988162
12788B187559n354510m712901q33878K563374L286962J694403n76750j420149
12780c165890P8396J820032J024742j104917o14586K421643L008458o57691l147010
12771c36823J65429N166754M415454j968644o403251m133493J464232M360626
$$ plain form
12829 -2409261 754232 5944008 8622256 6977749 3146999 809526 1827070 4616950
12821 4616950 5832211 4070275 1507891 1217946 3499391 6042850 7336944 8196729
12813 8196729 9499786 10134944 8597554 5606770 3301546 2123235 565380 -1515467
12805 -1515467 -1602190 1876338 6395722 8152205 6979613 5697556 5094697 2988199 -1152257
12796 -1152257 -4189102 -3697181 -1432758 -115848 705644 2628988 4175721 2187559
12788 2187559 -3166951 -7879852 -8713730 -6150356 -2863394 -1168991 -1745741 -3165890
12780 -3165890 -3087494 -1267462 -242720 -1347637 -1962223 459420 3467878 2810187 -336823
12771 -336823 -171394 4995360 9410814 7442170 1038919 -3094574 -1630342 2730284
12763B730284K833859l01884j957820j670798r53545p36452l32257M92367k727
12754A01027k629586m285527j753974K323980K404947r90218j508688K543942
12746c794097M994972K013538j690409j368848L4116j422698k683876K89816L875014
12737B47528K389779j710336j814152J606602K394335n85076k579292j685693
12729a736305m81407L49348K450600M452626L402108P57994m0632m90687l766086
12720D897559o409653k494569M913131O509198J142075k788225j293382M07157
12712D883291r78961j644228J47417J43532k517216k038204L060962N385886P11995
12703G154474m566523m192872j513038j526734j938742M08100J992849m46687
$$ plain form
12763 2730284 5564143 5262259 3304439 1633641 680096 -56356 -388613 103754 101027
12754 101027 -2528559 -6814086 -8568060 -6244080 -3839133 -4829351 -6338039 -3794097
12746 -3794097 1200875 3214413 1524004 155156 189272 -1233426 -3917302 -3627486 247528
12737 247528 2637307 926971 -887181 719421 3113756 2528680 -50612 -1736305
12729 -1736305 -2217712 -1868364 582236 5034862 8436970 9194964 9154332 8663645 4897559
12720 4897559 -1512094 -4006663 906468 7415666 8557741 5769516 4476134 4883291
12712 4883291 3904330 2260102 2407519 2551051 33835 -2004369 1056593 6442479 7154474
12703 7154474 2587951 -1604921 -3117959 -4644693 -6583435 -6175335 -4182486 -4629173
12695d629173k440931N12689M198284K963492l71607n03895M24195j821442l840555
12686e508943m35532M396937L131134j987969k413429K042777L260054j050230
12678A434799m089833j810141J678965K296319J163261k88209k768283m770457
12670g153579k774862K174551M436508K141555l54854J9533J055666O21692K74673
12661D40883J168348J292612p45066l033977l279311j324003J872350M602476
12653I94312M134441q2927l689152k306388J794469K861461K99288j592109j385399
12644A027996j394497j383889J257004M801179M180098l55402l051878k344640
12636B735971k803788n533861n123123N16228N348582M611374J743615J178156
$$ plain form
12695 -4629173 -7070104 -6557415 -2359131 604361 232754 -271141 153054 -1668388 -5508943
12686 -5508943 -5944475 -1547538 1583596 -404373 -2817802 -775025 2485029 1434799
12678 1434799 -2655034 -4465175 -2786210 -489891 673370 385161 -2383122 -7153579
12670 -7153579 -9928441 -7753890 -3317382 -1175827 -1530681 -1511148 -455482 166210 440883
12661 440883 1609231 2901843 2156777 -877200 -4156511 -5480514 -3608164 994312
12653 994312 5128753 5045826 1356674 -949714 844755 3706216 4005504 2413395 1027996
12644 1027996 -366501 -1750390 -493386 4307793 8487891 8132489 5080611 2735971
12636 2735971 -67817 -5601678 -10724801 -10208573 -4859991 -248617 1494998 2673154
12628B673154J106421j153485k859784r92533J513108P45722j362069r75015Q34177
12619d70304P93892o21534j180939j338133j812331n61265K911095M480877J931289
12610D132647j44684J984031L711549k21386n366083m015448J586416K771543
12602D438585q91505j606566K183265K988115j875515m864713j143815L062948
12594B290799J304527k340723r71528L148799K806936k085627m998504l257029
12586d102350m67958P24468J608324K918426L064671J706238O45338M31964j85939
12577F343182j128961r60609j26538m80295j457545o57487J547614K221702J099704
12568F400767R45915J879277O54560k694933l317084K78847K316857j340778n666862
$$ plain form
12628 2673154 3779575 2626090 -233694 -1226227 286881 1032603 -329466 -1304481 -470304
12619 -470304 323588 -297946 -1478885 -2817018 -4629349 -5190614 -2279519 2201358 4132647
12610 4132647 3987963 5971994 9683543 9462157 4096074 80626 1667042 4438585
12602 4438585 3547080 1940514 4123779 7111894 5236379 371666 -772149 2290799
12594 2290799 3595326 1254603 283075 3431874 6238810 4153183 -845321 -4102350
12586 -4102350 -4570308 -3845840 -2237516 680910 3745581 5451819 6097157 6529121 6343182
12577 6343182 5214221 4253612 4127074 3646779 2189234 1531747 3079361 5301063 6400767
12568 6400767 7346682 9225959 9880519 7185586 3868502 4147349 6464206 5123428 -543434
12559e43434l998896J152726K321091o19165r08383K960046M386834k38881n448600
12550i36662n162691r17144K389055L631223L901243K307236j731582n177479
12542a696801m893604k024708P46953L229007N150712L354484l118744q240314
12534g493015n651023J748459N492054L773766K668162M852258N173210L89288
12526A0953159l918266j600125L814053L809060k335331o294873k841098K776086
12518D362665K747694k158221m440493j292138J790392K57314k378011r79205
12510b090003K085924Q75143l362798l329319K271742O115138L856531J74117
12502F596475n35576j248100m445713n124989M75912N879176L518416k366633
$$ plain form
12559 -543434 -4542330 -3389604 -1068513 -1687678 -2596061 363985 4750819 4511938 -936662
12550 -936662 -6099353 -7016497 -4627442 -996219 2905024 5212260 3480678 -1696801
12542 -1696801 -6590405 -8615113 -7868160 -4639153 511559 3866043 747299 -7493015
12534 -7493015 -13144038 -11395579 -5903525 -2129759 538403 5390661 10563871 10953159
12526 10953159 7034893 5434768 9248821 13057881 10722550 4427677 1586579 4362665
12518 4362665 7110359 4952138 511645 -780493 1009899 1267213 -1110798 -2090003
12510 -2090003 -4079 871064 -2491734 -5821053 -3549311 2565827 6422358 6596475
12502 6596475 6060899 4812799 367086 -4757903 -4281991 1597185 5115601 2748968
12494B748968k466828J967528J996777k735865l443926J825428M614410J157330
12486E663822j275423K081400M910212J384321l487245l048100m51621k033889
12478C743477n385992l529167K754712N798398K657252j705288k405934O2613
12470A990071K442503K304790n68762l399387k443038J753826L843464J141893
12462G065360k134139j696257O8791q73821k574612q34431K517510K223632j181218
12453B580815j967189J302115L669030J896044j340766k732376k607942k269675
12445a469944j556141q54761j653272l299266k695141R15270L956475L322300
12437c334480N73522p35105J47433J172414Q85735j86293q72809n69492N76362
$$ plain form
12494 2748968 282140 2249668 4246445 1510580 -1933346 -107918 4506492 5663822
12486 5663822 4388399 6469799 11380011 12764332 9277087 6228987 5777366 3743477
12478 3743477 -1642515 -5171682 -2416970 3381428 6038680 4333392 1927458 1990071
12470 1990071 4432574 6737364 6168602 2769215 326177 2080003 5923467 7065360
12462 7065360 4931221 3234964 3303755 2429934 -144678 -979109 1538401 3762033 2580815
12453 2580815 613626 1915741 5584771 7480815 6140049 3407673 799731 -1469944
12445 -1469944 -3026085 -3880846 -5534118 -8833384 -11528525 -10613255 -6656780 -3334480
12437 -3334480 -2760958 -3496063 -3348630 -2176216 -1290481 -1476774 -2349583 -2919075 -2342713
12428b342713J596746J014001j657035m395483l805092Q41800N192207L926307
12420C70738j875109m570529K55572O935495P110394J548025j741719j48513P17050
12411H601404j923810k831709J278957M547287J217247m166155l611103J617126
12403D729244L469721k67682m048881m135804k349613m24208K056843L442946
12395B472566O96135m224578n009014j46590M276624L492319M78212J55410J731656
12386C922740J177167j589717k638753k88849K328008J659155j514567l125080
12378f9896j023402K381997L531638K401230J486803R10326j622816n372761n775657
12369c152538j503773K251729J245906j298774l76387K456830K388936Q9025K78536
$$ plain form
12428 -2342713 -745967 268034 -1389001 -5784484 -9589576 -8747776 -3555569 370738
12420 370738 -1504371 -6074900 -5819328 1116167 8226561 9774586 8032867 7884354 8601404
12411 8601404 6677594 3845885 5124842 9672129 10889376 6723221 3112118 4729244
12403 4729244 8198965 7931283 3882402 -253402 -2603015 -3027223 -970380 2472566
12395 2472566 3168701 -1055877 -6064891 -6211481 -1934857 1557462 2035674 2191084 3922740
12386 3922740 5099907 3510190 871437 582588 2910596 4569751 3055184 -69896
12378 -69896 -1093298 1288699 4820337 7221567 8708370 9618696 7995880 2623119 -3152538
12369 -3152538 -4656311 -2404582 -1158676 -2457450 -2833837 -377007 2011929 2100954 2379490
12360B379490L081983L786015R73440j624189j833252j601908k139682k124896
12352H97001j598507k227507k898803o02964L381362M037301O73109j558414j7203
12343H5375J696591Q65762K61690K049830K864893l71737m311945l891161J51466
12334e99236L131949L130482J541598o39793k691589k298813J628201N418225
12326H621024M299697p38181l711365j638658J720284J327715k579304n342427
12318A958785m011811n51028J240978M48821n29402M50245K944433N037021M937122
12309A1925164J533089m073619p407035m636761J223814K620932k013994n351509
12301f179919k182353K675791K871605P83710J644945K892614o81308n069665
$$ plain form
12360 2379490 5461473 9247488 10220928 8596739 6763487 5161579 3021897 897001
12352 897001 -701506 -2929013 -5827816 -6430780 -3049418 987883 1660992 102578 85375
12343 85375 1781966 2647728 2909418 4959248 7824141 7452404 3140459 -750702 -599236
12334 -599236 2532713 5663195 7204793 6565000 3873411 1574598 3202799 8621024
12326 8621024 12920721 12182540 8471175 6832517 8552801 9880516 7301212 1958785
12318 1958785 -2053026 -2604054 -1363076 -914255 -1443657 -993412 1951021 6988042 11925164
12309 11925164 13458253 9384634 1977599 -2659162 -1435348 1185584 -828410 -6179919
12301 -6179919 -8362272 -5686481 -2814876 -2031166 -386221 2506393 1825085 -3244580
12293c244580k050021N666725O866888p9493m412966q03904K906656M86897k579554
12284B756648o65932J472850j652163n399400l136724K273727M326911L636274
12276C612191L813270K846348j899370n659778l111687J611949J616403p83786
12268B045540O77368L498328Q69350m389252l297418L201137M778405j168753
12260F214705n826652m353929k342957l334042k113970L929219P731644M015981
12252C919999j277719q95264J997514N04374l578680l214885J682146M322446
12244C459931J762252j936796k917674j755333k02860J328226K346373J987229
12236D071348P26812p2004j95753k56910k67255m25971j764365l775452l417638
$$ plain form
12293 -3244580 -5294601 372124 7239012 7159519 2746553 1942649 4849305 5336202 2756648
12284 2756648 2090716 3563566 1911403 -3487997 -6624721 -4350994 -24083 3612191
12276 3612191 7425461 10271809 8372439 2712661 -399026 1212923 2829326 2045540
12268 2045540 2722908 6221236 7090586 2701334 -596084 2605053 7383458 6214705
12260 6214705 388053 -3965876 -6308833 -9642875 -11756845 -7827626 -95982 3919999
12252 3919999 2642280 1747016 3744530 4248904 670224 -2544661 -862515 3459931
12244 3459931 5222183 3285387 367713 -1387620 -1590480 -262254 2084119 4071348
12236 4071348 4798160 4726156 4530403 4273493 4006238 3580267 1815902 -1959550 -5377188
12227e377188N43983M160242L053272q03515j445935K298855N004308K561318
12219I995340k273953m331392k807867q47667m55781q55403r70351p25024M7523
12210c224575J609523K877991K108916l03472j753006j130596m10223r99169j025474
12201b250085J035903K420584o3640l718667k902493J777226L436713k57743k897114
12192c419316K26856L862542J178950m513468m408979K024608O453155M419291
12184E823639M05750j075679j618324l275533l656410q48034K070959J911780
12176b61852N79554R92857J486235q84353m258172m295649r48478J868864K492264
12167c228730K863937L767575K954864q43754m997627n620325j849036L173232
$$ plain form
12227 -5377188 -4833205 -672963 2380309 1576794 130859 2429714 7434022 9995340
12219 9995340 7721387 3389995 582128 -265539 -721320 -1576723 -2547074 -3272098 -3224575
12210 -3224575 -1615052 1262939 3371855 3068383 1315377 184781 -225442 -1224611 -2250085
12201 -2250085 -1214182 1206402 1142762 -2575905 -5478398 -3701172 -264459 -522202 -3419316
12192 -3419316 -3192460 670082 1849032 -2664436 -7073415 -5048807 1404348 5823639
12184 5823639 6229389 5153710 3535386 259853 -3396557 -4244591 -2173632 -261852
12176 -261852 317702 1310559 2796794 1912441 -2345731 -6641380 -7589858 -5720994 -3228730
12167 -3228730 -364793 3402782 6357646 5513892 516265 -5104060 -6953096 -3779864
12159c779864M973366J812507l126056m543701j017940L189873L616061R53356
12151B077602j212387j944287k811272l424537j378992K959074N488982L692184
12143C446367o4195k292083k851493l414514l609581j730875J584343L376224
12135e555807K286020R4260j268790k027450k633207j635488K043184N679279
12127c017999M796530n89040m564224k233722L821107O774500M271403N42506
12119I801061l63890K70208p22148k947640l629834k387671j199465l74664J521739
12110c2304L500765K183416k245928m153823J3750N237490L723021l961460q817854
12101d552927n291280J707463M121841J094640j763837q98857J756314L014001
$$ plain form
12159 -3779864 1193502 3006009 -120047 -4663748 -5681688 -2491815 1124246 2077602
12151 2077602 865215 -1079072 -3890344 -7314881 -8693873 -5734799 -245817 3446367
12143 3446367 3382172 1090089 -1761404 -5175918 -8785499 -10516374 -8932031 -5555807
12135 -5555807 -3269787 -3175527 -4444317 -6471767 -9104974 -10740462 -8697278 -3017999
12127 -3017999 1778531 1189491 -3374733 -5608455 -1787348 4987152 9258555 9801061
12119 9801061 9437171 9707379 8985231 6037591 2407757 20086 -1179379 -1554043 -32304
12110 -32304 3468461 5651877 3405949 -747874 -734124 4503366 8226387 4264927 -4552927
12101 -4552927 -9844207 -8136744 -4014903 -2920263 -4684100 -5582957 -3826643 -812642
12093h12642K165064K20623j559584j856840l32782J197145O48265j296224k128520
12084c755495j221575j69204K63487P24561R85998J75722p29767m0156R97734
12075b768695l66824l005412k603466J264929L833062K705699J325707K166327
12067B551327K150076j070067l683800j986581N53732j082084m341367k802512
12059i711276L117104O520242M420601R00193m14494p67813k038248l295124l022056
12050d290871j015322K349504N419128M830668k9766l758920j506467K849535
12042D847489J802465l647162n058978l8040M164094K575054o89158j094073r06478
12033A955213k795592l586975m99497K388515M62149l309939l008928J127312
$$ plain form
12093 -812642 1352422 1573045 13461 -1843379 -2176161 -979016 -330751 -1626975 -3755495
12084 -3755495 -4977070 -5146274 -4882787 -4158226 -3172228 -2996506 -3726273 -3766429 -2768695
12075 -2768695 -3135519 -6140931 -8744397 -7479468 -3646406 -940707 385000 2551327
12067 2551327 4701403 3631336 -52464 -2039045 -1485313 -2567397 -6908764 -9711276
12059 -9711276 -6594172 -73930 4346671 5246864 4832370 4064557 2026309 -1268815 -4290871
12050 -4290871 -5306193 -2956689 2462439 7293107 7263341 3504421 1997954 4847489
12042 4847489 6649954 3002792 -2056186 -2094226 2069868 4644922 3955764 2861691 1955213
12033 1955213 -840379 -4427354 -4926851 -2538336 -2076187 -5386126 -8395054 -7267742
12025g267742M184725M047344J975342j179604m089459l498640R93064L974462
12017h60508J551086j966343q54927K378105J684252j411419l76736M222184M890877
12008I256571k7316l249677n82606K613338Q48362l070059l963430k524163j990472
11999b689452j314549K099675N814639M844470l16905l673376k058997R69002
11991C674507P98593k130682l970658l081479j379244n70162L47045K562325M258820
11982E09065K603246j402022l244285j150779J148218J06466k174289j546259
11974e150639J478018K949657K058782J649702K388404J373599k377736n416873
11966a047086m677756j417888J441517K927508L206059J987996k53456j788397
$$ plain form
12025 -7267742 -3083017 964327 2939669 1760065 -2329394 -5828034 -4834970 -860508
12017 -860508 690578 -1275765 -2130692 247413 1931665 520246 143510 4365694 9256571
12008 9256571 9229255 5979578 5396972 8010310 8858672 5788613 1825183 -698980 -2689452
11999 -2689452 -4004001 -1904326 3910313 8754783 8437878 4764502 2705505 3674507
11991 3674507 4473100 2342418 -1628240 -4709719 -6088963 -6659125 -6312080 -3749755 509065
11982 509065 3112311 1710289 -1533996 -2684775 -1536557 -1430091 -3604380 -5150639
11974 -5150639 -3672621 -722964 1335818 2985520 5373924 6747523 4369787 -1047086
11966 -1047086 -5724842 -7142730 -5701213 -2773705 432354 2420350 2166894 378497
11958C78497k095795k565405l240323j707170K475954N025175K030027l773673
11950c472713n542746r48822M917355O028942K377919j116875j308803k59074
11942F75183j521020m618279n247172j053011M906630P748726O202613K703948
11934I797618n05067k873866l874517k630205M06947L214050L894731J709507
11926I139198k565743n916182m609213R99165N044908K982680j864731k903382
11918C06700m153R23625k124596m022714q81045L988948N267721K432072j361723
11909D524835l537974k919890K22739K999957K308217k99399m88443J193020m29840
11900C573222n352763o303953m22971M676704K577651j388662P90835O264367
$$ plain form
11958 378497 -1717298 -4282703 -7523026 -9230196 -6754242 -1729067 300960 -3472713
11950 -3472713 -9015459 -9964281 -5046926 982016 3359935 2243060 934257 675183
11942 675183 -845837 -5464116 -10711288 -11764299 -6857669 891057 7093670 9797618
11934 9797618 9292551 6418685 2544168 -86037 320910 3534960 7429691 9139198
11926 9139198 6573455 657273 -3951940 -2952775 2092133 5074813 3210082 306700
11918 306700 302547 1226172 -898424 -4921138 -5802183 -1813235 3454486 5886558 4524835
11909 4524835 986861 -1933029 -1710290 1289667 3597884 3298485 2810042 4003062 3573222
11900 3573222 -1779541 -8083494 -8506465 -3829761 -1252110 -2640772 -1849937 4414430
11892D414430O420989J233383j951758j440708k203626m741037l885868M21125
11884a733070J763407j089424j313547L643174O608816K639130k354132j365154
11876F799200K625812K616111j022134k694324j210192o8259o74525j541563k319270
11867B510856l245758k527988P60892L253080J649010j629039k089521k20587
11859a539055M44772J28484J617231L720444K366325k076521m636978l274688
11851c249986j102429n22248l61313L03473L73506j57952K80194J394910J297566
11842a744279M83543Q78231R61213k362091o535685m935671K336062O506107K709984
11833a702586k324003n37053N326275O612456J736308l059097l744699k249625
$$ plain form
11892 4414430 10835419 12068802 10117044 8676336 6472710 1731673 -2154195 -1733070
11884 -1733070 30337 -1059087 -2372634 1270540 7879356 10518486 8164354 6799200
11876 6799200 9425012 12041123 11018989 8324665 7114473 7046214 6371689 4830126 2510856
11867 2510856 -734902 -3262890 -2501998 751082 2400092 771053 -1318468 -1539055
11859 -1539055 -1094283 -965799 651432 4371876 6738201 4661680 24702 -3249986
11851 -3249986 -4352415 -4874663 -5235976 -4932503 -4558997 -4716949 -4436755 -3041845 -1744279
11842 -1744279 -1260736 -382505 578708 -1783383 -8319068 -13254739 -10918677 -4412570 -1702586
11833 -1702586 -4026589 -4563642 762633 7375089 9111397 6052300 2307601 57976
11825E7976q63800O69026J977659J377524n95313j263589k65745m8496j280698
11816b35456j793270r67149j005635k358987k025983J226929L645102J732150
11808a782299k028806k525584M70765K242393M32099j537610J15300L630834M074826
11799C091918M30874k896482k245487N37965J556907Q54954J443109L192894K212393
11790H179045k429977n650460l135685J886247K730253j564937n441219m744805
11782a0171538j318732R43827J120563R03244J580091K782805L014583J043049
11774a02108k101025l153410n70668K484436J936834j191383k236420j13366J374290
11765c672820K16721o62912R28795K240502M26195k038471r42256L039282N409212
$$ plain form
11825 57976 -805824 -136798 1840861 3218385 2623072 1359483 1093738 1045242 -235456
11816 -235456 -2028726 -2995875 -4001510 -6360497 -8386480 -7159551 -3514449 -1782299
11808 -1782299 -3811105 -6336689 -5865924 -3623531 -3191432 -4729042 -4613742 -982908 3091918
11799 3091918 3522792 626310 -1619177 -1081212 475695 1330649 2773758 5966652 8179045
11790 8179045 5749068 98608 -3037077 -1150830 1579423 14486 -5426733 -10171538
11782 -10171538 -11490270 -10546443 -9425880 -8522636 -6942545 -4159740 -1145157 -102108
11774 -102108 -2203133 -5356543 -5927211 -3442775 -1505941 -2697324 -4933744 -5047110 -3672820
11765 -3672820 -3456099 -4119011 -3190216 -949714 -523519 -2561990 -3504246 -464964 4944248
11756D944248M105593J100429j151884j658129l82673J155119O2000l984974o525396
11747b335667l789982J166124K430794K08941J18697L462240M744786J007789
11739G013722k655945j063727K589845J795460k932677n042562k115043J114268
11731a296659O56986j216447p13352J339227J515211m25363j451588k00779J304234
11722d88530J318180J000110J895023K763407J372281j283026j596313Q91579
11714E872711J400731l471875q950684o592698L824800J1832436Q812087o99291
11706A2028217n084412r65929L636991J752570l404150m889819k441835j154641
11698e23008k627936l443356j870649l78052l74329M76655L319742M766858J998948
$$ plain form
11756 4944248 9049841 10150270 8998386 7340257 6957584 8112703 8174703 4189729 -2335667
11747 -2335667 -6125649 -4959525 -2528731 -2319790 -2201093 1261147 6005933 7013722
11739 7013722 4357777 3294050 5883895 7679355 4746678 -295884 -2410927 -1296659
11731 -1296659 -639673 -1856120 -2569472 -1230245 284966 -140397 -1591985 -1792764 -488530
11722 -488530 829650 1829760 3724783 6488190 7860471 6577445 4981132 5872711
11714 5872711 7273442 3801567 -5149117 -11741815 -7917015 3915421 12727508 12028217
11706 12028217 6943805 5977876 9614867 11367437 7963287 3073468 631633 -523008
11698 -523008 -3150944 -6594300 -8464949 -8843001 -9217330 -8740675 -5420933 -654075 1344873
11689A344873j870009j700634K130525M349647K317494j151996k786014k820438
11681a86552k769407k483010j347063j34306K91285N38066J328638J921012J297422
11672a543915k98594k134918l828280m344324k139993K056790M617795L365467
11664d249972Q12328N53777K074292K187896L61901r55782p19624l51427n16461
11655h03072m09769l62485j395176j922861P06628M532251L930187j638257n134960
11646b497514j867208L036661K302513k363902l517795R7764K510825R77100m08905
11637a730461P99074Q26483k695758m937662j136650M885188N693627J067805
11629B771646k431965j530398L50238L2905r00029l31990M38478l32955j476429
$$ plain form
11689 1344873 -525136 -2225770 -95245 4254402 6571896 5419900 2633886 -186552
11681 -186552 -2955959 -5438969 -6786032 -6920338 -6629053 -6090987 -4762349 -2841337 -1543915
11672 -1543915 -1842509 -3977427 -7805707 -12150031 -14290024 -12233234 -7615439 -4249972
11664 -4249972 -3437644 -2883867 -809575 1378321 1740222 784440 64816 -286611 -803072
11655 -803072 -1212841 -1575326 -2970502 -4893363 -4186735 345516 4275703 2637446 -2497514
11646 -2497514 -4364722 -1328061 974452 -1389450 -4907245 -4809481 -2298656 -1321556 -1730461
11637 -1730461 -931387 -104904 -2800662 -7738324 -8874974 -3989786 1703841 2771646
11629 2771646 339681 -1190717 -840479 -807574 -1707603 -2039593 -1601115 -1934070 -3410499
11620c410499j387092j066890j722954j700346Q13433L759280L610067Q48464
11612b56537q26504m18936m92205j568276n24321L108726L904338j952412r053150
11603h079277q471556o3245O985366O587269K663088J279173J875517Q89226p15426
11594B950135J42257J672857k66011l901503l294390J299901K687183j444114
11586a53685l887409M48312N513511L467065k542028l447229J110712K672552
11578C181801j954030n723857k742854L095428M782548J734722j695207k949520
11570b270969k200196J67673K871205L038051l5246k622433j580356O71478O8828
11561a891965k333502k133482J129814L355115K386461N33759j4914o8514n15352
$$ plain form
11620 -3410499 -4797591 -5864481 -7587435 -9287781 -8474348 -4715068 -1105001 -256537
11612 -256537 -1083041 -1501977 -1994182 -3562458 -4086779 -978053 2926285 973873 -8079277
11603 -8079277 -16550833 -16614078 -9628712 -3041443 -378355 900818 2776335 3665561 2950135
11594 2950135 3092392 4765249 4499238 597735 -2696655 -1396754 1290429 -153685
11586 -153685 -4041094 -3592782 1920729 5387794 2845766 -601463 509249 3181801
11578 3181801 1227771 -4496086 -7238940 -4143512 639036 2373758 678551 -2270969
11570 -2270969 -4471165 -4303492 -1432287 1605764 1570518 -1051915 -2632271 -1960793 -1891965
11561 -1891965 -4225467 -6358949 -5229135 -1874020 512441 1046200 1031286 962772 447420
11552D47420l57758N77755K68245j995669l447112j623665J810628L518098L049459
11543B247401K322211J872581N92134j351620k264204j798290j536439k107488
11535b023714k033972m60963J059534J009856M30559J082388K272776J792125
11527C128589m34301j931673j179218M34027Q24543j78829j237368j256702j827
11518a832759J919484L054636K213134J04213j333368j514514j451853j193706
11510c4733M63514K821275K863413j43842k605867j720888K60645J58078o76495
11501A385100O65396K680493J817929p28348o03789J793092J353332l045580o171515
11492h53890m550523j090089P73506J889359L369069L248840R52001O7334K341907
$$ plain form
11552 447420 89662 667417 935662 -1060007 -4507119 -6130784 -4320156 -802058 2247401
11543 2247401 4569612 6442193 7034327 5682707 3418503 1620213 83774 -2023714
11535 -2023714 -4057686 -4518649 -3459115 -2449259 -2018700 -936312 1336464 3128589
11527 3128589 2694288 762615 -416603 17424 841967 663138 -574230 -1830932 -1832759
11518 -1832759 86725 3141361 5354495 5458708 4125340 2610826 1158973 -34733
11510 -34733 428781 3250056 6113469 5969627 3363760 1642872 1903517 2061595 1385100
11501 1385100 2050496 4730989 6548918 5820570 5216781 7009873 8363205 5317625 -853890
11492 -853890 -5404413 -6494502 -5720996 -3831637 -462568 2786272 3738273 3805607 6147514
11483F147514L494706j04561m726455m727807j223366O52138M16323J635181M122228
11474E685901L445947j447352n690105m908087l93003L139082K376671k083341
11466A25713n912841m509076J645370O621936O188553K769997N39810q48522l301876
11457C319064m639947j856300K386046K938581L02907q67311j01953r30605l043641
11448b493159k243266J330780K494721j43931j940999o11463M56247k92066O94452
11439b748684M229009M597676j291253p110025n456743J502212N670054M045367
11431C437613N56518q33906J62977J952129K578409N79054k885114m404832k972789
11422a829941j638345k237682j996116J321310M438418L149070q22846k337818
$$ plain form
11483 6147514 9642220 9537659 4811204 83397 -1139969 -487831 -71508 1563673 5685901
11474 5685901 9131848 7684496 1994391 -2913696 -3306699 -167617 2209054 125713
11466 125713 -5787128 -10296204 -8650834 -2028898 4159655 6929652 7469462 6620940 3319064
11457 3319064 -1320883 -3177183 -791137 2147444 2450351 1583040 1481087 550482 -2493159
11448 -2493159 -4736425 -3405645 -910924 -1054855 -2995854 -3607317 -3151070 -3443136 -2748684
11439 -2748684 1480325 6078001 4786748 -2323277 -7780020 -6277808 -607754 3437613
11431 3437613 3994131 3160225 3323202 5275331 7853740 8432794 5547680 1142848 -1829941
11422 -1829941 -3468286 -5705968 -7702084 -6380774 -1942356 1206714 383868 -1953950
11414a953950m84424J013409J33728j156224r42729L6746M48769L49255M11262
11405b144158P94080J146482R29148k4927r42874r38669m07636k07285J97631
11396a598208J628709K760775J788420O1389K49451J207435n24384l939689m084455
11387b450557m68042J429729p46913k269946K81907L299314L023579J736057K112298
11378E947426J650002j562432l573188j440743N47433j422898k849119R52619
11370a750900M798598J676830m177373l679230J283075J161041l955945m190333
11362h834237K271969N302120L60939l456835R08464O513275M358099k153624
11354E270170m123759j501889o89947k526883k390022J64566Q14263j054630r44261
$$ plain form
11414 -1953950 -2438374 -1424965 -1291237 -2447461 -3390190 -3353444 -2904675 -2555420 -2144158
11405 -2144158 -1350078 -203596 725552 700625 -242249 -1180918 -1588554 -1795839 -1598208
11396 -1598208 30501 2791276 4579696 4641085 4890536 6097971 5573587 1633898 -2450557
11387 -2450557 -2918599 -1488870 -2235783 -4505729 -4223822 -924508 2099071 3835128 5947426
11378 5947426 7597428 6034996 2461808 1021065 1568498 145600 -2703519 -1750900
11370 -1750900 3047698 4724528 547155 -3132075 -1849000 -687959 -4643904 -8834237
11362 -8834237 -6562268 -1260148 -899209 -4356044 -3447580 3065695 7423794 5270170
11354 5270170 1146411 -355478 -1045425 -3572308 -5962330 -5797764 -4983501 -6038131 -6982392
11345f982392K865191O028020M323904r45724n088161m863349o89757L806986
11337a545282M476455Q15838k929369k608829P12407K488789O74326k368686l506054
11328c790405k095034M89526K702946L597033K826483O93612j778737l105015
11320d59591k444627r10419o41898j573087q54533K495563M519518J531686l233367
11311a570755l234951J557336M363734K027132p08165O5645R74259j698496m343700
11302b567961j799948L079446K990262k503075o418027m834924j161198Q99088
11294a2316337K179114L755964L596323P88519j396751m06170J224811L42487
11286b232040j101028M87312L314124K190270k861878n536736k144478L146344
$$ plain form
11345 -6982392 -4117201 1910819 6234723 5288999 200838 -4662511 -5352268 -1545282
11337 -1545282 2931173 3747011 817642 -1791187 -1078780 1410009 2084335 -284351 -3790405
11328 -3790405 -5885439 -5395913 -2692967 904066 3730549 4424161 2645424 -459591
11320 -459591 -2904218 -3814637 -4456535 -6029622 -6884155 -4388592 130926 1662612 -1570755
11311 -1570755 -4805706 -3248370 1115364 3142496 2434331 2499976 3474235 1775739 -2567961
11302 -2567961 -4367909 -1288463 1701799 -801276 -7219303 -12054227 -13215425 -12316337
11294 -12316337 -10137223 -6381259 -2784936 -1996417 -3393168 -3799338 -2574527 -2232040
11286 -2232040 -3333068 -2845756 468368 2658638 -203240 -5739976 -7884454 -4738110
11278d738110M493278K004962k02267p10388j320969k286547j525070J166304
11270c118807K871079J628026j021008k636066k658576j604346J46951J558587
11262d834160J143524o99450j499002k0279K179099L348322L290878J729685j815958
11253B822659n109945m025145J236220M667688K599820n97825N40121L652914
11245E786507K640720j919479l688233j095029O22241j095286j988089Q59735
11237A23087L289139R81844k877329k355473J815992L312359k54467m009281k866047
11228b840176J814788M498712K386686k002761m560965m001953j830261O85450
11220e850480L402663N258543M049971j91079l778930l644681j367543l08577
$$ plain form
11278 -4738110 -244832 1760130 1557863 847475 -473494 -2760041 -4285111 -3118807
11270 -3118807 -247728 1380298 359290 -2276776 -4935352 -6539698 -6392747 -4834160
11262 -4834160 -3690636 -4390086 -5889088 -5909367 -3730268 -381946 2908932 4638617 2822659
11253 2822659 -2287286 -6312431 -5076211 -408523 2191297 1593472 2133593 5786507
11245 5786507 8427227 6507748 2819515 1724486 2346727 1251441 -736648 123087
11237 123087 3412226 4394070 1516741 -838732 977260 4289619 4035152 25871 -2840176
11228 -2840176 -1025388 3473324 5860010 3857249 -703716 -4705669 -6535930 -5850480
11220 -5850480 -2447817 2810726 6860697 6669618 2890688 -753993 -2121536 -2430113
11212b430113l42885J016842L197074K586524j478775m688728l357929Q23820
11204d674170L478128K880421Q16320m30647j96986Q04849J562161J510223N60149
11195F310448j279248l618990n104334m515617k687338j356653J73716M006393
11187h071623Q198831O878715r73760p237912m283593M211091P980793L677653
11179A0380195k631708n253844m376641j821472J897590M929997M400968J164338
11171H689423o84690k90015r13525l196859l332868j1834K494284J106566j226745
11162B633737p67321J278891J669393J38470j620124k781375k571917P0834L524668
11153A575256L620331n55513m272635l317870N05883K725148K152450P76259J39950
$$ plain form
11212 -2430113 -2772998 -1756156 1440918 4027442 2548667 -2140061 -5497990 -4674170
11204 -4674170 -1196042 1684379 2500699 2070052 1873066 2677915 4240076 5750299 6310448
11195 6310448 5031200 1412210 -3692124 -8207741 -10895079 -12251732 -12078016 -8071623
11187 -8071623 127208 7005923 6032163 -1205749 -5489342 -1278251 6702542 10380195
11179 10380195 7748487 2494643 -1881998 -3703470 -1805880 3124117 7525085 8689423
11171 8689423 8004733 7714718 6801193 3604334 271466 259632 2753916 3860482 2633737
11162 2633737 1866416 3145307 4814700 4953170 3333046 551671 -2020246 -1949412 1575256
11153 1575256 5195587 4640074 367439 -2950431 -2444548 280600 2433050 3209309 3349259
11144C349259K81238M40921n65787k678760l136161P7794L607382K330089k236234
11135A469741l194330Q88715L381194M36482k914809j789575M80675q47500l125798
11126e215205j312670K794867L663386J153569n44318p46042k080054l952065
11118f238532k951966O30229K592567J248801p66795j048630M94674L627879P542553
11109E130780R040645N327527j345729n658570n789702m446543l597600k111948
11101c451140Q15561L304994L117829M32571k384082k831890n02727J983260J485212
11092A969588j465721k992748j343287P46208O41081m95255p40625p43818j333233
11083e757810j177367J81438M47194j016395p54961K839686N204860K228054k417417
$$ plain form
11144 3349259 3630497 4071418 3505631 826871 -2309290 -2231496 1375886 3705975 1469741
11135 1469741 -1724589 -835874 2545320 2981802 66993 -1722582 -1241907 -2089407 -5215205
11126 -5215205 -6527875 -3733008 -69622 1083947 539629 -206413 -2286467 -6238532
11118 -6238532 -9190498 -8560269 -5967702 -4718901 -5485696 -6534326 -6039652 -2411773 5130780
11109 5130780 14171425 19498952 18153223 12494653 6704951 2258408 -1339192 -3451140
11101 -3451140 -2635579 669415 3787244 4219815 1835733 -996157 -1498884 484376 1969588
11092 1969588 503867 -2488881 -3832168 -3085960 -2444879 -2940134 -3680759 -4424577 -5757810
11083 -5757810 -6935177 -6753739 -6306545 -7322940 -8077901 -5238215 -33355 2194699 -222718
11074b22718k405334J603938L747663K302725O01982j62434k114812m652307l899588
11065e200885M81080L591768K328623n08219j208431l64771o65351k257311k814248
11056f617745r65319J958154L303952J905348m07955q24600Q25535K123050J989052
11047C289472J896461K312171J329375j416841k999676j662133M44618J345638
11039D539085K137484L146118J855528j752239k809937P77306L261992m70245
11031A0685092n856433n098293P75872L813622Q87811l753897o129552n686227
11023a0362005k087898M117053Q369000O373480R58527j644856j233118k348034
11015B142149m733291l388253J537532L433521k23221l652099j957533K099596
$$ plain form
11074 -222718 -2628052 -1024114 2723549 5026274 5628256 5465822 3351010 -1301297 -5200885
11065 -5200885 -4719805 -1128037 1200586 692367 -516064 -880835 -1546186 -3803497 -6617745
11056 -6617745 -7583064 -5624910 -2320958 -415610 -823565 -1648165 -822630 1300420 3289472
11047 3289472 5185933 7498104 8827479 7410638 4410962 2748829 3193447 4539085
11039 4539085 6676569 9822687 11678215 9925976 7116039 7893345 11155337 10685092
11031 10685092 4828659 -269634 506238 4319860 5207671 1453774 -4675778 -10362005
11023 -10362005 -12449903 -8332850 36150 6409630 7368157 5723301 4490183 2142149
11015 2142149 -2591142 -5979395 -4441863 -1008342 -1231563 -4883662 -6841195 -4741599
11007d741599L801787L181534K370226J004539j758326l936886l018728K76566
10999b820887K871815K841517J025224M3824J504937L356337J779408k812126
10991G790049m836671j463866K386369J392429j731540j129999K170461K361754
10983F938986j102917l184341k025538p06449o14938m8193P57269o5959r33205
10974i85285J278113M602475M052238j60408l283356m007346m515342l903623
10966f922534Q8002L899783K022791k540827j708807L908039N609943J670603
10958F026993j73844K558846K453433l610243p763919m412061P90579J586242
10950b543974N16398J037251K91945k853060k258019M721350R869938O308524
$$ plain form
11007 -4741599 -939812 2241722 4611948 5616487 3858161 -78725 -3097453 -2820887
10999 -2820887 50928 2892445 3917669 3961493 5466430 8822767 10602175 7790049
10991 7790049 2953378 1489512 3875881 5268310 3536770 2406771 4577232 6938986
10983 6938986 5836069 2651728 626190 -80259 -695197 -743390 13879 -52080 -985285
10974 -985285 292828 4895303 8947541 8787133 5503777 1496431 -3018911 -6922534
10966 -6922534 -6834532 -2934749 -911958 -3452785 -5161592 -1253553 4356390 6026993
10958 6026993 5853149 8411995 10865428 7255185 -508734 -4920795 -4130216 -2543974
10950 -2543974 -2027576 -990325 -698380 -3551440 -5809459 -1088109 8781829 15090353
10942A5090353k88320j806581q11958l356437o298282l486025J322327J27520
10934D92597m654816l611925L550791P173987K910385k691198l233647l86994
10926d50820J275513O08118r08545j550404n8677K579176K880531l02649k932766
10917A139477j554027J208584J389485K27430O40529J029203j210760l598793
10909g28872k611555l21772j46105J61157L560205N885582K098642l227971k227807
10900B441504K078139j09285p956211r696754j402725O771951O966785M055624
10892C149028L935012K862770l213794q189935m826389K335148L534268j031138
10884a445030k975696j85132J111815j392808k039980K032448M988551J839942
$$ plain form
10942 15090353 14802033 12995452 12183494 8827057 2528775 -957250 365077 492597
10934 492597 -4162219 -7774144 -4223353 2950634 5861019 3169821 -63826 -450820
10926 -450820 824693 1432811 524266 -1026138 -1084815 1494361 4374892 4072243 1139477
10917 1139477 -414550 794034 2183519 2410949 3051478 4080681 2869921 -728872
10909 -728872 -3340427 -3662199 -3808304 -3647147 -86942 5798640 7897282 4669311 2441504
10900 2441504 4519643 4410358 -3545853 -13242607 -14645332 -7873381 -906596 3149028
10892 3149028 7084040 9946810 6733016 -1456919 -6283308 -3948160 -413892 -1445030
10884 -1445030 -4420726 -4605858 -3494043 -4886851 -6926831 -4894383 94168 1934110
10876A934110l039687k988464L19602L93881k836625l222085O09492K658060K19541
10867e952175p04180M179700Q196474K875074p459631r928468j471089O744639
10859c519656N716417L54889k82880L005754K834871k042684n419056l634454
10851b986799L621J204574j5822j035222j36044K467770M843231M535176J274300
10842A0154785k182905l383708k905233k250385j326675j56902l67534k021814
10834d440371j716398K416247O220035M477891j289305m671718l121518k09258
10826b334395O35336J07436J13295P28489J263268J574433J306709n9963j754483
10817A580125k060461n70247J197925J562210K38227j474717j661803m4711P01056
$$ plain form
10876 1934110 -1105577 -4094041 -3774439 -3380558 -6217183 -9439268 -8829776 -6171716 -5952175
10867 -5952175 -6656355 -2476655 5719819 8594893 1135262 -8793206 -10264295 -3519656
10859 -3519656 2196761 2551650 2268770 5274524 8109395 6066711 647655 -2986799
10851 -2986799 -2983178 -1778604 -1794426 -2829648 -2965692 -497922 4345309 8880485 10154785
10842 10154785 7971880 4588172 1682939 -567446 -1894121 -2051023 -2418557 -4440371
10834 -4440371 -6156769 -3740522 2479513 6957404 5668099 996381 -2125137 -2334395
10826 -2334395 -1699059 -1591623 -1478328 -749839 513429 2087862 3394571 3334608 1580125
10817 1580125 -480336 -1050583 147342 1709552 1947779 473062 -1188741 -1233452 -532396
10808e32396j838749n117271l878607J664998M660703J529744j945264O90263
10800d766579O079713N907162l04630m740025l241557m24120j255386l778955
10792f524377l419748j86898K157623J826577P04210J050466K561782K910213
10784A079848O39371k719619m042641k346137J47542J313118J630913K119732
10776b177873J965262M04602q73971O8704K019805K062305l02600k748473l249690
10767b831929j774391M49405J851211J535188M03632K4749k8615j343152k764784
10758d478686j146195K591817K905115j823011n013358r33992O019372P149843
10750E270905J937708k012504n15034K400301J975250q52424k643781k777627
$$ plain form
10808 -532396 -2371145 -7488416 -11367023 -9702025 -5041322 -3511578 -5456842 -4766579
10800 -4766579 1313134 7220296 6915666 2175641 -1065916 -1490036 -2745422 -6524377
10792 -6524377 -9944125 -10131023 -7973400 -6146823 -5442613 -4392147 -1830365 1079848
10784 1079848 1719219 -1000400 -5043041 -7389178 -7241636 -5928518 -4297605 -2177873
10776 -2177873 -212611 191991 -681980 -613276 1406529 3468834 3166234 417761 -2831929
10767 -2831929 -4606320 -4156915 -2305704 -770516 -366884 -342135 -370750 -1713902 -4478686
10758 -4478686 -5624881 -3033064 -127949 -1950960 -6964318 -7898310 -1878938 5270905
10750 5270905 7208613 5196109 4681075 7081376 9056626 8204202 5560421 2782794
10742B782794k841667l185115k525550j73423K642698L705344K127932l58963
10734B174050j412426j190555j544356k212616r27738K029355L130216J001490
10726A047420j261966j126645Q11N70549J538453K523128M52145m258619n600197
10717f114921r24035L370846J240380k957933j459482L891422M660401k09290
10709A497388k988332L2330L237780J460109k295794k467334Q74987L206653J973223
10700D531010j009155k228975k78693K430261K253792o97124k251258l51368J641768
10691D040258N16093j496509q92610R84339O88448j342695k468128k769610l221572
10682e961986j913671K239720N054126K757705p36241N57500M346344L520875
$$ plain form
10742 2782794 -58873 -3243988 -5769538 -5942961 -3300263 405081 2533013 2174050
10734 2174050 761624 -428931 -1973287 -4185903 -5113641 -3084286 45930 1047420
10726 1047420 -214546 -1341191 -1340380 -769831 768622 3291750 3743895 -514724 -6114921
10717 -6114921 -7038956 -3668110 -2427730 -5385663 -6845145 -2953723 1706678 1497388
10709 1497388 -1490944 -1458614 1779166 3239275 943481 -1523853 -648866 2557787 4531010
10700 4531010 3521855 1292880 1014187 3444448 5698240 5001116 2749858 2398490 4040258
10691 4040258 4556351 3059842 2167232 3151571 3840019 2497324 29196 -2740414 -5961986
10682 -5961986 -7875657 -5635937 -581811 2175894 1439653 1997153 6343497 9864372
10674I864372j748918m409071k555039j617738l544342l340438Q82283L371283
10666c097608N60666k276115L50926N011634M994021P76335j460623N35533K781547
10657H176316J892827n49701j510084j123900j639399l055666k576487O67558
10649B81464K886368O36500l085651k522106J446357J871493k827399n341869
10641f654843j251522L108833Q75387l750134k416533L658990O226649L337587
10633C134414N86048L53175p88718l725339m513095j806829P26818R46228Q92349
10624d194949J724937J887811J330454J918642K734833N09645m164842o209687
10616d463156k974336K413947N431658M429504O89604k501991j917077J283223
$$ plain form
10674 9864372 8115454 3706383 1151344 -466394 -4010736 -7351174 -6468891 -3097608
10666 -3097608 -2536942 -4813057 -4462131 549503 5543524 6319859 4859236 5394769 8176316
10657 8176316 10069143 9519442 8009358 6885458 5246059 2190393 -386094 281464
10649 281464 3167832 3804332 718681 -1803425 -357068 1514425 -1312974 -6654843
10641 -6654843 -7906365 -4797532 -3922145 -7672279 -10088812 -6429822 -203173 3134414
10633 3134414 3720462 4073637 3284919 -440420 -4953515 -6760344 -6033526 -5087298 -4194949
10624 -4194949 -2470012 -582201 748253 2666895 5401728 5911373 1746531 -4463156
10616 -4463156 -7437492 -5023545 408113 4837617 5527221 3025230 1108153 2391376
10608B391376J633789k536275m914484m42268N566725M832217r85838l419862
10600B125380p75745Q12963j149457k493067j124590L2914j31433Q14769K549615
10591F61349J483275k162038l773620k053462o37736r90381k68392K497338M230455
10582a013212L100459P05369j617936l720703m084618j395905J923323K647644
10574c455579J901939K455425L087774J206032j500494j975351j487335k303616
10566b071205k199411J081392L869800K256380n76223j88116R77518n83240j338486
10557A228409K180176M377168n71753o798991n267348J367149M338831L319087
10549D172728K894692J154498m389894o515002O59453P397264K224601o910794
$$ plain form
10608 2391376 4025165 1488890 -3425594 -3867862 1698863 6531080 5545242 2125380
10600 2125380 1349635 2162598 1013141 -1479926 -2604516 -2571602 -2703035 -1888266 661349
10591 661349 2144624 -17414 -3791034 -5844496 -6482232 -7472613 -7741005 -5243667 -1013212
10582 -1013212 2087247 2792616 1174680 -2546023 -6630641 -8026546 -6103223 -3455579
10574 -3455579 -1553640 901785 3989559 5195591 3695097 1719746 232411 -2071205
10566 -2071205 -4270616 -3189224 680576 2936956 2360733 2172617 3150135 2566895 1228409
10557 1228409 3408585 7785753 7214000 415009 -4852339 -3485190 853641 4172728
10549 4172728 7067420 8221918 3832024 -2682978 -2023525 5373739 7598340 687546
10541F87546m599262N159336N610210l601923p031099j202595J762767j508792
10533d723812r57261N221253O468493N53934k404936N24799J340682j316348n88666
10524D118138J978437j431426o758349l449883L925218K556445l400361k68734
10516b730515O735362J905354q349608m569943P415125M477631r251719p259764
10508a1628077R140097J0801949m948651q548891N731747R392385l878885n938873
10500A22801P911127P299996j0163760q447201J3678546J1512657j6485754j2642301
10492g213889K7898932K7831875k6716736k1003266J04305284K03517121J07157816
10485D15777137j09169318k05161305j05906043J9381495K6657063k4173196k1113024
$$ plain form
10541 687546 -3911716 1247620 6857830 3255907 -3775192 -4977787 -3215020 -4723812
10533 -4723812 -5681073 -459820 6008673 6562607 4157671 4682470 6023152 4706804 4118138
10524 4118138 6096575 4665149 -2093200 -5543083 -1617865 938580 -2461781 -2730515
10516 -2730515 4004847 5910201 -2439407 -7009350 405775 4883406 -4368313 -11628077
10508 -11628077 -2487980 8313969 3365318 -5183573 548174 9940559 6061674 122801
10500 122801 8033928 15333924 5170164 -3277037 10401509 21914166 5428412 -7213889
10492 -7213889 20685043 48516918 21800182 796916 105102200 308619321 415777137
10485 415777137 306607819 101446514 -4459529 14921966 41579029 17405833 -3707191
10478c707191J8332695J7317777j4775141j7632488N024867O341943j0244677
10471F57785o155918J3258413J1860709o500996q522912M138690K718842j0189200
10463A265413p407186Q121928Q766654n312851q420582J855432M147709l079256
10455f2739j233494Q353636N900532o999167q725867J817337M084482m395240
10447a260520m463923O439097Q778955j896203o629531J658886O616350J00260
10439I343371m421767O36950L442165k949406p260447j767827M235477L021001
10431D279517R12664K677680J749222m552656o949905p11052N011992L150878
10423E568340k2852J963986M386772J516065l056345m073728k982771k289433
$$ plain form
10478 -3707191 14625504 31943281 17168140 -464348 4560519 10902462 657785
10471 657785 -5498133 7760280 19620989 13119993 4597081 8735771 11454613 1265413
10463 1265413 -6141773 1980155 10746809 5433958 -2986624 -1131192 3016517 -62739
10455 -62739 -1296233 7057403 12957935 5958768 -2767099 -949762 3134720 -1260520
10447 -1260520 -5724443 714654 9493609 7597406 967875 2626761 9243111 9343371
10439 9343371 4921604 5558554 9000719 6051313 -1209134 -2976961 1258516 4279517
10431 4279517 5192181 7869861 9619083 5066427 -1883478 -2594530 2417462 5568340
10423 5568340 5545488 7509474 11896246 13412311 10355966 6282238 3299467 1010034
10415A010034m33098K531189K662397k18959r33310J632478J971383k126422n498450
10406E97242m356847j191599J387004L884564N125995K147238l198366m976253
10398e81022k047068P95695J219395J553343K294913J158224q87298k41786K182650
10389E447046J822855j305925k587037j070822m07871j485475j403216J56633
10381h33812N68565J72946J720251M158826L598817J76918k150976j977735j057415
10372D376385j23509N40029j044768m546507m852581J65887L992207Q87000m080673
10363d686530l036610J691281K452724l32699n32923J581426R98165j013834P77034
10354b101966M140818K062692m131557n832226j208049K544871J273616j678549
$$ plain form
10415 1010034 576936 3108125 5770522 5551563 4618253 6250731 8222114 6095692 597242
10406 597242 -3759605 -4951204 -3564200 320364 5446359 7593597 4395231 -581022
10398 -581022 -2628090 -1832395 -613000 940343 3235256 4393480 3506182 3264396 5447046
10389 5447046 7269901 5963976 3376939 2306117 1898246 412771 -990445 -833812
10381 -833812 -265247 -92301 1627950 5786776 9385593 9562511 7411535 5433800 4376385
10372 4376385 4252876 4792905 3748137 -798370 -5650951 -5485064 -1492857 -605857 -4686530
10363 -4686530 -7723140 -6031859 -3579135 -3911834 -4444757 -2863331 -1865166 -2879000 -2101966
10354 -2101966 2038852 4101544 -30013 -5862239 -7070288 -4525417 -3251801 -4930350
10346d930350l187820l382230j425132L017542N396291K049863j978518j19613
10338d559967M076052K975990j242699r32663K190660L13864m673939l479767
10330e332469L277221N198251Q2086l253922j437688o56156k218654L44498O279683
10321B282850N473993l450438q012002j534278O081401M946922l72623j618222
10313C797603m32629j806243l660198k344580o50668j883931k801579R5506L636848
10304f049871L928282K884939K871100J420951k729328m881125j778951K217828
10296b116175K205465K73569L92273J317207K84151j072500Q6165K570471L417349
10287G357975J950567j120226m716627o041887l179018K87627n66932l165106
$$ plain form
10346 -4930350 -8118170 -11500400 -12925532 -9907990 -4511699 -2461836 -4440354 -4559967
10338 -4559967 -483915 2492075 1249376 316713 2507373 2821237 -1852702 -5332469
10330 -5332469 -2055248 3143003 3225089 -28833 -1466521 -2122677 -4341331 -3996833 2282850
10321 2282850 7756843 4306405 -3705597 -5239875 841526 5788448 5415825 3797603
10313 3797603 3364974 1558731 -2101467 -4446047 -5096715 -6980646 -9782225 -9686719 -6049871
10304 -6049871 -2121589 763350 3634450 5055401 2326073 -2555052 -4334003 -2116175
10296 -2116175 89290 362859 755132 2072339 2356490 1283990 1370155 3940626 7357975
10287 7357975 9308542 8188316 3471689 -2570198 -5749216 -5461589 -6028521 -9193627
10279i193627p71375N023347N244338j206637m468008K52233M920097K601869
10271B402237j760625j677818r9178j535933k097700K942893Q662734P390307
10263A4226917Q27266l806603n203380o727727p619316m446505R18742K940109
10255h890497R61770n92560K55618J112351L35024q14506j187845j400708k240600
10246a2461953l224825k538491J501444P201795Q931272L546747l790057n378379
10238f212447j579310P54378l10523K044L056978L808443R9396l412503l305771
10229g099315j487111R33767N209726Q148102L621417n704726q508322j299923
10221f186385N546839L752808j296652j566812J211216J926063J562339K073066
$$ plain form
10279 -9193627 -9965002 -4941655 302683 -903954 -5371962 -5119729 -199632 2402237
10271 2402237 641612 -1036206 -1135384 -2671317 -4769017 -1826124 6836610 14226917
10263 14226917 15054183 11247580 6044200 -683527 -8302843 -12749348 -11830606 -8890497
10255 -8890497 -7928727 -8521287 -8265669 -7153318 -6818294 -7632800 -8820645 -10221353 -12461953
10246 -12461953 -15686778 -18225269 -16723825 -9522030 -590758 2955989 -834068 -6212447
10238 -6212447 -7791757 -7037379 -7347902 -7345858 -4288880 -480437 -381041 -3793544 -7099315
10229 -7099315 -8586426 -7652659 -2442933 5705169 9326586 3621860 -4886462 -6186385
10221 -6186385 -639546 3113262 1816610 249798 1461014 3387077 4949416 7022482
10213G022482N09899l478406l192050L285106O149740r60692q069247l453966
10205b187134O675132P235468k236632p980437l700962K279465K181799j121914
10197A144785j788250M66072K605085K824223R54737j415618j219764K035395
10189E606665M056052J322486l714588o751195p289659o109542j900653M374305
10181a0406129O842600K627251k344443j801206J512248J706401k12684J33202
10173a942760J701574R87342l73985Q08145K005150m29451l215106j235273K901135
10164A206771L038603j11179j340124m36806o63918j082546Q49677K460990N03046
10155D424514j307663J203306L118400j741955p702218m602083M492809O633712
$$ plain form
10213 7022482 7532381 4053975 861925 4147031 10296771 9336079 1266832 -2187134
10205 -2187134 4487998 11723466 9486834 1506397 -2194565 84900 2266699 1144785
10197 1144785 -643465 -177393 2427692 5251915 6206652 4791034 3571270 5606665
10189 5606665 9662717 10985203 7270615 519420 -6770239 -12879781 -14780434 -10406129
10181 -10406129 -3563529 -936278 -3280721 -5081927 -3569679 -1863278 -2075962 -1942760
10173 -1942760 -241186 746156 372171 1180316 3185466 2756015 -459091 -1694364 1206771
10164 1206771 4245374 4134195 2794071 2357265 1693347 610801 1460478 3921468 4424514
10155 4424514 3116851 4320157 7438557 5696602 -2005616 -6607699 -2114890 4518822
10147D518822o72745o136255k916018K674935L439782Q33393j294222k671563
10139b223871k832824J70327M360827M611015P65409k030134j809442j196311
10131a85004n74154J816013L433747K87607m212433l155511J553271J679257k694806
10122b052013l203431J300311K550376j479454k591285J833958L058187k783933
10114c367284o129677J7616P463311N939902j069408l887218j897232q72953j435033
10105e237976k33287J947387K095456J280141J713485J452565j319799l112855
10097a414883q42949J806788M89420j927551p28256J754874L40197l388653l545564
10088g456577L47831L442544L639894K915037J970026k11445k429602k358611
$$ plain form
10147 4518822 3846077 -2290178 -5206196 -2531261 908521 1741914 447692 -2223871
10139 -2223871 -5056695 -4886368 -525541 4085474 4850883 2820749 1011307 -185004
10131 -185004 -759158 1056855 4490602 4778209 565776 -2589735 -1036464 642793 -2052013
10122 -2052013 -5255444 -3955133 -1404757 -2884211 -5475496 -3641538 -583351 -3367284
10114 -3367284 -9496961 -9479345 -2016034 3923868 2854460 -1032758 -2929990 -3802943 -5237976
10105 -5237976 -5471263 -3523876 -1428420 -148279 1565206 3017771 1697972 -1414883
10097 -1414883 -2257832 -451044 38376 -1889175 -2617431 -862557 -522360 -3911013 -7456577
10088 -7456577 -7108746 -3666202 -26308 2888729 4858755 4647310 2217708 -140903
10080a40903p22929J87278P22521K148712K624100j72506l904109m039910n83627
10071c881373K099118J602155j67150m93083J263131L594710L641254k76736n165142
10062B216884n231965M29063N436508M417352Q9356j723258o35991n61791k615426
10053A820732m118610l374535j376162L74492Q63936k78043j483907l20025K257967
10044e634155K017974j832691m142909j348711K729365K864295K92525l12424
10036e366731J518391K605867J822991M30120j052586k013716m15316L437103
10028I66123M908332J535533j928484m86196K552495O71760m840086o502846k106164
10019e229533K802548L882886K679899J610878M04774j081230j577807j308361
$$ plain form
10080 -140903 -863832 -676554 45967 2194679 4818779 4646273 742164 -3297746 -3881373
10071 -3881373 -1782255 -180100 -347250 -840333 422798 4017508 7658762 7382026 2216884
10062 2216884 -3015081 -2586018 2850490 7267842 7357198 5633940 4997949 4436158 1820732
10053 1820732 -2297878 -5672413 -7048575 -6674083 -5810147 -6088190 -7572097 -7892122 -5634155
10044 -5634155 -3616181 -5448872 -9591781 -10940492 -8211127 -5346832 -5054307 -5366731
10036 -5366731 -3848340 -1242473 580518 1010638 -41948 -2055664 -2470980 966123
10028 966123 5874455 7409988 5481504 4995308 7547803 8219563 3379477 -3123369 -5229533
10019 -5229533 -2426985 1455901 4135800 5746678 6151452 5070222 3492415 2184054
10011B184054j996702l165325k374646M07389K581076L182356L330872K579442
10003F728516n22651l991253l574703N81279L206042J445448j284362j075767
9995A512549Q42605J020620p25049j800054j011375M06384J082826Q76342K90744
9986B495592j83734j60577N37633J647566K398046J971952M73477q91223j317807
9977F970925j462949j909498j778329p70914q52519k737143k717924K090486O967215
9968C799350M776643k458704n252525j051471K131259n79262l289359n87198L031818
9959E20551K107600l6323J131751J968194j676067m778766j742842K187225j2622
9950c31299l056230J867205R330524O603550m176838p750919j53333N521477J096379
$$ plain form
10011 2184054 187352 -2977973 -5352619 -4945230 -2364154 818202 4149074 6728516
10003 6728516 6205865 2214612 -1360091 -778812 2427230 3872678 2588316 1512549
9995 1512549 2355154 3375774 2650725 850671 -160704 245680 1328506 2204848 2495592
9986 2495592 2311858 2151281 2688914 4336480 6734526 8706478 9179955 8288732 6970925
9977 6970925 5507976 3598478 1820149 1049235 196716 -2540427 -5258351 -3167865 3799350
9968 3799350 8575993 6117289 864764 -186707 1944552 1365290 -1924069 -2511267 520551
9959 520551 2628151 2591828 3723579 5691773 4015706 -763060 -2505902 -318677 -331299
9950 -331299 -3387529 -1520324 7810200 14413750 10236912 2485993 2332660 7854137 8950516
9941H950516n015108l997301n8472J83267m59785K516789N390053L027227j696984
9932H840202l220154j996878j214080m26422J602151K855491J833674M12190o50575
9923H035599l202766n774888l426186L055648N762998J588233k635516j436162
9915A966960J341394J009694j39218O65573O21321k040574l227914o62601J453647
9906I88282P87302J249810L829316K934763k309690m085106J35588J623695l682546
9897A471414o275216J85074O526086L893227j287977p98486N29587k517624k365732
9888f39647N747057R843766J327547o315804l2139P887059K370147m301048M127932
9879B0014870J1680488l085752j8271324K888913L9227641K6906420m0039226
$$ plain form
9941 8950516 3935408 -61893 -120365 62902 -396883 2119906 7509959 10537186 8840202
9932 8840202 5620048 3623170 2409090 1982668 3584819 6440310 8273984 8686174 8035599
9923 8035599 4832833 -942055 -4368241 -1312593 4450405 6038638 3403122 1966960
9915 1966960 3308354 4318048 4178830 4844403 5465724 3425150 197236 -465365 988282
9906 988282 1775584 3025394 6854710 9789473 7479783 3394677 3530265 5153960 1471414
9897 1471414 -4803802 -4618728 1907358 5800585 4512608 3714122 4243709 1726085 -639647
9888 -639647 5107410 14951176 16278723 9962919 9930780 17817839 20187986 15886938 20014870
9879 20014870 31695358 28609606 10338282 13227195 52454836 79361256 39322030
9872C9322030q4403906n0924532J5478328L8341456J3881133m966966J759576
9865c1512881O608699k761946m733216Q901757J5362164K801933q860608l766973
9857a7961071N013111K361579l834246j539025L324614R84290l089867L11173
9849a4429442O816154P359648L612366J762512M82754l237788m962033o13881
9841c209710M101235K366394k293577k710166m6801J56974j473923o22944J829478
9832a903040J677074q17648j904190o49378J137786K569503L005139J114773j714463
9823B515556j215925K950190N041769J648149k963163l966716k853187k564032
9815a407359j519548J929828M274806K171563j295569j640643m13104j650688
$$ plain form
9872 39322030 -45081876 -96006408 -80528080 -42186624 -28305491 -33272457 -31512881
9865 -31512881 -24904182 -27666128 -32399344 -23497587 -8135423 -5333490 -14194098 -17961071
9857 -17961071 -12947960 -10586381 -14420627 -15959652 -12635038 -11650748 -14740615 -14429442
9849 -14429442 -7613288 -253640 3358726 5121238 5603992 2366204 -2595829 -3209710
9841 -3209710 891525 3257919 964342 -1745824 -1792625 -1635651 -3109574 -3732518 -1903040
9832 -1903040 -225966 -1043614 -2947804 -3597182 -2459396 110107 3115246 4230019 2515556
9823 2515556 1299631 4249821 9291590 10939739 7976576 4009860 1156673 -1407359
9815 -1407359 -2926907 -997079 3277727 5449290 4153721 2513078 2099974 449286
9807D49286m309572m290541j423667J150327K419784L334531L288661J432893
9799B051702m03056k75798L28806p53453k301167k004014m90301L89661Q53863
9790b603757J484589Q96431j622124l784845l597980k132202n42670J929216M319465
9781e653877K988409k070765m790909j370760L488887L650702N02836o49584P84137
9772c120924J649173J442585J708968J531128p30578l248812l175816j034798
9764d979074J447972M490698O883952M177236l862322q772912l852035M850203
9756C83718O338989L96810l644814j915168R6544j344324k758491j042663J431083
9747b058316J950085J464959J202416M71235n86967p26799p61876k241376l069874
$$ plain form
9807 449286 -3860286 -8150827 -9574494 -8424167 -6004383 -2669852 618809 2051702
9799 2051702 1648646 1372848 1701654 948201 -1352966 -3356980 -3847281 -3457620 -2603757
9790 -2603757 -1119168 -222737 -1844861 -5629706 -9227686 -11359888 -11902558 -9973342 -5653877
9781 -5653877 -2665468 -4736233 -9527142 -10897902 -7409015 -3758313 -3255477 -3905061 -3120924
9772 -3120924 -1471751 -29166 1679802 3210930 2480352 -768460 -3944276 -4979074
9764 -4979074 -3531102 959596 7843548 12020784 8158462 -614450 -4466485 383718
9756 383718 6722707 7119517 3474703 1559535 1656079 311755 -2446736 -3489399 -2058316
9747 -2058316 -108231 1356728 2559144 3030379 2443412 1716613 954737 -1286639 -4356513
9738d356513j4506M533364M669595L22640k249052m93466Q46882j566849m014443
9729b322348k240351J667934K788545J14702l270767m116408j317113L174156
9721e521650N142584K704136l55404L53753K654949J146076l312065m492108j293647
9712b973376O34652p63406n39083L159381M190759j100905o067680l279888L887949
9703b851597O613851L392080j44620j344381k657875m581948l789533O43145M673783
9694d7095M714043J803334j084530k773509l294408k030688J241725M306533L686348
9685F521753j113310n507389m148807J986731N397680J260153n536183o441521
9677g580893p62908M019889L237143M88630N82561K596243L089993J811396M20029
$$ plain form
9738 -4356513 -4371019 162345 4831940 5154580 2905528 2412062 3258944 1692095 -2322348
9729 -2322348 -4562699 -2894765 -106220 8482 -3262285 -7378693 -8695806 -5521650
9721 -5521650 -379066 2325070 1969666 2323419 4978368 6124444 2812379 -1679729 -2973376
9712 -2973376 -2338724 -3102130 -3641213 -481832 3708927 2608022 -3459658 -6739546 -2851597
9703 -2851597 3762254 7154334 7009714 5665333 3007458 -1574490 -5364023 -4720878 -47095
9694 -47095 4666948 6470282 5385752 2612243 -682165 -2712853 -1471128 2835405 6521753
9685 6521753 5408443 -98946 -4247753 -2261022 3136658 4396811 -1139372 -7580893
9677 -7580893 -8343801 -4323912 -1086769 -598139 -15578 2580665 5670658 7482054 7902083
9668G902083j229681l714237n278489m052027j495376n36720j318847j366376
9660a1089670O77564L342642L910408R64697l576716m975608m83546O068989P532916
9651B371676K297205l345116l365776N83037K351445m89701m381087m628480n34015
9642i140812M035743M701649J628989m59282J224115L173517J039674k861677
9634C341916k860002N28974J146139k426105m382591j508283J838579J816739
9626b504634J215327L005579M058052Q22699l750660m680724k292465J83288K315704
9617a627834M324857L291473k194678o853802m854645J108678L395466N16682
9609b893803j788072J06137L334159L802787R72231l014859n241526l325890J788467
$$ plain form
9668 7902083 6672402 2958165 -2320324 -6372351 -7867727 -8404447 -9723294 -11089670
9660 -11089670 -10412106 -7069464 -3159056 -2194359 -5771075 -10746683 -11230229 -5161240 2371676
9651 2371676 4668881 1323765 -2042011 -1458974 892471 402770 -3978317 -8606797 -9140812
9642 -9140812 -5105069 -403420 1225569 766287 1990402 5163919 6203593 3341916
9634 3341916 481914 1010888 2157027 -269078 -4651669 -6159952 -4321373 -2504634
9626 -2504634 -1289307 1716272 5774324 6597023 2846363 -1834361 -4126826 -3943538 -1627834
9617 -1627834 2697023 5988496 3793818 -3059984 -7914629 -6805951 -3410485 -2893803
9609 -2893803 -4681875 -4575738 -1241579 2561208 3533439 518580 -4722946 -8048836 -6260369
9600f260369N163472L288261j077169k770082j114966P77141J509670J839569
9592A355527J420278l10329j492538n15923L94533j163723k620810k68775L627552
9583D25792L564866n08384l317344k362918R8447K474167M837016M951905L37559
9574A0501106n293110m914725J117548M368760N09297m681249m569707n16214
9566c478294K490788L423155L708905K545469j161641m896333n021746j661132
9558d050829J933700L330182K066901j102657m031130m206193j712574P11030
9550g061570J547103J823668J825159J46529k491079k543980Q17368L272682J476607
9541a187513j752741j837422P48503J800731l96181l535825m594557k081823L296736
$$ plain form
9600 -6260369 -1096897 2191364 1114195 -1655887 -2770853 -1993712 -484042 1355527
9592 1355527 2775805 2465476 972938 457015 851548 -312175 -2932985 -3201760 425792
9583 425792 3990658 3482274 164930 -2197988 -2099541 374626 5211642 10163547 10501106
9574 10501106 5207996 293271 1410819 5779579 6288876 1607627 -2962080 -3478294
9566 -3478294 -987506 2435649 6144554 8690023 7528382 2632049 -2389697 -4050829
9558 -4050829 -2117129 1213053 3279954 2177297 -1853833 -6060026 -7772600 -7061570
9550 -7061570 -5514467 -3690799 -1865640 -1719111 -4210190 -6754170 -5936802 -2664120 -1187513
9541 -1187513 -2940254 -4777676 -4029173 -2228442 -2624623 -6160448 -10755005 -12836828 -9540092
9532i540092P831772O871510N42289m747094l708491R76754K851505Q51980k78822
9523A651311J930542M047750K325333j792255l899680k394026J4309J3244k332383
9514d35855l739486j810497J733612L153194J681182K17774O04581J028973k66045
9505B167433j489714k78181J892961J636838j061175k840263j954958j91365M65824
9496a652600L64376O28594J154540J105786J33081j443780k747790k578454n07968
9487e544215K316898M226208M457614K984579J80533k283483k048532M44522J032074
9478E766198k605459o158367l683400L278722O553223K211227m173709n298735
9470d110300j028364L404581M636817L123173M79862j475042r39040J309070J487136
$$ plain form
9532 -9540092 -1708320 5163190 5705479 958385 -2750106 -1773352 1078153 1930133 1651311
9523 1651311 3581853 7629603 9954936 8162681 4263001 1868975 1883284 1896528 -435855
9514 -435855 -4175341 -5985838 -4252226 -1099032 582150 799924 1404505 2433478 2167433
9505 2167433 677719 399538 2292499 3929337 2868162 27899 -1927059 -2118424 -1652600
9496 -1652600 -1288224 -659630 494910 1600696 1733777 289997 -2457793 -5036247 -5544215
9487 -5544215 -3227317 998891 5456505 8441084 8621617 6338134 4289602 4734124 5766198
9478 5766198 3160739 -2997628 -6681028 -3402306 3150917 5362144 1188435 -4110300
9470 -4110300 -5138664 -1734083 2902734 6025907 6505769 5030727 4091687 5400757 6887893
9461F887893j810891m300785k143831J321249N02815k952639k643763J422585
9453c717367K397566j475450l247428Q81116M535546J795364k541112j028597
9445b400362L828086M078394l25787k287996J61388J881748N69309n09643m07263
9436D587874k084231m551342k517889L384483N002959p15736o001201m186866
9428g081949O42074J933074J012574J848441K169629j579172n481844l439850
9420i977023K240898M365841K352885J437916K335431R29237k368230k244742
9412i27787J604636K786418j446258n627382m644439n73305K021985K319731J841727
9403b644674J190756P73981J280330J753459N24070j190522n47990J630545J489748
$$ plain form
9461 6887893 5077002 776217 -1367614 -46365 456450 -2496189 -5139952 -3717367
9453 -3717367 -1319801 -2795251 -6042679 -5161563 -626017 1169347 -1371765 -2400362
9445 -2400362 1427724 5506118 5180331 2892335 3053723 4935471 5504780 4995137 4587874
9436 4587874 2503643 -2047699 -4565588 -1181105 3821854 3106118 -2895083 -7081949
9428 -7081949 -6439875 -4506801 -3494227 -1645786 523843 -1055329 -6537173 -9977023
9420 -9977023 -7736125 -3370284 -1017399 420517 2755948 3685185 1316955 -927787
9412 -927787 676849 3463267 2017009 -3610373 -8254812 -8828117 -6806132 -4486401 -2644674
9403 -2644674 -1453918 -679937 600393 2353852 2877922 1687400 1139410 2769955 4259703
9394D259703j263424k528410p62779N85811n68480j423524L60196K480519K036433
9385C176045j35294j742914k218959j553965O09805K983979L214259J762379J419799
9376G515134K075137O17700k831441l946139j219672J537380J843084J884925
9368G476108K652252J025680l643855o172558l315245N65384M91980j520533j065220
9359c506007J090757J580974O30134L19188J90620o14646o12644K06648j504048
9350b219024n707474n987870O68224P041968O006505J707302J528549K775764
9342E813944j375834p193993n141836K549025L600978l843304p139995J39642
9334a2591373P311098L987235l458353l128684L306099M546056j914262o770411
$$ plain form
9394 4259703 2996279 467869 -294910 290901 -277579 -1701103 -1340907 1139612 3176045
9385 3176045 3040751 1297837 -921122 -2475087 -1865282 1118697 4332956 6095335 7515134
9376 7515134 9590271 10207971 7376530 3430391 2210719 3748099 5591183 7476108
9368 7476108 10128360 11154040 7510185 1337627 -1977618 -1412234 -920254 -2440787 -3506007
9359 -3506007 -2415250 -834276 -204142 115046 305666 -308980 -921624 -714976 -2219024
9350 -2219024 -7926498 -13914368 -13246144 -6204176 -197671 1509631 3038180 5813944
9342 5813944 4438110 -2755883 -7897719 -5348694 -1747716 -5591020 -12731015 -12591373
9334 -12591373 -5280275 -1293040 -4751393 -7880077 -4573978 -27922 -1942184 -8712595
9326h712595l506782L256248N479457J481867l894765n122233q45990M899157
9318f965636O435161K864041p89949m94300J559217J444459j052M39024J886018
9309F376983P06739k597462l384454k25532K759113K337340N04078J65316K82793
9300F924914j490929l907847l563976k76808K289719J545778j036363k521859
9292b037371k020819m91907J261700K732980K893360J227218o99431o47246J075194
9283C293678J601339o61802l784257m696301k468381J380431M263455L724963
9275B653125n39552m947943m883611o39999K407639J339270k94260J102695K913551
9266h89085J193929j884547j748702J42144r19019l283130r53885M678282M944276
$$ plain form
9326 -8712595 -12219377 -8963129 -3483672 -2001805 -5896570 -11018803 -11864793 -6965636
9318 -6965636 -530475 2333566 1543617 1049317 2608534 4052993 4051941 4490965 6376983
9309 6376983 7083722 4486260 1101806 876274 3635387 5972727 6476805 6642121 6924914
9300 6924914 5433985 1526138 -2037838 -2314646 -24927 1520851 484488 -2037371
9292 -2037371 -4058190 -4550097 -3288397 -555417 2337943 3565161 2865730 2218484 3293678
9283 3293678 4895017 4233215 448958 -4247343 -6715724 -5335293 -1071838 2653125
9275 2653125 2113573 -2834370 -7717981 -8357980 -5950341 -4611071 -4905331 -3802636 -889085
9266 -889085 304844 -1579703 -3328405 -3186261 -4105280 -7388410 -8342295 -3664013 1280263
9257A280263j759044n755991j224769M003488J314009m379606l211191K951958
9249f780883M322352L53154N0683N080199N702508k566043r834931o294956L040988
9240f926929O539039K747476l22931P58075J230788j737736m026379j957204J774243
9231a921558K961989K120991K085666K441135M85715l432238n253438k468965
9223b980703K210667L748236O49864l197763l082245O51208K744389k00892m770805
9214d228044m802123M16462N107374M646530J006308j159342r25860o03771q15227
9205a357693O8315K015424K624740J061356m73875n44357r62136l478570o121088
9196g167884n331994p46592M225943O048253L886074k86639k956485j555404K587206
$$ plain form
9257 1280263 -478781 -6234772 -7459541 -3456053 -2142044 -6521650 -9732841 -6780883
9249 -6780883 -2458531 -2105377 -2054694 3025505 8728013 6161970 -3672961 -9967917 -6926929
9240 -6926929 -387890 2359586 2036655 2794730 4025518 2287782 -1738597 -3695801 -1921558
9231 -1921558 1040431 3161422 5247088 7688223 8173938 4741700 -511738 -2980703
9223 -2980703 -770036 2978200 3628064 430301 -2651944 -2000736 743653 542761 -4228044
9214 -4228044 -9030167 -8613705 -3506331 1140199 2146507 987165 61305 -542466 -1357693
9205 -1357693 -1289378 726046 3350786 4412142 3938267 3393910 2431774 -1046796 -7167884
9196 -7167884 -12499878 -13246470 -9020527 -2972274 913800 627161 -2329324 -3884728 -1297522
9187a297522M838563K641630j002539j713594J55368R01068j68396j62966J526640
9178E718252J658525j074213l299639k524142j125001j378777o90561L335445
9170F19889O465889K947695m462429o681453j147075M304444K818992k255278
9162B610674l512131r5202K937684K819210J245832j96214j687752k542120j406954
9153A73027M87099K21394j886686j962393J478120M626155L478964p41944l651373
9144B222363l456178k218516k140376k684011j676109J556190M591221M125620
9136C20204L88494k078169j83154K502132J01572o202966q219521k047417N668655
9127i750170O653167K163828o7815K423289M393917J880012k278825l442693j203688
$$ plain form
9187 -1297522 3541041 6182671 5180132 3466538 3621906 4522974 4354578 4191612 5718252
9178 5718252 7376777 6302564 3002925 478783 -646218 -2024995 -2715556 619889
9170 619889 7085778 10033473 5571044 -1110409 -2257484 2046960 4865952 2610674
9162 2610674 -901457 -996659 1941025 4760235 6006067 5809853 4122101 1579981 173027
9153 173027 660126 881520 -1005166 -2967559 -1489439 3136716 6615680 5873736 2222363
9144 2222363 -1233815 -3452331 -5592707 -8276718 -9952827 -8396637 -3805416 320204
9136 320204 708698 -1369471 -1552625 949507 1051079 -5151887 -13371408 -15418825 -9750170
9127 -9750170 -3097003 -933175 -1000990 1422299 5816216 7696228 5417403 1974710 771022
9118G71022J701797L169790K341202q07207m307766m752055j139369L199721M149312
9109D326447J187059k797381m686704l190008P44246M367693N129315L137767
9101H218434O85539q87028k256870l803843m332225k906781k01333K597724M509870
9092A623487M285181J605894j110874j121753J64013j071672m135651l599431
9084c360806J833646N564157K264773l723451m481794L83310M673492N221541
9076H374868M056704K214534j635319n995210o511752k768144M17910L51796p5022
9067a569635J513532K609386P34681j749028j496104O80352K136058K645400K680345
9058H184987P45025l281594n194477j988774K076156Q88726l565605l600832J768095
$$ plain form
9118 771022 2472819 5642609 7983811 7176604 2868838 -1883217 -3022586 177135 4326447
9109 4326447 5513506 2716125 -1970579 -5160587 -4416341 -48648 5080667 8218434
9101 8218434 8903973 8016945 5760075 1956232 -2375993 -5282774 -5484107 -2886383 1623487
9092 1623487 5908668 7514562 6403688 5281935 5445948 4374276 238625 -3360806
9084 -3360806 -1527160 4036997 6301770 2578319 -1903475 -1520165 3153327 8374868
9076 8374868 12431572 14646106 13010787 7015577 503825 -2264319 -1846409 -1494613 -1569635
9067 -1569635 -56103 2553283 3287964 1538936 42832 723184 2859242 5504642 8184987
9058 8184987 8930012 5648418 453941 -1534833 541323 1430049 -2135556 -5736388 -3968293
9049c968293M487905Q0226m663341j818862N288730O974782J684906k313969R3427
9040E845511L730443J984718l052520m376652p67637J971937q4609l720930l597055
9031b066794N79384L979255K575921k239002m958496j941046L884309N686166
9023E499697J081537m321966m203150k35950O88838l038607n519950k673367J750464
9014a0972454K498560N92022M21367K160093K047708j024748l651429k681751
9006a0610632J158055M497184M329770N59430k969645j760466L218153N394137
8998C815986J278291l965230l724783M30680J936742k19896r70507J514036L212978
8989C308297J936515P57572J594974J573199j214388l744956l279764j765329
$$ plain form
9049 -3968293 519612 599838 -4063503 -5882365 -593635 6381147 8066053 5752084 5845511
9040 5845511 9575954 11560672 8508152 4131500 3363863 5335800 5251191 1530261 -2066794
9031 -2066794 -1487410 2491845 5067766 2828764 -2129732 -4070778 -186469 5499697
9023 5499697 6581234 2259268 -1943882 -2179832 -1490994 -4529601 -10049551 -12722918 -10972454
9014 -10972454 -8473894 -7881872 -7460505 -5300412 -3252704 -4277452 -7928881 -10610632
9006 -10610632 -9452577 -4955393 -625623 -66193 -3035838 -4796304 -1578151 3815986
8998 3815986 5094277 1129047 -2595736 -2165056 -228314 -448210 -1418717 95319 3308297
8989 3308297 5244812 6002384 7597358 9170557 7956169 4211213 931449 -833880
8981h33880j529003j124599P21019J434280o94418k102971O82441M523599L982197
8972E058665k03621k589860j512671m72893j482067k304763r60709J251663K190792
8963a025464J262894j046852l394265l481760n00607K701473K798954Q21949N71705
8954a291973K598416L431761J116446j963177k653856o93862J906770K918433
8946E368958J150763k134966l388821q29919K351402J857732j515914l270495
8938d11260k041956n33389R1512J441481K948036J500106k229607k963372Q16328
8929a382121L351053L98903l734243l035344Q65053K263656Q58320P96653K321205
8920B703135J593675j633763l129146j648253p84863j830626j114525K832993
$$ plain form
8981 -833880 -2362883 -3487482 -2766463 -1332183 -2026601 -4129572 -3447131 1076468 5058665
8972 5058665 4855044 2265184 752513 279620 -1202447 -3507210 -4467919 -3216256 -1025464
8963 -1025464 237430 -809422 -4203687 -7685447 -8186054 -5484581 -2685627 -1863678 -1291973
8954 -1291973 1306443 4738204 5854650 3891473 1237617 543755 2450525 5368958
8946 5368958 6519721 4384755 995934 166015 2517417 4375149 2859235 -411260
8938 -411260 -2453216 -2986605 -2895093 -1453612 1494424 2994530 764923 -2198449 -1382121
8929 -1382121 1968932 2367835 -1366408 -4401752 -3536699 -1273043 -414723 381930 2703135
8920 2703135 4296810 2663047 -466099 -2114352 -2899215 -4729841 -5844366 -3011373
8912c011373N310138K628920j507478j683511P59241N21917k520546l116960N24739
8903b094913L446069J398406k759551l281753M14607L500762K729437K61386l76782
8894C237668M50269l78174l284185m543339j338427L749090N378969J813487l373576
8885A711782n707775l980748j6340L535202M583558K774604K15708n35428J93549
8876B774112k63582k463556l521400j554106J230453J983377J291266J140515
8868F17079J018097o43073k734523k799034j086258K27146R39753K147595K537160
8859B23942p0887l645543l499001L02625K372229N91287k40752L421517P117478
8850F572895M699785k063933n786189l709286l73538k95640k571155l648822k102556
$$ plain form
8912 -3011373 2298765 4927685 3420207 1736696 2495937 3017854 497308 -2619652 -2094913
8903 -2094913 1351156 2749562 -9989 -3291742 -2877135 623627 3353064 3614450 3237668
8894 3237668 3687937 3309763 25578 -4517761 -5856188 -2107098 3271871 5085358 1711782
8885 1711782 -3995993 -7976741 -7993081 -4457879 125679 2900283 3115991 2580563 2774112
8876 2774112 2510530 46974 -3474426 -5028532 -3798079 -1814702 -523436 617079
8868 617079 1635176 992103 -1742420 -4541454 -5627712 -5400566 -4460813 -2313218 223942
8859 223942 153055 -3492488 -6991489 -6688864 -4316635 -3725348 -3966100 -544583 6572895
8850 6572895 11272680 9208747 3422558 -286728 -660266 -955906 -3527061 -7175883 -9278439
8841i278439P32929K925833L642520L407478K874430J468093j373964l582360
8833H16520k026528K059825K935446j581781n598646k968846L413250N615625
8825B664865K045718j411330j119782l5089j135810k450056j257358J195483K104699
8816F01340J173282o5908o06901j31329Q91453N67425k113285m128001j557141
8807e369065L550916M472385k50500l559671P5363O225161O790335J168436m071012
8798I032348m517854j864127M69503J095051J39159j426661j706472K21652K364098
8789C806697J925416r59330l468553l494072j229987J597881K575184K60242l197704
8780b184226l147429J439748N176957K936180k552278m011151L01408M437034
$$ plain form
8841 -9278439 -8545510 -5619677 -1977157 1430321 4304751 5772844 4398880 816520
8833 816520 -1210008 849817 3785263 2203482 -3395164 -6364010 -2950760 2664865
8825 2664865 4710583 3299253 2179471 2144382 1008572 -1441484 -2698842 -1503359 601340
8816 601340 1774622 1708714 1101813 970484 1861937 2429362 316077 -3811924 -5369065
8807 -5369065 -1818149 2654236 2403736 -1155935 -1080572 5144589 11934924 13103360 9032348
8798 9032348 4514494 2650367 3119870 4214921 4354080 2927419 1220947 1442599 3806697
8789 3806697 5732113 4772783 1304230 -2189842 -3419829 -1821948 753236 1013478 -2184226
8780 -2184226 -5331655 -3891907 1285050 4221230 1668952 -2342199 -2040791 2396243
8772B396243L273743j014437k937263j180635N67682q40924l963794m722035j437038
8763i858458L113484N005763L592758J353762N5850p50532j478868j408571n46395
8754i21207j14415l05496K6345P29117K47176j057781p70683J371799K756522
8745A961377K412452J991883J136776k622117p324821o519180O11702N850822
8737b501106L728570j97696O29970K557599o18011m947103k411841M281662N225681
8728E747725j10344k393592J212443K900964j078766l774341k96406L529439J489328
8719G226450k926136l499423j119287m220j96319j32058j238490l849304l659463
8710i398250J484712N899771L656248k062805l722173l88664K547726K298257
$$ plain form
8772 2396243 5669986 4655549 1718286 537651 1105333 264409 -3699385 -8421420 -9858458
8763 -9858458 -6744974 -1739211 1853547 3207309 3263159 2512627 1033759 -374812 -921207
8754 -921207 -1035622 -1341118 -1314773 -585656 -338480 -1396261 -2166944 -795145 1961377
8745 1961377 4373829 6365712 7502488 4880371 -2444450 -8963630 -8351928 -2501106
8737 -2501106 1227464 1029768 1659738 4217337 3599326 -1347777 -3759618 522044 5747725
8728 5747725 5637381 3243789 4456232 7357196 6278430 2504089 2207683 5737122 7226450
8719 7226450 4300314 800891 -318396 -322616 -518935 -650993 -1889483 -5738787 -9398250
8710 -9398250 -7913538 -2013767 1642481 -420324 -4142497 -4531161 -1983435 314822
8702C14822J069248P48596O15534J9408n46246o66796N8703J904027L227551J491081
8692H235928k272395l670510j618736l57880k266372l681487j277482K438620
8684d470314L867890L526598K552452m36726m440262m050391K090309O707502
8676E347058M055617j194320k207201j072585l275060o542553m896253J42366
8668i642931K240244J195594J611731L224443K196275k01444P7848J056947j657375
8659A01332m764787j810378M023369L770491j625915k541888K114825K893318
8651B160367k814416n613404o69819M143691K625693J01418J731097K777770j045132
8642C397265m134495j189760K477913N41046k761862q53097K702258Q29659l798498
$$ plain form
8702 314822 1384070 2132666 2748200 2767608 2221362 1554566 1613269 3517296 6744847 8235928
8692 8235928 5963533 2293023 674287 316407 -1949965 -5631452 -6908934 -4470314
8684 -4470314 -602424 2924174 5476626 5039900 599638 -3450753 -1360444 5347058
8676 5347058 9402675 8208355 6001154 4928569 1653509 -4889044 -9785297 -9642931
8668 -9642931 -7402687 -6207093 -4595362 -1370919 825356 623912 701760 1758707 101332
8659 101332 -4663455 -6473833 -2450464 1320027 -305888 -2847776 -732951 2160367
8651 2160367 -654049 -6267453 -6937272 -2793581 -167888 -66470 1664627 4442397 3397265
8642 3397265 -737230 -1926990 550923 1091969 -1669893 -2522990 179268 1008927 -2789571
8633b789571l315144J670184L712614J131386r30604k35688P01798J120201K250472
8624C315648K338263r99187m724557l963169l91012R5475k939044m117927j028537
8615a2414047L020156M609198L152965o32586m093494k641221L937560P978993
8607B917524L416006m180569m906782O67696L228763n3223k290653L01894K531955
8598A632611K56694k526871j193173J704661J190283k233834l950678j599459
8590f719766K995969O137965M959720P8087l957057l406821j08885J569229J151626
8581B700067J104741J109488q90410k821751m41478M556340N353569K47019m610691
8572F306894m657698k612740k080429j663833R31629L945601M467352K569018
$$ plain form
8633 -2789571 -6104715 -4434531 -721917 409469 -521135 -756823 -55025 1065176 3315648
8624 3315648 5653911 4654724 -69833 -4033002 -4424014 -4328539 -7267583 -11385510 -12414047
8615 -12414047 -9393891 -4784693 -1631728 -2264314 -6357808 -8999029 -5061469 2917524
8607 2917524 6333530 2152961 -2753821 -2086125 1142638 1089415 -1201238 -899344 1632611
8598 1632611 1889305 -637566 -1830739 -126078 1064205 -1169629 -5120307 -6719766
8590 -6719766 -3723797 2414168 7373888 7451975 3494918 88097 -20788 1548441 2700067
8581 2700067 3804808 4914296 4023886 1202135 760657 5316997 10670566 10917585 6306894
8572 6306894 1649196 -963544 -3043973 -4707806 -3776177 169424 4636776 7205794
8564G205794k33566l102876m457877k428269J336578K472902L03305j063252K11379
8555B44118P04269j737710l807443k492667k61304n77880k216010k020560p4210
8546a2239397J610716K754198L779151L594857J464597r54908j795538j265282
8538c051606l07859O05801M75368j335845k627406o20942K875896L294098Q18209
8529A25714K85910K504636K511367j253103l409188r02363J507502j64239k037631
8520h31395K34829L417256K875445J116903K506001M245944J043859m684512n911217
8511D013113k220924L28509n42202j099257N89128J871900J147336N8354o14408
8502C531549j769563k297614N5030L612917L783885J0903l074054k467597l76231
$$ plain form
8564 7205794 6972228 3869352 -588525 -3016794 -1680216 792686 1095991 32739 244118
8555 244118 948387 -789323 -4596766 -7089433 -7350737 -7928617 -10144627 -12165187 -12239397
8546 -12239397 -10628681 -7874483 -4095332 -500475 964122 9214 -1786324 -3051606
8538 -3051606 -3359465 -2753664 -2278296 -3614141 -6241547 -6862489 -3986593 -692495 125714
8529 125714 411624 2916260 5427627 4174524 765336 -137027 1370475 1206236 -831395
8520 -831395 -596566 2820690 5696135 6813038 9319039 13564983 14608842 9924330 4013113
8511 4013113 1792189 2120698 1578496 479239 1068367 2940267 4087603 4145957 3531549
8502 3531549 1761986 -535628 -480598 3132319 6916204 6927107 3853053 1385456 1009225
8493A009225J86448n88229j097639r12518k81983N09452N63381p96805k405233
8484c813901k314040k80963K281369L914090L316837j04897l967573l739767J329909
8475c378936N590075L718475j984739m606608j313534M167605O278877K419724
8467A0890939m849318q520703l542637N439493P734378R16827n071453k887368
8459A10158R47500k273489p785496m833936M617164P790482R14167n500539l172876
8450i186865L232100N556128L172772J63524j422618j337701M41628K043327R57562
8441C619857j561421k002219o59960n96265j082694R85407L622769J883074k498405
8432A710143k761572P93718N39024m713848o630645j691506K488078N63845j562442
$$ plain form
8493 1009225 1195673 607444 -490195 -1402713 -1684696 -1175244 -611863 -1408668 -3813901
8484 -3813901 -6127941 -6408904 -4127535 -213445 3103392 2998495 -969078 -4708845 -3378936
8475 -3378936 2211139 5929614 3944875 -661733 -1975267 2192338 8471215 10890939
8467 10890939 6041621 -2479082 -6021719 -582226 7152152 8068979 2997526 110158
8459 110158 1057658 -1215831 -9001327 -13835263 -9218099 -1427617 -513450 -6013989 -9186865
8450 -9186865 -5954765 -398637 2774135 2937659 1515041 177340 618968 2662295 3619857
8441 3619857 2058436 56217 -603743 -1200008 -2282702 -1297295 2325474 4208548 1710143
8432 1710143 -1051429 -257711 281313 -4432535 -11063180 -12754686 -10266608 -9702763 -11265205
8423a1265205J723027N156053K278283k624347j934826K470945L609593J493846
8415I07369J133116K288466P74361k496046k671712K11356J394227m67807k090846
8406a017516j711629o00285N55661J623245R43838j878025l305256q76855J937413
8397d329409J195073n70630Q93176L245808J449606k611177k662584J148713K400706
8388A59282p60398l086241j517936N78679L60210p3852J230451K291562J376174
8379E57931L60268J040498J667455j66597l595402n377716l304622J815795O219102
8370g83288N929406J324754k400436j590604J180346J685789L94550j5453n05545
8361E219519l297552n820900l690974J299906L054485Q24085p2297K216472L114470
$$ plain form
8423 -11265205 -9542178 -4386125 -2107842 -4732189 -6667015 -4196070 -586477 907369
8415 907369 2040485 4328951 5103312 2607266 -64446 146910 1541137 1073330 -1017516
8406 -1017516 -2729145 -3329430 -2773769 -1150524 -206686 -2084711 -5389967 -6266822 -4329409
8397 -4329409 -3134336 -3704966 -2811790 434018 1883624 -727553 -3390137 -2241424 159282
8388 159282 -601116 -3687357 -5205293 -4626614 -4266404 -4340256 -3109805 -818243 557931
8379 557931 918199 1958697 3626152 3459555 -135847 -5513563 -8818185 -7002390 -783288
8370 -783288 5146118 6470872 4070436 2479832 3660178 5345967 5740517 5725064 5219519
8361 5219519 1921967 -3898933 -7589907 -6290001 -3235516 -2411431 -2483728 -267256 2847214
8352B847214M6665l056875k595064o41704r0477K34086J831265K479518J13981
8343A168609k801998k855830r26402j14698o34862l56610J058403J795118R06194
8334b762076o86932j704060j487626k11844Q37321K38795j417879j612081R28173
8325g878209M258926N366706L475058N48107r90141p37628n85771k031809l484251
8316b059012k132654J223456K318358j68583k088480m09725J749789P66653r39975
8307a740173K98217J737748j218944n272468k900075M669562P543468J982273
8299E099608l820458k377851K616429L528685J28806k200502j215585Q20519J750859
8290D330510J082471r19612k534287j397300J621571K497282K00798j175218Q95794
$$ plain form
8352 2847214 2893879 -162996 -2758060 -3399764 -3490241 -3256155 -1424890 1054628 1168609
8343 1168609 -1633389 -4489219 -5415621 -5530319 -6165181 -6521791 -5463388 -3668270 -2762076
8334 -2762076 -3449008 -5153068 -6640694 -6852538 -6015217 -5776422 -7194301 -8806382 -7878209
8325 -7878209 -3619283 1747423 5222481 5770588 4780447 4042819 3457048 1425239 -2059012
8316 -2059012 -4191666 -2968210 -649852 -818435 -2906915 -3316640 -1566851 -800198 -1740173
8307 -1740173 -1441956 295792 -923152 -6195620 -9095695 -4426133 3117335 5099608
8299 5099608 1279150 -1098701 1517728 5046413 5175219 2974717 1759132 2579651 4330510
8290 4330510 5412981 4493369 1959082 561782 2183353 4680635 4881433 3706215 4602009
8281D602009K962671J354617j916576l130147k850698l409877l807357j969156
8273h164514O52636J437658J158698J762165K090892M26426j159208L9395J994787
8264B38935R46066j971652k439663J3116K053207K616914L462344M258088K748912
8255A1926267j81849j114063j49819r55821m003393n283844l165247j116660j519071
8246e563500j938738l43137Q35475n15354j539948J000051M588487M281558L38083
8237A142977k330440j597979l11924o88026r39121P91438K631808J886787l24402
8228B61118m91369J839089L073614P81420k496007k435815J345923M875837M800504
8219A1554314J761323j498767l414404l911913l005748q53029J257266J528289
$$ plain form
8281 4602009 7564680 8919297 7002721 3872574 1021876 -2388001 -6195358 -8164514
8273 -8164514 -7511878 -6074220 -4915522 -3153357 -1062465 -636039 -1795247 -1755852 238935
8264 238935 1185001 -786651 -3226314 -3213198 -1159991 1456923 4919267 9177355 11926267
8255 11926267 11744418 10630355 10480536 9524715 5521322 237478 -2927769 -4044429 -5563500
8246 -5563500 -7502238 -7845375 -7009900 -7525254 -9065202 -8065151 -3476664 804894 1142977
8237 1142977 -1187463 -2785442 -3097366 -3785392 -4724513 -3933075 -1301267 585520 261118
8228 261118 -230251 1608838 4682452 5463872 2967865 532050 1877973 6753810 11554314
8219 11554314 13315637 11816870 8402466 4490553 1484805 631776 1889042 3417331
8211C417331l06624k178778j426195K298237N768880M794135p83351n586731m355629
8202A641275J203167M113735J269438k609519k177659Q24481Q82115k471266m123792
8193a448025j471139J910709K225066Q64096R47574J572716m42115m447247n914924
8184f203289k930009R85554K113495J494696K016397K931968J199889k458571
8176h49870l259301O54114M670377L718652q46277l536820k210749K51163J017120
8167c91591M82502O2370r0542j34825L97081J430360J825660Q95297o99470j875944
8157A900898j822715n7180K531742L129181j34774m703465n613853j658214K876778
8148c551602L554183O84176k194823k709756j180398P26587J540802R97843J53998
$$ plain form
8211 3417331 3110707 931929 -494266 1803971 7572851 12366986 11583635 5996904 1641275
8202 1641275 2844442 6958177 8227615 5618096 3440437 4264918 5147033 2675767 -1448025
8193 -1448025 -2919164 -1008455 1216611 2080707 3028281 4600997 4158882 -288365 -6203289
8184 -6203289 -9133298 -8147744 -6034249 -4539553 -2523156 408812 1608701 -849870
8176 -849870 -4109171 -3455057 1215320 4933972 4087695 550875 -1659874 -1408711 -391591
8167 -391591 90911 153281 62739 -72086 324995 1755355 3581015 4476312 3776842 1900898
8157 1900898 78183 21003 2552745 5681926 5547152 843687 -4770166 -6428380 -3551602
8148 -3551602 2581 686757 -1508066 -4217822 -5398220 -4671633 -3130831 -2132988 -1978990
8139a978990o0702o2315l76227k23789P90101Q58624j372239l480558k226465
8130h132560R29820J638322j82813p6192L222075N151879K522066j617098l146856
8121C08643k479722j674985j25154K765859L974782O81931m206049m754370L94717
8112e114348O248290P027822J729534n110335p267881k896530K950394M137130
8104A704076J348714K02329J821899J456139k199443l634761L396L302769J665729
8095E670847q28155O56718K265438j556866o640153m679715K571418N149424K85216
8086B894172m032092k037766K292862L196537R89797j135534k158663k163290
8078b153977j015033j07925j084771j949991N53851M317666L758821p80270k528507
$$ plain form
8139 -1978990 -2039692 -2102007 -2478234 -2702023 -1911922 -1053298 -2425537 -5906095 -8132560
8130 -8132560 -7202740 -5564418 -5747231 -5823423 -2601348 2550531 5072597 3455499 308643
8121 308643 -2171079 -3846064 -3971218 -1205359 2769423 3451354 -754695 -5509065 -5114348
8112 -5114348 1133942 8161764 9891298 4780963 -2486918 -5383448 -2433054 1704076
8104 1704076 3052790 3255119 5077018 6533157 4333714 698953 702349 4005118 5670847
8095 5670847 4842692 5499410 7764848 6207982 -432171 -5111886 -2540468 2608956 2894172
8086 2894172 -1137920 -3175686 -882824 2313713 3303510 2167976 9313 -2153977
8078 -2153977 -3169010 -3276935 -4361706 -6311697 -5757846 -1440180 2318641 1538371 -990136
8069i90136Q43770L200269J61243l718564k789548P75605J681900K95292L72815
8060a67354J442411J11032k699857k141116K784646O790779M983139j054329n252798
8051D796553l797310R45059L175352M90416k962150j874703K719673M752645J872830
8042A0118365j495454j322715J91775j011461l997105m271135m92281L727433
8034A447422M493613J878382p32488o02169J295047J631127n44654k261381j461384
8025E143515p26974k730685m661372k465934J395136J252328j720832r39382L602779
8016a851421M055581j855958n603020j139484N170499M717256m63675k701139
8008C28639p21422J410987K471074K979261M16961n741662q317992j469405P712778
$$ plain form
8069 -990136 -146366 3053903 3215146 -503418 -3292966 -2517361 -835461 -540169 -167354
8060 -167354 1275057 1386089 -1313768 -3454884 -670238 6120541 11103680 10049351 4796553
8051 4796553 999243 1944302 5119654 5610070 2647920 773217 3492890 8245535 10118365
8042 10118365 8622911 7300196 7491971 6480510 2483405 -1787730 -2280011 1447422
8034 1447422 5941035 7819417 7086929 6484760 7779807 9410934 8866280 6604899 5143515
8025 5143515 4416541 1685856 -2975516 -5441450 -4046314 -2793986 -4514818 -5454200 -1851421
8016 -1851421 2204160 348202 -5254818 -6394302 -1223803 3493453 3029778 328639
8008 328639 -392783 1018204 3489278 6468539 6885500 1143838 -7174154 -8643559 -930781
7999i30781P253183j873077p137528l328512J664151J467912j26654R92060J508775
7990e10471j472698l750378j650364J062452L63312p09041J269658K566853o89812
7981c520489l620487R4537O143731N025022k454628n674773n11828N058059M196579
7972D735723O69293L90283J404107j053101n006007m825573r40237R34428o30998
7963d322082q86557K572403N495909L619185j075336l873310l639773k222956
7955d332517k47850K597189M635857L515737N5820k410023k359332j057864K02499
7946E99516Q27299l73489l469760m891063j173134M602236N396541L96146l249031
7937a334739j232551J746989P71664q22084J698818M499195Q60974o120474o383607
$$ plain form
7999 -930781 6322402 4449325 -2688203 -6016715 -4352564 -2884652 -3011306 -2019246 -510471
7990 -510471 -1983169 -5733547 -7383911 -6321459 -5958147 -6667188 -5397530 -2830677 -3520489
7981 -3520489 -7140976 -7046439 -902708 4122314 1667686 -4007087 -4518915 539144 4735723
7972 4735723 5405016 5795299 7199406 6146305 1140298 -3685275 -4625512 -3691084 -4322082
7963 -4322082 -5208639 -2636236 2859673 6478858 5403522 1530212 -2109561 -4332517
7955 -4332517 -4580367 -1983178 2652679 6168416 6224236 3814213 1454881 397017 599516
7946 599516 1426815 1053326 -2416434 -7307497 -8480631 -3878395 1518146 1914292 -1334739
7937 -1334739 -2567290 -820301 -48637 -870721 828097 5327292 6188266 67792 -6315815
7928f315815J646963P960781N497039p30746k888321j342331j047115k434514
7920C45941k143207K98368K108008J960601P91204p72127k253327k012256O18969
7911a057826L107890K588808j74643k187745k142976o13725J750227L615427K726223
7902G611660p07618k655555p52355J314056p85987m505504l819208J102661L854543
7893F56693J675664r00935p336J719298L89032k577291l038544m13437K180246
7884c16610K269696j28322l300109m411818j459658L187442L787260j362958o079675
7875g814752l712902L444394O804935K970837k267633k347787J943962M979997
7867D001051L792391J79693k910942m139007l400147j240998Q16237J016696o08019
$$ plain form
7928 -6315815 -4668852 3291929 8788968 8058222 5169901 3827570 2780455 345941
7920 345941 -1797266 -1498898 609110 2569711 3360915 2588788 335461 -1676795 -1057826
7911 -1057826 2050064 4638872 4464229 2276484 133508 -480217 1270010 4885437 7611660
7902 7611660 6904042 4248487 3496132 4810188 4024201 -481303 -4300511 -3197850 656693
7893 656693 2332357 1431422 1424086 3143384 3532416 955125 -2083419 -2496856 -316610
7884 -316610 1953086 1824764 -1475345 -5887163 -7346821 -4159379 -372119 -1735077 -7814752
7875 -7814752 -11527654 -8083260 -1278325 1692512 -575121 -2922908 -978946 4001051
7867 4001051 7793442 7973135 5062193 923186 -2476961 -3717959 -2901722 -1885026 -2493045
$$ [...]
##END NTUPLES=NMR SPECTRUM
##END=
