##TITLE=31Pdec_3MBDE 2-1
 CDCl3, 148 sc
 13.12.2022
##JCAMPDX= 6.0         $$ Bruker NMR JCAMP-DX V2.0
##DATA TYPE= NMR SPECTRUM
##DATA CLASS= NTUPLES
##ORIGIN= UXNMR, Bruker Analytische Messtechnik GmbH
##OWNER= root
$$ XWIN-NMR		Version 3.5
$$ Tue Dec 13 13:54:47 2022 Russian Standard Time (UT+4h)  she@DPX200
##.OBSERVE FREQUENCY= 81.013821
##.OBSERVE NUCLEUS= ^31P
##.ACQUISITION MODE= SIMULTANEOUS
##.ACQUISITION SCHEME= undefined
##.AVERAGES= 148
##.DIGITISER RES= 16
##SPECTROMETER/DATA SYSTEM= spect
##.PULSE SEQUENCE= zgpg30
##.SOLVENT NAME= CDCl3
##.SHIFT REFERENCE= (INTERNAL, CDCl3, 0, 248.564)
##AUDIT TRAIL= $$ (NUMBER, WHEN, WHO, WHERE, WHAT)
$$ ##TITLE= Audit trail, XWIN-NMR		Version 3.5
$$ ##JCAMPDX= 5.01
$$ ##ORIGIN= Bruker BioSpin GmbH
$$ ##OWNER= she
$$ F:/spectra/data/she/nmr/P31/1/pdata/1/auditp.txt
$$ ##AUDIT TRAIL=  $$ (NUMBER, WHEN, WHO, WHERE, WHAT)
(   1,<2022-12-13 13:53:37.64 +0400>,<she>,<DPX200>,
      <continue with go, POWCHK disabled, PULCHK disabled
       configuration hash MD5:
       00 E9 B6 7A A2 85 ED C7 34 08 36 98 17 FE 4E 26
       data hash MD5: 32K
       7B FB A5 13 16 8F C9 23 CE C0 DF 8C E9 EA C5 C3>)
(   2,<2022-12-13 13:53:40.67 +0400>,<she>,<DPX200>,
      <Start of raw data processing
       efp BC_mod = 2 LB = 1 FT_mod = 6 PKNL = 1 PHC0 = -10608.69 PHC1 = -67.34418 SI = 64K 
       data hash MD5: 64K
       4A 1D D4 BA CB 78 04 3E 06 51 E3 17 B2 AF 47 AB>)
(   3,<2022-12-13 13:54:14.50 +0400>,<she>,<DPX200>,
      <pk PHC0 = 106.5879 PHC1 = 21.79986 
       data hash MD5: 64K
       80 79 9C 25 08 13 6F 8D 80 D6 1F 96 D5 2F DF C5>)
(   4,<2022-12-13 13:54:17.37 +0400>,<she>,<DPX200>,
      <abs ABSG = 5 
       data hash MD5: 64K
       F5 57 A8 AD BB D0 A2 FA 67 FA 8E F1 D2 8F 06 07>)
$$ ##END=
$$ 
$$ hash MD5
$$ D6 F6 A5 E4 FC BC AD 18 18 56 1C 99 75 49 84 02
##$RELAX= 
##$RELAX= 
##$RELAX= 
##$RELAX= 
##$RELAX= 
##$RELAX= 
##$RELAX= 
##$RELAX= 
##$RELAX= 
$$ Bruker specific parameters
$$ --------------------------
##$DU= <F:/spectra>
##$EXPNO= 1
##$NAME= <P31>
##$PROCNO= 1
##$TYPE= <nmr>
##$USER= <she>
##$AMP= (0..31)
100 100 100 100 100 100 100 100 100 100 100 100 100 100 100 100 100 100 
100 100 100 100 100 100 100 100 100 100 100 100 100 100 
##$AQSEQ= 0
##$AQ_mod= 1
##$AUNM= <au_zg>
##$AUTOPOS= <>
##$BF1= 81.014009
##$BF2= 200.13
##$BF3= 200.13
##$BF4= 200.13
##$BF5= 200.13
##$BF6= 200.13
##$BF7= 200.13
##$BF8= 200.13
##$BYTORDA= 1
##$CFDGTYP= 0
##$CFRGTYP= 5
##$CHEMSTR= <none>
##$CNST= (0..31)
1 1 145 1 1 1 1 1 1 1 1 1 1 1 1 1 1 1 1 1 1 1 1 1 1 1 1 1 1 1 1 1 
##$CPDPRG= <waltz16>
##$CPDPRG1= <>
##$CPDPRG2= <waltz16>
##$CPDPRG3= <>
##$CPDPRG4= <mlev>
##$CPDPRG5= <mlev>
##$CPDPRG6= <mlev>
##$CPDPRG7= <mlev>
##$CPDPRG8= <mlev>
##$CPDPRGB= <>
##$CPDPRGT= <>
##$D= (0..31)
0 1 0 0 0 0 0 0 0 0 0 0.03 2e-05 3e-06 0 0 0 0 0 0 0 0 0 0 0 0 0 0 0 0 
0 0 
##$DATE= 1670925003
##$DBL= (0..7)
120 120 120 11 120 120 24 19 
##$DBP= (0..7)
150 150 150 150 150 150 150 150 
##$DBP07= 0
##$DBPNAM0= <>
$$ [...]
##$SUBNAM3= <"">
##$SUBNAM4= <"">
##$SUBNAM5= <"">
##$SUBNAM6= <"">
##$SUBNAM7= <"">
##$SUBNAM8= <"">
##$SUBNAM9= <"">
##$SW= 501.771253377433
##$SWIBOX= (0..15)
0 1 3 0 0 0 0 0 0 0 0 0 0 0 0 0 
##$SW_h= 40650.406504065
##$TD= 32768
##$TD0= 1
##$TE= 0
##$TE2= 300
##$TE3= 300
##$TEG= 300
##$TL= (0..7)
0 120 53 12 22 120 120 120 
##$TP= (0..7)
150 150 150 150 150 150 150 150 
##$TP07= 0
##$TPNAME0= <>
##$TPNAME1= <>
##$TPNAME2= <>
##$TPNAME3= <>
##$TPNAME4= <>
##$TPNAME5= <>
##$TPNAME6= <>
##$TPNAME7= <>
##$TPOAL= (0..7)
0.5 0.5 0.5 0.5 0.5 0.5 0.5 0.5 
##$TPOFFS= (0..7)
0 0 0 0 0 0 0 0 
##$TUNHIN= 0
##$TUNHOUT= 0
##$TUNXOUT= 0
##$USERA1= <user>
##$USERA2= <user>
##$USERA3= <user>
##$USERA4= <user>
##$USERA5= <user>
##$V9= 5
##$VALIST= <valist>
##$VCLIST= <CCCCCCCCCCCCCCC>
##$VD= 0
##$VDLIST= <DDDDDDDDDDDDDDD>
##$VPLIST= <PPPPPPPPPPPPPPP>
##$VTLIST= <TTTTTTTTTTTTTTT>
##$WBST= 1024
##$WBSW= 4
##$XGAIN= (0..3)
0 0 0 0 
##$XL= 0
##$YL= 0
##$YMAX_a= 2369
##$YMIN_a= -6853
##$ZGOPTNS= <>
##$ZL1= 120
##$ZL2= 120
##$ZL3= 120
##$ZL4= 120
##$ABSF1= 248.5645
##$ABSF2= -253.2056
##$ABSG= 5
##$ABSL= 3
##$ALPHA= 0
##$AQORDER= 0
##$ASSFAC= 0
##$ASSFACI= 0
##$ASSFACX= 0
##$ASSWID= 0
##$AUNMP= <proc_1d>
##$AZFE= 0.1
##$AZFW= 0.5
##$BCFW= 0
##$BC_mod= 2
##$BYTORDP= 0
##$COROFFS= 0
##$CY= -3
##$DATMOD= 1
##$DC= 0
##$DFILT= <>
##$DTYPP= 0
##$F1P= 0
##$F2P= 0
##$FCOR= 1
##$FTSIZE= 65536
##$FT_mod= 6
##$GAMMA= 0
##$GB= 0
##$INTBC= 1
##$INTSCL= 6.047779e-11
##$ISEN= 30
##$LB= 1
##$LEV0= 0
##$LPBIN= 0
##$MAXI= 10000
##$MC2= 0
##$MEAN= 0
##$ME_mod= 0
##$MI= 50
##$NCOEF= 0
##$NC_proc= -8
##$NLEV= 6
##$NOISF1= 182.463
##$NOISF2= 159.3651
##$NSP= 0
##$NTH_PI= 0
##$NZP= 0
##$OFFSET= 248.5645
##$PC= 4
##$PHC0= -10502.1
##$PHC1= -45.54432
##$PH_mod= 1
##$PKNL= yes
##$PPARMOD= 0
##$PSCAL= 0
##$PSIGN= 0
##$REVERSE= no
##$SF= 81.0140089999694
##$SI= 65536
##$SIGF1= 159.3651
##$SIGF2= -187.1042
##$SINO= 113.3802
##$SIOLD= 16384
##$SREGLST= <1H.CDCl3>
##$SSB= 0
##$STSI= 65536
##$STSR= 0
##$SW_p= 40650.406504065
##$SYMM= 0
##$S_DEV= 0
##$TDeff= 32768
##$TDoff= 0
##$TI= <>
##$TILT= no
##$TM1= 0
##$TM2= 0
##$TOPLEV= 0
##$USERP1= <user>
##$USERP2= <user>
##$USERP3= <user>
##$USERP4= <user>
##$USERP5= <user>
##$WDW= 1
##$XDIM= 65536
##$YMAX_p= 383609636
##$YMIN_p= -173474236
$$ End of Bruker specific parameters
$$ ---------------------------------
##NTUPLES= NMR SPECTRUM
##VAR_NAME=  FREQUENCY,     SPECTRUM/REAL,   SPECTRUM/IMAG
##SYMBOL=    X,             R,               I
##VAR_TYPE=  INDEPENDENT,   DEPENDENT,       DEPENDENT
##VAR_FORM=  AFFN,          ASDF,            ASDF
##VAR_DIM=   65536,         65536,           65536
##UNITS=     HZ,            ARBITRARY UNITS, ARBITRARY UNITS
##FACTOR=    0.620285442955139, 1,           1
##FIRST=     20137.2065510682, 0,            0
##LAST=      -20513.1999529968, 0,           0
##MIN=       -20513.1999529968, -173474236,  0
##MAX=       20137.2065510682, 383609636,    0
$$ Real data points
##PAGE= N=1
##DATA TABLE= (X++(R..R)), XYDATA
$$ [...]
##PAGE= N=2
##DATA TABLE= (X++(I..I)), XYDATA
14886 -5562723 -4597888 -6051215 -9509873 -6938792 2251290 7146652 2156622 -3631963
14878 -3631963 -1782573 1953024 -257764 -2770008 3774608 14237839 15110622 5385332
14870 5385332 -2489206 -1482858 2612056 2957300 -464619 -6124297 -13818521 -19801338
14862 -19801338 -17728576 -7561793 2898996 7325956 6174727 2181784 -3166408 -7766329
14854 -7766329 -9357585 -8898371 -8842464 -8383276 -5196350 -511107 2955956 5850695 8593749
14845 8593749 6111253 -5304924 -18149278 -20431888 -11136678 803369 11276327 22611953
14837 22611953 30824027 26073136 9961956 -1314948 2134246 11427614 14692087 14145047
14829 14145047 18022456 24813557 26399946 20620450 10946898 -1064190 -13852218 -21292386
14821 -21292386 -19196292 -12475278 -7880254 -4352627 1301710 5214424 3216963 1227126
14813 1227126 6626276 13389921 9647174 -1990304 -6512842 626220 7667311 6061314
14805 6061314 675767 -4306793 -14069753 -29076095 -36375411 -27211719 -12794146 -9158154
14797 -9158154 -14304519 -14694091 -8588922 -6854209 -12509616 -15560326 -10315633 -3974603
14789 -3974603 -3735192 -7086310 -9882035 -13216811 -16111257 -11499146 2455260 15353647
14781 15353647 17803782 14841599 16482339 20774636 17963390 8469380 4053431 10118047
14773 10118047 17787738 16871904 8146083 -1026205 -6051193 -5928756 -919245 6068640
14765 6068640 10506753 12273390 15729652 20647315 19656562 9944658 792573 1566562
14757 1566562 7220045 5434134 -4438793 -10148427 -4337160 6732729 14342875 17155003
14749 17155003 15710072 7017965 -7879852 -18503652 -16324700 -6848352 -1349649 -656757
14741 -656757 2347115 6779592 3282770 -9141473 -18574881 -17364745 -12681726 -12862998
14733 -12862998 -13291397 -5598554 6712694 12959425 10552952 4721306 -2689437 -12143299
14725 -12143299 -17354870 -11093955 434636 3024011 -4224007 -7243444 169071 7073327
14717 7073327 5125845 2386209 7507180 13507384 9876056 225095 -5525601 -7453247
14709 -7453247 -9741572 -6692217 8572305 26541993 30037993 18696843 8369204 6762523
14701 6762523 6156539 1071540 -3974571 -7564910 -15477621 -25941868 -26141247 -11231467
14693 -11231467 5943476 11897928 7926999 1705401 -4395361 -8800331 -6837165 -714413
14685 -714413 -1877132 -13169169 -20029411 -11294115 2306635 4723576 -48037 3566370
14677 3566370 15103544 18026237 6480208 -5571895 -5326165 3126264 9313054 11102494
14669 11102494 12126772 12601203 10139883 5899201 4149043 6358680 8496235 5182870
14661 5182870 -3031456 -7952636 -3056347 6163449 8064582 2281035 1608057 11877937
14653 11877937 20928393 16360775 4026623 -3098183 -5265444 -9879940 -12148284 -866804
14645 -866804 18336424 25228881 13726190 957428 1542461 8404236 7844644 522810
14637 522810 -3713315 -2828819 -2985300 -6769072 -10557384 -11636952 -11354910 -11898072 -13344932
14628 -13344932 -13082361 -7886223 805976 5470320 1451706 -5387723 -7697069 -9811070
14620 -9811070 -19961745 -31260251 -26801794 -6845694 6560358 321460 -10508362
14613 -10508362 -6429527 7665998 13291784 7822618 4854384 9949292 13846783 9883780
14605 9883780 3372001 1154426 2982496 5699799 7306796 5566190 121236 -3996066
14597 -3996066 -2308517 1041848 -547652 -4097737 -1413506 5959684 8107507 3419497
14589 3419497 1094235 4649904 6240953 2296478 1698732 10395581 19165009 16909888
14581 16909888 7508536 2439148 3170469 2530089 -838446 -1640117 107628 -2021797
14573 -2021797 -9080340 -14010357 -13063533 -11160404 -12367710 -12693571 -7251802 1200711
14565 1200711 6460340 7768317 8839339 10088513 7581466 95845 -7339030 -9301356
14557 -9301356 -7061872 -6802073 -11010388 -14936657 -13746776 -10395639 -11451227 -15763673
14549 -15763673 -14188538 -3360408 7197022 7649532 1817448 254208 3590491 3589342
14541 3589342 -727916 -584029 6731972 12023768 9529946 6436734 9078526 10573083
14533 10573083 3545033 -3723065 1560732 14370858 16737258 4526408 -6139881 -2751902
14525 -2751902 6848461 8039117 -766081 -9575522 -10849207 -5015162 2854640 6251610
14517 6251610 1546497 -6745114 -9778415 -6265807 -3786755 -5047648 -2192755 8728542
14509 8728542 17093168 11517508 -2731551 -11636330 -12698167 -14519498 -18714503 -16204836
14501 -16204836 -3212126 11077209 16659945 13120127 4397801 -7340466 -17417416
14494 -17417416 -16925975 -3102240 13576240 19802025 14144362 5896849 2283705 2962054
14486 2962054 5363440 8491990 10447606 7938526 1336073 -3291944 -1129198 3727941
14478 3727941 1744485 -9982573 -22745308 -25977046 -19096473 -9466879 -986804 8396675
14470 8396675 17663108 19723560 11704639 1312756 -3193310 -3827708 -6477447 -8754519
14462 -8754519 -3914627 5592005 9249121 3909467 -1715010 -718488 2632288 1642816
14454 1642816 -2024675 -2283187 1488958 4461705 3501779 -742218 -7100180 -14529031
14446 -14529031 -20005618 -19814365 -14077771 -7792608 -5611450 -6030881 -2813191 6117264
14438 6117264 13024818 8236840 -5817423 -14668687 -9625037 444082 1406966 -7030708
14430 -7030708 -12941457 -9670645 -1912980 4660156 9540829 11925491 8901802 2130882
14422 2130882 -1902447 -1436787 -1524655 -3827880 -3049011 2379132 5120057 637629 -3831482
14413 -3831482 451724 10618892 17114893 16839617 13623396 9667934 4762152 1493971
14405 1493971 3196925 7580874 9149041 7506673 7343251 10418319 13120220 12361847
14397 12361847 9245792 6261724 4517965 4165786 4607492 4139382 1644544 -1808090
14389 -1808090 -4888492 -8261893 -12866394 -17480224 -20174875 -20577189 -18748431 -13992032
14381 -13992032 -7127262 -1830279 -1228353 -4831481 -10342370 -15834473 -18660496 -16019596
14373 -16019596 -9125790 -3135678 -350547 2404088 6912063 9268694 6496253 2247416
14365 2247416 812532 452225 -1416135 -1597681 2845923 6512893 2665873 -4680751
14357 -4680751 -5451729 1270943 6986845 8467654 11454194 17523189 18884525 11998726
14349 11998726 6447907 11564462 21021236 21066952 11141508 5645208 13790431 26611028
14341 26611028 29067311 19541838 10200992 9521471 12253294 9752655 3766498 2660613
14333 2660613 6888719 7840775 2671908 375283 7123573 13782692 7627512 -8241575
14325 -8241575 -18171057 -15094896 -7164275 -2229636 2442118 9822601 12782857 3232842
14317 3232842 -13852007 -24636928 -22658216 -13627604 -5362118 -150814 2567576 2751370
14309 2751370 1323221 432367 -163938 -3072014 -7518685 -7912726 -1508937 6067119 7333077
14300 7333077 2551606 -1976306 -3482247 -4883224 -7746091 -9397893 -8514490 -7665198
14292 -7665198 -7708218 -5459506 -690482 454580 -5316481 -10816774 -7204410 3086254
14284 3086254 10223591 11336086 11934295 13879508 12032949 4711459 -1992033 -4040698
14276 -4040698 -5288939 -8756301 -9740324 -4046020 2832111 2174196 -5615692 -11741780
14268 -11741780 -10469893 -4576990 -210278 -390221 -3465901 -5713057 -5747854 -6598061 -11441213
14259 -11441213 -17845432 -19994327 -16285743 -9986929 -3064947 4082571 7282689 2114280
14251 2114280 -5603477 -3172764 10927948 22381281 20266306 11177630 6792848 7049807
14243 7049807 5390710 2521655 3485348 6528052 5996930 2677527 1541827 2629610
14235 2629610 2958775 3581150 6226579 7621397 5856663 6569070 12831008 15527272 6068302
14226 6068302 -7221922 -9507682 -1838000 1759195 -3590625 -9938988 -12898833 -15438569
14218 -15438569 -16120877 -10305241 -3436578 -5881055 -13156425 -9542650 5741109 15361900
14210 15361900 12031786 9593408 17374371 23298530 15044411 626121 -7015951 -11266332
14202 -11266332 -21228114 -31660921 -31091862 -22092355 -16922818 -18067922 -17676114 -12479804
14194 -12479804 -6399221 -1714386 1151141 -839342 -7475029 -10037301 -2651996 6942186
14186 6942186 9370731 9257318 14927103 19426165 9679744 -8696089 -15256529 -4910222
14178 -4910222 4093443 -2405603 -15018321 -16926221 -7226137 1194191 -706711 -10382240
14170 -10382240 -18350349 -15408305 -272687 16071657 18994923 6854690 -6052776
14163 -6052776 -6410984 3325536 10344783 6749801 -4531060 -15529573 -21017768 -21759983
14155 -21759983 -21686080 -21728365 -18617692 -11938594 -8015012 -11164692 -15049180 -10780899 -1018415
14146 -1018415 3321668 -1167113 -8227131 -14657758 -22874509 -29387136 -24390004 -7997668
14138 -7997668 5438762 6447457 3029933 5860806 11205537 9166844 655861 -5920253
14130 -5920253 -9119906 -13140511 -15778987 -10765427 -1180531 2060316 -3140828 -6206049
14122 -6206049 -425274 6530975 4697423 -2910930 -4712380 3508688 14403692 19953971
14114 19953971 20153280 18897306 15933768 7731126 -4353864 -11885205 -8580552 869815
14106 869815 5597127 1259621 -6638663 -11603437 -12195987 -8167599 1915837 14759553
14098 14759553 20373553 12700736 -1459183 -10406692 -11422082 -10302350 -9932802 -7340114
14090 -7340114 -1478125 3970118 7007405 10125633 14517571 16505604 12174532 2384831
14082 2384831 -7817266 -12130132 -6590773 5088714 11218473 3920634 -8905980 -11270515
14074 -11270515 -95389 10295280 8284996 298060 -905138 4525693 6058176 463778
14066 463778 -4090901 -1871815 1985262 145680 -6172382 -9180483 -3814351 7843348
14058 7843348 18954439 22624980 16572159 5578709 -1806640 -802570 5675300 11025911
14050 11025911 11786520 9820483 8895333 10325510 11917061 10633230 5924296 163260
14042 163260 -3902664 -5281780 -4510712 -2788011 -1686372 -2110828 -2863693 -1777100 1228364
14033 1228364 4140885 6282840 8943739 11824977 12664669 12259886 15194977 21674438
14025 21674438 23169099 12779399 -2306325 -6521482 4826924 18593253 19232690 6709213
14017 6709213 -4964506 -4608728 4894480 12242695 11223533 5863241 2599144 1497334
14009 1497334 -775836 -1841604 4918358 18246743 26440597 21843761 11021177 4013786
14001 4013786 386860 -5010365 -8756508 -3848139 5325134 7028932 1170713 161355
13993 161355 8456619 15303113 12636435 6567401 4093070 1444725 -5014767 -8296630
13985 -8296630 -2993169 1862479 -4393720 -15567487 -16994646 -7672707 -33239 -478328
13977 -478328 -4060942 -7581646 -14113884 -22777565 -26116805 -20957644 -12550166 -5667847
13969 -5667847 -254990 2898554 1895647 902778 7054348 17001050 17391008 4217514
13961 4217514 -8229321 -5392246 8083215 15415286 9312797 -1823226 -6864119 -3687707
13953 -3687707 1978474 4281387 2590260 1109354 3505015 8158821 10449758 8924588
13945 8924588 5743651 1604680 -4822111 -11978096 -15479188 -14536452 -12909685 -11760197
13937 -11760197 -7466781 965520 8623441 12484385 16244764 22179271 23826275 14054933
13929 14054933 -2589878 -13114178 -11468079 -4925265 -4107934 -11066328 -19271633 -22643025
13921 -22643025 -21557865 -19835731 -18167537 -13554631 -5713017 -317612 -2562763 -9758342
13913 -9758342 -14306510 -12492099 -6325440 1261265 7753997 9361366 4537830 -1373976
13905 -1373976 -1672442 1811171 1477717 -3542924 -6046698 -2916604 441732 293615 84789
13896 84789 2021128 1984495 -2356933 -6655958 -8298209 -11331945 -17082157 -18684755 -12754714
13887 -12754714 -8279476 -14218953 -24700011 -27158715 -20757169 -15863230 -17498682 -19364983
13879 -19364983 -13982168 -1005472 14061359 23420368 21341933 11098869 4465765 7683730
13871 7683730 11984548 5944510 -7572920 -17004191 -20119227 -23319667 -25125370 -16039716
13863 -16039716 2622801 14834775 11122262 1244966 -2228101 -1890222 -7086596 -16482231
13855 -16482231 -20758034 -17046320 -9319550 1181076 13598445 18595449 6681938 -13162018
13847 -13162018 -18157795 -1108606 18043045 19312707 9316937 7025808 12229575 7752096
13839 7752096 -8928488 -17646133 -5518682 13134880 18039510 9809269 1970512 -1891245
13831 -1891245 -6535488 -9320221 -4519808 1537112 -1676443 -8608149 -4550462 8086456
13823 8086456 11343141 1326687 -6006927 -3616182 -4159166 -12510590 -11753217 7716748
13815 7716748 26620403 24481685 11373914 9397574 16635678 14927206 4081927 1558948
13807 1558948 11603906 19377969 15801032 6835141 -2144522 -10845275 -13017403 -2155231
13799 -2155231 10735532 7142828 -8671410 -12793116 53137 6581310 -7003507 -22233407
13791 -22233407 -19252590 -8130936 -8560219 -15549827 -9914358 7061794 14486990 4701721
13783 4701721 -6765692 -6503203 -750501 -2107855 -11475994 -19698620 -19312993 -9985202
13775 -9985202 2277177 8678876 5411842 -439692 2055078 12979580 19445979 11479327
13767 11479327 -4421263 -12621331 -7378832 1159817 1353467 -4801776 -6077708 1239907
13759 1239907 8941963 10284894 8991933 10134619 10568535 6689840 4451090 10322615
13751 10322615 17210062 12818610 -76552 -6300747 -1912182 28724 -8650516 -18277581
13743 -18277581 -17836883 -11976134 -11383034 -15035880 -13068425 -2886350 6630775 5838252
13735 5838252 -5278063 -15913678 -13174848 3298265 16302007 8838560 -13323195
13728 -13323195 -27600212 -23932029 -14708007 -12330107 -12986952 -10415669 -9575786 -14202530
13720 -14202530 -14459863 -2363157 10830062 9108869 -3781865 -10870018 -7712377 -4631678
13712 -4631678 -6005214 -4653093 2082814 6050817 1960379 -4325781 -5339864 -1378732
13704 -1378732 2343965 1030023 -7869783 -20990849 -27492767 -19156132 -2257818 8268365
13696 8268365 6552914 164545 -2733313 -2089718 -1150387 -1084262 -2278182 -4686846 -5650494
13687 -5650494 -2465022 3003562 6917161 8670581 8190538 1934258 -10708454 -20924212
13679 -20924212 -20122159 -13149310 -11122616 -13613645 -10622185 -1213637 4317366 2734948
13671 2734948 3542310 11554477 17603795 14037249 7618497 7979050 12782917 13916586
13663 13916586 10739338 7535752 4058243 -1588896 -5449438 -2851053 2349429 3031686
13655 3031686 852338 3483297 10979324 14765599 11229293 6930938 6987723 6569403 -254317
13646 -254317 -9273586 -11556335 -7441693 -6686456 -13720277 -20694208 -19621262 -14995170
13638 -14995170 -16513812 -22582016 -21173342 -8255051 4663434 6529033 2156681 3689640
13630 3689640 11858574 15117495 6046493 -9401389 -19633380 -18688341 -9467286 -546606
13622 -546606 18763 -8256435 -17436056 -20042540 -16896991 -13097841 -9993141 -6387269
13614 -6387269 -4154368 -5804614 -8658750 -8084730 -4514976 -836779 4140604 11729006
13606 11729006 15944216 9804115 -2535380 -10156574 -11082600 -12752373 -17126840 -17897058
13598 -17897058 -14284733 -14021464 -17914201 -14960530 -896137 10191099 3835509 -13299450
13590 -13299450 -21551709 -13181171 1615940 10837495 12294640 9121090 2881542 -5630736
13582 -5630736 -13672572 -17680274 -15787842 -9053435 -1463650 2223149 317644 -4687976
13574 -4687976 -9302135 -11544666 -9867052 -2627494 9176378 20230349 24025259 18007643
13566 18007643 6101944 -3632097 -5833390 -3579836 -4522516 -9741447 -11243040 -4055296
13558 -4055296 5148652 7708244 5569493 5902195 8093684 6338523 1695748 544898
13550 544898 3544142 7256175 13575327 24473476 30584913 21259952 4826449 513592
13542 513592 8988074 11042837 -399004 -8990668 -3817288 2900713 -228268 -3480025
13534 -3480025 3084224 7572346 -3523794 -18276521 -16293279 -1809023 4886817 1549489
13526 1549489 3541363 12473114 11601116 -4881750 -21153796 -24006459 -18249463 -11785480
13518 -11785480 -3486011 6248760 9051978 2171141 -4482429 -3859062 -3045838 -10122667
13510 -10122667 -19758469 -21472393 -14808288 -7587890 -4670412 -5704883 -9231224 -12650654
13502 -12650654 -11987192 -6758253 -1830484 -1107039 -3149259 -5341796 -7648552 -9938406
13494 -9938406 -10545178 -9670440 -9420764 -9103890 -5901267 -1075061 888452 205967 1614048
13485 1614048 5301942 6562565 6198275 11158782 20850881 23350133 12239046 -1677702
13477 -1677702 -4415512 1824310 3089768 -6043580 -16182169 -16859759 -9255482 -3385716
13469 -3385716 -6441126 -15437925 -20395851 -14921152 -3325876 4595069 4949053 2349992
13461 2349992 2002057 4450307 8387273 12376805 12014434 1653861 -17550926 -35730383
13453 -35730383 -43356027 -38876197 -26237076 -9810122 5984078 16453071 18930413
13446 18930413 13634457 3208193 -5464509 -2935618 11675681 24017482 19105017 1540219
13438 1540219 -10140634 -9018387 -6141625 -9642855 -13336914 -11964571 -12155029 -18651221
13430 -18651221 -23255139 -18901027 -12763901 -12814505 -12465091 -3116593 7546988 6407269
13422 6407269 -2445650 -3047451 7894555 18038900 19445484 16198955 12165295 5868180
13414 5868180 -843582 -2165827 1250964 2419444 -52151 -996560 -291929 -3694019
13406 -3694019 -10829326 -14291667 -12470078 -11261054 -11234468 -6284040 2084563 3491401
13398 3491401 -3208630 -5057496 4170802 12037185 6464193 -5335623 -9068430 -4855258
13390 -4855258 -3140782 -6011573 -6635827 -3810251 -3821281 -8288041 -11023421 -7890455 -1439907
13381 -1439907 4900649 10241640 13515617 13479834 11612153 10109810 8039208 4244139
13373 4244139 1719344 3136650 4600294 1115145 -3747440 -2024061 5650041 10230144
13365 10230144 8004134 4863929 4763557 3407735 -2154419 -6150824 -2733644 4302842
13357 4302842 7360651 5872808 4359248 3662351 1999961 2106731 8281456 16345477
13349 16345477 15470855 2683779 -11871151 -18103308 -17924959 -18701715 -20585220 -18355741
13341 -18355741 -12841123 -11079288 -14277134 -14159502 -5082064 6700846 11028605 6587840
13333 6587840 133023 -3723246 -5689936 -6462981 -4666774 -405071 4259078 8804293
13325 8804293 13557025 15462765 10375009 1022756 -3255210 2064464 10326743 12518191
13317 12518191 8224245 3132150 -938518 -7308865 -16540022 -23061812 -21578499 -13644581
13309 -13644581 -5772222 -2458438 -2828215 -3763388 -4353231 -5403748 -5285695 -225951 8955061
13300 8955061 14453691 10993507 4723322 5110317 9444144 5556099 -8316978 -17988084
13292 -17988084 -13597843 -4462487 -3935638 -8848394 -7484216 -1556679 -3363903 -12338477
13284 -12338477 -12330183 3123187 18563412 18248070 7526772 1833105 3908642 4481215
13276 4481215 -513429 -6403722 -10535646 -14135640 -14071273 -4767295 9813267 17133994
13268 17133994 13096006 8531545 12847543 19384995 15559891 2659136 -4389181 3155625
13260 3155625 16418210 20310522 11088092 -1900577 -9248771 -10548170 -9448940 -5185783
13252 -5185783 5212112 17648735 21262943 11576266 -1758511 -5835666 -55006 5204805
13244 5204805 3289183 -2561328 -7136670 -9316314 -8626825 -3480883 3787095 6782520
13236 6782520 3925754 1414940 3261616 5037863 2869914 1562870 6091210 10988594
13228 10988594 7677128 -1758194 -8196177 -9878854 -12113255 -14247446 -9638679 19477
13220 19477 3144800 -4385478 -11560354 -8504078 -1060128 -1121246 -9394459 -16077339 -13965782
13211 -13965782 -3757946 9616548 19513896 20234935 13049581 5955457 2994486 -467350
13203 -467350 -6785926 -8752961 -1921359 4090187 -942760 -9214769 -4835723 10594883
13195 10594883 19118710 13738785 7099134 8201195 8012205 -1644020 -9713344 -1232003
13187 -1232003 18061063 28315484 23050273 15366029 16549037 21472008 19303977 9386806
13179 9386806 483732 -1030672 2743484 5324711 3359610 202238 1869929 8720375
13171 8720375 13254809 8942091 -740412 -6165132 -3444327 2133837 4516804 3750883
13163 3750883 2867405 2295541 576228 -1679206 -1654851 2529876 10353746 19700658 27331204
13154 27331204 29370010 23927613 13892138 5068118 174512 -3597869 -9021998 -12749587
13146 -12749587 -8986796 868135 7654910 6080171 2089361 4311241 12157456 18086705
13138 18086705 18618278 16415056 13673009 11159920 12391856 19533160 24816208 16360816
13130 16360816 -4476714 -21335340 -22973380 -15844428 -10875963 -7629990 -615336 6808862
13122 6808862 6594047 19898 -3489416 -145402 4729362 6119458 4055114 -479206
13114 -479206 -6830078 -11985395 -12986060 -11481566 -10411307 -8212773 -2567593 2799676
13106 2799676 2364279 -2712389 -7809353 -12974258 -18799222 -18451841 -6074336 9147294
13098 9147294 11232785 -27113 -8694494 -6232291 -550629 1370429 3460450 7043535
13090 7043535 3902466 -7468384 -13648740 -6255982 3273109 2310924 -2290593 1735994
13082 1735994 8652482 4906595 -5017929 -4625041 6018263 9805592 1440278 -4968387
13074 -4968387 -1765425 -274542 -8532251 -15175332 -8539598 2696846 3060235 -5485456
13066 -5485456 -8107908 72283 9798396 13150949 10938356 6198037 792856 -2456979
13058 -2456979 -3101146 -6829825 -17200450 -26084702 -22566106 -9644468 -724908 -60543
13050 -60543 627705 4960578 5886293 1563551 2300385 12258857 17333290 4715203 -14958394
13041 -14958394 -20794015 -11254498 -3433068 -4794353 -4366307 4493851 10817586 4886583
13033 4886583 -4136742 -2398422 6861302 10219103 6613203 7361872 15269676 18978715
13025 18978715 11295519 666728 -1486006 4158694 8763000 7536253 1522506 -7542696
13017 -7542696 -17175029 -22103736 -19001725 -12234146 -9735273 -13442300 -17645657 -16372388
13009 -16372388 -9013671 829488 8546366 10476307 6043010 -900699 -4934321 -4427289
13001 -4427289 -2869566 -4093633 -7193794 -7490690 -2628833 3562856 4862893 77825
12993 77825 -5714778 -8243549 -9221780 -11783698 -13933749 -11370686 -5006863 216853 3453287
12984 3453287 8147877 13183405 11402349 694712 -9786799 -9938584 -994643 7858335
12976 7858335 11708090 12791703 13261442 11635985 7068962 2313710 462164 1118731
12968 1118731 1488972 479886 346308 3164487 6179131 4162399 -1541814 -1406899 8834374
12959 8834374 17920599 12558744 -1271918 -4597215 5262605 8351696 -7060430 -23515851
12951 -23515851 -18533923 2620288 16250817 14236439 8482629 4910115 -4779060 -21826393
12943 -21826393 -30909105 -21201569 -2991466 6489386 3817878 -2438432 -5563097 -4326874
12935 -4326874 307542 4393276 2207663 -5772973 -11400269 -10014908 -6626260 -6253147
12927 -6253147 -5700109 -936333 4822696 7181613 7515376 6854551 769247 -10923021
12919 -10923021 -16986360 -8051834 8643445 18610043 18935610 16315160 11857616 2327662
12911 2327662 -6592778 -4825566 3387883 1528040 -14127543 -26583001 -22540874 -11283028
12903 -11283028 -9065195 -15570880 -18494907 -14540320 -12270674 -16625957 -22913087 -26840297
12895 -26840297 -30252361 -34018161 -32943899 -21968762 -3269203 15298740 25714436
12888 25714436 23333580 10184614 -3151053 -4312639 7842068 20316893 20432176 10570045
12880 10570045 3403622 4443866 6543660 2929338 -1859840 570774 8751593 12513821
12872 12513821 7054653 -1010277 -3320125 150238 3961685 5850624 7731443 9899359
12864 9899359 8869489 1636000 -10263941 -21537054 -27125127 -25818407 -20492011 -14047762
12856 -14047762 -5648160 6322792 17658789 19806930 10968409 1114902 591471 6612338
12848 6612338 7536147 -572801 -8875783 -8604083 -2367296 1069577 -1367196 -5387687
12840 -5387687 -7312297 -8620225 -11812313 -14941671 -12627236 -2515445 10323541 16706344
12832 16706344 11758278 -388387 -10605383 -12484377 -5871609 4709687 12920142 13804715
12824 13804715 7481288 -692407 -5955531 -9313363 -14480521 -21251620 -25657865 -25762305
12816 -25762305 -22838374 -17008278 -6905635 5064311 12142413 10633643 4315286 -1218064
12808 -1218064 -5379544 -10724449 -16950199 -20486787 -19128445 -14315350 -8972615 -4596308
12800 -4596308 -457707 4468054 8383382 7170530 710052 -3183615 3427622 16715987
12792 16715987 23377238 17053248 6333594 2790561 7074168 12003997 13738509 12701910
12784 12701910 7603930 -2807332 -13576552 -17285762 -14034634 -10630378 -9599022 -6240068
12776 -6240068 2295512 12231821 19589111 24536819 26438646 21280590 8529064 -4580669
12768 -4580669 -10310271 -8346644 -3162926 1922819 4125149 -210377 -10633911 -19820033
12760 -19820033 -21430646 -17689323 -13730746 -8446108 1391347 10671608 9342546 -2961638
12752 -2961638 -14383609 -15801899 -11246927 -9612182 -12076998 -13114226 -10358091 -7895930
12744 -7895930 -10212106 -15845242 -17574958 -9407065 4949147 12504455 4828076 -9402394
12736 -9402394 -12975906 -2590139 6086461 240868 -12457677 -16702554 -12589974 -13190440
12728 -13190440 -21891700 -26216710 -17160915 -2879602 3349864 430678 -2860199 -1629931
12720 -1629931 1975261 6009647 10516328 12679557 8181333 -551757 -3738700 4163752
12712 4163752 15965003 19281426 11226203 1567780 757180 7995398 13371742 10318688
12704 10318688 2846731 -340697 3620874 9638600 12187971 11822870 12949903 17133421
12696 17133421 20900633 20093518 14773911 8863047 5350918 3056431 -1040765 -6968840
12688 -6968840 -11043719 -10402060 -6548989 -3381350 -3181023 -5602548 -8662754 -9186521 -4741686
12679 -4741686 2271945 4924050 -213428 -7466792 -9040469 -5668472 -4243020 -5789827
12671 -5789827 -3668390 4570291 11498115 10159280 3368797 -2712786 -8089719 -14787966
12663 -14787966 -18227421 -12254652 -939805 4530022 1957928 2140708 12907433 26306083
12655 26306083 27831191 14831728 -113495 -3392451 5993188 17010208 18317861 9100736
12647 9100736 -517659 279725 12112621 25215718 29524232 23073208 10795901 -1334574
12639 -1334574 -9040259 -9840943 -4501234 1964924 3801277 -61764 -5401165 -7618893
12631 -7618893 -5811672 -1847003 2625430 6851875 9710795 9828487 7687628 6529699
12623 6529699 9655893 16466940 21992670 21008487 12504246 269986 -9857795 -13123463
12615 -13123463 -8411733 -19267 4098278 -799412 -10051910 -12985239 -4700306 7330750
12607 7330750 11451004 5787573 235383 3626579 12961433 18526777 16599426 11806174
12599 11806174 7844580 2553202 -5288092 -10154710 -6210821 3649044 11071184 12939290
12591 12939290 12778920 12307038 8768178 2054011 -2684694 -2981877 -3356087 -6930503 -8433482
12582 -8433482 -2157546 7258755 10100131 5841643 3654507 8118745 12771355 10932878
12574 10932878 5637989 3388690 3315841 -258119 -6710245 -8271209 -1678403 5366891
12566 5366891 3233021 -7440362 -16886477 -18173282 -13549686 -8592144 -4713546 -176609
12558 -176609 4766285 7825426 8463843 8022873 6626005 3481852 66907 -473916 2876558
12549 2876558 8943104 17094635 25591930 28480038 21003173 8672063 3054376 6249930
12541 6249930 8153213 3106620 -725226 3961670 9395283 4811652 -4561062 -5187203
12533 -5187203 1927643 2519861 -6440431 -10639053 -1931171 7873945 6069791 -1282968
12525 -1282968 -1191752 4571494 4280421 -2882463 -6288997 -2944433 -2292505 -9364075 -16264303
12516 -16264303 -16287784 -15716609 -22854330 -32554352 -32041217 -19395466 -6521968 -2976884
12508 -2976884 -4980287 -3859010 805174 2273871 -1899325 -5992337 -4655079 -450205
12500 -450205 298380 -3476087 -6730071 -5958022 -3765506 -4381503 -7576676 -9808215 -9860968
12491 -9860968 -9821603 -10271451 -8307774 -2805934 1212210 -1936705 -9356841 -11498458 -5523830
12482 -5523830 -1076872 -7450982 -19337437 -23252613 -16253529 -8652824 -7119388 -5821934
12474 -5821934 752507 6430074 3570289 -3064357 -3576355 1026391 2179598 228481
12466 228481 3878304 12837560 15235060 6650013 -1215934 1893408 9558447 10323502
12458 10323502 5394835 3150115 2496341 -4566423 -15870711 -18389233 -7296251 5335374
12450 5335374 6026584 -3934821 -13431992 -16025997 -12656818 -4821169 6097900 14068548
12442 14068548 11944775 2073311 -3774894 676626 7085080 4223322 -5656052 -10486560
12434 -10486560 -6479604 -2573125 -5122032 -8274016 -5031114 712081 1325674 -1617418
12426 -1617418 -1080383 2794783 3986635 2488234 4346221 9795877 11648890 7430626
12418 7430626 3721905 5059037 6550807 1765898 -8040022 -16026955 -16408198 -7657534
12410 -7657534 5288684 11727839 5384124 -5541289 -6881017 2349753 9365351 7342354
12402 7342354 3296331 2700152 196559 -7124897 -10512933 -3834496 4265147 4019049
12394 4019049 457538 3129366 8745985 8088858 3313062 3712724 9187082 12202920
12386 12202920 12133703 13348329 12680561 3913437 -7796059 -11517541 -8882039 -10566978
12378 -10566978 -15328282 -10733631 3046781 8969136 -1209905 -13599266 -12859940 -2295646
12370 -2295646 5573827 6400660 2971791 -2556452 -6549166 -3462999 4475897 6559961
12362 6559961 14876 -3451873 3853144 11850387 8586103 -332657 -1567446 4657022
12354 4657022 7732617 5991368 7925663 15999714 22680905 22933094 19690481 16224284
12346 16224284 12380188 8942964 7642951 6714489 3518212 528608 1590843 4136676
12338 4136676 2836225 -1396869 -4508292 -8426582 -16898088 -24671144 -22918244 -14850678
12330 -14850678 -13025002 -19724489 -23192468 -16697528 -8157150 -5299796 -4012256 492340
12322 492340 2218975 -5370708 -15819176 -17359251 -8943319 1031809 7562665 11185678
12314 11185678 10933294 4825568 -4331498 -11599762 -16263680 -18308459 -12525633 3874139
12306 3874139 20413703 22175704 10142442 1312610 5985037 15721805 17972810 12171540
12298 12171540 5093455 -488595 -4503049 -4405255 -294662 480525 -6668774 -13347055
12290 -13347055 -8380216 4394008 9938371 3628891 -2426424 2312802 12599472 17217607
12282 17217607 14808875 12165745 11794283 9549473 3255672 -3086673 -4564869 -852069
12274 -852069 4294260 6708786 5053477 2141049 2443261 6750996 10299117 7806413
12266 7806413 -523124 -9213575 -12497664 -8252585 958373 9259116 11723226 8828663
12258 8828663 5265830 3957567 4041050 5100259 8656599 13208950 12897558 5460823 -2435709
12249 -2435709 -3158959 1221482 1846396 -4618879 -11813713 -11660024 -2438278 11017872
12241 11017872 21875217 26014109 24249643 19453831 11773745 827748 -6952428 -1441828
12233 -1441828 15555321 26149595 17256088 -263498 -4748521 7739665 20989850
12226 20989850 23240043 19541277 17124236 13133161 4231802 -2934704 -720405 6546738
12218 6546738 7265338 -3003950 -17544881 -26179293 -23563049 -13459733 -6806603 -10542196
12210 -10542196 -17255624 -13351610 910745 9769229 4624166 -3273310 -1096713 5257584
12202 5257584 1259767 -13043176 -23481551 -22243982 -15427593 -11006351 -10217154 -11265618
12194 -11265618 -12115708 -8911902 -98070 7474334 5067489 -4465259 -8281929 -458031
12186 -458031 10747815 15162537 12814934 10144390 10226853 11165429 10385734 7104509 2729301
12177 2729301 5285 -722195 -3859622 -13054533 -23946165 -27822390 -22660768 -14742218
12169 -14742218 -8889517 -4033545 -218535 -2149881 -10806310 -17232077 -11308128 5265988
12161 5265988 19725839 21672038 12870066 3852650 2632497 7324802 10106844 8053899
12153 8053899 6993982 12225401 19101520 18382068 9039489 -820881 -5169098 -5029794
12145 -5029794 -2054405 4447453 11531725 12004060 4670401 -1443250 1222659 8250020
12137 8250020 10340317 6204232 1783738 307120 276179 1131299 3783985 6244814 5051951
12128 5051951 1073292 -1546051 -2144441 -3825517 -6851226 -7596755 -5222378 -3582833
12120 -3582833 -4260342 -3306580 1310863 3801152 -2263764 -13184107 -17707711 -10952443
12112 -10952443 -894027 1434879 -4836454 -10261180 -7013562 2334415 8641918 6198236
12104 6198236 -2952793 -12869164 -18824297 -18781614 -13315533 -6105990 -2329735 -3685741
12096 -3685741 -5756565 -3021002 3568287 6827740 2092905 -6704325 -11440433 -8619753
12088 -8619753 -1934306 2484476 862356 -7154044 -18662664 -27717683 -28034013 -17787825
12080 -17787825 -1592722 12596028 18189303 13158523 1714875 -7095612 -6195313 2404992
12072 2404992 9865224 10836198 7960623 5015270 1150161 -4386099 -7235045 -3626153
12064 -3626153 2652857 5329786 4613961 4517359 4643509 2770497 2657517 9274967 17670914
12055 17670914 17759238 10582879 8102021 14866181 22098846 23484074 23997941 27475738
12047 27475738 28336091 23454702 19871772 21208857 18618403 6903447 -2113542 3188623
12039 3188623 13765656 13630631 6204477 7452375 16777742 15968368 -1049209 -16589752
12031 -16589752 -13618440 2461087 13276812 8582335 -7127631 -20788129 -20580692 -7132698
12023 -7132698 4454955 1645409 -8769842 -11612891 -7038073 -7541403 -13150293 -9537240
12015 -9537240 5795891 15911949 10859445 2819251 4285385 8764677 6572278 3848395
12007 3848395 9363321 15037961 7837053 -7332670 -14140219 -8681898 -731902 4599326
11999 4599326 10748849 17521206 19620025 16869531 13576011 8436605 -3122897 -16820971
11991 -16820971 -21111794 -12084252 2203099 12675087 16741637 15610316 11904527 9367715
11983 9367715 8682175 5791043 -180445 -2760176 623783 423806 -11175578 -24966805
11975 -24966805 -26852322 -19923982 -18805421 -25492439 -28384026 -24557906 -24096019 -29204717
11967 -29204717 -27547325 -13308064 1028843 2847060 -3564066 -7004141 -5060411 -991216
11959 -991216 4584827 9549362 7297635 -2290651 -7232858 1008326 13606061 16575042
11951 16575042 10642975 7441541 10236701 10714651 4003064 -3780005 -4521546 2606693
11943 2606693 11962377 16237734 10810068 -1257173 -8967577 -3675634 10192904 19632104
11935 19632104 18434540 12915260 11175585 11975648 8089422 -1831594 -9570259 -7069840
11927 -7069840 2761554 8624391 4319910 -4573020 -9756718 -11119941 -13412029 -16101947
11919 -16101947 -14616023 -10136700 -9051460 -11833293 -11605971 -6220010 -2498945 -4156233
11911 -4156233 -4477961 2427343 10630474 10638285 3248495 -2948247 -3875992 -1653074 2967204
11902 2967204 11017548 19016750 20457094 14945043 9764717 10437610 14205952 14947167
11894 14947167 11450815 8523875 10910481 17516642 22386675 21699280 17957735 14752255
11886 14752255 9797629 -966466 -12991381 -14997961 -4116046 8291482 10576934
11879 10576934 4033755 -3224460 -8905952 -15366916 -20573873 -18997239 -9927975 1453912
11871 1453912 9486651 9685365 -683876 -16673533 -24446294 -15183222 1700575 8306658
11863 8306658 423332 -9055042 -8872595 -1991441 2662142 2312199 174247 -736595 27800
11854 27800 314733 -3402503 -10268280 -11299104 1234921 20429550 30092302 26060630
11846 26060630 22054683 28806304 37383585 32617311 15811039 2429145 686052 4385414
11838 4385414 6622138 8578131 11426237 10163988 2321884 -4543641 -2196973 5887859
11830 5887859 9877606 8709815 10481694 17605854 21408966 15136980 3788836 -4884812
11822 -4884812 -11573704 -19020587 -20525154 -7183811 14475307 24876084 15256667 -930579
11814 -930579 -6216334 -498864 3109351 -2205375 -10183548 -11704767 -4648432 5759624
11806 5759624 11624437 8254768 -1200649 -8413186 -9277007 -7445874 -6511233 -4240106
11798 -4240106 1324937 6059954 5881592 3003372 -545480 -9173791 -24337325 -34742203
11790 -34742203 -28136404 -10232653 735174 -2019593 -7627902 -6281610 -1266763 1287860
11782 1287860 2607817 5278374 6963010 6640392 8646450 13847296 14723710 6788769
11774 6788769 -2092858 -2317628 2996493 3304136 -3228245 -8304140 -7054012 -4382407
11766 -4382407 -6431823 -11930043 -14492544 -10377017 -2511459 1801552 -2517939 -12796994
11758 -12796994 -20713769 -20751855 -14549162 -6271901 2495610 10912971 15700810 13808288
11750 13808288 6629834 -1455509 -7701811 -12176940 -15505746 -16951689 -14316713 -6482077
11742 -6482077 2333007 3636086 -5092206 -13557069 -9732827 2800520 7981405 -787958
11734 -787958 -12318162 -15170095 -12478748 -12357195 -13811475 -11911112 -8801613 -8583353
11726 -8583353 -7428875 -124408 8488034 10084563 6444012 4325710 1207832 -9215010
11718 -9215010 -19846150 -15813508 720654 8516720 -3714263 -21238519 -25136298 -17264503
11710 -17264503 -12016849 -13337126 -13625566 -9827002 -6924244 -6968445 -6337040 -4736254 -7291498
11701 -7291498 -15352606 -22768206 -24331916 -22152865 -20362870 -18094841 -11794475 -2012516
11693 -2012516 6044878 8490926 6960408 6356902 9379869 13748930 14613622 9468246
11685 9468246 852218 -5286582 -4022496 4247998 12801712 13313080 3856884 -8182414
11677 -8182414 -13260189 -9544292 -3674740 -2052154 -3951768 -3695880 2568408 13060211
11669 13060211 22009111 24944640 23228847 22459978 25460663 29136450 30156135 30143721
11661 30143721 31207954 30006794 22705966 13604124 11047486 15149654 17470744 13559008
11653 13559008 7744644 4151068 1656046 93916 1984111 4380206 -725448 -12020326
11645 -12020326 -15371715 -3160343 12521157 16668131 12711431 13806526 19680075 18595741
11637 18595741 9686384 5690051 11213306 14591402 7433831 -1538429 -816877 6224606
11629 6224606 7619086 -353062 -11487584 -19670474 -22695143 -20116123 -14298494 -10391038
11621 -10391038 -9726102 -7354076 -1488998 337353 -7721332 -17641377 -16174616 -3340284
11613 -3340284 7542266 7836483 2238073 -1477205 -2339201 -3124804 -5094228 -9386659
11605 -9386659 -17358140 -25671377 -26536553 -17219814 -5101041 849059 32675 -2252197
11597 -2252197 -3703159 -6499966 -11735991 -16891216 -18645069 -15593719 -8825953 -1630965
11589 -1630965 2636241 4057822 5893168 9397544 11315458 8480178 2227146 -4156182
11581 -4156182 -9413211 -12794376 -11961035 -6757471 -2174762 -2084301 -2168598 4098734 13056085
11572 13056085 12590296 -1003838 -14984002 -14487270 -688770 11456584 11577612 3581969
11564 3581969 -3245334 -6257486 -8672730 -11008803 -9831345 -5270076 -3669518 -8974605
11556 -8974605 -15480271 -14691758 -7255993 -1335343 202481 2397751 6217062 4391133
11548 4391133 -4301067 -6522277 8193024 27728087 29726244 12288091 -2613262 1012422
11540 1012422 14268265 20333780 17067626 13016054 11353125 9862252 10126930 14241246
11532 14241246 16105996 7901984 -6349100 -14600544 -13791315 -12695916 -16903674 -20937643
11524 -20937643 -18213693 -10585018 -3980787 -351404 2514266 6930615 12910491 17061700
11516 17061700 14814437 7688066 5358023 13614878 23202240 20377146 7239295 -251138
11508 -251138 4398003 9847773 6023924 -1299878 -2206801 2455424 6921001 11294470
11500 11294470 15911645 13502349 -590603 -16390207 -20382218 -14797425 -13128174 -18975060
11492 -18975060 -22712021 -18894131 -13704627 -12904862 -14442722 -16752664 -23225254 -32833053
11484 -32833053 -35916105 -26674759 -13083763 -6822780 -7741682 -5530481 5224182 17723358
11476 17723358 20963765 11916975 -980790 -6368533 -2656189 -142819 -7039095 -16115446
11468 -16115446 -12622368 4521768 18420032 14707202 -1417314 -14317396 -17425359
11461 -17425359 -15715526 -13007750 -6873656 2819252 8295690 1766677 -13636392 -24886312
11453 -24886312 -21930196 -8298719 2512608 1421016 -7080359 -11124683 -4610931 8198880
11445 8198880 18769787 20909058 12968380 -1155373 -12975119 -15994249 -11993311 -7243446
11437 -7243446 -3450440 2579357 11256538 18380924 20875815 18530323 11236604 1626068
11429 1626068 -1758543 5888179 14171633 8704277 -5857295 -10032950 -230720 3752461
11421 3752461 -9244462 -22142105 -17247975 -5257565 -5535942 -12078408 -5497075 9963699
11413 9963699 11104186 -4425767 -13193060 -5381695 177392 -9008001 -16161949 -3965123
11405 -3965123 15876410 21569543 12679377 2302859 -7566403 -20437458 -26568650 -14689791
11397 -14689791 3824638 7145028 -3457280 -6927062 695154 -516974 -17886429 -28986952
11389 -28986952 -15112312 8840921 16278592 5988808 -2672554 -1984019 -1661654 -5863043
11381 -5863043 -5589637 2539109 7474401 1551042 -5749913 -2047545 8161534 9323896
11373 9323896 -2706583 -14453750 -12395537 767663 11206556 11079723 5763512 4740892
11365 4740892 9375514 12121069 6748385 -3457722 -9313430 -6546291 -688226 -202505
11357 -202505 -6133686 -10660240 -6366645 4476755 11417356 6777396 -5922193 -15605576
11349 -15605576 -15740376 -11327154 -12079554 -19205263 -22501614 -13172734 3243010 12172780
11341 12172780 8302118 2069156 4495371 11809642 12401217 5215555 1092112 5259797
11333 5259797 8968820 3509704 -5853194 -7839686 -1810873 2482209 -328900 -5405814
11325 -5405814 -7009826 -5948603 -5455889 -5657030 -5456052 -5922696 -8713090 -13756504 -20565256
11316 -20565256 -29047963 -36841638 -38543786 -30666668 -16408182 -3519407 2168414 478995
11308 478995 -4477423 -8275677 -9379831 -8860230 -7078159 -2502236 4471499 9033567
11300 9033567 7419634 3615451 5305756 12786537 17595877 14073943 6751959 2911543
11292 2911543 2746640 1634807 -1475500 -3415322 -2493284 320666 4810491 11257050
11284 11257050 17150640 18660564 15576227 10892874 5619651 -1364336 -7693965 -7354007
11276 -7354007 688355 7830799 4615449 -7361267 -16779446 -16023773 -9457481 -6650744
11268 -6650744 -10287146 -14106508 -12190208 -6704444 -4504663 -7907489 -11736088 -9858860
11260 -9858860 -2615161 3675511 4047503 423295 -1179826 917739 360668 -9426756
11252 -9426756 -24063291 -30121380 -21465165 -8797002 -6667529 -14361911 -18411834 -12948619
11244 -12948619 -6502925 -5866691 -5125597 1668624 7300910 2761553 -4982368 -1100102
11236 -1100102 13477624 21728155 15793106 7747751 9017787 12500702 5749606 -8005849
11228 -8005849 -15515114 -14797996 -16205401 -22770425 -23632755 -11556578 4076523 9280084
11220 9280084 3335613 -3379652 -4769995 -3405418 -1477333 3206137 10260974 13554380
11212 13554380 9534029 3416061 1528033 1208339 -4807336 -15541693 -21225248 -16986594
11204 -16986594 -9588803 -6560440 -5223609 946442 9761868 12710987 8328736 4399272
11196 4399272 5758803 8051064 6708315 4947733 7897726 14041813 17852724 17097591
11188 17097591 12640977 4936641 -3531516 -5856411 2035655 13338848 16648646 9884705
11180 9884705 1327430 -2897680 -4432996 -4253345 2584208 18124500 33208931 35261140
11172 35261140 22917349 7771605 1721267 5906974 11942347 11154973 1993925 -9944643
11164 -9944643 -17813934 -18635289 -12814698 -1726775 10808720 17001875 11378052 -640225
11156 -640225 -6531873 -1372863 6803786 8994767 6201875 4118819 3419905 1959278
11148 1959278 1290837 2924801 2066724 -5772242 -14434319 -13425396 -3833658 2604794
11140 2604794 1439858 1382277 8462408 15110455 12287847 4391475 2969159 10060997
11132 10060997 16398916 14337079 5549423 -3556376 -8629777 -9567184 -9509843 -11125324
11124 -11125324 -12017361 -6873279 3044566 7432725 -233749 -11261214 -11139917 652316
11116 652316 8446517 -152903 -18954334 -30614942 -25543746 -10407325 195923 -1484180
11108 -1484180 -9349844 -11194292 -3577216 3863650 1309166 -7903278 -12140362 -6964195
11100 -6964195 1445593 7574696 12829266 18307748 19297107 12291441 2449757 -1780364
11092 -1780364 1089770 5462797 6768801 4947051 957287 -4951769 -10434153 -10712240
11084 -10712240 -4007419 4472742 7075493 2282405 -3870726 -5900633 -5339142 -6219000
11076 -6219000 -7183233 -4144233 -21384 -3576196 -15387573 -23005937 -16807511 -4795903
11068 -4795903 -2948548 -14088547 -25405681 -25785856 -16947448 -7232701 -2491181 -4361373
11060 -4361373 -10486629 -14880361 -13887717 -12038464 -15835769 -22758255 -24580977 -21026825
11052 -21026825 -20088305 -23645842 -23600021 -15549622 -6101274 -2325926 -3437850 -6993188
11044 -6993188 -12987484 -16940372 -10437017 4362101 11939692 3882111 -8224035 -9802301
11036 -9802301 -2611976 3932620 9725620 17930337 21306557 11785969 -1982981 -4287407
11028 -4287407 3550934 6261753 359547 -1785384 4683792 8276286 1451875 -6481582
11020 -6481582 -5072877 1708643 4635806 3463061 2995239 3501901 3879813 7326863 15091726
11011 15091726 19884612 13861544 -149363 -11960303 -15669223 -12784867 -7138573 -2169627
11003 -2169627 -713969 -2332943 -2237095 3322461 11728695 16660674 14713068 7573559
10995 7573559 -622006 -6373503 -8494658 -7876534 -5573245 -2284970 67104 -115087
10987 -115087 326419 6087195 12394124 6138257 -14054665 -28213428 -18466328 4921406
10979 4921406 17078839 13332883 11138456 18517047 22703951 14766357 4155179 99365
10971 99365 -2055167 -5346437 -1041651 12601927 19438527 9882355 162952 7807195
10963 7807195 21742107 19321458 3111175 -3918098 5076804 13561861 10529818 3931323
10955 3931323 2005954 1220667 -1605748 -1943302 1417316 1795083 -3546394 -9134646 -12449348
10946 -12449348 -16614636 -18961465 -11433040 2891595 8739094 974422 -6580769 -3356604
10938 -3356604 1252724 -4828954 -14669728 -12743681 776277 11142683 10626717 5554814
10930 5554814 3156670 3288485 3971438 5312458 5872346 2666870 -2983729 -5490797 -3040993
10921 -3040993 -930104 -4619398 -12773551 -19059541 -18444680 -10285820 2603458 15674954
10913 15674954 23913397 23638472 15303262 5019316 940805 5430650 11822832 12028140
10905 12028140 6732167 4216751 8855481 15212113 15436347 9028620 2633622 2157649
10897 2157649 7163146 11780296 9968262 1241950 -7974580 -10041874 -3725491 4991445
10889 4991445 9493557 8167126 3689537 -838928 -3976496 -5316375 -4008617 1017170
10881 1017170 8271557 12596400 10420472 5833461 6358743 11756984 13393548 7177227
10873 7177227 -314957 -2855064 -3313479 -4799561 -2068032 8181217 16390331 12683301
10865 12683301 4650484 7381435 18818678 22028051 12481018 5449915 11617660 21638175
10857 21638175 22934171 17945300 15253841 13146206 3742230 -12452510 -25866238 -28623770
10849 -28623770 -20094863 -5543563 6576353 10702825 10614726 14208571 20463201 20340476
10841 20340476 12925139 9145401 14064580 17495251 10621581 855167 -675033 2838721
10833 2838721 746795 -7041778 -11851661 -11593988 -11747222 -13391248 -11892255 -6833971
10825 -6833971 -3299450 -3265134 -4065544 -5184284 -8874595 -13898263 -15228987 -10328845 -1142738
10816 -1142738 8825498 15258656 13857592 5667015 -1288137 -837654 3781291 5560045
10808 5560045 2684755 -2625165 -8593569 -11698898 -6552299 5212479 12725388 10206243
10800 10206243 5914232 7822859 9346809 1812488 -7098871 -3453886 9604886 16275117
10792 16275117 13470806 13041551 17843150 15276986 372629 -12541891 -10685056 -943385
10784 -943385 3881937 5135402 11560492 20478383 19962268 7448770 -5642894 -9047450
10776 -9047450 -5159020 -3002845 -6257691 -10716543 -11243067 -7828801 -4136825 -2242985
10768 -2242985 -1449030 -1407091 -2129128 -378510 7871709 18417611 19179564 5706360 -9397619
10759 -9397619 -10519676 1449895 11926636 11702415 4349774 -2990523 -6705816 -5481674
10751 -5481674 -770319 1728717 -1489656 -5141537 -2499833 3340514 4573624 2217785
10743 2217785 3795602 9413357 11861469 9657303 7746214 5621236 -1837955 -10814257
10735 -10814257 -10246288 -36864 6580610 3285334 -732712 1667836 3416798 -2943614
10727 -2943614 -11677615 -14347132 -13913940 -17431206 -22246501 -20649503 -13566256 -9579916
10719 -9579916 -12479625 -17315932 -17714574 -12165642 -4210265 812541 665680 -1698180
10711 -1698180 -3386280 -6474050 -12131956 -13440032 -3492075 11502412 18629016 16856573
10703 16856573 16440188 19964425 19020749 11665511 6647661 5747602 -832482 -14075468
10695 -14075468 -18419422 -5390487 9996683 9419720 -4080617 -14477672 -15819125 -14239509
10687 -14239509 -14700001 -16925987 -18599302 -14983094 -2881158 9711140 8830207 -4903672
10679 -4903672 -14310630 -10666054 -4727899 -4798453 -2956615 4822801 5255472 -8841879
10671 -8841879 -20985841 -16725243 -8897970 -14558903 -23482069 -15860939 2337430 9760560
10663 9760560 4665226 1195049 223022 -6203504 -9405573 4631146 23859413 23930697
10655 23930697 10494711 11756876 28377876 29770645 7066064 -9618546 -527490
10648 -527490 13692599 10296503 333977 3479652 14458512 19066769 20769994 26762558
10640 26762558 27480137 14913999 4027166 10782078 23798143 23160061 14139417 15686257
10632 15686257 26012656 27409311 18687533 15285806 19784993 18625759 9080926 5234073
10624 5234073 12974635 20190017 18008828 13985644 16882535 22729346 23443186 18412785
10616 18412785 11535937 5424555 2534635 4182833 6108390 2821360 -2791295 -3071637
10608 -3071637 877432 -13411 -6591746 -7653290 3059164 16296192 20343017 16573242
10600 16573242 14583784 17957918 23104910 28381239 35222053 40518699 36485315 21781235
10592 21781235 6866599 2311989 4918178 3174031 -3952126 -3902432 9103515 21049896
10584 21049896 16353880 2092220 -783001 11852301 21735384 15726487 2626641 -4085591
10576 -4085591 -5425041 -8452552 -10729276 -6319681 217709 -1129857 -10359016 -17612384
10568 -17612384 -16921220 -11622232 -7536762 -6922985 -7796295 -5599222 1516279 7241107
10560 7241107 2890686 -8996131 -14742358 -6884807 7021135 16750541 20481773 18757359
10552 18757359 9403862 -3886601 -9534371 -3916659 1616509 -842112 -2145562 7383793
10544 7383793 19511085 20644741 13403130 10328510 13489477 15489520 14596950 13991693
10536 13991693 11301114 3514059 -2204371 3415458 16807248 27114373 31425694 32200876
10528 32200876 26561082 12647226 421139 801803 8940302 12513815 10845643 11372050
10520 11372050 13932306 14113637 15264330 21166561 24460549 19138583 15456265 23567372
10512 23567372 32254886 25768510 12409697 11823981 21873657 24661259 19008383 18886956
10504 18886956 24370259 23050198 16879053 18664299 25319148 23656684 17589508 19181003
10496 19181003 21673997 16594770 24188329 61569806 96193694 92058728 89867664 156399370
10488 156399370 245439698 211882323 13333043 -194136327 -239206708 -145122339 -66163493
10481 -66163493 -68242212 -82580843 -55058804 -24030396 -30761425 -48615552 -41524427
10474 -41524427 -24304150 -22876309 -25785898 -14878286 -4272490 -12315390 -26167549
10467 -26167549 -26311312 -19777288 -20886686 -23234956 -17060513 -12279067 -19317123 -27152130
10459 -27152130 -23595560 -17977096 -21196232 -22681204 -10836254 1729012 -1636461 -11923613
10451 -11923613 -10329864 -612356 149792 -7266667 -7987530 -941898 1388296 -3156672
10443 -3156672 -5252030 -4464309 -10210122 -22796776 -31269110 -30271381 -24103631 -15302970
10435 -15302970 -3777987 4283629 1338769 -8275272 -13243674 -12290442 -13425171 -17780752
10427 -17780752 -17929917 -12068944 -6721467 -4751331 -2975679 -2357212 -8281729 -19141494
10419 -19141494 -26384648 -28304364 -32820502 -43465343 -52702601 -53091825 -46511245 -38431580
10411 -38431580 -30688471 -23950253 -20605464 -20594426 -19073043 -12111702 -1859562 5872705
10403 5872705 6695551 312709 -8480712 -12180545 -8162757 -2935013 -3964360 -8601280
10395 -8601280 -7585101 606713 6331437 1872424 -8396010 -14530097 -12971898 -7818737
10387 -7818737 -3516230 -1352606 -2337553 -8501924 -18875914 -26889541 -26028185 -18312453
10379 -18312453 -12705751 -12850635 -11485346 -2232720 7944332 6995998 -3723985 -10112475
10371 -10112475 -5384733 1816431 2786051 811143 1762038 3084066 353068 -3827219
10363 -3827219 -6068490 -9352774 -14973590 -15679079 -7717783 -1925288 -9448177 -21936972
10355 -21936972 -20761921 -3608417 12444375 14137911 4923398 -6130697 -14680276 -17051754
10347 -17051754 -8422748 8516339 21395714 20582867 8983545 -3030626 -7280874 -1575933
10339 -1575933 9526153 16467010 13343074 5313060 1307773 767728 -3911406 -13000144
10331 -13000144 -18382150 -17470154 -16397393 -17087694 -13724548 -6380039 -5015691 -12768662
10323 -12768662 -17784809 -11638899 -4766787 -10646501 -22803068 -22658783 -6609456 9515234
10315 9515234 13119445 8748966 6470106 7728140 8444139 8134082 9111221 10990699 11876480
10306 11876480 12698360 15434791 17971971 15095395 5502502 -4792463 -7707057 -1190465
10298 -1190465 8510788 12309990 5923293 -6771735 -16788138 -17075222 -8506465 639428
10290 639428 2610644 -2160795 -7092182 -8692306 -9814398 -12551669 -13250685 -8821199
10282 -8821199 -3669568 -4068256 -7827936 -6228267 4136785 17096687 24272019 21610720
10274 21610720 9776009 -5400210 -13496860 -8564593 1258814 1378782 -9625730 -16639325
10266 -16639325 -8729416 5097084 8038161 -2543042 -13666754 -14170370 -5590348 3655877
10258 3655877 8089647 7809779 5726854 4129353 2522930 -1358618 -7819105 -13842549
10250 -13842549 -16368723 -15072873 -11113376 -5689394 -744674 2148503 4867695 10919327
10242 10919327 18781728 21327624 14707460 4163550 -1922774 -631222 4958034 9927570
10234 9927570 10291741 6522938 6371101 17498952 33805743 37368880 20829566 327941
10226 327941 -3299989 9431326 20267065 18757722 11294831 5433307 -1096869 -11659586
10218 -11659586 -21640532 -24384459 -19979939 -13618514 -9874733 -10966087 -15302657 -16204462
10210 -16204462 -8630370 1272188 1556461 -7760621 -11895316 -1792726 11884056 13445726
10202 13445726 2991997 -7579402 -13135188 -17515647 -20296588 -14939790 -1633942 9680753
10194 9680753 13021312 13705583 17305494 19785163 15295582 7386391 4394104 6832526
10186 6832526 6877953 -309072 -10714685 -17363588 -17569663 -13408499 -8468918 -5516720
10178 -5516720 -5140391 -5424479 -4141375 -1902763 -2171129 -7499173 -16046116 -22181173 -21109225
10169 -21109225 -13654891 -6110669 -4251190 -7951749 -12976103 -16570722 -18255794 -16441617
10161 -16441617 -9532026 -1081636 1969753 -1246795 -3402790 -27724 3010035 -1276540
10153 -1276540 -9204714 -11311903 -5984562 -176941 1949909 2837866 4152333 3971897
10145 3971897 2842829 4987299 10843268 14856892 13421774 9133958 4617005 -1723664
10137 -1723664 -10480639 -17397590 -18455964 -14334847 -7252279 1494754 8607863 9790701
10129 9790701 6829948 6933240 11155863 10821704 656900 -11786741 -16237688 -12495843
10121 -12495843 -6150420 1461696 10262056 14535861 9449881 688045 -2236760 706190
10113 706190 2633499 1985468 1858581 395207 -6314664 -13461224 -12024294 -3769984 619910
10104 619910 -1219534 -1204319 2487708 1142714 -7652479 -13563174 -11346706 -11306872 -21189341
10095 -21189341 -29417796 -20522753 12623 11345659 5030367 -6435670 -9200515 -4061368
10087 -4061368 501620 1608428 2234579 3532728 3062682 -677132 -6058628 -11164943
10079 -11164943 -16589338 -23813705 -31240552 -34061702 -29772021 -22277944 -17684456 -16633330
10071 -16633330 -14000282 -6185900 4320732 11744867 11854602 5025139 -2224359 -788129
10063 -788129 10679041 20682926 17206089 4432842 -1534780 5091910 11785091 6385523
10055 6385523 -5442466 -8969169 -222499 11351046 16356345 13629616 6698674 -756117
10047 -756117 -5627190 -6567365 -5251054 -3891318 -2301434 179071 1458944 -1436616
10039 -1436616 -7934391 -13799155 -15374233 -12891852 -9901338 -9282870 -9195812 -4922445 3237957
10030 3237957 7601696 3586803 -1296524 2822624 11842788 12008492 955041 -7895799
10022 -7895799 -5750801 -980508 -4148200 -11214839 -11323412 -3514906 4475976 8550898
10014 8550898 9654956 7114508 113702 -6741904 -7661989 -3720246 -136116 1651149
10006 1651149 2648441 641651 -6313043 -13195258 -12763110 -5937482 -687438 -1310218 -4551772
9997 -4551772 -5460143 -2170016 3769480 7573047 3881802 -6637171 -15938023 -17474781
9989 -17474781 -13002747 -7382184 -1932218 2707268 3281910 -582851 -3107733 -403876
9981 -403876 3977570 6821894 10705799 14866117 10210187 -6142894 -19800201 -15516610
9973 -15516610 1066429 10984022 6711752 -3355214 -10985894 -15136669 -15573363 -12442460
9965 -12442460 -10375783 -11834119 -10290749 -1926482 2435353 -7020018 -17764214 -9614783
9957 -9614783 12135888 21087500 8399218 -6548076 -9063234 -8386886 -14092367 -16430269
9949 -16430269 -5815375 6528856 5415103 -4341562 -8415435 -6496736 -7507022 -10059837
9941 -10059837 -6574452 -1542994 -6636863 -19035509 -22550077 -12446142 -3254071 -6708325
9933 -6708325 -15123380 -14574630 -5122020 1658060 293275 -3184123 -3036719 -2563476 -7037697
9924 -7037697 -13111748 -12141631 -3284890 3845066 2015305 -4670982 -9138862 -12271519
9916 -12271519 -18300859 -24296485 -23561938 -17141601 -12723832 -12940008 -13211665 -10641385 -6938755
9907 -6938755 -3332731 -711238 -3317282 -13119757 -21872762 -18975090 -6782699 1925391
9899 1925391 1216833 -3362062 -6369965 -7861757 -8187322 -8185447 -12598211 -22107154 -26017318
9890 -26017318 -16308060 -3505572 -2094219 -6677475 -3292550 2537298 -4507768 -16964325
9882 -16964325 -13724706 41249 -771101 -13406691 -10264972 2913843 -12712225 -47707074
9874 -47707074 -25163339 87990077 201032578 199225624 95061597 7288212 1237984
9867 1237984 25997987 16884537 -15107097 -26477040 -14615113 -5110678 -3258777 659743
9859 659743 1390286 -10485137 -23524170 -20631804 -7399196 -1102192 -2787903 -2359820
9851 -2359820 -749868 -5500402 -12780628 -13520299 -10282269 -10554751 -10920369 -4957169 1003783
9842 1003783 -2247713 -8241257 -4370357 5857743 8820132 4569330 5002658 10163016
9834 10163016 6507206 -8935015 -20758920 -16894711 -3828199 5727634 8615954 8674161
9826 8674161 8140739 8074910 10477178 14731941 17049913 16880107 18608704 23630880 25869225
9817 25869225 19469429 8035014 2411880 9451199 23652112 30075400 18104806 -5457736
9809 -5457736 -20298504 -13892331 3812748 12504925 6053280 -2447164 -263637 8437586
9801 8437586 9717501 -1548101 -15915698 -21438287 -17334389 -13456060 -17080640 -23308122
9793 -23308122 -21424737 -9534591 2069082 3762197 -1870222 -5009511 -1527655 4029376
9785 4029376 6421614 5137536 1703397 -3410310 -8921657 -10814880 -5713989 3764230
9777 3764230 9311411 4578416 -7614854 -17659217 -19271647 -14877198 -10120533 -7130446
9769 -7130446 -6112734 -8784185 -14508573 -16821517 -11174995 -3405143 -1938463 -3704196
9761 -3704196 1634860 13801106 20323687 15006971 5765487 118532 -4364264 -9162814
9753 -9162814 -7969949 -338237 484448 -13409890 -27387803 -21314354 2187080 21393819
9745 21393819 23476023 14370991 3743669 -4303939 -6042025 762418 8403453 5912918
9737 5912918 -3082247 -3084742 8858446 16034207 6112098 -10978474 -18143243 -12774966
9729 -12774966 -3443118 4737443 9779862 6559655 -5396848 -13398070 -5119099 11976472
9721 11976472 18585391 10095686 798520 -76186 -1075675 -10472704 -18975926 -12456167
9713 -12456167 5534089 16673687 11143147 -2387138 -10072620 -7458141 707735 7591323
9705 7591323 8049185 710702 -10148140 -17755975 -19504455 -17620013 -13557057 -7122767
9697 -7122767 -1618425 -2357914 -7062375 -5464002 6308463 18325510 20821407 18214098
9689 18214098 19424504 20669363 11390066 -5653300 -15682676 -14506152 -14082747 -20396092
9681 -20396092 -21347019 -6924171 11094423 13368915 -680369 -14607227 -18377678 -16317065
9673 -16317065 -13897370 -10713276 -7773311 -8997436 -11923208 -7876387 3784191 11252050
9665 11252050 6308217 -3247568 -4546589 3075865 9823885 10341259 8237280 7156127
9657 7156127 5399528 753397 -5084087 -9017973 -9930514 -8263093 -5390704 -4402808 -8058499
9648 -8058499 -14185727 -16165910 -10530390 -1794895 3226865 4215472 6645891 12718123
9640 12718123 17469523 15985589 11140253 10227106 14688835 17256748 11207164 227324
9632 227324 -4319869 3182552 14393237 15378264 3022068 -10938427 -14516794 -9817345
9624 -9817345 -7454964 -9996917 -10098583 -5608093 -5436924 -14380764 -21589796 -14384800 2215152
9615 2215152 11438573 7544821 577384 -1404002 -2198382 -6524280 -10764229 -10343486 -7274761
9606 -7274761 -4275166 596431 6924829 7408034 -1325901 -9393154 -4553994 10805488
9598 10805488 22129956 20504540 10701845 2361162 -254677 654075 896515 -771575
9590 -771575 -493471 5737326 13790704 13615336 3436217 -4892417 -1339315 7413980 7450955
9581 7450955 -2119567 -8705852 -4503712 4969607 11150746 11936016 8965983 3613247
9573 3613247 -1195305 -1550011 1925373 4008542 2361508 171625 -419512 -2128230 -7002039
9564 -7002039 -11681526 -11756783 -8155720 -6239252 -9620321 -16108861 -19179053 -14019162 -3169070
9555 -3169070 5611497 8383312 8438357 8387292 4603848 -4756837 -11801892 -7898955 2627971
9546 2627971 7740009 4960203 2640132 4144893 2895375 -3846816 -7936654 -3304023
9538 -3304023 2989633 144689 -11453122 -20869458 -18537749 -3925477 14372116 23732450
9530 23732450 18168792 6118601 1382171 5066105 5551319 -1243302 -3838404 5785451
9522 5785451 17215082 16513811 6440269 -1119338 -5015051 -11686518 -17144605 -9901811
9514 -9901811 7880212 19103375 15638777 8555897 8222407 8341260 -282080 -11600513
9506 -11600513 -13039183 -5430756 -584090 -1976921 -1269364 5460851 10547289 7692739
9498 7692739 1718655 -630909 -1131771 -3556268 -3638472 4026012 12760060 9606626 -4977339
9489 -4977339 -14896990 -10111696 -139417 1187613 -4588261 -6326408 -2365536 -1156275
9481 -1156275 -5306387 -8215959 -7641640 -9775703 -15779611 -16215484 -5877292 5808066
9473 5808066 8025763 4257249 4582325 8333808 6065527 -4086038 -13448607 -15745055
9465 -15745055 -12651076 -6023132 4785828 15472952 17227844 9816808 5297142 11506965
9457 11506965 18869203 12776142 -4860277 -16547477 -11705164 671599 4870426 -2716080
9449 -2716080 -12558633 -15452407 -10593760 -1387755 9908243 20473149 24636413 18762977
9441 18762977 7261181 -1342412 -4868108 -9099527 -16970127 -21509909 -14802929 -961739
9433 -961739 6630242 1396593 -8941239 -13184257 -10227089 -7811812 -10389176 -13256056
9425 -13256056 -9575749 -71615 6837519 4506800 -4016375 -9283767 -6618546 -1425396
9417 -1425396 -1290635 -5194937 -5239164 1036187 5920456 2365652 -5124857 -6308736 50228
9408 50228 4124551 -1159404 -10596490 -14741731 -12561875 -10192547 -9751020 -6813641 293808
9399 293808 5947876 5749403 3886913 6053131 8970082 5173764 -2683186 -2018256 11442179
9390 11442179 24119454 21160844 7269883 572460 7078586 13236738 7668602 -1319449
9382 -1319449 492146 10117668 12100284 4136609 2039388 14297673 26208566 20770543
9374 20770543 5527185 2974363 17526045 28533329 19497945 127488 -8645284 -1519233
9366 -1519233 9486085 14200199 14130158 14405501 15109015 12913253 6577199 -925754 -3905813
9357 -3905813 1451331 11822022 18205077 15521135 8407469 4540790 5479485 7943626
9349 7943626 10277430 12141038 10922924 4822457 -2458804 -5992084 -6430302 -6619884 -4570091
9340 -4570091 2431227 9349977 8614198 2844416 2199287 8450580 12298134 8774185 4589898
9331 4589898 5866614 8491345 6747914 3342862 4058947 8689657 13388605 16577885
9323 16577885 17230118 12838923 4223053 -3083483 -6599962 -9609056 -11891246 -6377076
9315 -6377076 8293780 20654899 20960193 15421705 15700578 20750948 20760498 14022351 7226442
9306 7226442 2484049 -2711977 -4827596 2141995 12482429 12749432 2407768 -3645659
9298 -3645659 2252109 9084366 5687685 -1664769 -590388 7606227 11369470 7054860
9290 7054860 2269623 2756286 5459415 5132608 887090 -4703456 -7888094 -4772852 5225944
9281 5225944 16202733 19886915 13996547 3888137 -4319278 -9374709 -13092078 -15889155
9273 -15889155 -16204004 -13417144 -9566016 -7343674 -6725584 -4984596 -1147195 1018727
9265 1018727 -2795585 -10547479 -14654906 -11071676 -4634949 -3138818 -8250981 -14959010
9257 -14959010 -18417914 -17954652 -14640862 -8851736 -2432922 -780974 -8543929 -22364775
9249 -22364775 -31389389 -28172862 -17366023 -9730550 -8556842 -7369492 -1685897 3786576
9241 3786576 3494661 478173 1111639 4522739 4722068 962294 -1979021 -2964975 -5528451
9232 -5528451 -9006678 -7344307 354421 6116215 4764812 2601970 7984767 17776510
9224 17776510 20530396 11682606 -587652 -5115980 610988 9208277 11312138 4460828
9216 4460828 -4588238 -6924576 -1509943 3840893 2714020 -1911421 -3264326 -1654975
9208 -1654975 -3929656 -11546830 -15232482 -6354503 8938733 13743861 1099677 -14622240
9200 -14622240 -13540847 4095367 16404322 6903398 -14664790 -25286035 -17036451 -3065039
9192 -3065039 2835901 2047205 3887285 11096779 17985457 18453733 11219305 -239464
9184 -239464 -9629033 -11836154 -7402166 -1463804 2603414 6074234 11167738 17855900
9176 17855900 24798282 29688489 28471801 18974742 6115292 -1618982 -2155991 -1154896
9168 -1154896 -2372253 -3141243 -1482551 -534726 -2075193 -2245884 1326607 3840020 152944
9159 152944 -7401257 -13128692 -15352591 -14774798 -10571800 -3978104 -926138 -4316744 -7575238
9150 -7575238 -3018971 6475995 11395618 8802973 4385897 2724526 2412753 547378
9142 547378 -3463498 -8254770 -10662452 -7387381 -478783 2110116 -3572449 -10844761
9134 -10844761 -11589283 -7689128 -5831220 -5430951 -1530514 3361328 1862784 -4409181
9126 -4409181 -5382207 1204374 5384215 906648 -4511204 -1151765 8040473 11956320
9118 11956320 6018538 -3969415 -10506734 -12232407 -13652991 -19276548 -27799119 -32639096
9110 -32639096 -29867029 -23526130 -19469063 -16368293 -8420560 4603256 16304981 21651800
9102 21651800 19748454 10507402 -3164596 -10963355 -3341588 14051237 23533682 16111676
9094 16111676 871324 -8826780 -9484744 -4405465 3749465 11558881 13864122 10161628
9086 10161628 5713926 2152997 -5068170 -15016127 -16716248 -4468189 10121149 11423727
9078 11423727 215441 -8780452 -6783227 579561 3667272 144852 -5042962 -6726287
9070 -6726287 -5486657 -6968937 -13602545 -18928801 -15904947 -8898846 -7643622 -9619437
9062 -9619437 -2133877 14577189 22211063 11040299 -3379504 -2919798 6670416 7615356
9054 7615356 -2075949 -10222773 -12154205 -12122883 -8341195 3707164 15220024 11089046
9046 11089046 -5975173 -16331221 -10873647 -848166 2793291 2989113 4642130 4978905
9038 4978905 2447378 1653753 3149285 977751 -3950957 -1347726 10991932 20228289
9030 20228289 16587690 6453267 -158844 -3237750 -5856588 -5484985 -1259183 727805
9022 727805 -2098922 -3631398 -1908609 -4421409 -11851328 -11230224 2494888 12790837
9014 12790837 5232519 -8156131 -6994193 5407540 9055247 -559229 -9297556 -10238329
9006 -10238329 -10860993 -13975310 -12112739 -4465466 -1181522 -5625186 -8096738 -2566187
8998 -2566187 4513998 7085176 7482149 6677543 468888 -8880235 -11131375 -4975000 -2578294
8989 -2578294 -9171289 -12115904 -969946 14330778 18380170 13082859 11105514 14111270
8981 14111270 12854044 4913060 -2447443 -6119856 -10718387 -17217771 -19245204 -13402738
8973 -13402738 -4591352 1911499 6904914 13058333 19593602 23703907 23631863 19005739
8965 19005739 11176942 3753948 303635 1913768 8679982 20556975 33207221 37163207
8957 37163207 27676264 13020332 5717127 6844320 7065921 2815475 1743182 9201074
8949 9201074 18186829 18444269 9591792 -639964 -6750631 -8106365 -4676580 3232820
8941 3232820 11958314 16363081 14748693 8864930 731803 -6868984 -9229985 -4596380
8933 -4596380 1160206 1043011 -2452563 -721275 6147665 7288842 -1861943 -9817973
8925 -9817973 -4985452 5852992 7046321 -1474201 -3551296 7990131 19922360 18775925
8917 18775925 9923507 6386727 8388735 7312963 3878520 6848727 14818751 14792986
8909 14792986 2436519 -9636776 -10210795 -5018044 -5545520 -11142754 -12583694 -7700540
8901 -7700540 -2416194 1203481 7125255 15169321 18074656 11618523 926207 -6556752
8893 -6556752 -9275072 -9625591 -8385642 -5253409 -2196441 -2014949 -4406519 -6567570 -7443457
8884 -7443457 -8733658 -11240518 -12563008 -10205662 -6087218 -5530861 -10565416 -15796015
8876 -15796015 -13463721 -2618996 9284911 14845723 14247791 12637442 12462827 11555226
8868 11555226 7691050 1707238 -3997517 -7363782 -6879451 -2677447 1907842 2741461
8860 2741461 185567 -834495 1779793 2810826 -3262742 -12285734 -13118142 -1777691
8852 -1777691 12121442 16588738 11076613 4262144 1122464 -641340 -1782139 2519517
8844 2519517 14273700 26355595 29466907 21706099 7607327 -7720104 -19054602 -20984750
8836 -20984750 -14042885 -7109444 -6800226 -8153185 -3533871 3585013 4252091 390980
8828 390980 2312786 9737964 9662381 -2873082 -15357666 -15678522 -7410106 378716 6611084
8819 6611084 11579284 8333748 -5988665 -18744513 -16332036 -4520453 116250 -5627255
8811 -5627255 -11332687 -13159556 -16509584 -19029109 -10404070 6315367 11504243 -3906627
8803 -3906627 -23044380 -25882894 -15352995 -8445302 -10930058 -14723278 -14340408 -12197414
8795 -12197414 -10095829 -7386350 -6817804 -12007456 -19049936 -19393560 -11305233 -906745
8787 -906745 7578675 14439673 17852435 14150158 6345893 3355700 7423686 10244174
8779 10244174 5828539 50026 1771544 10006214 16210859 15832060 11725128 8423324
8771 8423324 8258173 11381204 14603922 11700517 353357 -11750250 -13629586 -4831881
8763 -4831881 2999389 748956 -7183227 -10612435 -7709250 -4695295 -3558755 1161034
8755 1161034 11244140 18932906 18220095 15334933 18902746 24085402 18864625 5496118
8747 5496118 707751 9249814 12492934 -4702141 -28299138 -33844943 -23195732 -20595761
8739 -20595761 -33020463 -38658181 -22758120 -2671889 -1653815 -14559209 -19345877 -11418932
8731 -11418932 -4354322 -2249782 4899437 17483425 20518026 8192499 -4598013 -4573661
8723 -4573661 1793211 3176907 2323196 6825543 12283895 9868872 3193875 2368918 5937607
8714 5937607 3738140 -4782782 -10010530 -9488542 -10979117 -15977640 -14335860 -742778
8706 -742778 15081451 21530361 19332626 15704464 12293288 6882636 943840 -3032070
8698 -3032070 -7738184 -16464973 -24956708 -25935815 -20635757 -17668442 -19409884 -17292992
8690 -17292992 -4550853 12019052 19052695 13160644 4278740 1911984 4035181 3437091
8682 3437091 426411 2224979 10810201 19083319 21219284 19860570 19058272 16548928
8674 16548928 9204590 1289950 -121956 4622599 8795367 8799942 7025136 7455159 13557620
8665 13557620 26694267 40492959 42185196 28283125 13499509 12871172 20184939 18528579
8657 18528579 8219288 5633005 14384339 19074482 13271510 12013270 25011169 36905048
8649 36905048 30318112 12887145 2799589 75513 -6750397 -14503123 -9572390 5111525
8641 5111525 10575394 1237574 -6768666 -1750088 7159865 7123098 -299627 -7157243 -12719155
8632 -12719155 -19155791 -22780368 -18993995 -9792437 458752 10564827 18328760 18188547
8624 18188547 9454435 119425 -3959828 -6700116 -11834530 -13398299 -5770874 3439542
8616 3439542 2414432 -6698686 -10963729 -6659433 -3417167 -7045502 -10898114 -8975990
8608 -8975990 -6152296 -7803288 -8906673 -3764755 489647 -7035680 -21588351 -26457995
8600 -26457995 -17090270 -7564822 -8164252 -10158034 -2407182 8700945 9920133 3795486
8592 3795486 3738796 9807103 7801416 -5828265 -16452425 -14713607 -10445979 -13308090
8584 -13308090 -15090281 -5361335 7639715 8824833 830693 -1432135 3606581 2923293
8576 2923293 -7051592 -13782097 -10196334 -6392542 -12064692 -20334591 -18891657 -8130857
8568 -8130857 1789083 6171564 8859453 13191736 17600459 19276588 16955057 10571213
8560 10571213 1693296 -6263671 -10492234 -10619906 -7100359 83459 9536819 17176803
8552 17176803 18717140 12949754 2526306 -7236748 -10802726 -5912234 4566616 14642433
8544 14642433 18595375 13378127 1332403 -8847346 -8986179 -1691909 1682298 -3541434
8536 -3541434 -8826293 -6225457 -613104 24821 -1235397 2677659 7199378 1548551
8528 1548551 -12187240 -19437105 -13671937 -3982446 163732 206568 1322473 4432878
8520 4432878 9160042 15638932 20036915 16869676 8594345 4259464 6186722 7042072
8512 7042072 2378870 -3700641 -7724938 -10847779 -10693397 -1355418 13463267 19411226
8504 19411226 10477892 -1871807 -5782698 -4179849 -4326645 -3507682 3142315 9114713
8496 9114713 4188123 -8844728 -16981681 -14414614 -7348963 -2754393 -859453 1170020
8488 1170020 4520917 8239461 9817058 6932075 504897 -6097022 -11441278 -15576090
8480 -15576090 -15658597 -9118587 -1696588 -3025171 -11737414 -15168318 -7934401 95338
8472 95338 188718 -2257536 640429 5197103 4193334 464208 1150478 4636380 4124752
8463 4124752 -378483 -3384733 -3260240 -1874698 697512 3416922 1394996 -6372466
8455 -6372466 -11925821 -8994622 -2779174 -854688 -1091075 1797191 4380509 408530
8447 408530 -6571889 -7922735 -3587303 -517145 -694876 -655126 140752 -209675 -347689
8438 -347689 1040267 172240 -5322089 -9901555 -8760464 -6826552 -9337093 -10264270 -2003134
8429 -2003134 9147651 10081052 -417184 -11742105 -16196505 -12708258 -1422399 12985049
8421 12985049 17953339 6456182 -10313687 -15886942 -8934879 950946 9623881 16117938
8413 16117938 13742944 1751603 -3239327 10837380 26229734 17446016 -7195007 -15581464
8405 -15581464 -1936366 5557670 -8010101 -22720810 -21199851 -16153479 -22279009 -27369753
8397 -27369753 -14535880 6327275 13078002 4119689 -4523644 -4787655 -388390 6274646
8389 6274646 13704577 15175652 8465289 4293956 10779022 18128165 14059751 5373871
8381 5373871 6535669 14274369 13344512 3560846 715610 10212898 18347169 13673420
8373 13673420 2041188 -4799832 -3896918 611762 4682049 5282529 1105702 -4245189
8365 -4245189 -5249696 -2435052 -2158396 -7576092 -15078277 -20218941 -21857108 -19775921
8357 -19775921 -13482186 -4933130 1362759 2525401 -226981 -3200391 -3155337 -172810
8349 -172810 1412371 -2166652 -7405507 -6427026 1222441 5624676 -357329 -10473627
8341 -10473627 -13424849 -7597025 -1104928 275278 -736473 2124966 11417065 22597570
8333 22597570 26180996 16544497 348922 -8546461 -5091470 1391651 573366 -6431943
8325 -6431943 -12487126 -15839188 -19678805 -24650714 -27874083 -26816103 -20352876 -9381570
8317 -9381570 1041521 5010224 3506041 2802625 3362952 -1207524 -11169526 -17115900
8309 -17115900 -14910613 -13181483 -18082424 -21499338 -14897967 -5251599 -4569676 -10937759
8301 -10937759 -13336497 -9914445 -7785656 -8160554 -5374190 560595 3055971 896055
8293 896055 6048 2003750 456180 -9145771 -22345958 -30348264 -27902199 -17530979
8285 -17530979 -8635543 -8691497 -12741390 -8461926 4559094 10654723 236810 -15133237
8277 -15133237 -20308192 -17876692 -18106296 -18182643 -9213029 3554839 7100888 2969434
8269 2969434 3451514 7686903 2329097 -12958021 -21015210 -12505493 1871559 9310237
8261 9310237 9007107 3728998 -6787086 -18230888 -21831716 -17435267 -13513390 -11425077
8253 -11425077 -5045639 1703309 -3725629 -18182358 -20851950 -4842818 10060660 8696109
8245 8696109 3821071 11091362 19603947 9684668 -12935023 -24418464 -17169309 -5201582
8237 -5201582 501888 1648936 -137194 -6190464 -10356971 -3148369 11502976 18650675
8229 18650675 13555792 6520575 4632206 3106654 -1643663 -4257886 -1442548 972741
8221 972741 -1682184 -5296445 -5619890 -5632174 -7975245 -8065030 -1998849 4724182 3749832
8212 3749832 -4399445 -10918474 -8931231 298102 8821839 7793373 -4316717 -17538962
8204 -17538962 -19248773 -9191179 -56930 -596560 -5142530 -4578263 -688892 -1978270
8196 -1978270 -9749565 -16993357 -19319230 -18863519 -17421453 -13440473 -7667979 -5110879
8188 -5110879 -7937233 -11310909 -10158896 -6230191 -3895382 -1923063 4505826 14186242
8180 14186242 18800358 13851977 5477181 2012599 2619452 456834 -4792957 -5600744
8172 -5600744 727536 6097000 3304722 -2796984 -3228276 448362 -1095832 -8803783
8164 -8803783 -12241529 -5130552 5449534 10237439 10246847 11264956 12217778 7741060 -1067434
8155 -1067434 -7257934 -8117991 -6774071 -4513821 186457 4699168 3143856 -3787252
8147 -3787252 -8455539 -8711040 -11665672 -20039102 -23731879 -13047675 6248075 19879881
8139 19879881 22259207 18142196 11942533 5688548 4136110 9999257 15049373 8032420
8131 8032420 -7593156 -15804594 -10336484 -2567694 -2598474 -4933902 -690342 7023814
8123 7023814 10385402 11212577 16124482 22390037 20716251 10431702 1143968 -1320426
8115 -1320426 -1949277 -7625190 -17268141 -22984637 -18094226 -4276105 7354535 5522588
8107 5522588 -7499026 -15968069 -9446986 3632323 8086082 2471400 -2154890 -652628
8099 -652628 530167 -3613984 -8604777 -8532102 -4341217 -764908 -553752 -3863325 -8695943
8090 -8695943 -11087063 -9211170 -6547844 -5997337 -3548155 4443504 10285188 2393171
8082 2393171 -15714728 -25634498 -17111731 -717251 7530064 5010427 -355461 -3839618
8074 -3839618 -6722061 -9957205 -12038642 -11312419 -7028432 -974030 698231 -6923495
8066 -6923495 -17872909 -18605232 -5295127 8891126 9290864 -3087605 -15369803 -18618695
8058 -18618695 -14087438 -8125550 -6629014 -11346917 -17305558 -17226263 -11362416 -7823030
8050 -7823030 -10250574 -12220764 -8145380 -1647587 2925556 8667069 17480881 21586576
8042 21586576 14500805 4104365 2571441 7699154 7136784 -1452388 -8017875 -7534791
8034 -7534791 -6236715 -8117993 -7528405 76195 9558061 13266205 9689584 1509700
8026 1509700 -8108771 -14461085 -13598224 -8495282 -6118126 -6341377 -1901102 8071896 14021846
8017 14021846 10187495 3623397 2596461 4475842 3235583 1711062 6570528 15691587
8009 15691587 20214171 16728871 9263053 1448504 -5379000 -8470497 -6456263 -4610156
8001 -4610156 -9120790 -16865238 -19205669 -15571952 -14144776 -18169127 -21189390 -18574160
7993 -18574160 -14490139 -13043242 -11001905 -5201915 182653 811227 607447 5055555
7985 5055555 10421341 8221768 -1708960 -10439465 -11318796 -5487159 2917315 10168678
7977 10168678 12055015 6690713 -1003775 -3683549 -944243 1539225 1930308 3879497
7969 3879497 7667618 8351593 5362572 5316485 10881747 14951007 11680799 5836086 3997110
7960 3997110 3290414 -2251427 -9470927 -10473895 -5962758 -3508017 -4118908 -1914260 2287308
7951 2287308 -794654 -12795920 -20488933 -12283874 5006642 14246788 9027938 -1160844
7943 -1160844 -5157416 -2172687 1206055 295615 -4012326 -7593433 -6400646 879968
7935 879968 10865238 16650407 13605051 4980696 -359189 2309678 7924703 8684104 4999286
7926 4999286 4434263 9971966 15778744 16674998 14951076 13565128 9500300 724850 -6063024
7917 -6063024 -3699387 3135409 3827912 -1957834 -4754745 -1708034 -740737 -5777143 -9397466
7908 -9397466 -5695487 -302190 80325 -89433 6999795 17639825 19688088 9054200
7900 9054200 -5056847 -11456460 -7442498 1891972 9056195 8319906 -265045 -9254506
7892 -9254506 -9791779 -873576 9547524 13287625 9361963 2437378 -2781711 -3847548
7884 -3847548 -209737 5734223 7851819 517334 -14488255 -27827832 -31789751 -27485712
7876 -27485712 -20001840 -9814760 4505250 16987646 17605700 7364573 -113424 2284838
7868 2284838 4527514 -3166379 -11890634 -6364718 10480839 20744662 16978791 8660721
7860 8660721 3382829 -1750111 -6771769 -3538233 9296477 20218404 21995532 22036936
7852 22036936 26614150 27557698 16406289 989507 -5642342 -4815424 -6951297 -12723459
7844 -12723459 -13743975 -8631187 -4679613 -4495018 -2979659 2007115 5957198 5222909
7836 5222909 282475 -7563372 -15043956 -14803799 -3671667 8691601 9320307 -689958
7828 -689958 -8216006 -6986442 -3847843 -5558079 -10290520 -14673382 -18918917 -21162541
7820 -21162541 -16095636 -4302398 4676975 3946114 -1964722 -4389503 -1141883 4425874
7812 4425874 9741526 13530327 13953791 10921228 7843335 7699964 9270468 9279945 6015727
7803 6015727 -322515 -7747965 -11831113 -8580230 318360 8249509 10856413 9200905
7795 9200905 5112477 -1879805 -10556198 -15004279 -9588995 4124799 17627735 22721601
7787 22721601 18752629 13320286 14375212 20436708 21768960 13890542 5174121 5294754
7779 5294754 10639158 10222190 3764468 2493636 10508880 16865605 11548153 123321
7771 123321 -4746383 124860 7780121 12154601 12079093 7364158 -1308972 -9279091 -11077497
7762 -11077497 -7456368 -4931387 -7653386 -12876800 -14890507 -10922056 -2733972 5774237
7754 5774237 11863201 15332397 16834075 16075963 13602554 12919368 16650734 20606908 17059381
7745 17059381 5845859 -3203568 -2532550 3213736 4387265 -419233 -4442728 -3857024
7737 -3857024 -2244178 -4186622 -10077970 -17802380 -24220458 -23969242 -12717048 5138422
7729 5138422 16642461 12914287 -543021 -10264351 -10040125 -5369954 -3552074 -4927035
7721 -4927035 -6003928 -6659365 -9701335 -14802250 -17172958 -13194668 -5213080 191428
7713 191428 -1988587 -10693167 -19067274 -20077038 -13288051 -5156742 -1273623 -112702
7705 -112702 3246625 9201916 12862336 9994025 589548 -11719428 -20226960 -18061824
7697 -18061824 -6309371 3056045 -449560 -11881483 -17205912 -12077036 -4314501 1434238
7689 1434238 8200278 13746858 8693712 -5356835 -10794424 1768612 17142654 16976204
7681 16976204 6098412 1231833 3054320 -617501 -9213768 -8791472 2871622 11040701
7673 11040701 7757682 2620928 4030659 6379661 3809375 1848940 5703936 9321421
7665 9321421 6390685 2038296 3226798 5889293 1809066 -8206167 -17181666 -22527006
7657 -22527006 -25838004 -27364792 -27433925 -27787231 -25852427 -15232581 1560340 10017103
7649 10017103 2390908 -9150553 -9143387 -637593 2607812 -1136374 -2453928 -714202
7641 -714202 -5610576 -17727458 -24042187 -17758689 -8827845 -7777434 -10618787 -8503147
7633 -8503147 -3349307 -3565930 -9432977 -12789311 -9674099 -5229464 -5454708 -9517386 -11412561
7624 -11412561 -6188663 5718150 18131723 23700693 21056195 16545082 16480201 18913922
7616 18913922 16511442 7190969 -2216070 -4353971 -59767 3795422 2804947 -1756919
7608 -1756919 -6572736 -9073069 -6869865 1003290 10686831 15318212 12975594 9528173
7600 9528173 10229140 11543755 6093038 -5912041 -15386622 -14651448 -4905613 6878370
7592 6878370 14754726 16783146 14422812 10243318 5124825 -1418474 -7171754 -7149846 -1170651
7583 -1170651 2694666 -1621505 -7934843 -5936165 2685209 6195124 640948 -5477233
7575 -5477233 -6678295 -8776645 -15816416 -19437859 -10662476 4678708 12325882 7828039
7567 7828039 -327127 -3938055 -3737824 -4916535 -9557444 -14194053 -12547413 -2284027
7559 -2284027 9446362 11434091 2362981 -5674650 -2002374 9498552 17830967 20328702
7551 20328702 22719201 26956494 28078278 23186750 15850130 9684299 3148097 -6529186
7543 -6529186 -17252630 -22378873 -17185432 -5201493 3089420 1116946 -4670241 -1998343
7535 -1998343 10239561 19677285 17967718 11621043 9384184 7794523 -1018637 -13747362
7527 -13747362 -19663404 -16485500 -11518273 -9071887 -7287693 -5792875 -5440554 -1411950
7519 -1411950 11241139 24422486 22291539 3326776 -14771387 -17619872 -10891934 -7784825
7511 -7784825 -9790325 -9393232 -4767254 -923778 709543 4238979 11069126 16761099
7503 16761099 16820458 11048181 2348965 -4772139 -5343604 1757147 10357576 12059984 5874774
7494 5874774 -592987 -1157994 762732 -3014209 -13703050 -22500295 -20848449 -11064030
7486 -11064030 -3330581 -3121006 -6059325 -5983379 -2823834 682974 5169188 11918136 17078026
7477 17078026 15363041 8794253 5453848 8782197 13274563 11969828 4070527 -5564650
7469 -5564650 -10653014 -7225213 2426611 9508172 7101971 -1377037 -7109455 -8155948
7461 -8155948 -9609884 -11798412 -8125028 2225522 9254719 6086404 -168123 483868
7453 483868 5353291 4255721 -3598798 -8060184 -2337455 10036711 22351291 30254782
7445 30254782 29702277 18925613 5645767 3671078 16659568 31436683 33392245 23419861
7437 23419861 13108481 8032019 4818109 2377933 5099756 12714023 16821202 13141771
7429 13141771 9728117 15249076 24284495 23876359 12627143 2743787 1650097 2023587
7421 2023587 -4523405 -12614515 -10983589 -406884 6643637 4017337 166304 5100713
7413 5100713 15812133 19993275 11079342 -5130485 -17655292 -20481091 -15890815 -10819674
7405 -10819674 -10640431 -14511230 -15850563 -8786742 4742690 15434968 15686413 7316575
7397 7316575 -1976918 -9033789 -17852577 -30460864 -40296703 -39387422 -28780691 -16036402
7389 -16036402 -4974220 4639245 9031253 2586778 -9862730 -13869260 -4519141 4472409
7381 4472409 -830346 -14527380 -19497177 -10930018 205670 4724728 4419619 3354698
7373 3354698 1057504 -2595143 -4408519 -3506520 -3376578 -5349032 -5883719 -2686576 2184407
7364 2184407 7171984 13050715 18026593 17632666 11974848 6570711 3663520 44396
7356 44396 -3792076 -1343225 7878812 12889740 5593055 -6310440 -9449942 -2438588
7348 -2438588 5602670 9560875 11265952 10974464 6898618 2538951 3926120 8667428
7340 8667428 7924791 1521358 779247 11689602 24460522 26648928 19519275 12975086
7332 12975086 8969032 -240500 -17664650 -33500417 -34457693 -17802073 5365015 19271703
7324 19271703 16784483 6003297 2222638 10517530 18834992 13198881 -2774933 -11649579
7316 -11649579 -5929507 1710018 -2762121 -14157277 -16052955 -5040718 4718610 1885138
7308 1885138 -7959957 -13070226 -11567411 -9635640 -9992533 -11062826 -14382215 -23014247
7300 -23014247 -32272965 -31142610 -16591220 -14131 5330263 -882286 -8388163 -10219596
7292 -10219596 -8891374 -9971060 -14526820 -18845464 -18749148 -13519657 -7171997 -5180577
7284 -5180577 -7862509 -8504670 -1683406 7708022 9261224 1752492 -3400634 2695937
7276 2695937 13397602 15401682 7383230 1305428 5156406 12966790 15142513 11518032
7268 11518032 8917896 10875485 15625493 20756785 24106811 22931672 18092121 16429983
7260 16429983 22396947 29479022 27459784 16897783 7936136 4925258 1840716 -5151941
7252 -5151941 -10651495 -9981459 -7043848 -5955564 -2883759 5894095 14391584 14632847 9304035
7243 9304035 6760790 6381927 -96360 -12741758 -19955484 -14431342 -4047236 -1250681
7235 -1250681 -7057573 -11652092 -8127658 145442 5652108 5603616 2727588 -75918 -2297892
7226 -2297892 -3105983 -181406 5715876 8023358 1414601 -9483871 -14316370 -10114314
7218 -10114314 -3666055 81292 3591901 7302809 3918341 -10311491 -25403845 -28010025
7210 -28010025 -18211312 -7529080 -3302199 -3809684 -6573124 -11637494 -16421179 -16113008
7202 -16113008 -10873314 -5889630 -3337786 -927370 719463 -3493083 -14830913 -26634315
7194 -26634315 -31342248 -27631763 -19077380 -9851550 -3289122 -1037713 -1788434 -2639081
7186 -2639081 -1795210 1141109 5146036 6108960 -466669 -11519251 -16665164 -11725898
7178 -11725898 -5675822 -6761584 -9117133 -3933012 3269519 1376890 -5230091 -2500301
7170 -2500301 7596587 7550519 -6085129 -14638763 -7417049 384053 -6347776 -16471002
7162 -16471002 -11320952 3058964 4751904 -8641157 -15897276 -4636480 11590704 14756900
7154 14756900 5925577 -1340871 -949399 1952059 1889384 -537054 -1633884 1242646 8017159
7145 8017159 15168215 17087588 10607164 -1338390 -11455193 -13935183 -8789751 -656656
7137 -656656 6356787 11692169 15780017 16791247 12934768 6588719 1860156 -1656040
7129 -1656040 -7830578 -16392514 -22071715 -22723998 -21925415 -20725349 -13959093 -143083
7121 -143083 11254277 10424919 1687911 -1301789 5741780 12029397 6992839 -5180020
7113 -5180020 -10916283 -3839180 9129103 17701191 19192844 17006254 12263558 3253784
7105 3253784 -7129511 -10921132 -5617185 1190579 2939135 3538529 8418041 12681809
7097 12681809 8967411 2138805 2250213 5091005 -3770571 -23516022 -33939689 -23505689
7089 -23505689 -5789364 1956806 2389384 7174772 14354033 12952861 3518693 -2011556
7081 -2011556 1653642 8729063 14135376 17126082 14319808 1979085 -13702910 -20158218
7073 -20158218 -14796376 -8145356 -8071588 -9976536 -6563709 262549 2481907 -3223307
7065 -3223307 -11595350 -14067009 -7087536 3140405 5708499 -2502495 -12176863 -13393897
7057 -13393897 -8354745 -6414125 -10072562 -13777424 -14448129 -14489237 -14835266 -13322297 -10413754
7048 -10413754 -8942267 -7760662 -3289107 2255418 2520814 -2033461 -3780121 -786649
7040 -786649 -701003 -7480645 -12980487 -8478476 1676185 5335694 -2153228 -14384572
7032 -14384572 -23145699 -25108971 -20431744 -10619901 863439 9336148 12187095 10557052
7024 10557052 7260123 3655891 -973137 -6851632 -11137554 -9713849 -2507880 4820334
7016 4820334 6353379 1688437 -5299244 -11062587 -13234592 -9850496 -2144027 3710172
7008 3710172 2836282 -909429 1090905 10574241 20056001 23442970 23501131 25363760 26905925
6999 26905925 21288705 8518306 -973928 2174634 13125042 16157692 3227233 -14615238
6991 -14615238 -19033608 -5817249 11238812 17388840 11063320 -198213 -10004250 -15158320
6983 -15158320 -14264523 -10264913 -9744969 -14259781 -16641442 -11274018 -3310965 -1190837
6975 -1190837 -4112395 -4420669 178961 4148051 2685802 -3138083 -8867989 -10103462
6967 -10103462 -5842620 -1937935 -6654322 -18210203 -22965345 -12732662 2741040 9266348
6959 9266348 7358699 6650114 7414016 2518021 -5063762 -3262435 8942546 17751758
6951 17751758 15392687 11018827 14157502 19170241 15129527 2800648 -7374744 -9204394
6943 -9204394 -5114513 21367 3238115 3630805 2565401 2636558 4268907 4935795 2524788
6934 2524788 -2658081 -8916189 -13460055 -13061242 -8060456 -3770970 -3809476 -5252954 -5474566
6925 -5474566 -8548133 -16636383 -20527350 -10898173 4089838 6695738 -4970129 -14024852
6917 -14024852 -9439852 1364127 8984854 15814716 25223479 30194904 23653511 11062435
6909 11062435 2559778 -694028 -3681589 -7318935 -9166960 -8851998 -5759535 2918654
6901 2918654 15070438 20681562 13240174 -1194581 -12880053 -20420813 -26887945 -30193630
6893 -30193630 -26236742 -17857193 -12697300 -14348772 -20879058 -28394241 -31288333 -24296640
6885 -24296640 -10246251 -526524 -1521174 -5738115 -2932391 5463254 10438380 8910371
6877 8910371 5040848 1876710 -553664 -1717137 -1862026 -3837580 -7910549 -8767911 -3384761
6868 -3384761 3096997 5599491 7350902 12233491 14720115 6881190 -8508207 -20842981
6860 -20842981 -24495880 -20979490 -12851312 -4379862 -3658339 -13651607 -24400076 -24325538
6852 -24325538 -16064142 -10443137 -8503748 -2647725 6133005 7000570 -2602675 -10876062
6844 -10876062 -8475223 -1014259 427165 -6761858 -16783209 -22747627 -20386927 -10501074
6836 -10501074 -548974 1576525 -3158705 -7544176 -9949944 -15436478 -23980612 -27174555
6828 -27174555 -20677579 -11909495 -10176802 -15173056 -19979986 -20392696 -17007300 -12407481
6820 -12407481 -9934438 -11574115 -14682974 -14702197 -12084216 -10993376 -10476957 -4986452 3662194
6811 3662194 4211257 -8114874 -21628340 -22329884 -12114561 -3570212 -805582 3583070
6803 3583070 13134370 20225172 17868213 10648892 7893015 10502016 10994829 5191340
6795 5191340 -1865211 -2722187 3622209 11553281 14710092 9646111 -3649728 -20449373
6787 -20449373 -31073074 -27214719 -11135322 4327890 7840589 473976 -7045881 -6246436
6779 -6246436 1870774 10153774 13597566 13883894 15486330 17531635 13229375 1101397
6771 1101397 -7529629 -932294 14381185 18707144 5673839 -8281762 -7639592 662294
6763 662294 322901 -9003037 -13649100 -7936097 591467 5869078 8810212 8098604 90047
6754 90047 -9389218 -7205295 7474655 17889502 11694427 -1538753 -3963425 6351171
6746 6351171 14793975 10662568 -488501 -5441567 825894 9578464 7858066 -6316926
6738 -6316926 -20035494 -19747633 -7125258 4827625 9431292 11633773 15456927 16239498
6730 16239498 9420809 -1330142 -10126557 -16096492 -19030683 -14617253 -1534525 11368446
6722 11368446 13201940 4656090 -3086915 -2413260 3241974 6213334 4271832 1492214
6714 1492214 1397215 1561065 -3368709 -13356663 -20943756 -20059334 -13449617 -7167573 -1857031
6705 -1857031 3754915 5075545 -2243750 -10774654 -8902384 -576718 -2881657 -19724297
6697 -19724297 -33158968 -29167282 -17756756 -15369071 -19583043 -16870802 -6904063 -1535218
6689 -1535218 -3645196 -4509987 -1924883 -4353454 -13886781 -19720142 -14456418 -5225566
6681 -5225566 -1830031 -3479650 -4801720 -6802963 -12524780 -17015168 -12089158 -406007
6673 -406007 4331171 -5338844 -18816296 -18637976 -2117994 14265351 14631365 2452213
6665 2452213 -6848630 -8519195 -13103351 -27047881 -40459997 -40950826 -30042884 -16739620
6657 -16739620 -3529580 9308522 13172939 1214836 -14172162 -11849337 8036962
6650 8036962 21293297 12378276 -5541379 -11521742 -3991314 4344955 7716370 9734127
6642 9734127 11266233 9198393 4354290 84326 -4295589 -9371123 -9076004 697153
6634 697153 10493960 7566513 -3372432 -4246300 9229603 19241509 11148323 -5960656
6626 -5960656 -13907208 -10639870 -8335842 -12225123 -15053922 -11819756 -7607996 -7575008 -8578511
6617 -8578511 -6103222 -3187437 -6041411 -13486592 -16361348 -7748005 8918555 22289128
6609 22289128 22671536 10031381 -6165332 -15382622 -14999853 -10770155 -9081965 -10827919
6601 -10827919 -13124703 -14131610 -14092597 -13487143 -12693548 -12605611 -13261078 -12316810 -7234736
6592 -7234736 713396 6345461 5042385 -3420548 -15031610 -24062211 -25821428 -19267006
6584 -19267006 -8275086 418586 1861226 -3470890 -9815832 -10389708 -3482252 5273236
6576 5273236 9181447 9763276 15471182 28037419 35238239 24607348 2027625 -12614084
6568 -12614084 -9418062 1028716 4307447 -531173 -7006487 -15182929 -28114675 -39469255
6560 -39469255 -38143415 -25111172 -13653586 -10612174 -8614481 -898437 7382171 9673076
6552 9673076 10032369 14836397 19568743 15424753 5442790 2365552 10891351 22178962
6544 22178962 26717834 23459944 15159026 4394101 -3216296 -1533532 6137383 8494635
6536 8494635 2505280 -1169751 4362137 9340296 2221163 -10844486 -14844236 -9187077
6528 -9187077 -6930907 -12123699 -14054110 -6985077 -167899 -1587232 -5520115 -5674954
6520 -5674954 -8299783 -19171097 -26872908 -15292587 10952245 29195679 26847764 13084215
6512 13084215 1303013 -5657435 -8562236 -4380226 5410917 9913552 2481068 -8458525
6504 -8458525 -12200600 -11985648 -16568765 -21823115 -16103078 -2241523 2234917 -9478817
6496 -9478817 -22254178 -20295977 -7783925 766325 829285 -2727655 -9117795 -20815128
6488 -20815128 -32141134 -32176420 -20513730 -9575762 -8786000 -15091292 -21313114 -24990402
6480 -24990402 -25745332 -22593147 -18397274 -19112366 -23423374 -20761371 -5964476 10987902
6472 10987902 17116284 12280428 5312485 522012 -2630813 -1775990 5013355 10930707
6464 10930707 7194001 -2829280 -7617061 -5400212 -5708211 -11426933 -12757611 -4257073
6456 -4257073 4331060 2332859 -6242164 -10224896 -7070892 -2160829 1546500 3675602
6448 3675602 910682 -8707346 -18447433 -19057596 -11226617 -4096645 -2492342 -3326901 -3756748
6439 -3756748 -4578630 -5097489 -2686143 783858 -771607 -8369766 -15051078 -15085830 -10734993
6430 -10734993 -6805062 -3604295 583516 4009710 3465852 94121 -1029203 2924050
6422 2924050 9232941 12534773 9634483 1902472 -5628283 -7638854 -2299869 7530478
6414 7530478 16749694 21693849 21710180 17773732 10609406 1322368 -6428115 -7634591 -1567834
6405 -1567834 5728758 7984591 6534450 7375002 11215508 12271650 7882435 2959379
6397 2959379 2022305 2750223 1737734 1492817 6112312 13447479 17114587 14293291 7403409
6388 7403409 581602 -1720553 3755125 13969755 19265887 13941630 4798912 3352742
6380 3352742 11302209 19454930 19761295 12762263 3751626 -3143988 -6684144 -7980397
6372 -7980397 -8637825 -8337832 -6303988 -5179046 -7820215 -9147334 -216014 15375903
6364 15375903 20250989 7026203 -7684956 -5763894 5726233 7151986 -1808685 -4136148
6356 -4136148 2921319 2021694 -13300083 -23939865 -12933971 9219030 20769634 17547366
6348 17547366 11036088 7051884 1900447 -5004993 -9045436 -9988465 -12490083 -16485164
6340 -16485164 -15844968 -8130294 678749 3277855 -536304 -3770924 458977 11024486
6332 11024486 18502520 15154951 4167387 -5127198 -9487423 -12672580 -15625339 -15132575
6324 -15132575 -12741173 -14115264 -17015645 -11860119 925658 6714041 -2312148 -13757296
6316 -13757296 -13194281 -5738150 -6727892 -17960074 -26634649 -24115306 -13661726 -1746511
6308 -1746511 7765686 12278427 12047657 11224598 10667460 4791989 -6414449 -9904919 3525663
6299 3525663 21327935 23834181 12886083 7798255 13396595 12788685 -2236026 -13641240
6291 -13641240 -3101928 18605734 24768207 8451020 -10811433 -14605620 -6023486 688002
6283 688002 209246 -1297505 1059825 3434743 -54085 -7458057 -9983829 -2904079 7774660
6274 7774660 11738670 5957220 -2357917 -3768149 3935544 13708742 15838343 7429657
6266 7429657 -4803617 -13065600 -18271071 -26306444 -35162843 -34375610 -20931093 -7150797
6258 -7150797 -5479610 -12024590 -14156742 -9449073 -6386321 -8717921 -10532427 -7796101
6250 -7796101 -4870409 -6559694 -11021574 -13683636 -12846960 -9353585 -5342900 -4430350 -8514846
6241 -8514846 -13907001 -15245392 -12987431 -11763564 -11955940 -9245491 -2435695 4993611
6233 4993611 11408568 17935515 22114621 18522787 7972263 -1205292 -3989432 -4130377
6225 -4130377 -5808098 -6816872 -4348237 -1390407 -2006669 -4599267 -4822158 -1865706 2434901
6216 2434901 7681491 13763681 17780348 16086017 8541154 -1585078 -10798609 -16986848
6208 -16986848 -19349205 -17897867 -12047587 -444925 15116468 26670333 25734997 13046638
6200 13046638 -1196910 -8013126 -7369253 -4861804 -4623858 -6557520 -7189300 -2527163
6192 -2527163 6849827 13795945 11636021 3001681 -2686047 -408198 6173212 10953118
6184 10953118 10803382 5642743 -926422 -1852573 5642127 13219884 10182463 -1345474
6176 -1345474 -9374505 -10536397 -13981332 -23614982 -28884037 -20481687 -5103072 4230301
6168 4230301 4593702 1022536 -4657225 -12451174 -17062877 -13408296 -6740563 -7115417 -14734788
6159 -14734788 -19720496 -16213949 -8554094 -2925305 -159046 1789983 3986654 6589373
6151 6589373 8707008 7896665 3274549 -1785449 -3604464 -2908760 -1680322 1335813 6261044
6142 6261044 6913491 -1855957 -13977856 -18899998 -17762536 -21832912 -33127246 -38728171
6134 -38728171 -29959699 -15915485 -8732531 -4793633 6499015 20836560 21847739 6792765
6126 6792765 -5541831 845927 18267169 27700514 23407382 14119115 5890579 -2224180
6118 -2224180 -7280839 -2793918 6336778 3658133 -15644222 -32908733 -28891065 -10300973
6110 -10300973 -35057 -5889980 -14063088 -12890290 -7311381 -5379822 -4044996 2823447
6102 2823447 11179147 11965230 5914900 4128171 13152815 25008950 25220528 10308796
6094 10308796 -5232452 -3612913 13662000 24509947 13016760 -9353059 -19016775
6087 -19016775 -11359231 -2907564 -4647816 -9667885 -10074181 -9403258 -10778748 -7559895
6079 -7559895 3625534 12307985 8198701 -3512103 -11949596 -16772730 -22724692 -26239252
6071 -26239252 -21036031 -11172183 -5334236 -3091394 298688 888937 -7207243 -16107050
6063 -16107050 -12017907 2008351 7880023 -1089742 -11350257 -10735913 -4125702 -1163906
6055 -1163906 -1203517 1140970 4884955 5473997 2515824 -1394432 -4513615 -4860950 -1098741
6046 -1098741 2874072 1264685 -3202888 -645894 10800061 20263558 19152350 11429881
6038 11429881 3136343 -7978824 -23272993 -32483274 -24501750 -4961024 8182161 5773071
$$ [...]
##END NTUPLES=NMR SPECTRUM
##END=
