##TITLE=31Pdec_3MBDE 1-6
 CDCl3, 24 sc
 13.12.2022
##JCAMPDX= 6.0         $$ Bruker NMR JCAMP-DX V2.0
##DATA TYPE= NMR SPECTRUM
##DATA CLASS= NTUPLES
##ORIGIN= UXNMR, Bruker Analytische Messtechnik GmbH
##OWNER= root
$$ XWIN-NMR		Version 3.5
$$ Tue Dec 13 14:08:46 2022 Russian Standard Time (UT+4h)  she@DPX200
##.OBSERVE FREQUENCY= 81.013821
##.OBSERVE NUCLEUS= ^31P
##.ACQUISITION MODE= SIMULTANEOUS
##.ACQUISITION SCHEME= undefined
##.AVERAGES= 24
##.DIGITISER RES= 16
##SPECTROMETER/DATA SYSTEM= spect
##.PULSE SEQUENCE= zgpg30
##.SOLVENT NAME= CDCl3
##.SHIFT REFERENCE= (INTERNAL, CDCl3, 0, 248.564)
##AUDIT TRAIL= $$ (NUMBER, WHEN, WHO, WHERE, WHAT)
$$ ##TITLE= Audit trail, XWIN-NMR		Version 3.5
$$ ##JCAMPDX= 5.01
$$ ##ORIGIN= Bruker BioSpin GmbH
$$ ##OWNER= she
$$ F:/spectra/data/she/nmr/P31/1/pdata/1/auditp.txt
$$ ##AUDIT TRAIL=  $$ (NUMBER, WHEN, WHO, WHERE, WHAT)
(   1,<2022-12-13 14:07:55.29 +0400>,<she>,<DPX200>,
      <created by zg, POWCHK disabled, PULCHK disabled
       configuration hash MD5:
       00 E9 B6 7A A2 85 ED C7 34 08 36 98 17 FE 4E 26
       data hash MD5: 32K
       20 08 25 C4 3F 7E FC 28 2F 36 EA 86 ED 1F 26 CF>)
(   2,<2022-12-13 14:07:57.87 +0400>,<she>,<DPX200>,
      <Start of raw data processing
       efp BC_mod = 2 LB = 1 FT_mod = 6 PKNL = 1 PHC0 = -10812.99 PHC1 = 518.2559 SI = 64K 
       data hash MD5: 64K
       5A 59 CB 0E 8D 61 DE DA 36 DD 4F 0F E8 33 35 18>)
(   3,<2022-12-13 14:08:19.64 +0400>,<she>,<DPX200>,
      <pk PHC0 = -147.8166 PHC1 = 338.2 
       data hash MD5: 64K
       1C 16 DD 43 39 E2 5F F7 5B 4B CF 9F AE 9F 09 1C>)
(   4,<2022-12-13 14:08:22.45 +0400>,<she>,<DPX200>,
      <abs ABSG = 5 
       data hash MD5: 64K
       B0 22 EA 47 DB AD EF 67 4E 12 77 E4 B4 09 C4 D2>)
$$ ##END=
$$ 
$$ hash MD5
$$ 41 25 E9 B9 D1 90 D0 9C 5B 6D 9E 1C B3 D9 47 FA
##$RELAX= 
##$RELAX= 
##$RELAX= 
##$RELAX= 
##$RELAX= 
##$RELAX= 
##$RELAX= 
##$RELAX= 
##$RELAX= 
$$ Bruker specific parameters
$$ --------------------------
##$DU= <F:/spectra>
##$EXPNO= 1
##$NAME= <P31>
##$PROCNO= 1
##$TYPE= <nmr>
##$USER= <she>
##$AMP= (0..31)
100 100 100 100 100 100 100 100 100 100 100 100 100 100 100 100 100 100 
100 100 100 100 100 100 100 100 100 100 100 100 100 100 
##$AQSEQ= 0
##$AQ_mod= 1
##$AUNM= <au_zg>
##$AUTOPOS= <>
##$BF1= 81.014009
##$BF2= 200.13
##$BF3= 200.13
##$BF4= 200.13
##$BF5= 200.13
##$BF6= 200.13
##$BF7= 200.13
##$BF8= 200.13
##$BYTORDA= 1
##$CFDGTYP= 0
##$CFRGTYP= 5
##$CHEMSTR= <none>
##$CNST= (0..31)
1 1 145 1 1 1 1 1 1 1 1 1 1 1 1 1 1 1 1 1 1 1 1 1 1 1 1 1 1 1 1 1 
##$CPDPRG= <waltz16>
##$CPDPRG1= <>
##$CPDPRG2= <waltz16>
##$CPDPRG3= <>
##$CPDPRG4= <mlev>
##$CPDPRG5= <mlev>
##$CPDPRG6= <mlev>
##$CPDPRG7= <mlev>
##$CPDPRG8= <mlev>
##$CPDPRGB= <>
##$CPDPRGT= <>
##$D= (0..31)
0 1 0 0 0 0 0 0 0 0 0 0.03 2e-05 3e-06 0 0 0 0 0 0 0 0 0 0 0 0 0 0 0 0 
0 0 
##$DATE= 1670926074
##$DBL= (0..7)
120 120 120 11 120 120 24 19 
##$DBP= (0..7)
150 150 150 150 150 150 150 150 
##$DBP07= 0
##$DBPNAM0= <>
##$DBPNAM1= <>
$$ [...]
##$SUBNAM3= <"">
##$SUBNAM4= <"">
##$SUBNAM5= <"">
##$SUBNAM6= <"">
##$SUBNAM7= <"">
##$SUBNAM8= <"">
##$SUBNAM9= <"">
##$SW= 501.771253377433
##$SWIBOX= (0..15)
0 1 3 0 0 0 0 0 0 0 0 0 0 0 0 0 
##$SW_h= 40650.406504065
##$TD= 32768
##$TD0= 1
##$TE= 0
##$TE2= 300
##$TE3= 300
##$TEG= 300
##$TL= (0..7)
0 120 53 12 22 120 120 120 
##$TP= (0..7)
150 150 150 150 150 150 150 150 
##$TP07= 0
##$TPNAME0= <>
##$TPNAME1= <>
##$TPNAME2= <>
##$TPNAME3= <>
##$TPNAME4= <>
##$TPNAME5= <>
##$TPNAME6= <>
##$TPNAME7= <>
##$TPOAL= (0..7)
0.5 0.5 0.5 0.5 0.5 0.5 0.5 0.5 
##$TPOFFS= (0..7)
0 0 0 0 0 0 0 0 
##$TUNHIN= 0
##$TUNHOUT= 0
##$TUNXOUT= 0
##$USERA1= <user>
##$USERA2= <user>
##$USERA3= <user>
##$USERA4= <user>
##$USERA5= <user>
##$V9= 5
##$VALIST= <valist>
##$VCLIST= <CCCCCCCCCCCCCCC>
##$VD= 0
##$VDLIST= <DDDDDDDDDDDDDDD>
##$VPLIST= <PPPPPPPPPPPPPPP>
##$VTLIST= <TTTTTTTTTTTTTTT>
##$WBST= 1024
##$WBSW= 4
##$XGAIN= (0..3)
0 0 0 0 
##$XL= 0
##$YL= 0
##$YMAX_a= 2560
##$YMIN_a= -2396
##$ZGOPTNS= <>
##$ZL1= 120
##$ZL2= 120
##$ZL3= 120
##$ZL4= 120
##$ABSF1= 248.5645
##$ABSF2= -253.2056
##$ABSG= 5
##$ABSL= 3
##$ALPHA= 0
##$AQORDER= 0
##$ASSFAC= 0
##$ASSFACI= 0
##$ASSFACX= 0
##$ASSWID= 0
##$AUNMP= <proc_1d>
##$AZFE= 0.1
##$AZFW= 0.5
##$BCFW= 0
##$BC_mod= 2
##$BYTORDP= 0
##$COROFFS= 0
##$CY= -3
##$DATMOD= 1
##$DC= 0
##$DFILT= <>
##$DTYPP= 0
##$F1P= 0
##$F2P= 0
##$FCOR= 1
##$FTSIZE= 65536
##$FT_mod= 6
##$GAMMA= 0
##$GB= 0
##$INTBC= 1
##$INTSCL= 6.047779e-11
##$ISEN= 30
##$LB= 1
##$LEV0= 0
##$LPBIN= 0
##$MAXI= 10000
##$MC2= 0
##$MEAN= 0
##$ME_mod= 0
##$MI= 50
##$NCOEF= 0
##$NC_proc= -7
##$NLEV= 6
##$NOISF1= 182.463
##$NOISF2= 159.3651
##$NSP= 0
##$NTH_PI= 0
##$NZP= 0
##$OFFSET= 248.5645
##$PC= 4
##$PHC0= -10960.81
##$PHC1= 856.4559
##$PH_mod= 1
##$PKNL= yes
##$PPARMOD= 0
##$PSCAL= 0
##$PSIGN= 0
##$REVERSE= no
##$SF= 81.0140089999694
##$SI= 65536
##$SIGF1= 159.3651
##$SIGF2= -187.1042
##$SINO= 113.3802
##$SIOLD= 16384
##$SREGLST= <1H.CDCl3>
##$SSB= 0
##$STSI= 65536
##$STSR= 0
##$SW_p= 40650.406504065
##$SYMM= 0
##$S_DEV= 0
##$TDeff= 32768
##$TDoff= 0
##$TI= <>
##$TILT= no
##$TM1= 0
##$TM2= 0
##$TOPLEV= 0
##$USERP1= <user>
##$USERP2= <user>
##$USERP3= <user>
##$USERP4= <user>
##$USERP5= <user>
##$WDW= 1
##$XDIM= 65536
##$YMAX_p= 315136403
##$YMIN_p= -9317735
$$ End of Bruker specific parameters
$$ ---------------------------------
##NTUPLES= NMR SPECTRUM
##VAR_NAME=  FREQUENCY,     SPECTRUM/REAL,   SPECTRUM/IMAG
##SYMBOL=    X,             R,               I
##VAR_TYPE=  INDEPENDENT,   DEPENDENT,       DEPENDENT
##VAR_FORM=  AFFN,          ASDF,            ASDF
##VAR_DIM=   65536,         65536,           65536
##UNITS=     HZ,            ARBITRARY UNITS, ARBITRARY UNITS
##FACTOR=    0.620285442955139, 1,           1
##FIRST=     20137.2065510682, 0,            0
##LAST=      -20513.1999529968, 0,           0
##MIN=       -20513.1999529968, -9317735,    0
##MAX=       20137.2065510682, 315136403,    0
$$ Real data points
##PAGE= N=1
##DATA TABLE= (X++(R..R)), XYDATA
$$ [...]
$$ plain form
39304 1243867 -736579 -1769178 -430401 1550620 1921230 1437436 2529337 4970200
39296 4970200 5726816 3626648 1332252 1288754 2188204 1475660 -568104 -1624641 -943672
39287 -943672 167731 635526 335726 -733375 -2032870 -2021668 -136608 1598673 1140683
39278 1140683 -296659 -108704 1376949 1583889 297891 -48442 913296 338956 -2866042
39269 -2866042 -5425539 -4234238 -798650 1278987 1072826 81273 -989789 -2445774
39261 -2445774 -3706359 -3721593 -2747295 -1821578 -1141780 -577236 -802854 -2098714 -2987649
39252 -2987649 -2031127 -169142 642205 285064 4090 -23396 -470921 -1017425 -1006508 -1194526
39242 -1194526 -2371927 -2971245 -922882 2470469 3594173 1552098 -873930 -1620663
$$ packed form
39304A243867j980446j032599J338777J981021L70610m83794J091901K440863
39296D970200P56616k100168k294396m3498Q99450p12544k043764j056537O80969
39287i43672J111403M67795k99800j069101j299495J1202J885060J735281m57990
39278A140683j437342J87955J485653K06940j285998l46333R61738n74340l204998
39269b866042k559497J191301L435588K077637k06161r91553j071062j455985
39261b445774j260585j5234R74298R25717O79798N64544k25618j295860q88935
39252b987649R56522J861985Q11347l57141k80974k7486m47525n46504J0917j88018
39242a194526j177401n99318K048363L393351J123704k042075k426028p46733
$$ plain form
39234 -1620663 -1595236 -1831384 -1538903 -274799 681740 604013 589553 1195599 1219282 309066
39224 309066 264397 1877680 2900157 1415815 -852996 -1114687 358990 1314973 1324324
39215 1324324 1695444 2511767 2562682 1853691 1706631 2446302 3068107 3124393 3081130 2922828
39205 2922828 2149702 1029958 246262 -438577 -1531750 -2216632 -1276872 593576 1353529
39196 1353529 541839 -205698 201034 847249 413988 -1109430 -2651428 -2995984 -1585351
39187 -1585351 565441 1210366 -517563 -2437796 -1956363 286678 1543657 1209066 1279723
39178 1279723 2593584 3533383 3084958 2319976 1747511 -29312 -3370191 -5740444 -4836691
39169 -4836691 -1712336 1164569 3184107 4753844 4901597 2546800 -678010 -1671071
$$ packed form
39234a620663K5427k36148K92481J264104R56539p7727j4460O06046K3683r10216
39224C09066m4669J613283J022477j484342k268811k61691J473677R55983R351
39215A324324L71120Q16323N0915p08991j47060P39671O21805N6286m3263j58302
39205B922828p73126j119744p83696o84839j093173o84882R39760J870448P59953
39196A353529q11690p47537M06732O46215m33261j523418j541998l44556J410633
39187a585351K150792O44925j727929j920233M81433K243041J256979l34591P0657
39178A279723J313861R39799m48425p64982n72465j776823l340879k370253R03753
39169d836691L124355K876905K019538J569737J47753k354797l224810r93061
$$ plain form
39161 -1671071 127374 2168823 2291456 843735 -763141 -1716004 -1701194 -868080 -327497
39152 -327497 -1146421 -2437596 -2088989 -14890 1078827 -669503 -3399181 -3969532 -2319278
39143 -2319278 -1369414 -2749497 -4628986 -4468035 -2346683 -320865 538062 876703 1174691
39134 1174691 880578 -92855 -520596 369531 1293040 526186 -1371766 -2101707 -955062
39125 -955062 67615 -841442 -2681349 -3143955 -1840697 -514036 -259025 -94060 1149872
39116 1149872 2677763 2626557 752075 -1025783 -1126214 -290286 -93363 -250847 891163
39107 891163 3122972 3660903 860584 -2938736 -4147253 -2536419 -942279 -870068 -1009424
39098 -1009424 -417339 -375201 -1699029 -2543639 -1085394 1082431 749516 -2297816 -4885959
$$ packed form
39161a671071J798445K041449J22633j447721j606876r52863J4810Q33114N40583
39152c27497q18924j291175L48607K074099J093717j748330k729678n70351J650254
39143b319278R49864j380083j879489J60951K121352K025818Q58927L38641K97988
39134A174691k94113r73433m27741Q90127R23509p66854j897952p29941J146645
39125i55062J022677r09057j839907m62606J303258J326661K55011J64965J243932
39116A149872J527891n1206j874482j777858j00431Q35928J96923j57484J142010
39107H91163K231809N37931k800319l799320j208517J610834J594140P2211j39356
39098a009424N92085M2138j323828q44610J458245K167825l32915l047332k588143
$$ plain form
39089 -4885959 -4799430 -3329526 -2751015 -3104072 -2887155 -1845777 -1324196 -1955290 -2514817
39080 -2514817 -1733784 -294004 68205 -889627 -1540286 -859752 -2679 -417751 -1344457
39071 -1344457 -744183 1582570 3503210 3464936 2375954 1901787 2154244 2020240 907695
39062 907695 -745606 -2078699 -2247965 -960796 808374 1443794 699879 175837 1016852
39053 1016852 2225771 2348836 1762532 1803125 2435820 2514165 1925624 1732029 2293887 2896201
39043 2896201 3266694 3842698 4352464 3793996 2251605 1113514 808421 -94575 -2471154
39034 -2471154 -4652037 -4283910 -1477282 1244414 1873792 747533 -429153 -464171 540853
39025 540853 1675285 2221106 2284035 2377350 2464993 1934465 690468 -387827 -565044 -278569
$$ packed form
39089d885959Q6529J469904N78511l53057K16917J041378N21581o31094n59527
39080b514817P81033J439780L62209r57832o50659O80534Q57073m15072r26706
39071a344457O00274K326753J920640l8274j088982m74167K52457j34004j112545
39062I07695j653301j333093j69266J287169J769170O35420p43915n24042Q41015
39053A016852J208919J23065n86304M0593O32695P8345n88541j93595N61858O02314
39043B896201L70493N76004N09766n58468j542391j138091l05093r02996k376579
39034b471154k180883L68127K806628K721696O29378j126259j176686l5018J005024
39025E40853J134432N45821O2929R3315Q7643n30528j243997j078295j77217K86475
$$ plain form
39015 -278569 -386028 -725995 -188824 1753587 4097620 5079006 3848400 1482512 210853
39006 210853 1148816 2812421 2666919 339673 -1789666 -1816196 -895683 -1351382 -3207525
38997 -3207525 -4479408 -4510747 -4825099 -6234205 -7137924 -5805601 -2841487 -75724 1837046
38988 1837046 3287470 4094891 3637351 2151572 490636 -1059598 -2408007 -2638545 -1086872
38979 -1086872 817739 784325 -1034454 -1969946 -707347 741265 84227 -1890716 -2527899
38970 -2527899 -749088 2175674 4445282 4960753 3538395 1311720 307899 1271751
38962 1271751 2462745 1884194 -643 -1250423 -1391612 -1515128 -1870631 -1481830 -272496
38953 -272496 371380 -357796 -1605933 -2204928 -1779382 -381928 1449742 2155720 476498
$$ packed form
39015b78569j07459l39967N37171J942411K344033R81386j230606k365888j271659
39006B10853R37963J663605j45502k327246k129339k6530R20513m55699j856143
38997c207525j271883l1339l14352j409106r03719J332323K964114K765763J912770
38988A837046J450424Q07421m57540j485779j660936j550234j348409k30538J551673
38979a086872J904611l3414j818779r35492J262599J448612o57038j974943o37183
38970b527899J778811K924762K269608N15471j422358k226675j003821R63852
38962A271751J190994n78551j884837j249780j41189j23516l55503L88801J209334
38953b72496O43876p29176j248137n98995M25546J397454J831670P05978j679222
$$ plain form
38944 476498 -2293995 -3201821 -1368407 949877 1670346 1278421 993699 648877 -135389
38935 -135389 -495166 154717 588062 -342283 -1425793 -675949 1608128 3237170 3039482
38926 3039482 1711085 307280 -482302 -57191 1452220 2655711 2499995 1832444 1798114
38917 1798114 1499989 -562226 -3200160 -3310981 -270220 2846574 3259718 1709875 656879
38908 656879 938466 1467272 1066964 -521735 -2626589 -3846381 -3140671 -1329227 -462398
38899 -462398 -1078509 -1363127 69164 1919456 2069290 577161 -838767 -1518044 -2125240
38890 -2125240 -2487811 -1272212 1656687 4256788 4701743 3668280 3199174 4028687 5103926
38881 5103926 5312388 4611195 3600536 2942995 3185933 4234449 4929178 4113105 2296510
$$ packed form
38944D76498k770493r07826J833414K318284P20469l91925k84722l44822p84266
38935a35389l59777O49883M33345r30345j083510P49844K284077J629042j97688
38926C039482j328397j403805p89582M25111J509411J203491j55716o67551l4330
38917A798114k98125k062215k637934j10821L040761L116794M13144j549843j052996
38908F56879K81587N28806m00308j588699k104854j219792P05710J811444Q66829
38899d62398o16111k84618J432291J850292J49834j492129j415928o79277o07196
38890b125240l62571J215599K928899K600101M44955j033463m69106Q29513J075239
38881E103926K08462p01193j010659o57541K42938J048516O94729q16073j816595
$$ plain form
38872 2296510 1184072 1213015 880129 -723959 -2140525 -1685467 -177154 374956 29123
38863 29123 567390 2143763 2848901 2074548 1744787 3071769 4436965 4178614 3422284
38854 3422284 3863276 4253538 1924686 -2642726 -5468947 -3864966 238821 2578126
38846 2578126 1168731 -1964323 -3145225 -817942 2913785 4661385 3535558 1692094
38838 1692094 1065424 1154652 826607 516640 1050187 1706295 1384017 611529 379526 -18366
38828 -18366 -1689865 -3520582 -3476776 -2113411 -1998093 -3606016 -4583261 -3542444 -1868136
38819 -1868136 -904745 56442 1676846 2673869 1675509 -562358 -2244773 -2653207 -2018231
38810 -2018231 -482994 1578127 3117019 3383464 2772345 2115719 1810823 1909207 2117148
$$ packed form
38872B296510j112438K8943l32886j604088j416566M55058J508313N52110l45833
38863B9123N38267J576373P05138p74353l29761J326982J365196k58351p56330
38854C422284M40992L90262k328852m567412k826221J603981M103787K339305
38846B578126j409395l133054j180902K327283L731727J747600j125827j843464
38838A692094o26670Q9228l28045l09967N33547O56108l22278p72488k32003l97892
38828a8366j671499j830717M3806J363365J15318j607923r77245J040817J674308
38819a868136R63391R61187J620404R97023r98360k237867j682415m08434O34976
38810b018231J535237K061121J538892K66445o11119o56626l04896R8384K07941
$$ plain form
38801 2117148 1567867 -187137 -1813066 -1245828 1625729 4735123 6382288 6384384 4811419
38792 4811419 1840996 -856390 -1151278 379670 847837 -497796 -1002853 891516 2821075
38783 2821075 2154088 -170385 -1770418 -2367201 -2625852 -1735993 799910 2747622 1730039
38774 1730039 -1003399 -2365240 -1812660 -1007483 -373145 712449 1322328 143456 -1444918
38765 -1444918 -1107885 135058 -680249 -2883152 -2468701 1253640 3805853 2125989 -970871
38756 -970871 -1392891 494136 1696271 1594055 1835230 2782287 3146580 2451442 1424895
38747 1424895 407348 -668936 -1186171 -480978 814479 1543173 1637853 1627101 1257736
38738 1257736 192272 -567799 197902 1663111 1684558 -57570 -1368858 -557547 1211765
$$ packed form
38801B117148n49281j755004j625929N67238K871557L109394J647165K096j572965
38792D811419k970423k697386k94888J530948M68167j345633n05057J894369J929559
38783B821075o66987k324473j600033n96783k58651Q89859K535903J947712j017583
38774A730039k733438j361841N52580Q05177O34338J085594O09879j178872j588374
38765a444918L37033J242943q15307k202903M14451L722341K552213j679864l096860
38756i70871m22020J887027J202135j02216K41175R47057L64293o95138j026547
38747A424895j017547j076284n17235P05193J295457P28694R4680j0752l69365
38738A257736j065464p60071P65701J465209K1447j742128j311288Q11311J769312
$$ plain form
38729 1211765 1488245 -259703 -1923756 -1234136 1497904 3522051 2767183 430882 -425338
38720 -425338 1136730 2657194 1654051 -1022387 -2508847 -1693925 -16506 1061107
38712 1061107 1528111 1595225 770121 -970529 -2309901 -2025148 -677737 129905 -140928
38703 -140928 -543962 -241740 426837 748251 702551 628169 384385 -249349 -538933 719448
38693 719448 3343864 5431899 5638760 4965050 5210960 6229345 6072586 3759616 602519
38684 602519 -1400174 -1419694 53340 1722170 1936298 -56369 -2824581 -3877092 -2539718
38675 -2539718 -562306 449772 632687 348170 -904519 -2773254 -3192337 -1190534 950694
38666 950694 612356 -1281280 -1879134 -1027764 -1223083 -3104451 -4240619 -3135058 -1499367
$$ packed form
38729A211765K76480j747948j664053O89620K732040K024147p54868k336301q56220
38720d25338J562068J520464j003143k676438j486460Q14922J677419J077613
38712A061107M67004O7114q25104j740650j339372K84753J347411Q07642k70833
38703a40928m03034L02222O68577L21414m5700p4382k43784o33734k89584J258381
38693G19448K624416K088035K06861o73710K45910J018385j56759k312970l157097
38684F02519k002693j9520J473034J668830K14128j992667k768212j052511J337374
38675b539718J977412J012078J82915k84517j252689j868735m19083K001803K141228
38666I50694l38338j893636n97854Q51370j95319j881368j136168J105561J635691
$$ plain form
38657 -1499367 -1214346 -1557080 -1164801 -614159 -966432 -1353903 -268014 1755200 2839195
38648 2839195 2504456 1811252 1292045 597833 -133464 -357341 -397038 -950600 -1489791 -911608
38638 -911608 286109 404773 -692202 -1230135 -481202 -74693 -1367580 -3263893 -3966720
38629 -3966720 -3505732 -3073489 -2935018 -2514256 -1773064 -1027609 13651 1585020 2706606
38620 2706606 2170332 404036 -1062088 -1723685 -2134408 -2005613 -286956 2374668 3263189
38611 3263189 932694 -2529895 -4118929 -3754223 -3704591 -4764830 -5212400 -3877508 -2119875
38602 -2119875 -1543468 -1391204 -92517 1565545 1206939 -1191242 -2584096 -1045120 1469585
38593 1469585 2170498 1447395 1546298 2553696 2673952 2062569 3051700 5939721 7717814
$$ packed form
38657a499367K85021l42734L92279N50642l52273l87471J085889K023214J083995
38648B839195l34739o93204n19207o94212p31297k23877l9697n53562n39191N78183
38638i11608J197717J18664j096975n37933P48933M06509j292887j896313p02827
38629c966720M60988M32243J38471M20762P41192P45455J041260J571369J121586
38620B706606n36274j766296j466124o61597m10723J28795J718657K661624Q88521
38611C263189k330495l462589j589034L64706M9632j060239m47570J334892J757633
38602b119875N76407J52264J298687J658062l58606k398181j392854J538976K514705
38593A469585P00913p23103R8903J007398J20256o11383R89131K888021J778093
$$ plain form
38584 7717814 6430481 4045790 3057502 2760255 1464819 295749 1512773 4260374
38576 4260374 5420165 4329852 3431870 4067734 4680090 3893076 2698356 2522484 3269894
38567 3269894 4281402 5329783 5780434 4668423 2553370 1446825 1934517 2259874 1293667
38558 1293667 363339 784608 1609467 1545068 1277849 1893073 2550503 1941825 809606
38549 809606 679418 1041622 279139 -1179170 -1257442 206171 806608 -831411 -2792117
38540 -2792117 -2356229 391253 2553645 1706705 -1366472 -3313204 -1740985 1928743
38532 1928743 3842554 2174949 -885422 -2216151 -1458792 -427490 -121756 -157275 -403190
38523 -403190 -1161008 -1905264 -1650041 -636010 -96288 -243069 -4232 952923 1323497
$$ packed form
38584G717814j287333k384691r88288k97247j295436j169070J217024K747601
38576D260374J159791j090313q97982O35864O12356p87014j194720j75872P47410
38567C269894J011508J048381M50651j112011k115053j106545M87692L25357r66207
38558A293667r30328M21269Q24859o4399k67219O15224O57430o08678j132219
38549H09606j30188L62204p62483j458309p8272J463613O00437j638019j960706
38540b792117M35888K747482K162392q46940l073177j946732J572219L669728
38532A928743J913811j667605l060371j330729P57359J031302L05734l5519k45915
38523d03190p57818p44256K55223J014031N39722j46781K38837R57155L70574
$$ plain form
38514 1323497 -151958 -2995436 -5406375 -5902370 -4601861 -3315972 -3902957 -5905655
38506 -5905655 -6578925 -4223736 -656810 900366 -392192 -2735552 -4352790 -4635919
38498 -4635919 -3398667 -1150802 234138 -667869 -2452428 -2496914 -898288 -383589 -2010479
38489 -2010479 -3519793 -2795889 -634971 1095989 2041216 2749529 3176922 3261403 3746070
38480 3746070 5088766 6417148 6530259 5192931 2965560 807371 121677 1679641
38472 1679641 4019447 4592257 3102897 1846952 2001390 1862509 120332 -1424771 -527605
38463 -527605 1854919 2946583 1983650 321544 -1346534 -3306525 -4729546 -3848291 -685243
38454 -685243 2280534 2815279 1069455 -1290318 -2891526 -3256390 -2676217 -2013143 -2016108
$$ packed form
38514A323497j475455k843478k410939m95995J300509J285889n86985k002698
38506e905655o73270K355189L566926J557176j292558k343360j617238k83129
38498d635919J237252K247865J384940r02007j784559m4486J598626N14699j626890
38489b010479j509314P23904K160918J730960R45227P08313M27393Q4481M84667
38480C746070J342696J328382J13111j337328k227371k158189o85694J557964
38472A679641K339806N72810j489360j255945J54438j38881j742177j545103Q97166
38463e27605K382524J091664r62933j662106j668078j959991j423021Q81255L163048
38454f85243K965777N34745j745824k359773j601208l64864N80173O63074k965
$$ plain form
38445 -2016108 -2571677 -3032108 -3127231 -2922315 -2136413 -471616 1334517 1794556 471015
38436 471015 -1190410 -1469307 -494886 -24086 -980638 -2007165 -1281199 664858 1368212
38427 1368212 -20590 -1301267 -469751 1192457 1192580 -227446 -733442 186262 820909
38418 820909 631301 963261 1948045 1850798 406131 -389101 -63731 -832866 -3113441
38409 -3113441 -3469205 108974 4042262 3879117 679654 -1241975 -929318 -759403 -1198988
38400 -1198988 -378866 1488551 1941859 879709 978678 2702555 3120331 1050194 -654909
38391 -654909 75204 1070797 -213935 -2474859 -3107280 -2547377 -2916251 -4021810 -3874093
38382 -3874093 -2225616 -725050 -60989 437515 574028 -831934 -3547508 -5523732 -5507292
$$ packed form
38445b016108n55569m60431r5123K04916P85902J664797J806133M60039j323541
38436D71015j661425k78897R74421M70800r56552j026527P25966J946057P03354
38427A368212j388802j280677Q31516J662208J23j420026n05996R19704O34647
38418H20909j89608L31960R84784r7247j444667p95232L25370p69135k280575
38409c113441l55764L578179L933288j63145l199463j921629L12657J69915m39585
38400a198988Q20122J867417M53308j062150R8969J723877M17776k070137j705103
38391f54909P30113R95593j284732k260924o32421N59903l68874j105559J47717
38382c874093J648477J500566O64061M98504J36513j405962k715574j976224J6440
$$ plain form
38373 -5507292 -4457061 -3732793 -3263866 -2347087 -1196104 -638132 -762208 -821131 -412180
38364 -412180 -597 -34049 -136439 223609 585332 -53848 -1515657 -2271376 -1635472 -1015037
38354 -1015037 -1788346 -2906495 -2376842 -605530 -60988 -1453141 -2547800 -1645616 -121627
38345 -121627 8056 -616979 151840 2416509 3899210 3095028 1116479 -4774 194415
38336 194415 359300 -856114 -3054534 -4347663 -3622032 -2229455 -2345914 -3590780 -3011764
38327 -3011764 546767 3817582 2958799 -944318 -2875517 -429356 3308801 4398502
38319 4398502 3155115 2686657 3964924 4974832 4337485 3184711 2811456 2555927 1297257
38310 1297257 -359411 -956525 -444159 -25123 -159150 -251302 -217765 -802048 -2037166
$$ packed form
38373e507292J050231P24268M68927R16779J150983N57972j24076n8923M08951
38364d12180M11583l3452j02390L60048L61723o39180j461809p55719O35904O20435
38354a015037p73309j118149N29653J771312N44542j392153j094659R02184J523989
38345a21627J29683o25035P68819K264669J482701q04182j978549j121253J99189
38336A94415J64885j215414k198420j293129P25631J392577j16459j244866N79016
38327c011764L558531L270815q58783l903117j931199K446161L738157J089701
38319D398502j243387m68458J278267J009908o37347j152774l73255k55529j258670
38310A297257j656668n97114N12366M19036j34027r2152L3537n84283j235118
$$ plain form
38301 -2037166 -2754644 -2138385 -664871 939526 2507299 3677066 3628438 2401721 1351775
38292 1351775 1371300 1723666 1567278 1416672 1858881 2014278 866494 -788389 -1425518
38283 -1425518 -1124617 -1107016 -1592303 -1988585 -2661249 -4348088 -6025218 -5649193 -3261554
38274 -3261554 -1225535 -925112 -1243680 -887529 -139706 599388 2003371 4168152 5327508
38265 5327508 3850876 668790 -1617988 -1542815 192870 1928544 2529737 2094357 1657727
38256 1657727 1843697 1873358 737276 -839860 -974018 713429 2523315 3117097 2926245
38247 2926245 2601670 1789999 344004 -823027 -1140154 -1245225 -1468956 -961214 494296
38238 494296 1332457 406989 -915372 -546534 1348370 2841738 3128302 3378556 4898020
$$ packed form
38301b037166p17478O16259J473514J604397J567773J169767m8628j226717j049946
38292A351775J9525L52366j56388j50606M42209J55397j147784j654883o37129
38283a425518L00901J7601m85287l96282o72664j686839j677130L76025K387639
38274c261554K036019L00423l18568L56151P47823P39094J403983K164781J159356
38265E327508j476632l182086k286778P5173J735685J735674O01193m35380m36630
38256A657727J85970K9661j136082j577136j34158J687447J809886N93782j90852
38247B926245l24575q11671j445995j167031l17127j05071k23731N07742J455510
38238D94296Q38161r25468j322361L68838J894904J493368K86564K50254J519464
$$ plain form
38229 4898020 7451944 9252325 8255490 4294021 223247 -507743 1865973 3284634
38221 3284634 1095026 -2443571 -3456331 -1412627 1259247 2838155 3051942 1456812
38213 1456812 -1930165 -4878580 -4659477 -1600390 1305114 2243969 1863104 979776 -391979
38204 -391979 -1536267 -1124048 547224 1544453 1108960 440368 210867 -418381 -1547615
38195 -1547615 -1661631 -181301 1235889 1345107 1294576 2299939 3133922 2015859 -264750
38186 -264750 -1355679 -810803 -430479 -1302847 -2407661 -2486356 -1845791 -1703135 -2621024
38177 -2621024 -4130055 -5397218 -5849537 -5363908 -4149588 -2545467 -943114 299548
38169 299548 1166010 2024856 2922483 3074482 1791930 -216265 -1414372 -1404810 -1330394 -2094076
$$ packed form
38229D898020K553924J800381r96835l961469m070774p30990K373716J418661
38221C284634k189608l538597j012760K043704K671874J578908K13787j595130
38213A456812l386977k948415K19103L059087K905504R38855l80865q83328j371755
38204c91979j144288M12219J671272R97229m35493o68592k29501o29248j129234
38195a547615j14016J480330J417190J09218n0531J005363Q33983j118063k280609
38186b64750j090929N44876L80324q72368j104814p8695O40565J42656r17889
38177b621024j509031j267163m52319M85629J214320J604121J602353J242662
38169B99548Q66462Q58846Q97627J51999j282552k008195j198107R562P4416p63682
$$ plain form
38159 -2094076 -3237858 -3959044 -4107440 -3623940 -2205581 -394463 149547 -1326783 -3226583
38150 -3226583 -3512001 -2409044 -1722062 -1861417 -1336076 545897 2138758 1602774 -351123
38141 -351123 -1049918 888257 3674627 4142945 1323737 -2185373 -2902973 -428114 2120215
38132 2120215 1997772 82246 -899932 -480836 -783242 -2760242 -4416223 -3909957 -2514637
38123 -2514637 -2528664 -3452723 -2727665 32609 2163923 1904843 847001 1098929 1952364
38114 1952364 1305222 -891541 -2799262 -3624426 -4171084 -4649304 -4129608 -2529618 -1215684
38105 -1215684 -976094 -1005557 -592712 -289268 -582665 -837758 -525559 -242492 -512795 -763759
38095 -763759 -529899 -526052 -1387115 -2377786 -2478104 -1746862 -571395 1188580 3046120
$$ packed form
38159b094076j143782p21186j48396M83500J418359J811118N44010j476330j899800
38150c226583k85418J102957O86982j39355N25341J881973J592861n35984j953897
38141c51123o98795J938175K786370M68318k819208l509110p17600K474859K548329
38132B120215j22443j915526r82178M19096l02406j977000j655981N06266J395320
38123b514637j4027r24059P25058K760274K131314k59080j057842K51928Q53435
38114A952364o47142k196763j907721q25164n46658m78220N19696J599990J313934
38105a215684K39590k9463M12845L03444k93397k55093L12199K83067k70303k50964
38095g63759K33860L847q61063r90671j00318P31242J175467J759975J857540
$$ plain form
38086 3046120 3288009 1276605 -825445 -659923 862647 862400 -1326994 -3510449 -3881049
38077 -3881049 -2688466 -699949 1751012 3831797 4359518 3499611 2732388 2691918 2519037
38068 2519037 1632444 542951 -414725 -1528883 -2508073 -2452519 -1450109 -624249 -257708
38059 -257708 407150 1184318 818806 -531451 -900850 330480 1020271 -530838 -2842418
38050 -2842418 -3475595 -2437391 -1474706 -1237623 -1172328 -1315444 -2078025 -2696525 -1862590
38041 -1862590 173683 1734096 1944395 1442881 884517 179796 -527441 -430534 792632
38032 792632 2224255 2682354 2011236 999909 314081 -103680 -606697 -1137784 -1294558
38023 -1294558 -1123479 -1301623 -2059653 -2440402 -1488439 121095 717025 -127707 -1074465
$$ packed form
38086C046120K41889k011404k102050J65522J522570k47k189394k183455l70600
38077c881049J192583J988517K450961K080785N27721q59907p67223m0470j72881
38068B519037q86593j089493r57676j114158r79190N5554J002410Q25860L66541
38059b57708O64858P77168l65512j350257l69399J231330O89791j551109k311580
38050b842418o33177J038204R62685K37083O5295j43116p62581o18500Q33935
38041a862590K036273J560413K10299n01514n58364p04721p07237R6907J223166
38032G92632J431623M58099o71118j011327o85828m17761n03017n31087j56774
38023a294558J71079j78144p58030l80749R51963J609534N95930q44732r46758
$$ plain form
38014 -1074465 -879651 244322 1301478 1541401 666855 -947149 -2125133 -2062842 -1607286
38005 -1607286 -2074856 -2928285 -2408754 -618118 160485 -1111797 -2573669 -2294231 -900098
37996 -900098 -184260 -794188 -2461119 -4727344 -6176483 -4926006 -1508674 695743 -193903
37987 -193903 -1744142 -997324 907603 871323 -938933 -1561598 -293538 431747 -479126
37978 -479126 -866668 933023 3175198 3268189 1422276 -63992 -152691 -28605 -888898
37969 -888898 -1976847 -1412460 1211234 3763321 3856057 1864378 344190 361750 240452
37960 240452 -1324340 -2987298 -3023980 -1934096 -898384 488114 2554706 3342133 1068583
37951 1068583 -2307479 -3217578 -1594928 -653404 -1837025 -3299619 -3577590 -3470275 -3590363
$$ packed form
38014a074465J94814J123973J057156K39923q74546j614004j177984O2291M55556
38005a607286m67570q53429N19531J790636P78603j272282j461872K79438J394133
37996i00098P15838o09928j666931k266225j449139J250477L417332K204417q89646
37987a93903j550239P46818J904927l6280j810256o22665J268060P25285r10873
37978d79126l87542J799691K242175R2991j845913j486268q8699J24086q60293
37969h88898j087949N64387K623694K552087R2736j991679j520188J7560j21298
37960B40452j564792j662958l6682J089884J035712J386498K066592P87427k273550
37951A068583l376062r10099J622650R41524j183621j462594k77971J07315j20088
$$ plain form
37942 -3590363 -3069745 -1704774 -787095 -800730 -625294 144211 449261 131437 575542
37933 575542 2059952 2919528 2379715 1783465 1928473 1748844 887892 879293 2156932 2525979
37923 2525979 597215 -1598653 -1549786 254958 1824375 2545204 2426972 710574 -2168569
37914 -2168569 -3264974 -791282 2462106 2528318 -86612 -1396633 197970 2359298
37906 2359298 2890351 2190581 1376056 751086 681547 1581548 2454960 1624876 -479268
37897 -479268 -1305371 322595 2513020 2922920 1496471 -205682 -1027042 -752035 243615
37888 243615 1153055 1410523 1572057 2537720 3678867 3055215 55399 -3378008 -4924271
37879 -4924271 -4359504 -3116174 -2195610 -1434000 -406156 808972 1781044 2172272 1867089
$$ packed form
37942c590363N20618J364971R17679j3635J75436P69505L05050l17824M44105
37933E75542J484410Q59576n39813n96250J45008j79629q60952q599J277639L69047
37923B525979j928764k195868M8867J804744J569417P20829j18232j716398k879143
37914b168569j096405K473692L253388O6212k614930j310021J594603K161328
37906B359298N31053o99770q14525o24970o9539R00001Q73412q30084k104144
37897d79268q26103J627966K190425M09900j426449j702153q21360K75007R95650
37888B43615R09440K57468J61534R65663J141147o23652k999816l433407j546263
37879d924271N64767J243330R20564P61610J027844J215128R72072L91228l05183
$$ plain form
37870 1867089 812517 -965349 -2881130 -3605040 -2233329 167419 1201791 -134036
37862 -134036 -2374138 -3836438 -4613200 -5231667 -4878192 -2897844 -979629 -1386877 -3349183
37853 -3349183 -3687765 -1249708 1584722 2391214 1538737 615047 -29038 -811520 -1442172
37844 -1442172 -1410229 -1121160 -1346282 -2073401 -2715811 -2883161 -2338088 -935787 745217
37835 745217 1484935 833653 -241439 -688978 -511542 71271 1562290 4192785 6682247
37826 6682247 7237644 5621481 3347829 1917068 1483743 1157387 198774 -920021 -595913
37817 -595913 2060864 5275645 5716866 2409469 -1551820 -2493544 -543806 1066219 527845
37808 527845 -739438 -958158 -559922 -795123 -1299381 -693582 970653 1899121 809868
$$ packed form
37870A867089j054572j777866j915781p23910J371711K400748J034372j335827
37862a34036k240102j462300p76762o18467L53475J980348J918215m07248j962306
37853c349183l38582K438057K834430Q06492q52477r23690o44085p82482o30652
37844a442172L1943K89069k25122p27119o42410j67350N45073J402301J681004
37835G45217P39718o51282j075092m47539J77436N82813J491019K630495K489462
37826F682247N55397j616163k273652j430761m33325l26356r58613j118795L24108
37817e95913K656777L214781M41221l307397l961289r41724J949738J610025n38374
37808E27845j267283k18720L98236k35201n04258O05799J664235R28468j089253
$$ plain form
37799 809868 -1520181 -3258673 -3386442 -2254843 -819484 210169 649879 669674 491440
37790 491440 278620 293964 886623 1987291 2747147 2176515 277464 -1832635 -3088057
37781 -3088057 -3428940 -3435505 -3396354 -3026207 -1899140 -41057 1678704 1901532 175058
37772 175058 -2046373 -2753648 -1898022 -1321685 -1771458 -1670494 23648 1558258 1005675
37763 1005675 -280006 457726 2796992 3545129 1725366 -73154 -36449 376467 -323717
37754 -323717 -902412 11790 1034340 216980 -1665247 -2516916 -2213433 -2069181 -2217591
37745 -2217591 -1974814 -1814339 -2442028 -2619990 -467975 3391767 6256178 6704368 5622112
37736 5622112 4295278 3391776 3313575 3659827 3014776 1147862 326658 2143660 4332917
$$ packed form
37799H09868k330049j738492j27769J131599J435359J029653M39710J9795j78234
37790D91440k12820J5344N92659J100668P59856n70632j899051k110099j255422
37781c088057l40883o565L9151L70147J127067J858083J719761K22828j726474
37772A75058k221431p07275Q55626N76337m49773J00964J694142J534610n52583
37763A005675j285681P37732K339266P48137j819763j798520L6705M12916p00184
37754c23717n78695R14202J022550q17360j882227q51669L03483J44252j48410
37745b217591K42777J60475o27689j77962K152015L859742K864411M48190j082256
37736E622112j326834r03502p8201L46252o45051j866914q21204J817002K189257
$$ plain form
37727 4332917 3647500 747386 -1134646 -1357896 -1769932 -2200927 -707002 1702073 1598463
37718 1598463 -792090 -1161795 1727684 3661931 2019648 -42173 334188 588687 -1864464
37709 -1864464 -3668865 -599204 4629256 5821110 2741812 921298 2710111 4563512
37701 4563512 3756094 2281889 2449228 3075336 2244616 579141 -314683 -310019 -113880
37692 -113880 -74944 -644214 -2166678 -3588683 -3337440 -1822468 -824231 -270185 1514760
37683 1514760 3901117 3699072 126348 -3198113 -3188982 -1425556 -1065744 -2129474 -2593259
37674 -2593259 -2244833 -2407183 -2957920 -2487518 -877821 705366 1969238 3395609 4353983
37665 4353983 3649225 1938828 1353340 2354887 2999679 1934625 303755 -197282 415507
$$ packed form
37727D332917o85417k900114j882032k23250m12036m30995J493925K409075j03610
37718A598463k390553l69705K889479J934247j642283k061821L76361K54499k453151
37709a864464j804401L069661N228460J191854l079298j820514J788813J853401
37701D563512q07418j474205J67339O26108q30720j665475q93824M664J96139
37692a13880L8936n69270j522464j422005K51243J514972R98237N54046J784945
37683A514760K386357k02045l572724l324461R131J763426L59812j063730m63785
37674b593259L48426j62350n50737M70402J609697J583187J263872J426371R58374
37665D353983p04758j710397n85488J001547O44792j065054j630870n01037O12789
$$ plain form
37656 415507 1208179 2058307 3127813 3439454 1701706 -1482239 -3704273 -3543220 -2176370
37647 -2176370 -1450044 -1263416 -150825 1930391 3075057 2211765 962211 1516652 3527124
37638 3527124 4578095 3425883 1347516 213170 486715 1423016 2152368 2130571 1364178
37629 1364178 608607 697033 1450593 1904974 1662066 1199852 846739 479326 319602 831328
37619 831328 1567803 1398741 321145 -236292 506521 1558783 1784751 1360225 819443
37610 819443 8762 -1003774 -1322002 -736875 -519720 -1230811 -1021499 1979312 6491954
37601 6491954 9349985 9384790 8013700 6379656 4219493 1642951 -286574 -1330246
37593 -1330246 -2423311 -3515456 -3010876 -436787 2059656 2268887 677349 -664174
$$ packed form
37656D15507P92672Q50128J069506L11641j737748l183945k222034J61053J366850
37647b176370P26326J86628J112591K081216J144666q63292j249554N54441K010472
37638C527124J050971j152212k078367j134346K73545R36301P29352k1797p66393
37629A364178p55571Q8426P53560M54381k42908m62214l53113l67413j59724N11726
37619H31328P36475j69062j077596n57437P42813J052262K25968m24526n40782
37610H19443q10681j012536l18228N85127K17155p11091K09312L000811M512642
37601F491954K858031L4805j371090j634044k160163k576542j929525j043672
37593a330246j093065j092145N04580K574089K496443K09231j591538j341523
$$ plain form
37585 -664174 -844106 -234594 918342 2258180 2462091 646805 -1633174 -1768445 393888
37576 393888 2285141 2255545 1574377 1929956 2764600 2629224 1848761 1852351 2473420 2009617
37566 2009617 47218 -1692190 -1906266 -1425427 -1361956 -989571 967415 3750714 5058480
37557 5058480 4018279 2109485 874056 202468 -398631 -169268 1890027 4870868 6228900
37548 6228900 4535908 1239093 -729511 142544 2553177 3712592 2092079 -969589
37540 -969589 -2566251 -1382496 788456 1253540 -189317 -1161702 -180433 1152294 527701
37531 527701 -1464819 -1927008 169657 2292791 1732789 -845768 -2758020 -3179307 -3599994
37522 -3599994 -4607562 -4517307 -2101594 1101123 2675353 2373070 1606396 671003 -1425412
$$ packed form
37585f64174j79932O09512J152936J339838K03911j815286k279979j35271K162333
37576C93888J891253k9596o81168L55579Q34644j35376p80463L590O21069m63803
37566B009617j962399j739408k14076M80839O3471L72385J956986K783299J307766
37557E058480j040201j908794j235429o71588o01099K29363K059295K980841J358032
37548F228900j692992l296815j968604Q72055K410633J159415j620513l061668
37540i69589j596662J183755K170952M65084j442857r72385R81269J332727o24593
37531E27701j992520m62189K096665K123134n60002k578557j912252m21287m20687
37522c599994j007568R0255K415713L202717J574230l02283p66674r35393k096415
$$ plain form
37513 -1425412 -4286751 -5410136 -3289807 88156 1369170 -107750 -1853832 -1751797
37505 -1751797 -436130 479326 1066381 2391024 3876681 3528488 1260971 -10051 1965694
37496 1965694 5418890 6768943 5295946 3366908 2407266 1330034 -541988 -1648057
37488 -1648057 -642471 1376202 2656711 3103381 3209932 2473336 881676 368454 2305177
37479 2305177 4706988 4600799 2387802 1083010 1743858 2640482 2822102 3311689 4326046
37470 4326046 4450649 3500960 3242095 4004445 3466724 532708 -2215109 -2072758 -3403
37461 -3403 1447696 2052965 3079819 4137481 3786743 2424016 1767048 1926165 1570906
37452 1570906 701549 608060 1073498 356596 -1526825 -2146521 -367048 1594202 1414279
$$ packed form
37513a425412k861339j123385K120329L377963J281014j476920j746082J02035
37505a751797J315667R15456N87055J324643J485657l48193k267517j271022J975745
37496A965694L453196J350053j472997j929038r59642j077232j872022j106069
37488a648057J005586K018673J280509M46670J06551p36596j591660n13222J936723
37479B305177K401811j06189k212997j304792O60848Q96624J81620M89587J014357
37470D326046J24603r49689k58865P62350n37721k934016k747817J42351K069355
37461c403J451099O05269J026854J057662l50738j362727o56968J59117l55259
37452A570906q69357r3489M65438p16902j883421o19696J779473J961250j79923
$$ plain form
37443 1414279 174115 616871 2978904 4757149 4432287 3400679 3565722 4479894 4108152
37434 4108152 1806740 -763081 -1767961 -1166136 -74256 890594 1751206 2292619 2229224
37425 2229224 2054146 2552205 3389521 3265243 1683411 -378371 -1751391 -2096732 -1579671
37416 -1579671 -630771 -141324 -681800 -1403147 -1039200 456 244223 -107631 650842
37407 650842 2368649 2582189 645157 -499797 1308209 3831345 3757672 1499997 -272533
37398 -272533 -1048963 -2002092 -2487290 -912785 1473543 1642240 -216110 -571041 1801543
37389 1801543 3657452 2171190 -1099877 -2894300 -2378511 -784752 939494 2189236
37381 2189236 2083013 656101 -526561 -416708 34608 -322873 -943270 -905709 -769247
$$ packed form
37443A414279j240164M42756K362033J778245l24862j031608J65043R14172l71742
37434D108152k301412k569821j004880O01825J091880R64850Q60612N41413o3395
37425B229224j75078M98059Q37316j24278j581832k061782j373020l45341N17061
37416a579671R48900M89447n40476p21347L63947J039656K43767l51854P58473
37407F50842J717807K13540j937032j144954J808006K523136p3673k257675j772530
37398b72533p76430r53129m85198J574505K386328J68697j858350l54931K372584
37389A801543J855909j486262l271067j794423N15789J593759J724246J249742
37381B189236j06223j426912j182662J09853M51316l57481o20397L7561J36462
$$ plain form
37372 -769247 -1404010 -1994258 -1022891 1263408 2920270 2647925 990318 -582886 -1003910
37363 -1003910 -308994 470764 543170 614901 1936818 3888348 4071464 1621898 -1120307
37354 -1120307 -1478467 364352 2439059 3923101 5125351 5521705 4115103 1631214
37346 1631214 310764 1097578 2564053 3114186 2880063 2696416 2372344 1195211 -376358
37337 -376358 -921988 -282414 -407458 -2851877 -5961848 -6253193 -2981398 443206 810010
37328 810010 -776589 -1116719 108085 419675 -950767 -1928774 -1379547 -806348 -1159409
37319 -1159409 -995198 479626 1328757 101665 -1269668 -473922 1144519 514389 -2375443
37310 -2375443 -4482738 -3886690 -1500748 898092 2175786 1896231 870627 1004195 2719418
$$ packed form
37372g69247o34763n90248R71367K286299J656862k72345j657607j573204m21024
37363a003910O94916P79758P2406P1731J321917J951530J83116k449566k742205
37354a120307l58160J842819K074707J484042J202250L96354j406602k483889
37346A631214j320450P86814J466475N50133k34123j83647l24072j177133j571569
37337c76358n45630O39574j25044k444419l109971k91345L271795L424604L66804
37328H10010j586599l40130J224804L11590j370442r78007N49227N73199l53061
37319a159409J64211J474824Q49131j227092j371333P95746J618441o30130k889832
37310b375443k107295N96048K385942K398840J277694k79555j025604J33568J715223
$$ plain form
37301 2719418 3584308 1704372 -840404 -807746 1131549 1665243 513230 714869 3013290
37292 3013290 4230091 2519240 330711 105330 392477 -1130854 -3443572 -3939616 -2592941
37283 -2592941 -1491590 -1354781 -1136490 -447144 -61619 -257949 -455380 -392096 -373672 -644046
37273 -644046 -1471886 -3195055 -5209506 -5871894 -4584709 -2919894 -2311096 -1832546 -51076
37264 -51076 2011324 2050215 81376 -1481496 -1366338 -947040 -1878442 -4014832 -6104212
37255 -6104212 -7030156 -6047487 -3321115 -611307 91391 -913112 -1294507 118204 1948638
37246 1948638 2570746 2050125 967624 -863528 -3159377 -4225308 -2994890 -892867
37238 -892867 120078 423153 1632986 3309244 3239291 1124920 -475722 171283 1361653
$$ packed form
37301B719418Q64890j879936k544776L2658J939295N33694j152013K01639K298421
37292C013290J216801j710851k188529k25381K87147j523331k312718m96044J346675
37283b592941J101351J36809K18291O89346L85525j96330j97431O3284J8424k70374
37273f44046q27840j723169k014451o62388J287185J664815O08798M78550J781470
37264e1076K062400L8891j968839j562872J15158M19298r31402k136390k089380
37255f104212r25944R82669K726372K709808P02698j004503l81395J412711J830434
37246A948638O22108n20621j082501j831152k295849j065931J230418K102023
37238h92867J012945L03075J209833J676258o9953k114371j600642O47005J190370
$$ plain form
37229 1361653 531548 -1894403 -3054032 -1531412 994940 2152023 1652209 1053160 1402147
37220 1402147 1947866 1389880 -4994 -317430 1507028 3727367 3666538 1445253 214470
37211 214470 1940461 4588039 4982222 3174199 1830431 1970365 1898841 575705 -568099
37202 -568099 -265244 341086 -248078 -1253005 -1050023 -119802 -319326 -1678319 -2128259
37193 -2128259 -559014 1753817 3222645 3825640 4255235 4570017 4569046 4525020 4714115 4911195
37183 4911195 4936133 4949650 4698535 3440209 1405136 367259 1574163 3702089 4164583
37174 4164583 2250156 -223814 -1369125 -1183821 -795501 -764020 -703934 -39029 1286787
37165 1286787 2520965 2477523 801574 -1120687 -1431483 -223895 444326 -457795 -1302881
$$ packed form
37229A361653q30105k425951j159629J522620K526352J157083m99814n99049L48987
37220A402147N45719n57986j394874l12436J824458K220339o0829k221285j230783
37211B14470J725991K647578L94183j808023j343768J39934p1524j323136j143804
37202e68099L02855O06330n89164j004927K02982R30221j99524j358993m49940
37193b128259J569245K312831J468828O02995M29595L14782r71m4026J89095J97080
37183D911195K4938J3517k51115j258326k035073j037877J206904K127926M62494
37174D164583j914427k473970j145311J85304L88320L1481O0086O64905J325816
37165A286787J234178m3442j675949j922261l10796J207588O68221r02121q45086
$$ plain form
37156 -1302881 -428508 880435 136155 -2222966 -3039832 -1083641 1163690 1472626 1029313
37147 1029313 1644324 2070347 82490 -3128151 -4103787 -2331062 -868685 -1380698 -1970110
37138 -1970110 -1118044 -471483 -1647814 -3017443 -2356292 -702170 -613515 -1886504 -2042321
37129 -2042321 -475234 752033 225386 -1135100 -1897030 -1617576 -428873 1022889 1264742
37120 1264742 -453257 -2355133 -1926507 524406 2308523 2384623 2359899 3059903 2986538
37111 2986538 1370203 118045 966369 2752093 3358790 2671598 1782074 856194 -191924
37102 -191924 -251530 1552807 3867718 4620682 3891338 3382684 3629583 3691847 3193561 2647247
37092 2647247 1924459 412015 -1214735 -1342948 10614 765570 -303276 -1671698 -1184842
$$ packed form
37156a302881Q74373J308943p44280k359121q16866J956191K247331L08936m43313
37147A029313O15011M26023j987857l210641r75636J772725J462377n12013n89412
37138a970110Q52066O46561j176331j369629O61151J654122Q8655j272989j55817
37129b042321J567087J227267n26647j360486p61930K79454J188703J451762K41853
37120A264742j717999j901876M28626K450913J784117P6100k4724P00004p3365
37111B986538j616335j252158Q48324J785724O06697o87192q89524r25880j048118
37102a91924n9606J804337K314911P52964p29344n08654K46899O2264m98286n46314
37092B647247p22788j512444j626750j28213J353562P54956j068846j368422M86856
$$ plain form
37083 -1184842 858528 1978539 695947 -1498294 -1834410 304037 2377611 1747222
37075 1747222 -809030 -2000328 -451707 1599852 1776600 733621 301335 266960 -643594
37066 -643594 -1790527 -1402227 187076 903603 495729 846840 2280731 2496957 355721
37057 355721 -1871189 -1686599 233628 1551155 1437728 479754 -955286 -2242663 -1762386
37048 -1762386 1107412 4213392 5108591 4572622 5218137 7043065 7200444 4566289 1806542
37039 1806542 1662252 3284991 3956823 3027557 2186341 2412202 2549074 1253581 -845589
37030 -845589 -1708683 -298657 2131847 3410476 2902512 2028949 2102178 2470431 1798954
37021 1798954 652282 1187657 4001215 6808579 7109965 5002954 2337952 150564
$$ packed form
37083a184842K043370J120011j282592k194241l36116K138447K073574o30389
37075A747222k556252j191298J548621K051559J76748j042979m32286l4375r10554
37066f43594j146933L88300J589303P16527m07874L51111J433891K16226k141236
37057C55721k226910J84590J920227J317527j13427r57974j435040j287377M80277
37048a762386K869798L105980Q95199n35969O45515J824928J57379k634155k759747
37039A806542j44290J622739O71832r29266q41216K25861J36872j295493k099170
37030h45589q63094J410026K430504J278629n07964q73563P3229L68253o71477
37021A798954j146672N35375K813558K807364L01386k107011k665002k187388
$$ plain form
37013 150564 -1664060 -2837420 -2626758 -1271400 -173115 -272957 -1161449 -1960300 -2169926
37004 -2169926 -1519609 -32200 1423089 1623525 517738 -563622 -664814 -335151 -495581
36995 -495581 -1024204 -1137442 -509134 579274 1552830 1557628 62629 -1970111 -2595281
36986 -2595281 -1383677 -225103 -548972 -1117154 -259345 965771 249116 -1960490 -2680607
36977 -2680607 -819047 1268283 1479439 908830 1761257 4083815 6045326 6300480 4928511
36968 4928511 3024159 2132355 2874908 3542377 1722244 -1898257 -3484239 -1129313 2304157
36959 2304157 3339646 2554217 2421014 2645893 1330488 -530910 10732 2590336 3429942
36950 3429942 1261559 -616754 325806 2105239 1946585 616916 395978 1257127 1989893
$$ packed form
37013A50564j814624j173360K10662J355358J098285r9842q88492p98851k09626
37004b169926O50317J487409J455289K00436j105787j081360j01192L29663j60430
36995d95581n28623j13238O28308J088408R73556M798j494999k032740o25170
36986b595281J211604J158574l23869n68182Q57809J225116p16655k209606p20117
36977b680607J861560K087330K11156n70609Q52427K322558J961511K55154j371969
36968D928511j904352q91804P42553O67469j820133l620501j585982K354926L433470
36959B304157J035489p85429j33203K24879j315405j861398N41642K579604Q39606
36950C429942k168383j878313R42560J779433j58654j329669k20938Q61149P32766
$$ plain form
36941 1989893 3080861 5256977 6646907 4903987 1481001 353659 2453387 4510993
36933 4510993 3958994 2117530 1512266 2494376 3899890 5149792 6197931 6768392 6965857
36924 6965857 7532236 8405259 8211270 6389408 4640853 4779980 6055403 6283493 5111258
36915 5111258 4381786 5276438 6700106 6963529 5917504 4766924 4399154 4449165 3845187
36906 3845187 2145822 385126 210973 1809342 3251267 2685965 704318 -570851
36898 -570851 -440424 -239203 -847164 -1154832 164683 2474253 3839466 3299491 1632857
36889 1632857 311765 358101 1678027 2799793 1891958 -1024415 -3416798 -2924941 -356593
36880 -356593 1286467 692939 -268400 682755 3254174 5154152 4814952 2689449 318081
$$ packed form
36941A989893J090968K176116J389930j742920l422986j127342K099728K057606
36933D510993n51999j841464o05264R82110J405514J249902J048139N70461J97465
36924F965857N66379Q73023j93989j821862j748555J39127J275423K28090j172235
36915E111258p29472Q94652J423668K63423j046025j150580l67770N0011o03978
36906C845187j699365j760696j74153J598369J441925n65302j981647j275169
36898e70851J30427K01221o07961l07668J319515K309570J365213n39975j666634
36889A632857j321092M6336J319926J121766r07835k916373k392383M91857K568348
36880c56593J643060n93528r61339R51155K571419J899978l39200k125503k371368
$$ plain form
36871 318081 -1076248 -1212180 -585676 215959 1179221 2675883 4523850 5640190 4992992
36862 4992992 2747514 241521 -1095613 -802232 343263 1038792 731201 192882 494874
36853 494874 1473812 1800121 740059 -690535 -704343 1336631 4136815 5496558 4305853
36844 4305853 1817438 583789 1580271 2889527 2222952 286887 74899 2718813 5786140
36835 5786140 6444168 4849094 3314307 3232348 4036334 4494285 3986161 3007005 3057393
36826 3057393 5223846 8241756 9155077 6888417 3926106 3143521 4184136 4630096 3696198
36817 3696198 2704787 2494023 2483835 2191613 1839438 1489866 1187283 1732656 3587713
36808 3587713 5313177 5122882 3832525 3943323 5601945 5989910 3528201 408899 -283353
$$ packed form
36871C18081j394329j35932O26504Q01635R63262J496662J847967J116340o47198
36862D992992k245478k505993j337134K93381J145495O95529l07591n38319L01992
36853D94874R78938L26309j060062j430594j3808K040974K800184J359743j190705
36844D305853k488415j233649R96482J309256o66575j936065k11988K643914L067327
36835E786140O58028j595074j534787q1959Q03986M57951n08124r79156N0388
36826C057393K166453L017910R13321k266660k962311p82585J040615M45960r33898
36817C696198r91411k10764j0188k92222l52175l49572l02583N45373J855057
36808C587713J725464j90295j290357J10798J658622L87965k461709l119302o92252
$$ plain form
36799 -283353 1770562 4463622 5735657 4737702 2059037 -196012 36144 2252032 3782627
36790 3782627 3305554 2146875 1439053 399354 -1246355 -1667323 165743 2130943 1951856
36781 1951856 740743 903957 2125670 2455893 2119070 2817248 3945266 3149809 668146
36772 668146 -474188 781830 1955466 1332260 672066 1880090 3670919 3769234 2453392
36763 2453392 1595067 1593311 1589272 1817091 3403643 6030824 7722105 7232537 5402755
36754 5402755 3897579 3472801 3677881 3700858 3351984 3320476 4193003 5270483 5156955
36745 5156955 3720344 2411746 2138523 2000985 989981 -221996 -395456 307834 862071
36736 862071 1147643 1651190 1950474 1247666 222441 535568 2264045 3527391 3187300
$$ packed form
36799b83353K053915K693060J272035r97955k678665k255049K32156K215888J530595
36790C782627m77073j158679p07822j039699j645709m20968J833066J965200j79087
36781A951856j211113J63214J221713L30223l36823O98178J128018p95457k481663
36772F68146j142334J256018J173636o23206o60194J208024J790829R8315j315842
36763B453392q58325j756m039K27819J586552K627181J691281m89568j829782
36754E402755j505176m24778K05080K2977l48874l1508Q72527J077480j13528
36745E156955j436611j308598k73223j37538j011004j211977j73460P03290N54237
36736H62071K85572N03547K99284p02808j025225L13127J728477J263346l40091
$$ plain form
36727 3187300 2362398 2463378 3113516 3137477 2560690 2316647 2619161 2973429 3507445 4916342
36717 4916342 6908751 7920922 7059991 5634422 5862289 8136486 10304915 10033394 7460210
36708 7460210 4875270 3903026 3971132 4005778 4506420 6539165 9205103 10062038 8495051
36699 8495051 6858591 7220749 8556316 8724783 7899080 7885793 8839813 9233893 9033563
36690 9033563 10136904 12853289 14541045 13342639 11181142 10977940 12486992 13304410
36682 13304410 12916333 12970898 13891592 14077132 12905693 11963265 12295326 12680642 12123235
36673 12123235 12245356 15176572 19981250 23184391 22779147 20287348 18656106 19178562
36665 19178562 20951188 22745875 24641631 27462960 30932487 33445050 34359047 35486801
$$ packed form
36727C187300q24902J00980O50138K3961n76787k44043L02514L54268N34016J408897
36717D916342J992409J012171q60931j425569K27867K274197K168429k71521k573184
36708G460210k584940r72244O8106L4646N00642K032745K665938Q56935j566987
36699H495051j636460L62158J335567J68467q25703j3287R54020L94080k00330
36690I033563J103341K716385J687756j198406k161497k03202J509052Q17418
36682A3304410l88077N4565R20694J85540j171439r42428L32061L85316n57407
36673A2123235J22121K931216M804678L203141m05244k491799j631242N22456
36665A9178562J772626J794687J895756K821329L469527K512563R13997J127754
$$ plain form
36657 35486801 38810902 43396354 46712430 48896309 53030260 60428127 68445806 74664490
36649 74664490 80726639 89574048 100937957 112670380 125218751 141284409 161445396
36642 161445396 183496163 206331820 231190426 258074005 283598442 303458006 314743277
36635 314743277 315136403 302929396 279848971 251594648 223278555 195764418 168225125
36628 168225125 142317029 121122522 105107745 91970228 80178799 70237140 62519937
36621 62519937 56258780 51134676 47835641 46216179 44474857 41147123 36866843 33286485
36613 33286485 31046671 29663662 28862311 28996074 30016983 30698742 29613355 27086523
36605 27086523 25461325 26396885 28203199 27465586 23683037 20360256 20285952 21657074 21020767
$$ packed form
36657C5486801L324101M585452L316076K183879M133951P397867Q017679O218684
36649G4664490O062149Q847409J1363909J1732423J2548371J6065658K0160987
36642A61445396K2050767K2835657K4858606K6883579K5524437J9859564J1285271
36635C14743277L93126j2207007k3080425k8254323k8316093k7514137k7539293
36628A68225125k5908096k1194507j6014777j3137517j1791429r941659p717203
36621F2519937o261157n124104l299035j619462j741322l327734m280280l580358
36613C3286485k239814j383009q01351J33763J020909O81759j085387k526832
36605B7086523j625198R35560J806314p37613l782549l322781p4304J371122o36307
$$ plain form
36596 21020767 18547890 17415340 18571248 19473520 18463529 17125432 16916243 16290013
36588 16290013 13362109 9455631 7572329 8513786 10680376 12736395 14220636 14236882
36580 14236882 12087149 9216619 8272614 9826771 11884890 12992874 13839470 15109077
36572 15109077 15832563 15266518 14844538 16492205 19865127 22935555 24851435 26586816
36564 26586816 28869426 31095208 32746498 34541977 37181698 39579483 39452894 35898544
36556 35898544 30850134 27479031 27074451 27824516 26986153 23997289 20816379 19230657
36548 19230657 18790130 17930404 16275642 14780159 13951923 13094890 11470165 9343281 7556143
36539 7556143 6634916 6558408 6898885 6985598 6431699 5737053 5890759 7058569 8017860 7240469
$$ packed form
36596B1020767k472877j132550J155908R02272j009991j338097k09189o26230
36588A6290013k927904l906478j883302R41457K166590K056019J484241J6246
36580A4236882k149733k870530r44005J554157K058119J107984Q46596J269607
36572A5109077P23486n66045m21980J647667L372922L070428J915880J735381
36564B6586816K282610K225782J651290J795479K639721K397785j26589l554350
36556C5898544n048410l371103m04580P50065q38363k988864l180910j585722
36548A9230657m40527q59726j654762j495483q28236q57033j624725k126884j787138
36539G556143r21227p6508L40477Q6713n53899o94646J53706J167810R59291p77391
$$ plain form
36529 7240469 4446952 1041474 -876163 -175754 2197739 3985482 3977914 3264178 3374978
36520 3374978 3724748 2387480 -589529 -2462436 -1172517 2011662 4307354 4659933
36512 4659933 3976258 3275375 3120462 3999825 5557758 6015386 4102057 1199443 -189629
36503 -189629 193918 469161 -101832 -278287 363559 310803 -1132278 -2232747 -1578254
36494 -1578254 -546781 -1033900 -2206217 -1899197 -326204 232391 -777063 -1344045 -400113
36485 -400113 228308 -1306653 -3791612 -4532645 -3123836 -1788681 -2087673 -2975907 -2751120
36476 -2751120 -1666123 -1322130 -1907633 -1601640 673649 3120031 3071492 670025 -1172635
36467 -1172635 -788944 14005 -1149062 -3522984 -4216676 -2329712 -105812 190461 -1176640
$$ packed form
36529G240469k793517l405478j917637P00409K373493J787743p568p13736J10800
36520C374978L49770j337268k977009j872907J289919L184179K295692L52579
36512D659933o83675p00883j54913Q79363J557933M57628j913329k902614j389072
36503a89629L83547K75243n70993j76455O41846n2756j443081j100469O54493
36494a578254J031473m87119j172317L07020J572993N58595j009454n66982R43932
36485d00113O28421j534961k484959p41033J408809J335155k98992q88234K24787
36476b751120J084997L43993n85503L05993K275289K446382m8539k401467j842660
36467a172635L83691Q02949j163067k373922o93692J886964K223900K96273j367101
$$ plain form
36458 -1176640 -2596090 -3396217 -3937313 -4362408 -4380438 -3914451 -3191442 -2481767 -2249314
36449 -2249314 -2992622 -4236706 -4313545 -2238232 490663 1196550 -757708 -3191033 -3891754
36440 -3891754 -3065431 -2301592 -2125848 -1817028 -1179402 -1044334 -1763334 -2335665 -1653124
36431 -1653124 75374 1736262 2628142 2763950 2290667 1321096 147776 -983651 -2167678
36422 -2167678 -3386226 -4052119 -3731604 -3107159 -3291514 -4168126 -4400723 -3314272 -1764191
36413 -1764191 -742013 -207694 -26896 -945892 -3301065 -5376554 -4708752 -1252680 2027453
36404 2027453 2331754 3584 -2223545 -2326630 -691703 829423 754873 -1029099 -3329980
36395 -3329980 -4474175 -3651884 -1867141 -1146301 -2225396 -3303378 -1970460 1535262
$$ packed form
36458a176640j419450q00127n41096m25095j8030M65987P23009P09675K32453
36449b249314p43308j244084p6839K075313K728895P05887j954258k433325p00721
36440c891754Q26323P63839J75744L08820O37626J35068p19000n72331O82541
36431a653124J728498J660888Q91880J35808m73283r69571j173320j131427j184027
36422b167678j218548o65893L20515O24445j84355q76612k32597J086451J550081
36413a764191J022178N34319J80798r18996k355173k075489O67802L456072L280133
36404B027453L04301k328170k227129j03085J634927J521126p4550j783972k300881
36395c329980j144195Q22291J784743P20840j079095j077982J332918L505722
$$ plain form
36387 1535262 4081436 3364006 958838 365142 2456147 4567482 4362823 2803351 2123853
36378 2123853 2229759 1014552 -2070796 -4670474 -4388030 -1781358 486205 916543 576450
36369 576450 1217390 2851244 3791069 2841357 743834 -836969 -1275103 -1343944 -1807587
36360 -1807587 -2365526 -2199585 -1093297 257134 807132 14773 -1531759 -2418473 -1854651
36351 -1854651 -765856 -803442 -2285318 -3893431 -4451635 -4059735 -3284557 -2324742 -1442151
36342 -1442151 -1187375 -1558377 -1796581 -1562046 -1375961 -1399631 -962573 12094 481505 146503
36332 146503 361545 1842561 2967107 2211431 1023042 1957575 4685694 6277876 5209374
36323 5209374 2781996 612064 -953229 -1666718 -994822 378378 676646 -442451 -1155121
$$ packed form
36387A535262K546174p17430k405168n93696K091005K111335k04659j559472o79498
36378B123853J05906j215207l085348k599678K82444K606672K267563M30338l40093
36369E76450O40940J633854R39825r49712k097523j580803m38134o8841m63643
36360a807587n57939J65941J106288J350431N49998p92359j546532q86714N63822
36351a854651J088795l7586j481876j608113n58204L91900P75178R59815Q82591
36342a442151K54776l71002k38204K34535J86085k3670M37058R74667M69411l35002
36332A46503K15042J481016J124546p55676j188389R34533K728119J592182j068502
36323E209374k427378k169932j565293p13489O71896J373200K98268j119097p12670
$$ plain form
36314 -1155121 -100934 1776505 2816550 2630560 1728408 554491 -301833 -239287 258132
36305 258132 -84519 -1310292 -1898281 -1134807 -307275 -659178 -1568484 -1691918 -651506
36296 -651506 1168015 3106171 3871489 2406921 -108028 -1041166 -41516 214649 -1697207
36287 -1697207 -3413596 -2513595 -441998 -74568 -1200757 -1365086 69794 1610494 2441539
36278 2441539 2761279 2136008 300222 -1156428 -743383 42247 -1197880 -3560087 -4154611
36269 -4154611 -3028747 -2823604 -3649210 -2721693 275787 2112650 1725001 2337460 5540120
36260 5540120 7775307 6119363 3586171 4365356 6930201 6934172 4914214 5564184 9940042
36251 9940042 13758766 14109892 13075371 13111472 12914438 10231137 5827822 2216133 441039
$$ packed form
36314a155121J054187J877439J040045j85990r02152j173917q56324O2546M97419
36305B58132l42651j225773n87989P63474Q27532l51903r09306j23434J040412
36296f51506J819521J938156P65318j464568k514949r33138R99650K56165j911856
36287a697207j716389R00001K071597L67430j126189j64329J434880J540700Q31045
36278B441539L19740o25271j835786j456650M13045P85630j240127k362207n94524
36269d154611J125864K05143q25606R27517K997480J836863l87649O12459L202660
36260E540120K235187j655944k533192P79185K564845L971k019958O49970M375858
36251I940042L818724L51126j034521L6101j97034k683301m403315l611689j775094
$$ plain form
36242 441039 121749 876028 1848621 1550689 71174 -208144 1864850 3675261 2357638
36233 2357638 -553697 -1074879 1348065 3262513 2556238 959703 366307 16611 -870231
36224 -870231 -629661 1998682 4683627 4312021 1739119 487747 1334597 1639032 170509
36215 170509 -993242 -467600 -108900 -1560031 -2965034 -1754013 1197276 3023468 3235467
36206 3235467 3709752 4962272 5389271 4295512 3029310 2538377 2009995 755039 -354850
36197 -354850 -268518 731710 1650699 1922873 1524941 907567 971752 2121566 3461077
36188 3461077 4041962 4362128 5010809 4641878 1833149 -1485395 -1736421 863925 2166237
36179 2166237 409503 -1195963 -148317 1063986 -452717 -2593537 -1716201 908627
$$ packed form
36242D41039l19290P54279R72593k97932j479515k79318K072994J810411j317623
36233B357638k911335n21182K422944J914448p06275j596535n93396l49696q86842
36224h70231K40570K628343K684945l71606k572902j251372Q46850L04435j468523
36215A70509j163751N25642L58700j451131j405003J211021K951289J826192K11999
36206C235467M74285J252520M26999j093759j266202m90933n28382j254956j109889
36197c54850Q6332J000228R18989K72174l97932o17374O4185J149814J339511
36188C461077N80885L20166O48681l68931k808729l318544k51026K600346J302312
36179B166237j756734j605466J047646J212303j516703k140820Q77336K624828
$$ plain form
36171 908627 963894 -1825544 -3394077 -1898478 171867 1021159 2096495 4107504 4586562
36162 4586562 1806716 -1903019 -3273037 -2292814 -1027185 -186039 757981 1493606 1244556
36153 1244556 358901 -274469 -582490 -650984 147776 1756120 2341203 538229 -2097646
36144 -2097646 -2903832 -1784617 -1040994 -1828845 -2808242 -2442224 -907044 638115 1354661
36135 1354661 1029763 207722 147244 1538724 3163592 2948862 510103 -2400079 -4081118
36126 -4081118 -4408254 -3999863 -3084762 -1742912 -431620 256525 -81390 -1595971 -3757176
36117 -3757176 -5102808 -4450813 -2516297 -1339437 -1902694 -3258249 -4094421 -3959316 -2744514
36108 -2744514 -485201 1679112 1859358 -185520 -2230022 -2379034 -1577620 -1888276 -3228795
$$ packed form
36171I08627N5267k789438j568533J495599K070345Q49292J075336K011009M79058
36162D586562k779846l709735j370018R80223J265629Q41146R44020P35625k49050
36153A244556q85655o33370l08021o8494P98760J608344N85083j802974k635875
36144b097646q06186J119215P43623p87851r79397L66018J535180J545159P16546
36135A354661l24898q22041o0478J391480J624868k14730k438759k910182j681039
36126d081118l27136M08391R15101J341850J311292O88145l37915j514581k161205
36117c757176j345632O51995J934516J176860n63257j355555q36172J35105J214802
36108b744514K259313K164313J80246k044878k044502j49012Q01414l10656j340519
$$ plain form
36099 -3228795 -3631041 -2255573 -300220 989626 1474132 1197404 80621 -1075108 -970379
36090 -970379 157773 462179 -708279 -1497917 -259412 1791853 2217687 675860 -1127613
36081 -1127613 -2179544 -3000666 -3912740 -4260924 -3690787 -2810203 -2159776 -1616582 -1125020
36072 -1125020 -955477 -919937 -358145 750076 1600307 1734135 1397603 586642 -1014040
36063 -1014040 -2842563 -3600522 -3074983 -2398998 -1945269 -669425 1524224 2641453 1373470
36054 1373470 -588496 -944990 -219969 -589227 -2186234 -3050425 -2439161 -1782233 -2154872
36045 -2154872 -2887102 -3087754 -2788274 -2172563 -1239193 -542310 -778727 -1453473 -1472680 -1050217
36035 -1050217 -1208369 -1415075 -19621 2595129 3844461 2807642 1706611 2157247 2451248
$$ packed form
36099c228795m02246J375468J955353J289846M84506k76728j116783j155729J04729
36090i70379J128152L04406j170458p89638J238505K051265M25834j541827j803473
36081a127613j051931q21122r12074l48184N70137Q80584O50427N43194M91562
36072a125020J69543L5540N61792J108221Q50231J33828l36532q10961j600682
36063a014040j828523p57959N25539O75985M53729J275844K193649J117229j267983
36054A373470j961966l56494P25021l69258j597007q64191O11264O56928l72639
36045b154872p32230k00652K99480O15711R33370O96883k36417o74746j9207M22463
36035a050217j58152k06706J395454K614750J249332j036819j101031M50636K94001
$$ plain form
36026 2451248 591566 -2041719 -2536820 -603453 1540913 2535818 2831712 2844436 2318292
36017 2318292 1354084 365932 -742696 -1903772 -1941024 -7948 2478970 3184616 1941531
36008 1941531 774916 993927 1974954 2756688 3041861 2478652 730105 -1311885 -1911165
35999 -1911165 -646635 961629 1346588 398155 -1037059 -2000149 -1643341 173631 2269242
35990 2269242 3139245 2628282 1634885 471679 -1045325 -2107871 -1391494 664768 1791331
35981 1791331 730293 -1244140 -2210685 -1736752 -615609 347195 814003 1169855 2399428
35972 2399428 4580404 5786916 4213418 1184535 -182739 583604 841917 -670444
35964 -670444 -1882219 -1178922 -90842 -183109 -133555 1313604 1920666 -971689 -5451632
$$ packed form
36026B451248j859682k633285m95101J933367K144366R94905K95894J2724n26144
36017B318292r64208r88152j108628j161076l7252J933076K486918P05646j243085
36008A941531j166615K19011R81027P81734K85173n63209j748547k041990n99280
35999a911165J264530J608264L84959r48433j435214r63090L56808J816972K095611
35990B269242Q70003n10963r93397j163206j517004j062546P16377K056262J126563
35981A791331j061038j974433r66545M73933J121143R62804M66808L55852J229573
35972B399428K180976J206512j573498l028883j367274P66343K58313j512361
35964f70444j211775P03297J088080r2267M9554J447159O07062k892355m479943
$$ plain form
35955 -5451632 -6912990 -4387660 -1425450 -605034 -676454 14721 486430 -725797 -2533018
35946 -2533018 -2409289 412956 4140782 6179658 5067337 1570230 -1522913 -1615772 1038499
35937 1038499 3628247 4087969 3123873 2529943 2777720 3233325 3711678 4427526 4825856
35928 4825856 3834920 1480232 -734915 -1555312 -1472716 -1807137 -2565876 -2249237 -231605
35919 -231605 1693295 1431935 -275481 -700982 722677 1315163 -711828 -3228448 -3325283
35910 -3325283 -1719053 -1286677 -2340493 -2664669 -1934879 -2403218 -4388051 -4709085 -1578682
35901 -1578682 1909377 1892957 -743975 -2015260 -681501 807644 750417 252139 333513
35892 333513 -30916 -1569553 -2667524 -1620273 429361 883818 -570925 -1604174 -660220
$$ packed form
35955e451632j461358K525330K962210Q20416p1420O91175M71709j212227j807221
35946b533018J23729K822245L727826K038876j112321l497107l093143r2859K654271
35937A038499K589748M59722r64096n93930K47777M55605M78353P15848L98330
35928D825856r90936k354688k215147q20397Q2596l34421p58739L16639K017632
35919b31605J924900k61360j707416m25501J423659N92486k026991k516620r6835
35910c325283J606230M32376j053816l24176P29790m68339j984833l21034L130403
35901a578682L488059j6420k636932j271285J333759J489145n7227m98278Q1374
35892C33513l64429j538637j097971J047251K049634M54457j454743j033249R43954
$$ plain form
35883 -660220 1084017 1856933 1873097 2433225 3297395 2745400 418139 -1505522 -950758
35874 -950758 1214192 2289686 1306610 58386 366544 1645095 2064349 1336922 1081841
35865 1081841 2374851 4009711 3965186 2207123 1006365 2091650 4329422 5187330 3989189
35856 3989189 2268947 934160 -948056 -3621044 -4877307 -2836683 720721 2208708
35848 2208708 908571 -670827 -932373 -898775 -1316689 -1033569 365461 989687 -248459
35839 -248459 -1224200 120545 1883383 767403 -2415248 -3321150 -362335 2750912 1852154
35830 1852154 -2641574 -6844430 -7822197 -5662879 -2580640 -1222646 -2761823 -5552836
35822 -5552836 -6599023 -5143250 -3537269 -3592024 -3713145 -1435296 2426930 4439204 2937747
$$ packed form
35883f60220J744237P72916J6164N60128Q64170n51995k327261j923661N54764
35874i50758K164950J075494r83076j248224L08158J278551M19254p27427k55081
35865A081841J293010J634860m4525j758063j200758J085285K237772Q57908j198141
35856C989189j720242j334787j882216k672988j256263K040624L557404J487987
35848B208708j300137j579398k61546L3598m17914K83120J399030O24226j238146
35839b48459r75741J344745J762838j115980l182651r05902K958815L113247q98758
35830A852154m493728m202856r77767K159318L082239J357994j539177k791013
35822e552836j046187J455773J605981n4755j21121K277849L862226K012274j501457
$$ plain form
35813 2937747 -306090 -2702000 -3171246 -1839256 486468 2062925 1420210 -452691
35805 -452691 -984079 196879 580061 -916860 -1565269 910539 3924441 3265034 -537081
35796 -537081 -2972725 -2383869 -1805387 -3128834 -3730993 -1278759 1647466 1169436 -1894213
35787 -1894213 -3302357 -1473060 1123659 2036785 1074159 -1248072 -4267745 -6027757
35779 -6027757 -4717543 -1850689 -1055088 -2931520 -4151470 -2783891 -1269956 -2187526
35771 -2187526 -4081451 -4216445 -3073281 -2878559 -3316851 -2243091 121895 1253055 630618
35762 630618 701673 2724928 4448886 3368040 309855 -1805557 -1532105 132057 1461771
35753 1461771 1489395 304094 -1171525 -1947594 -1980098 -1981550 -1990579 -1096597 698088 1377495
$$ packed form
35813B937747l243837k395910m69246J331990K325724J576457o42715j872901
35805d52691n31388J180958L83182j496921o48409K475808L013902o59407l802115
35796e37081k435644N88856N78482j323447o02159K452234K926225m78030l063649
35787a894213j408144J829297K596719R13126r62626k322231l019673j760012
35779f027757J310214K866854P95601j876432j219950J367579J513935r17570
35771b187526j893925j34994J143164J94722m38292J073760K364986J131160o22437
35762F30618P1055K023255J723958j080846l058185k115412K73452J664162J329714
35753A461771K7624j185301j475619p76069l2504j452r029Q93982J794685O79407
$$ plain form
35743 1377495 -856472 -4556460 -5907331 -3235373 639088 1739617 -149764 -1570899
35735 -1570899 -333697 1651777 1533959 -274884 -1158950 -607468 -753584 -2463330 -3611844
35726 -3611844 -2428493 -350287 177250 -882181 -1844669 -2186945 -2636539 -3095851 -2565581
35717 -2565581 -954816 732329 1900790 2579196 2373162 816614 -1251793 -2182801 -1562417
35708 -1562417 -575631 -329901 -917489 -1910710 -2535231 -1668582 877391 3342514 3875300
35699 3875300 3167479 3451012 4990843 5622872 4045444 1573029 88663 70515 1194201
35690 1194201 3017120 4320875 3590629 1095255 -1084995 -1920534 -2617633 -4017308 -4704533
35681 -4704533 -3182825 -445761 1253192 1192294 349049 -358033 -734585 -926626 -1381635
$$ packed form
35743A377495k233967l699988j350871K671958L874461J100529j889381j421135
35735a570899J237202J985474j17818j808843q84066N51482j46116j709746j148514
35726c611844J183351K078206N27537j059431r62488l42276m49594m59312N30270
35717b565581J610765J687145J168461O78406k06034j556548k068407r31008O20384
35708a562417R86786K45730n87588r93221o24521Q66649K545973K465123N32786
35699C875300p07821K83533J539831O32029j577428k472415j484366j8148J123686
35690A194201J822919J303755p30246k495374k180250q35539o97099j399675o87225
35681d704533J521708K737064J698953o0898q43245p07082l76552j92041m55009
$$ plain form
35672 -1381635 -2495038 -3598314 -3285698 -1416876 421414 1143843 1368750 1577838 926765
35663 926765 -815669 -2045852 -1800157 -1681808 -3173469 -4608379 -3422420 -318739 1628999
35654 1628999 1434189 925209 1181562 1092373 -75915 -1175962 -1097767 -244351 709403
35645 709403 1781092 2538655 1631095 -1334031 -4522063 -5646816 -4490580 -2873600 -2441004
35636 -2441004 -3019531 -3109797 -1840231 -225717 80644 -710250 -507441 1512356 3236796
35627 3236796 2539688 567136 71832 1344106 2193114 1624559 991025 1249250 1506456
35618 1506456 1073080 932512 2056824 3639058 3986634 2370766 -382077 -2369485 -1910430
35609 -1910430 456372 1758477 17700 -2709463 -2947401 -934813 -146888 -1623762
$$ packed form
35672a381635j113403j103276L12616J868822J838290P22429K24907K09088o51073
35663I26765j742434j230183K45695J18349j491661j434910J185959L103681J947738
35654A628999j94810n08980K56353q9189j168288j100047P8195Q53416R53754
35645G09403J071689P57563r07560k965126l188032j124753J156236J616980M32596
35636b441004n78527r0266J269566J614514L06361p90894K02809K019797J724440
35627C236796o97108j972552m95304J272274Q49008n68555o33534K58225K57206
35618A506456m33376j40568J124312J582234L47576j615868k752843j987408M59055
35609a910430K366802J302105j740777k727163k37938K012588P87925j476874
$$ plain form
35601 -1623762 -2333861 -285141 2236206 2524530 1493616 1294337 1473136 574161 -361051
35592 -361051 684601 2761385 2883518 565520 -1558573 -1726281 -974745 -695395 -715919
35583 -715919 -606813 -827459 -1443889 -1254426 480089 2374635 2367779 610025 -286306
35574 -286306 1563576 4527310 5066686 2416891 126986 1441521 4427959 4397745 773101
35565 773101 -1953898 -935220 1128069 946450 -22465 1322423 3928482 4233094 2188835
35556 2188835 1117771 1915363 1805684 -610876 -3120856 -3856495 -3909281 -4442767 -4372412
35547 -4372412 -2830012 -1268255 -1052589 -1191119 -516979 -106559 -1275609 -2824716 -2688217
35538 -2688217 -1227178 -609387 -1551516 -2636526 -2520240 -1260880 274339 1158753 938937
$$ packed form
35601a623762p10099K048720K521347K88324j030914j99279J78799q98975r35212
35592c61051J045652K076784J22133k317998k124093j67708P51536K79350k0524
35583g15919J09106k20646o16430J89463J734515J894546o856j757754q96331
35574b86306J849882K963734N39376k649795k289905J314535K986438l0214l624644
35565G73101k726999J018678K063289j81619r68915J344888K606059L04612k044259
35556B188835j071064P97592j09679k416560k509980p35639n2786n33486P0355
35547d372412J542400J561757K15666j38530O74140M10420j169050j549107J36499
35538b688217J461039O17791r42129j085010J16286J259360J535219Q84414k19816
$$ plain form
35529 938937 261790 315142 988862 721014 -984729 -2348694 -1852500 -472204 166325
35520 166325 310779 836210 977182 -289314 -1784057 -1749031 -1034699 -1701150 -3087164
35511 -3087164 -2704313 -927142 -911782 -3071446 -3652560 -663581 2478396 1999807 -657958
35502 -657958 -1838396 -1740463 -3085143 -5083858 -3761608 1390421 5778299 6253395 5185835
35493 5185835 5546330 5549711 1928078 -3757659 -6434101 -4510124 -1622969 -1081144 -2056354
35484 -2056354 -2299179 -1546433 -607394 435429 1193997 170023 -2919115 -5607142 -5609194
35475 -5609194 -3942592 -2969951 -2720135 -1784210 -742842 -1458765 -3271525 -3250206 -746315
35466 -746315 1326692 719103 -1308300 -2499965 -2483923 -1808424 -475285 993228 1202626
$$ packed form
35529I38937o77147N3352O73720k67848j705743j363965M96194J380296O38529
35520A66325J44454N25431J40972j266496j494743L5026P14332o66451j386014
35511c087164L82851J777171J5360k159664n81114K988979L141977m78589k657765
35502f57958j180438R7933j344680j998715J322250N152029M387878M75096j067560
35493E185835L60495L381l621633n685737k676442J923977K887155N41825r75210
35484b056354k42825P52746R39039J042823P58568j023974l089138k688027k052
35475e609194J666602R72641K49816R35925J041368p15923j812760K1319K503891
35466g46315K073007o07589k027403j191665J6042O75499J333139J468513K09398
$$ plain form
35457 1202626 245520 215441 1579194 1521694 -1617753 -4631868 -3451449 852875 3732925
35448 3732925 3695578 3184816 3394560 2551555 68078 -1631659 -1054981 -136437 -858941
35439 -858941 -2108842 -2003701 -1017210 -508900 -147716 698310 647199 -1799485 -5014192
35430 -5014192 -5741517 -3596063 -1596303 -2074919 -4168932 -5690961 -5566601 -3847126 -1019689
35421 -1019689 1781494 3095222 2606546 1548604 1002603 586776 -462785 -1657295 -1708958
35412 -1708958 -351591 1220701 1850670 1652385 1412643 1300360 834386 -18818 -528955
35403 -528955 -282038 151658 227669 421677 1245694 1806362 763816 -1334662 -2263344
35394 -2263344 -1110751 411528 456011 -491329 -774008 -184153 -53523 -1210864 -2969118
$$ packed form
35457A202626r57106l0079J363753n7500l139447l014115J180419M304324K880050
35448C732925l7347n10762K09744q43005k483477j699737N76678R18544p22504
35439h58941j249901J05141R86491N08310L61184Q46026n1111k446684l214707
35430e014192p27325K145454J999760m78616k094013j522029J24360J719475K827437
35421a019689K801183J313728m88676j057942n46001m15827j049561j194510n1663
35412a708958J357367J572292O29969j98285k39742j12283m65974q53204n10137
35403e28955K46917M33696P6011J94008Q24017N60668j042546k098478r28682
35394b263344J152593J522279M4483r47340k82679N89855J30630j157341j758254
$$ plain form
35385 -2969118 -3921082 -3069197 -606141 1915453 2901217 2666319 3008019 4310263 4732201
35376 4732201 3402875 2460683 3852703 5758373 4980104 1881920 -165826 137371 770179
35367 770179 378181 150861 843158 1073912 22233 -919337 -811622 -947262 -2144084
35358 -2144084 -2732910 -1441827 -31506 -517159 -1746717 -1587139 -799012 -1485468 -2941237
35349 -2941237 -2641915 -788579 -201999 -1623724 -2699427 -2286527 -2337986 -4187096 -5954596
35340 -5954596 -5438786 -3220235 -1059312 739816 2398182 2901901 1460873 -476066
35332 -476066 -922258 -331590 -729060 -2244093 -2660552 -687414 2065995 3112431 2011845
35323 2011845 447274 -161448 -306531 -1332428 -3068739 -3507929 -1554466 813551 789537
$$ packed form
35385b969118r51964Q51885K463056K521594R85764k34898L41700J302244M21938
35376D732201j329326r42192J392020J905670p78269l098184k047746L03197O32808
35367G70179l91998k27320O92297K30754j051679r41570J07715j35640j196822
35358b144084n88826J291083J410321m85653j229558J59578P88127o86456j455769
35349b941237K99322J853336N86580j421725j075703M12900n1459j849110j767500
35340e954596N15810K218551K160923J799128J658366N03719j441028j936939
35332d76066m46192N90668l97470j515033m16459J973138K753409J046436j100586
35323B011845j564571o08722j45083j025897j736311m39190J953463K368017k4014
$$ plain form
35314 789537 -1131245 -1474381 1146298 3594597 2456745 -1080549 -2856755 -1281439
35306 -1281439 1134474 1631382 444222 -326116 412170 1798429 2293129 1417563 346602
35297 346602 604017 2107931 3271653 3352475 3468517 4447748 5087241 4061369 2395666
35288 2395666 2088325 2992107 3155152 1902134 480882 -257488 -735265 -1071320 -674653
35279 -674653 184075 243552 -807475 -1892082 -2396055 -2766240 -2995801 -2444575 -1580155
35270 -1580155 -1795819 -2880020 -2922844 -1614468 -1183948 -2709505 -3979376 -2955746 -1103612
35261 -1103612 -806086 -1321334 -225190 2365663 4132959 4497127 5052583 6069183 5710833
35252 5710833 3517629 1855317 2419707 3443011 2249051 -795677 -2855152 -2497483
$$ packed form
35314G89537j920782l43136K620679K448299j137852l537294j776206J575316
35306a281439K415913M96908j187160p70338P38286J386259M94700q75566j070961
35297C46602K57415J503914J163722Q0822J16042R79231O39493j025872j665703
35288B395666l07341R03782J63045j253018j421252p38370m77777l36055L96667
35279f74653Q58728N9477j051027j084607n03973l70185k29561N51226Q64420
35270a580155k15664j084201m2824J308376M30520j525557j269871J023630J852134
35261a103612K97526n15248J096144K590853J767296L64168N55456J016600l58350
35252E710833k193204j662312N64390J023304j193960l044728k059475L57669
$$ plain form
35244 -2497483 -1165839 -795320 -1499779 -2142658 -2077429 -1384415 22637 2292424 4530222
35235 4530222 4979190 3055490 397024 -1083617 -1526734 -2283543 -3370458 -3540240 -2753678
35226 -2753678 -2533881 -3413857 -4007325 -3394207 -2478651 -1929220 -810336 1222938 2312314
35217 2312314 979780 -1252713 -2014914 -1490861 -1264179 -1019459 651125 2798979 2708884
35208 2708884 172779 -1733180 -932786 1019848 1643560 827364 115296 159578 254333
35199 254333 -312240 -1352635 -1935490 -1249382 344615 1484342 1608729 1735253 2423694
35190 2423694 2271549 323279 -1274637 177019 3354497 4168501 1722775 -449905
35182 -449905 9127 930149 -329364 -2514231 -2752047 -1085117 117641 102281 406505
$$ packed form
35244b497483J331644L70519p04459o42879O5229O93014J407052K269787K237798
35235D530222M48968j923700k658466j480641m43117p56809j086915j69782P86562
35226b753678K19797q79976n93468O13118R15556N49431J118884K033274J089376
35217B312314j332534k232493p62201N24053K26682K44720J670584K147854r0095
35208B708884k536105j905959Q00394J952634O23712q16196p12068M4282R4755
35199B54333n66573j040395n82855O86108J593997J139727J24387J26524O88441
35190B423694j52145j948270j597916J451656L177478Q14004k445726k172680
35182d49905M59032R21022j259513k184867k37816J666930J202758j5360L04224
$$ plain form
35173 406505 1924620 3427364 3307844 1619398 59292 231242 1764600 2363808 531655
35164 531655 -2132811 -2795987 -1243058 148956 227437 270472 910381 771150 -632543
35155 -632543 -1465616 -729319 -230718 -1424708 -2777670 -2518447 -1608725 -1423096 -805452
35146 -805452 1561850 3886362 3669869 1710272 279746 -1096889 -4105006 -7052768
35138 -7052768 -6329741 -2315894 505662 -82710 -1551667 -1491677 -1052508 -1804769 -2603818
35129 -2603818 -1976889 -1096182 -1778387 -3181512 -2981288 -982403 550267 -43966 -1909905
35120 -1909905 -2970993 -2308281 -935289 -327403 -498902 -269928 431088 -57670 -2473763
35111 -2473763 -4854654 -5093933 -3913289 -3166844 -2529061 -649775 1437177 1458845 39954
$$ packed form
35173D06505J518115J502744j19520j688446j560106J71950J533358N99208j832153
35164E31655k664466o63176J552929J392014P8481M3035O39909j39231j403693
35155f32543q33073P36297M98601j193990j352962K59223R09722J85629O17644
35146h05452K367302K324512k16493j959597j430526j376635l008117k947762
35138g052768P23027M013847K821556n88372j468957N9990M39169p52261p99049
35129b603818O26929Q80707o82205j403125K00224J998885J532670n94233j865939
35120a909905j061088O62712J372992O07886j71499K28974P01016m88758k416093
35111b473763k380891k39279J180644P46445O37783J879286K086952K1668j418891
$$ plain form
35102 39954 46736 1648523 1841744 -349000 -2044773 -1287173 -592 -289813 -1169194
35093 -1169194 -1303928 -1867910 -3848658 -5176631 -3698728 -942111 249511 94451 632621
35084 632621 1582845 1041387 -480596 -399964 1518536 2392174 521772 -2247650 -3384723
35075 -3384723 -2689077 -1410373 -172108 947946 1491088 1091809 337247 124601 243575
35066 243575 -659620 -3295604 -6153474 -6510955 -3567988 162641 1710736 1258891 1194061
35057 1194061 2027959 1844743 179336 -540905 1120260 2967517 2534925 836823 265751
35048 265751 663831 375028 -283247 169452 1016019 181238 -1828916 -2154018 -142337
35039 -142337 1329150 52179 -2452392 -3317708 -1968469 -115970 707932 573060 665875
$$ packed form
35102C9954O782J601787J93221k190744j695773P57600J286581k89221q79381
35093a169194j34734n63982j980748j327973J477903K756617J191622j55060N38170
35084F32621R50224n41458j521983Q0632J918500Q73638j870402k769422j137073
35075c384723O95646J278704J238265J120054N43142l99279p54562k12646J18974
35066B43575r03195k635984k857870l57481K942967L730629J548095m51845o4830
35057A194061Q33898j83216j665407p20241J661165J847257m32592j698102n71072
35048B65751L98080k88803o58275M52699Q46567q34781k010154l25102K011681
35039a42337J471487j276971k504571q65316J349239J852499Q23902j34872R2815
$$ plain form
35030 665875 1794110 3096478 2728248 510117 -1130099 -214436 1887350 2543902 1841792
35021 1841792 1960019 3189029 3555896 2478966 1757086 2233444 2281174 713799 -1246702
35012 -1246702 -2154734 -2282439 -2081722 -869982 1380680 2869568 2370622 1279000 1515511
35003 1515511 2714691 3275525 3108623 3462322 4640217 5508349 5003703 3109330 789640
34994 789640 -366046 643474 2575133 2686018 229707 -2015562 -1115933 2187986 4587573
34985 4587573 4230827 1949368 -710609 -2651454 -2821376 -852197 1631033 2204472 727342
34976 727342 -342071 538683 1654548 488782 -2454758 -3992909 -2402193 332945
34968 332945 1213149 112340 -448064 919486 2727266 3277777 3300698 4347690 5803246
$$ packed form
35030F65875J128235J302368l68230k218131j640216R15663K101786O56552p02110
35021A841792J18227J229010L66867j076930p21880M76358M7730j567375j960501
35012a246702r08032j27705K00717J211740K250662J488888m98946j091622K36511
35003A515511J199180N60834j66902L53699J177895Q68132n04646j894373k319690
34994G89640j155686J009520J931659J10885k456311k245269Q99629L303919K399587
34985D587573l56746k281459k659977j940845j69922J969179K483230N73439j477130
34976G27342j069413Q80754J115865j165766k943540j538151J590716K735138
34968C32945Q80204j100809n60404J367550J807780N50511K2921J046992J455556
$$ plain form
34959 5803246 5684627 3879034 2209239 1330512 145805 -1227315 -768443 1806945 3353288
34950 3353288 1403213 -2022934 -3226197 -1977021 -1067545 -1646980 -2084358 -1398049 -817168
34941 -817168 -1148995 -1083964 522553 2456033 2798230 1705869 1021804 1581556 2211319
34932 2211319 1477209 -438461 -1996339 -2118590 -1335960 -958206 -1366658 -1688694 -1234812
34923 -1234812 -508841 -323922 -600143 -768819 -827613 -1106827 -1364997 -1086189 -467471 -130029
34913 -130029 52258 781162 1878597 2084569 819501 -623953 -401046 1592309 3321393
34904 3321393 2697190 -87741 -2575478 -2597437 -608066 971369 581315 -1012294 -2058861
34895 -2058861 -1665886 -91163 1652325 1960370 -317539 -4033183 -6071684 -4780690
$$ packed form
34959E803246j18619j805593j669795q78727j184707j373120M58872K575388J546343
34950C353288j950075l426147j203263J249176R09476n79435m37378O86309N80881
34941h17168l31827O5031J606517J933480L42197j092361o84065N59752O29763
34932B211319p34110j915670j557878j22251P82630L77754m08452l22036M53882
34923a234812P25971J84919k76221j68676n8794k79214k58170K78808O18718L37442
34913a30029J82287P28904J097435K05972j265068j443454K22907J993355J729084
34904C321393o24203k784931k487737k1959J989371J579435l90054j593609j046567
34895b058861L92975J574723J743488L08045k277909l715644k038501J290994
$$ plain form
34887 -4780690 -2149506 -1211864 -2197931 -2977538 -2586827 -2139376 -2352769 -2397350 -1713822
34878 -1713822 -1066053 -962792 -661680 193355 307331 -1527335 -4265719 -5584900 -4737440
34869 -4737440 -3286973 -2953411 -3611882 -3788214 -2658685 -1037432 -335596 -899776 -1736571
34860 -1736571 -1723854 -582000 1268879 3028310 3596959 2401792 578024 184671 1556150
34851 1556150 2680493 2125657 1091950 1149816 1539944 824921 -149010 314271 1234424
34842 1234424 48867 -2956880 -4653756 -3930889 -3182784 -3942544 -4418559 -3103153 -1675216
34833 -1675216 -1878760 -2161954 -393117 2012138 1910580 -723157 -2826679 -2618463 -1218407
34824 -1218407 -87265 688473 1399714 2011099 2655987 3278571 2922580 959352 -1276902
$$ packed form
34887d780690K631184R37642r86067p79607L90711M47451k13393m4581O83528
34878a713822O47769J03261L01112Q55035J13976j834666k738384j319181Q47460
34869d737440J450467L33562o58471j76332J129529J621253P01836n64180q36795
34860a736571J2717J141854J850879J759431N68649j195167j823768l93353J371479
34851A556150J124343n54836j033707N7866L90128p15023r73931M63281R20153
34842A234424j185557l005747j696876P22867P48105p59760m76015J315406J427937
34833a675216k03544k83194J768837K405255j01558k633737k103522K08216J400056
34824a218407J131142P75738P11241O11385O44888O22584l55991j963228k236254
$$ plain form
34815 -1276902 -1843708 -948387 -509424 -1111757 -1368107 -419673 833250 1306059 841268
34806 841268 -537265 -2833249 -5179671 -6209689 -5633651 -4191525 -2170101 418188
34798 418188 2383071 2135374 79679 -1730739 -2405895 -2536966 -1797658 861928 4115580
34789 4115580 4644720 2012808 52119 1405577 3589294 3068181 651706 -442167
34781 -442167 7493 -513218 -2482076 -3462731 -2027058 433145 2163524 2867652 2732066
34772 2732066 1836556 954929 1045946 1611250 1238832 -128818 -1198485 -1508852 -1634241
34763 -1634241 -1266171 597769 3214883 4167112 2581780 252766 -1158209 -2004741 -2909758
34754 -2909758 -3205336 -2319554 -1048628 -273198 216180 743623 1079307 1499815 2852802
$$ packed form
34815a276902n66806Q95321M38963o02333k56350R48434J252923M72809m64791
34806H41268j378533k295984k346422j030018N76038J442126K021424K588289
34798D18188J964883k47697k055695j810418o75156j31071P39308K659586L253652
34789D115580N29140k631912j960689J353458K183717n21113k416475j093873
34781d42167M49660n20711j968858r80655J435673K460203J730379P04128j35586
34772B732066q95510q81627R1017N65304l72418j367650j069667l10367j25389
34763a634241L68070J863940K617114R52229j585332k329014j410975q46532r05017
34754b909758k95578Q85782J270926P75430M89378N27443L35684M20508J352987
$$ plain form
34745 2852802 4776923 5684365 5360061 5468087 6362905 5794263 2533533 -907799 -1396404
34736 -1396404 688350 2641088 3231216 3046442 2409168 1360126 683944 739638 303062
34727 303062 -1366662 -2655383 -2084909 -1103346 -1601108 -2232974 -669461 1747397 1661332
34718 1661332 -592099 -1305759 459916 1528153 230855 -1038639 -489012 3653 -1194854
34709 -1194854 -2102840 -474279 2319406 3647550 3575754 3643504 3607493 2266981 188162
34700 188162 -930569 -623104 503605 1993566 2933553 1872167 -742965 -1956429 -242660
34691 -242660 2024311 2379983 2122001 3336452 4568123 3441599 1635195 2536015 5076363
34682 5076363 4984973 1893943 -62468 667024 672359 -2113420 -4756926 -4532116 -3333999
$$ packed form
34745B852802J924121R07442l24304J08026Q94818n68642l260730l441332m88605
34736a396404K084754J952738N90128j84774o37274j049042o76182N5694m36576
34727C03062j669724j288721N70474R81563m97762o31866J563513K416858q6065
34718A661332k253431p13660J765675J068237j297298j269494N49627M92665j198507
34709a194854r07986J628561K793685J328144p1796O7750l6011j340512k078819
34700A88162j118731L07465J126709J489961R39987j061386k615132j213464J713769
34691b42660K266971L55672k57982J214451J231671j126524j806404R00820K540348
34682E076363r1390l091030j956411P29492N335k785779k643506K24810J198117
$$ plain form
34673 -3333999 -3574467 -3476314 -576477 2829333 2349113 -1729683 -4633956 -3798421 -1639384
34664 -1639384 -1214478 -2243801 -2540894 -1222216 784019 2231080 2608449 2209563 1501804
34655 1501804 327613 -1743880 -3910574 -4121354 -1642479 1393321 2406389 1413536
34647 1413536 81043 -1170154 -2859705 -3978689 -2710869 146313 1281225 -640628
34639 -640628 -3006262 -3143894 -1969912 -1812011 -2367589 -1411658 1251715 3151003 2612375
34630 2612375 771397 -459538 -766847 -900870 -999668 -555587 531051 1721824 2408757
34621 2408757 2285639 1535729 928871 1138096 1634159 1061964 -747242 -2089967 -1621276
34612 -1621276 -356024 -137347 -852335 -924045 -253365 -593569 -2640454 -4725140 -5235435
$$ packed form
34673c333999k40468R8153K899837L405810m80220m078796k904273Q35535K159037
34664a639384M24906j029323k97093J318678K006235J447061L77369l98886p07759
34655A501804j174191k071493k166694k10780K478875L035800J013068r92853
34647A413536j332493j251197j689551j118984J267820K857182J134912j921853
34639f40628k365634j37632J173982J57901n55578R55931K663373J899288n38628
34630B612375j840978j230935l07309j34023r8798M44081J086638J190773O86933
34621B408757j23118p49910o06858K09225M96063n72195j809206j342725M68691
34612a621276J265252K18677p14988p1710O70680l40204k046885k084686n10295
$$ plain form
34603 -5235435 -4574291 -3594391 -1803680 1197176 3755772 3658753 1087603 -1543404 -2390748
34594 -2390748 -1522142 18028 1050317 656403 -769187 -1330017 -23324 1297881 253242
34585 253242 -2310984 -3229170 -1547378 389292 689052 130218 -165250 -706412 -1969598
34576 -1969598 -2980907 -3091302 -3237212 -3874719 -3583431 -1545314 413354 402155 -483152
34567 -483152 -70540 1237709 1380397 309555 -67987 765948 1405062 1297529 1358814
34558 1358814 1486838 164112 -2592452 -4284547 -3220921 -863827 456819 549001 582433
34549 582433 652090 -114706 -1709809 -3083428 -3609221 -3558818 -3254016 -2693461 -2019836 -1656187
34539 -1656187 -1855686 -2398697 -2682481 -2115073 -829845 33989 -477266 -1551092 -1259178
$$ packed form
34603e235435O61144R79900J790711L000856K558596r7019k571150k631007q47344
34594b390748Q68606J540170J032289l93914j425590n60830J306693J321205j044639
34585B53242k564226r18186J681792J936670K99760n58834k95468n41162j263186
34576a969598j011309j10395j45910o37507K91288K038117J958668j1199q85307
34567d83152M12612J308249J42688j070842l77542Q33935O39114j07533O1285
34558A358814J28024j322726k756564j692095J063626K357094J320646R2182L3432
34549E82433O9657p66796j595103j373619n25793N0403L04802N60555O73625L63649
34539a656187j99499n43011k83784N67408J285228Q63834n11255j073826K91914
$$ plain form
34530 -1259178 782635 2572482 2372233 1074095 658365 1193811 1068119 -201772 -1272852
34521 -1272852 -1244419 -806175 -518103 313313 1921184 2771880 1655356 28139 183106
34512 183106 1557791 1292171 -1211454 -2824334 -1112773 1916305 2633201 912503 -212708
34503 -212708 598754 1440803 802322 -98917 93776 336614 -825886 -2437237 -2527187
34494 -2527187 -1260053 -410004 -356583 629 563131 -151603 -2066151 -2876939 -1458301
34485 -1458301 141880 -273341 -1639101 -1291866 894398 2316413 1513938 167512 579227
34476 579227 2675308 4505269 4749922 3651490 2011561 410734 -659716 -896901 -734010
34467 -734010 -1143295 -2483010 -3904343 -4220760 -3071820 -996608 1190917 2631637 2438045
$$ packed form
34530a259178K041813J789847k00249j298138m15730N35446j25692j269891j071080
34521a272852K8433M38244K88072Q31416J607871Q50696j116524j627217J54967
34512A83106J374685k65620k503625j612880J711561L029078P16896j720698j125211
34503b12708Q11462Q42049o38481r01239J92693K42838j162500j611351q9950
34494b527187J267134Q50049N3421L57212N62502p14734j914548q10788J418638
34485a458301J600181m15221j365760L47235K186264J422015q02475j346426M11715
34476E79227K096081J829961K44653j098432j639929j600827j070450k37185J62891
34467g34010m09285j339715j421333l16417J148940K075212K187525J440720j93592
$$ plain form
34458 2438045 293130 -2871246 -5354069 -6066053 -5183132 -3510257 -1694477 -102391
34450 -102391 1120392 2146635 3207028 3966568 3535859 1450668 -1536052 -3873365 -4395443
34441 -4395443 -3177956 -1462327 -619061 -855979 -1098466 -508052 241285 -94337 -1383146
34432 -1383146 -2116205 -1449323 -360104 -522909 -2645776 -5872985 -8099716 -7211796 -3261114
34423 -3261114 726125 1605537 -175105 -1389389 -624286 167589 -695369 -2009364 -2168507
34414 -2168507 -1892702 -2365590 -2611505 -1309256 186837 -553991 -3210426 -5132455 -5085200
34405 -5085200 -4028464 -2589701 -496401 1532563 2082654 1566459 1909340 3242811 3430715
34396 3430715 1604655 -316290 -700841 -534082 -1335034 -2671825 -3236539 -2901410 -2336307
$$ packed form
34458B438045k144915l164376k482823p11984Q82921J672875J815780J592086
34450a02391J222783J026243J060393P59540m30709k085191k986720k337313n22078
34441d395443J217487J715629Q43266k36918k42487N90414P49337l35622j288809
34432a383146p33059O66882J089219j62805k122867l227209k226731Q87920L950682
34423c261114L987239Q79412j780642j214284P65103P91875q62958j313995j59143
34414b168507K75805m72888k45915J302249J496093p40828k656435j922029M7255
34405e085200J056736J438763K093300K028964N50091n16195L42881J333471J87904
34396C430715j826060j920945l84551J66759q00952j336791n64714L35129N65103
$$ plain form
34387 -2336307 -1787787 -1359125 -1367742 -1528249 -1011339 -83718 -228542 -1753397 -2868332
34378 -2868332 -2243608 -926361 -459361 -616275 -456984 -242201 -678718 -1396764 -1773278
34369 -1773278 -2282135 -3483847 -4589978 -4557225 -3767690 -3161766 -2578392 -1462935 -344817
34360 -344817 -12616 -26243 337621 495242 -345288 -1307592 -1020275 -19632 120951 -382531
34350 -382531 157949 1840971 2744047 1965269 1082919 1867749 4075717 6143402 6797734
34341 6797734 5540380 2831722 254699 -708301 -480581 -846589 -2342366 -3531445 -3327626
34332 -3327626 -2624377 -2784084 -3583863 -3604546 -2048146 471935 2485167 2718538 1218919
34323 1218919 -405548 -619323 60581 -315122 -2322898 -4152457 -3992888 -2461615 -1819733
$$ packed form
34387b336307N48520M28662q617j60507N16910R27621j44824j524855j114935
34378b868332O24724J317247M67000j56914J59291K14783m36517p18046l76514
34369a773278n08857j201712j106131L2753P89535O05924N83374J115457J118118
34360c44817L32201j3627L63864J57621q40530r62304K87317J000643J40583n03482
34350c82531N40480J683022R03076p78778q82350P84830K207968K067685O54332
34341F797734j257354k708658k577023r63000K27720l66008j495777j189079K03819
34332c327626P03249j59707p99779k0683J556400K520081K013232K33371j499619
34323A218919j624467k13775O79904l75703k007776j829559J59569J531273O41882
$$ plain form
34314 -1819733 -3282056 -5754381 -6988388 -5689220 -2729550 -305224 387844 255681
34306 255681 514035 585871 -790574 -2855726 -3316648 -1814168 -724536 -1541987 -2496944
34297 -2496944 -1398339 766892 1250483 -266052 -1178632 327007 2969421 4278396
34289 4278396 3412672 1407155 -366794 -1180448 -980843 -247621 285273 205200 -273311
34280 -273311 -721032 -1041728 -1374187 -1600599 -1386814 -864126 -820649 -1660625 -2400561 -1595018
34270 -1595018 528828 1862823 993824 -945745 -1972424 -1860950 -1635295 -1294802 -147632
34261 -147632 868296 -243463 -3034312 -4170969 -1881807 1263241 1864432 225841
34253 225841 -904858 -781722 -1030677 -2071295 -2091874 -107554 2287193 3128830 2317818
$$ packed form
34314a819733j462323k472325j234007J299168K959670K424326O93068j32163
34306B55681K58354P1836j376445k065152m60922J502480J089632q17451r54957
34297b496944J098605K165231M83591j516535r12580J505639K642414J308975
34289D278396q65724k005517j773949q13654J99605P33222N32894q0073m78511
34280b73311m47721l20696l32459k26412K13785N22688M3477q39976p39936Q05543
34270a595018K123846J333995q68999j939569j026679J11474K25655L40493J147170
34261a47632J015928j111759k790849j136657K289162L145048O01191j638591
34253B25841j130699J23136k48955j040618k0579J984320K394747Q41637q11012
$$ plain form
34244 2317818 804040 -883719 -2317796 -2753416 -2168468 -1701705 -2018537 -2157517 -1051833
34235 -1051833 636514 1360324 767151 -158598 -594212 -560468 -525397 -1163445 -2922560
34226 -2922560 -4894561 -4875930 -1889409 1904266 3336140 1956025 80034 -562265 -314752
34217 -314752 193970 963249 1140463 -900312 -4557674 -6176088 -3269620 1833629 4675075
34208 4675075 3936662 1877534 458786 -340037 -670669 -83683 861035 605480 -964408
34199 -964408 -2005726 -1435377 -359264 2899 -36376 -3612 -355330 -963069 -401453 1665224
34189 1665224 3096668 2134138 171457 -364977 394514 586956 10916 155303 1376985
34180 1376985 2543404 3254966 4025043 4380371 3326969 1842984 2208026 4251663 4929006
$$ packed form
34244B317818j513778j687759j434077m35620N84948M66763l16832j38980J105684
34235a051833J688347P23810n93173r25749m35614L3744L5071o38048j759115
34226b922560j972001J8631K986521L793675J431874j380115j875991o42299K47513
34217c14752N08722P69279J77214k040775l657362j618414K906468N103249K841446
34208D675075p38413k059128j418748p98823l30632N86986R44718k55555j569888
34199i64408j041318N70349J076113L62163l9275L2764l51718o07739N61616K066677
34189A665224J431444r62530j962681n36434P59491J92442n76040J44387J221682
34180A376985J166419P11562P70077L55328j053402j483985L65042K043637O77343
$$ plain form
34171 4929006 2703099 -93097 -685945 553125 1667338 2279776 3046893 3418059 2369930
34162 2369930 666961 184591 1218955 2297399 2523243 2404822 2372938 2170561 1969632
34153 1969632 2493488 3452178 3239338 1084755 -1463433 -2214143 -905098 883739 2021579
34144 2021579 2857045 3808497 4114289 2898378 868159 -260537 -9583 373959 -37670
34135 -37670 -634706 -834561 -1480506 -3278573 -4908223 -4568191 -2861208 -2158882 -3303910
34126 -3303910 -4942557 -6013618 -6599237 -6170473 -3709736 -331683 1046634 -21843
34118 -21843 -427871 1408356 2361635 -511678 -4449954 -4395733 -569361 1778143 -9996
34109 -9996 -2987835 -4050599 -4198456 -5327594 -6175036 -4443826 -945048 1361261 1497760
$$ packed form
34171D929006k225907k796196n92848J239070J114213O12438P67117L71166j048129
34162B369930j702969m82370J034364J078444K25844j18421l1884k02377k00929
34153A969632N23856R58690k12840k154583k548188p50710J309045J788837J137840
34144B021579Q35466R51452L05792j215911k030219j128696K50954L83542m11629
34135c7670n97036j99855o45945j798067j629650L40032J706983P02326j145028
34126c303910j638647j071061n85619M28764K460737L378053J378317j068477
34118b1843m06028J836227R53279k873313l938276N4221L826372K347504j788139
34109i996k977839j062764j47857j129138q47442J731210L498778K306309J36499
$$ plain form
34100 1497760 1145927 1672162 2628403 3105677 2817706 1808224 553415 320046 1870073
34091 1870073 3637079 2839278 -899722 -4411598 -4551605 -1991917 -152850 -819351 -2354058
34082 -2354058 -2512199 -1555806 -1457529 -2797924 -3941398 -3346575 -1403627 553781 2040320
34073 2040320 3378473 4530225 4929382 4261635 2796346 1219600 523439 1348266 2741042
34064 2741042 2457801 -350125 -3546886 -4587590 -3937636 -3889460 -4422208 -3055864 538661
34055 538661 2726905 650336 -3336987 -4546423 -2122185 359784 99905 -1771215
34047 -1771215 -2704961 -2115144 -1122851 -527730 -428713 -965125 -2112562 -3102261 -3080421 -2259469
34037 -2259469 -1663517 -1725588 -1735738 -821084 913982 2437730 2838416 2136375 997641
$$ packed form
34100A497760l51833N26235R56241M77274k87971j009482j254809k33369J550027
34091A870073J767006p97801l739000l511876j40007K559688J839067o66501j534707
34082b354058j58141R56393R8277j340395j143474N94823J942948J957408J486539
34073B040320J338153J151752L99157o67747j465289j576746o96161Q24827J392776
34064B741042k83241k807926l196761j040704O49954M8176n32748J366344L594525
34055E38661K188244k076569l987323j209436K424238K481969k59879j871120
34047a771215r33746N89817R92293N95121R9017n36412j147437r89699K1840Q20952
34037b259469N95952o2071j0150R14654J735066J523748M00686p02041j138734
$$ plain form
34028 997641 -148429 -1239064 -1768918 -733439 1793938 3729432 3078147 778647 -331249
34019 -331249 317535 111591 -2300998 -4055571 -2134936 1305646 1346871 -2319952 -4505246
34010 -4505246 -2072880 1593140 2096567 526797 709069 2422095 2181496 -57743 -168291
34001 -168291 3245814 5863362 3831727 -695142 -3084699 -2496530 -1384821 -863567 -234519
33992 -234519 103091 -912373 -1994779 -569165 2792618 4365002 2629309 518637
33984 518637 766343 1783212 438668 -3014611 -5401868 -4991617 -2960687 -866032 1104838
33975 1104838 3042399 4212090 3864934 2323177 693012 -126504 -14062 367860 99492
$$ packed form
34028I97641j146070j090635n29854J035479K527377J935494o51285k299500j109896
34019c31249O48784k05944k412589j754573J920635L440582M1225l666823k185294
34010d505246K432366L666020N03427j569770J82272J713026k40599k239239j10548
34001a68291L414105K617548k031635m526869k389557N88169J111709N21254O29048
33992b34519L37610j015464j082406J425614L361783J572384j735693k110672
33984E18637K47706J016869j344544l453279k387257M10251K030930K094655J970870
33975A104838J937561J169691l47156j541757j630165q19516J12442L81922k68368
$$ [...]
##END NTUPLES=NMR SPECTRUM
##END=
