##TITLE=31Pdec_3E1603
 aceton-d6, 64 sc
 17.3.2023
##JCAMPDX= 6.0         $$ Bruker NMR JCAMP-DX V2.0
##DATA TYPE= NMR SPECTRUM
##DATA CLASS= NTUPLES
##ORIGIN= UXNMR, Bruker Analytische Messtechnik GmbH
##OWNER= root
$$ XWIN-NMR		Version 3.5
$$ Fri Mar 17 14:26:38 2023 Russian Standard Time (UT+4h)  she@DPX200
##.OBSERVE FREQUENCY= 81.013821
##.OBSERVE NUCLEUS= ^31P
##.ACQUISITION MODE= SIMULTANEOUS
##.ACQUISITION SCHEME= undefined
##.AVERAGES= 24
##.DIGITISER RES= 16
##SPECTROMETER/DATA SYSTEM= spect
##.PULSE SEQUENCE= zgpg30
##.SOLVENT NAME= DMSO
##.SHIFT REFERENCE= (INTERNAL, DMSO, 0, 248.564)
##AUDIT TRAIL= $$ (NUMBER, WHEN, WHO, WHERE, WHAT)
$$ ##TITLE= Audit trail, XWIN-NMR		Version 3.5
$$ ##JCAMPDX= 5.01
$$ ##ORIGIN= Bruker BioSpin GmbH
$$ ##OWNER= she
$$ F:/spectra/data/she/nmr/P31/1/pdata/1/auditp.txt
$$ ##AUDIT TRAIL=  $$ (NUMBER, WHEN, WHO, WHERE, WHAT)
(   1,<2023-03-17 14:25:31.51 +0400>,<she>,<DPX200>,
      <created by zg, POWCHK disabled, PULCHK disabled
       configuration hash MD5:
       00 E9 B6 7A A2 85 ED C7 34 08 36 98 17 FE 4E 26
       data hash MD5: 32K
       80 4B A2 0C 6A AA 36 52 AF 3A B7 C3 9F 90 CA 6D>)
(   2,<2023-03-17 14:25:40.15 +0400>,<she>,<DPX200>,
      <Start of raw data processing
       efp BC_mod = 2 LB = 1 FT_mod = 6 PKNL = 1 PHC0 = -10879.98 PHC1 = 21.01018 SI = 64K 
       data hash MD5: 64K
       4D 6F 2A 68 E5 FA E3 0A 0F D6 D1 B9 FE 8D 49 3F>)
(   3,<2023-03-17 14:25:56.90 +0400>,<she>,<DPX200>,
      <pk PHC0 = 4.200168 PHC1 = 0 
       data hash MD5: 64K
       0A EE 9B 71 F1 C4 39 F6 8F 02 15 E3 BB F1 C5 FC>)
(   4,<2023-03-17 14:26:08.28 +0400>,<she>,<DPX200>,
      <abs ABSG = 5 
       data hash MD5: 64K
       8C E9 DD 56 E9 87 D1 6B 78 30 DA 25 1F 66 84 B5>)
$$ ##END=
$$ 
$$ hash MD5
$$ CA 77 1A 6E 90 50 8F BF D6 AF F5 F7 52 C6 82 7A
##$RELAX= 
##$RELAX= 
##$RELAX= 
##$RELAX= 
##$RELAX= 
##$RELAX= 
##$RELAX= 
##$RELAX= 
##$RELAX= 
$$ Bruker specific parameters
$$ --------------------------
##$DU= <F:/spectra>
##$EXPNO= 1
##$NAME= <P31>
##$PROCNO= 1
##$TYPE= <nmr>
##$USER= <she>
##$AMP= (0..31)
100 100 100 100 100 100 100 100 100 100 100 100 100 100 100 100 100 100 
100 100 100 100 100 100 100 100 100 100 100 100 100 100 
##$AQSEQ= 0
##$AQ_mod= 1
##$AUNM= <au_zg>
##$AUTOPOS= <>
##$BF1= 81.014009
##$BF2= 200.13
##$BF3= 200.13
##$BF4= 200.13
##$BF5= 200.13
##$BF6= 200.13
##$BF7= 200.13
##$BF8= 200.13
##$BYTORDA= 1
##$CFDGTYP= 0
##$CFRGTYP= 5
##$CHEMSTR= <none>
##$CNST= (0..31)
1 1 145 1 1 1 1 1 1 1 1 1 1 1 1 1 1 1 1 1 1 1 1 1 1 1 1 1 1 1 1 1 
##$CPDPRG= <waltz16>
##$CPDPRG1= <>
##$CPDPRG2= <waltz16>
##$CPDPRG3= <>
##$CPDPRG4= <mlev>
##$CPDPRG5= <mlev>
##$CPDPRG6= <mlev>
##$CPDPRG7= <mlev>
##$CPDPRG8= <mlev>
##$CPDPRGB= <>
##$CPDPRGT= <>
##$D= (0..31)
0 1 0 0 0 0 0 0 0 0 0 0.03 2e-05 3e-06 0 0 0 0 0 0 0 0 0 0 0 0 0 0 0 0 
0 0 
##$DATE= 1679048730
##$DBL= (0..7)
120 120 120 11 120 120 24 19 
##$DBP= (0..7)
150 150 150 150 150 150 150 150 
##$DBP07= 0
##$DBPNAM0= <>
##$DBPNAM1= <>
$$ [...]
##$SUBNAM3= <"">
##$SUBNAM4= <"">
##$SUBNAM5= <"">
##$SUBNAM6= <"">
##$SUBNAM7= <"">
##$SUBNAM8= <"">
##$SUBNAM9= <"">
##$SW= 501.771253377433
##$SWIBOX= (0..15)
0 1 3 0 0 0 0 0 0 0 0 0 0 0 0 0 
##$SW_h= 40650.406504065
##$TD= 32768
##$TD0= 1
##$TE= 0
##$TE2= 300
##$TE3= 300
##$TEG= 300
##$TL= (0..7)
0 120 53 12 22 120 120 120 
##$TP= (0..7)
150 150 150 150 150 150 150 150 
##$TP07= 0
##$TPNAME0= <>
##$TPNAME1= <>
##$TPNAME2= <>
##$TPNAME3= <>
##$TPNAME4= <>
##$TPNAME5= <>
##$TPNAME6= <>
##$TPNAME7= <>
##$TPOAL= (0..7)
0.5 0.5 0.5 0.5 0.5 0.5 0.5 0.5 
##$TPOFFS= (0..7)
0 0 0 0 0 0 0 0 
##$TUNHIN= 0
##$TUNHOUT= 0
##$TUNXOUT= 0
##$USERA1= <user>
##$USERA2= <user>
##$USERA3= <user>
##$USERA4= <user>
##$USERA5= <user>
##$V9= 5
##$VALIST= <valist>
##$VCLIST= <CCCCCCCCCCCCCCC>
##$VD= 0
##$VDLIST= <DDDDDDDDDDDDDDD>
##$VPLIST= <PPPPPPPPPPPPPPP>
##$VTLIST= <TTTTTTTTTTTTTTT>
##$WBST= 1024
##$WBSW= 4
##$XGAIN= (0..3)
0 0 0 0 
##$XL= 0
##$YL= 0
##$YMAX_a= 537
##$YMIN_a= -530
##$ZGOPTNS= <>
##$ZL1= 120
##$ZL2= 120
##$ZL3= 120
##$ZL4= 120
##$ABSF1= 248.5645
##$ABSF2= -253.2056
##$ABSG= 5
##$ABSL= 3
##$ALPHA= 0
##$AQORDER= 0
##$ASSFAC= 0
##$ASSFACI= 0
##$ASSFACX= 0
##$ASSWID= 0
##$AUNMP= <proc_1d>
##$AZFE= 0.1
##$AZFW= 0.5
##$BCFW= 0
##$BC_mod= 2
##$BYTORDP= 0
##$COROFFS= 0
##$CY= -3
##$DATMOD= 1
##$DC= 0
##$DFILT= <>
##$DTYPP= 0
##$F1P= 0
##$F2P= 0
##$FCOR= 1
##$FTSIZE= 65536
##$FT_mod= 6
##$GAMMA= 0
##$GB= 0
##$INTBC= 1
##$INTSCL= 6.047779e-11
##$ISEN= 30
##$LB= 1
##$LEV0= 0
##$LPBIN= 0
##$MAXI= 10000
##$MC2= 0
##$MEAN= 0
##$ME_mod= 0
##$MI= 50
##$NCOEF= 0
##$NC_proc= -9
##$NLEV= 6
##$NOISF1= 182.463
##$NOISF2= 159.3651
##$NSP= 0
##$NTH_PI= 0
##$NZP= 0
##$OFFSET= 248.5645
##$PC= 4
##$PHC0= -10875.78
##$PHC1= 21.01018
##$PH_mod= 1
##$PKNL= yes
##$PPARMOD= 0
##$PSCAL= 0
##$PSIGN= 0
##$REVERSE= no
##$SF= 81.0140089999694
##$SI= 65536
##$SIGF1= 159.3651
##$SIGF2= -187.1042
##$SINO= 113.3802
##$SIOLD= 16384
##$SREGLST= <1H.CDCl3>
##$SSB= 0
##$STSI= 65536
##$STSR= 0
##$SW_p= 40650.406504065
##$SYMM= 0
##$S_DEV= 0
##$TDeff= 32768
##$TDoff= 0
##$TI= <>
##$TILT= no
##$TM1= 0
##$TM2= 0
##$TOPLEV= 0
##$USERP1= <user>
##$USERP2= <user>
##$USERP3= <user>
##$USERP4= <user>
##$USERP5= <user>
##$WDW= 1
##$XDIM= 65536
##$YMAX_p= 327031689
##$YMIN_p= -10798148
$$ End of Bruker specific parameters
$$ ---------------------------------
##NTUPLES= NMR SPECTRUM
##VAR_NAME=  FREQUENCY,     SPECTRUM/REAL,   SPECTRUM/IMAG
##SYMBOL=    X,             R,               I
##VAR_TYPE=  INDEPENDENT,   DEPENDENT,       DEPENDENT
##VAR_FORM=  AFFN,          ASDF,            ASDF
##VAR_DIM=   65536,         65536,           65536
##UNITS=     HZ,            ARBITRARY UNITS, ARBITRARY UNITS
##FACTOR=    0.620285442955139, 1,           1
##FIRST=     20137.2065510682, 0,            0
##LAST=      -20513.1999529968, 0,           0
##MIN=       -20513.1999529968, -10798148,   0
##MAX=       20137.2065510682, 327031689,    0
$$ Real data points
##PAGE= N=1
##DATA TABLE= (X++(R..R)), XYDATA
$$ [...]
42071 46306 36631 -414701 -762543 -569627 -286297 -558514 -1167359 -1294047 -681216 70405
42061 70405 374780 300241 213697 247497 340114 435160 377322 -65727 -759313 -1064936 -561951
42050 -561951 275214 588243 248406 -47666 161461 499738 453877 178219 161787 413168
42040 413168 500202 271050 27058 -22461 -1496 29097 243814 603168 635874 38119
42030 38119 -747090 -949226 -391071 344563 651071 486369 173962 -76644 -260900 -366167
42020 -366167 -309954 -94799 123422 193203 141976 125016 204632 254981 132866 -124636 -363208
42009 -363208 -512883 -581038 -473739 -41464 620475 1115204 1137716 794518 392920 58041
41999 58041 -242881 -409607 -224009 299037 766027 723650 96185 -702865 -1095971 -860582
41989 -860582 -352879 -91463 -99336 95391 691070 1191409 1081398 639840 572149 956595
41979 956595 1146621 782404 292166 129945 61372 -349522 -935538 -1159299 -958293 -804901
41969 -804901 -948076 -1097950 -974326 -748219 -721023 -850222 -836294 -520489 -8547 476999
41959 476999 712354 569571 174209 -138120 -209008 -304542 -740063 -1315304 -1436436 -879789
41949 -879789 -144811 139710 -63559 -321166 -392714 -430670 -568433 -680684 -649499 -564901
41939 -564901 -497119 -310658 93429 532419 758657 800769 881089 1067435 1182974 1016578
41929 1016578 510994 -172148 -685513 -740279 -434403 -170192 -133637 -101474 70984 109836
41919 109836 -207232 -552455 -469673 -71751 184127 238149 358322 436276 46678 -722869
41909 -722869 -1191080 -1041835 -742040 -740471 -871345 -900419 -1019679 -1288273 -1171694 -337381
41899 -337381 504176 354681 -658549 -1393655 -1187788 -508143 -16832 286198 669948
41890 669948 1001130 942854 513682 17595 -412700 -819301 -1061483 -863467 -303402 67401
41880 67401 -178655 -779987 -1064944 -762767 -289822 -177452 -476725 -881135 -1169833 -1251733
41870 -1251733 -1008501 -507962 -228597 -564166 -1138657 -1179095 -631918 -259151 -409487 -418851
41860 -418851 283641 1115462 1109303 335869 -237460 -115563 279642 487000 553241 573276
41850 573276 382853 -6494 -206400 -11249 251958 239326 98963 138535 279192 208801
41840 208801 -94191 -330096 -295292 -61533 222504 473174 602472 505155 206689 -72442
41830 -72442 -108793 70127 209981 153533 39796 47631 42961 -249050 -735111 -986551 -900035
41819 -900035 -903872 -1215936 -1307229 -596991 579620 1280731 1140163 666743 361923 154293
41809 154293 -106393 -165982 220000 718996 699751 -8108 -914347 -1410178 -1331794 -974758
41799 -974758 -673596 -465686 -202480 108874 292547 359554 575115 990002 1201802 890826
41789 890826 364184 204139 533500 968486 1121988 799777 -58665 -1157706 -1772864
41780 -1772864 -1468765 -765141 -510854 -723201 -715946 -286892 34730 -4228 14626 307879
41770 307879 424929 63414 -341233 -320152 -84497 -42313 -112037 -24085 133335 169852
41760 169852 210797 390580 489428 321887 131902 175507 285151 264478 282069 410797
41750 410797 270540 -287822 -629163 -183217 553546 680443 275892 235047 839575 1367765
41740 1367765 1192742 506176 -179574 -585533 -587307 -196363 223975 258775 57164 109013
41730 109013 362394 216018 -472127 -1061384 -1076984 -832847 -758892 -714854 -432326 -141143
41720 -141143 -235151 -657628 -1077294 -1376496 -1540052 -1367582 -778518 -168689 27325 -38727
41710 -38727 85400 390066 450930 176403 -48376 -41548 -127904 -551390 -1009000 -1081108 -845394
41699 -845394 -732562 -931061 -1234653 -1380691 -1245392 -760124 27274 748679 904046 450321
41689 450321 -30542 2859 392718 583265 440211 358073 554633 736862 663159 598381
41679 598381 834265 1070735 766229 -34336 -725068 -972036 -1001386 -958593 -559566 257883
41669 257883 799536 341743 -755499 -1293962 -721003 170614 337784 -167355 -474693
41660 -474693 -257536 -93199 -376556 -605127 -205213 447016 496936 -129531 -638923 -533627
41650 -533627 -199799 -167315 -364368 -409658 -200934 127184 502151 859173 1053284 1071020
41640 1071020 1053303 919832 363390 -510893 -994802 -655801 -29453 72474 -350290 -633690
41630 -633690 -450172 -71707 229561 440687 498827 282851 -42337 -153070 -77400 -125237
41620 -125237 -288700 -215519 122115 234215 -196299 -816422 -1042828 -742027 -281293 -88103
41610 -88103 -283922 -610041 -658690 -291283 206454 495023 549221 473967 204382 -279978
41600 -279978 -670260 -673754 -461156 -337758 -188885 221672 622438 560682 217572 163397
41590 163397 356885 195522 -383969 -713971 -495908 -237665 -276455 -198696 306850 764281
41580 764281 636508 128958 -271370 -502836 -648439 -516332 -91814 114254 -201458 -532361
41570 -532361 -343519 19967 -63771 -417436 -428788 -167668 -230426 -630440 -752409 -410030
41560 -410030 -109348 -158156 -270553 -215959 -166399 -189626 -35940 308479 423922 109583
41550 109583 -256607 -315394 -241585 -329162 -449564 -317002 -31337 39698 -191833 -412803
41540 -412803 -323832 1179 192134 -16875 -448022 -608611 -251769 315049 641178 668561
41530 668561 593251 419725 99379 -37041 412808 1144939 1307919 653271 -50313 -81443
41520 -81443 293012 405435 250079 317495 628665 660133 245707 -96031 51679 388707
41510 388707 390491 63787 -176418 -184984 -222913 -442997 -616871 -498818 -200091 -20154
41500 -20154 -65894 -216799 -349483 -399468 -276055 62619 454990 648047 588141 449561
41490 449561 376103 360830 372599 403742 385369 266110 177492 272357 392002 210261 -229594
41479 -229594 -481769 -337362 -123636 -156370 -272609 -210085 -103945 -215127 -434307 -488725
41469 -488725 -446409 -557653 -713625 -533677 14680 488983 525350 226200 -39548 1106
41459 1106 338479 652862 555884 63366 -318899 -216065 123429 266726 261226 406539
41449 406539 587477 424861 6789 -155002 55592 177081 -63813 -361128 -400655 -312516
41439 -312516 -304759 -297913 -207474 -199132 -370785 -520687 -511942 -543020 -759459 -895384 -630161
41428 -630161 -77631 374068 512795 338294 -117244 -693004 -1012080 -838755 -436424 -272312
41418 -272312 -414990 -492441 -237625 169795 363820 221542 -67948 -279643 -364376 -345808
41408 -345808 -142429 290003 662335 543905 10540 -274701 40640 383394 49655 -669541
41398 -669541 -835810 -217635 454946 633781 576739 628072 627830 395317 148521 22713
41388 22713 -248446 -729601 -927173 -546659 -90661 -136166 -472970 -558450 -401329 -334360
41378 -334360 -291806 -56425 65593 -367945 -1012635 -1015272 -231706 556283 732791 509578
41368 509578 362835 399539 478630 478779 264950 -205447 -627762 -611193 -280843 -181273 -487313
41357 -487313 -784367 -767730 -656362 -686658 -672065 -384992 6312 228877 332247 473897
41347 473897 511177 180357 -429794 -903602 -976910 -771530 -555763 -434102 -314553 -113903
41337 -113903 64974 32881 -178098 -244036 68523 564544 859055 850423 727658 617991
41327 617991 526057 551915 817611 1158447 1200495 798301 159031 -444326 -821465 -817798
41317 -817798 -488884 -270550 -548945 -1058168 -1150940 -695779 -219812 -100257 -163165 -220377
41307 -220377 -398499 -663129 -606984 -115111 262122 63879 -382625 -512428 -375914 -363165
41297 -363165 -382725 17849 820012 1418995 1356829 731041 -91169 -737115 -860050 -382526
41287 -382526 254028 484557 289601 99913 80043 -8197 -202311 -163565 206183 491170
41277 491170 410092 292988 517011 829613 724241 258658 -50620 -75384 -246862 -767121
41267 -767121 -1169439 -965420 -352343 121291 341370 595104 863009 721293 92058 -429143
41257 -429143 -333235 96547 265783 166700 256164 581408 651254 257566 -145353 -121938
41247 -121938 130504 151413 -139611 -487461 -729687 -864481 -878136 -783810 -690052 -621873
41237 -621873 -448185 -171198 -50498 -206867 -352315 -197095 102944 207378 76408 -130435
41227 -130435 -415442 -823389 -1142288 -1118411 -835189 -521790 -161901 317189 676512 656402
41217 656402 445439 340513 150459 -409764 -898330 -559429 399413 831442 218771 -612728
41207 -612728 -759448 -435006 -312232 -363169 -140140 250929 313322 70603 15154 216785
41197 216785 212241 -174446 -554400 -635073 -585619 -581863 -505802 -296471 -126616 -9152 305379
41186 305379 758263 777482 59910 -804528 -998104 -552914 -240621 -476990 -880216 -987316
41176 -987316 -889226 -893811 -938814 -721757 -246073 119653 112689 -150102 -396164 -495171 -480361
41165 -480361 -424720 -366635 -276833 -86072 169017 273057 71860 -233834 -263307 26583
41155 26583 246348 107376 -204019 -359902 -335852 -255984 -27765 483948 1029402 1133385
41145 1133385 700198 117635 -276057 -494559 -623553 -610314 -479159 -436613 -568497 -683287
41135 -683287 -634854 -565079 -645527 -803917 -890927 -895121 -803675 -490194 28709 445676 519759
41124 519759 380053 230398 -11010 -465545 -909651 -1027442 -915074 -943631 -1197244 -1415056
41114 -1415056 -1424414 -1259930 -921566 -430801 -86877 -195425 -509684 -435058 110375 559800
41104 559800 606441 687129 1197152 1723115 1601196 926221 399321 296890 189565 -266694
41094 -266694 -801650 -998882 -884770 -759638 -709745 -616102 -515322 -607197 -869041 -933830
41084 -933830 -515494 170414 591597 479499 62057 -301751 -516612 -652188 -647436 -392470
41074 -392470 -38969 90478 -44360 -134029 -13713 82255 -45574 -176791 -32479 216401
41064 216401 210299 32869 96628 391941 376347 -178518 -689801 -506460 139307 412998
41054 412998 30082 -372250 -160773 397047 498799 -109807 -801059 -858309 -300347 264349
41044 264349 405233 220287 -1744 -132130 -113835 174183 693707 1045455 817630 132132
41034 132132 -437417 -551023 -442860 -459287 -523526 -314934 166249 526934 492274 242800
41024 242800 136041 254961 381290 336428 182847 78552 75879 141266 263885 408094
41014 408094 424631 206910 -58945 -43619 223444 265599 -204845 -806321 -994316 -862445
41004 -862445 -942155 -1247722 -1136654 -336739 456958 447555 -197519 -663705 -617932 -450622
40994 -450622 -492509 -574432 -458770 -242347 -147788 -227667 -422102 -665714 -843660 -868467
40984 -868467 -845814 -912436 -891077 -426726 453241 1225029 1435216 1130907 657112 312318
40974 312318 270616 515270 733490 573434 94969 -324310 -528061 -621361 -511099 -14949
40964 -14949 487424 268679 -584221 -1016168 -512205 34144 -303551 -966799 -784158 127587
40954 127587 518373 -93169 -833993 -906335 -562932 -365073 -352284 -340395 -339284 -300634 -51758
40943 -51758 212936 -17238 -722939 -1183250 -990509 -613055 -572728 -719641 -795176 -1041826
40933 -1041826 -1596218 -1821234 -1039026 352878 1222775 1050124 366911 -48335 77555
40924 77555 506360 820329 775345 561248 580947 823248 787381 266959 -226894 -190524
40914 -190524 171450 418733 573596 771330 676559 -999 -725845 -690099 7665 513152
40904 513152 454744 263844 296892 426628 565075 823106 1009005 699394 14564 -357960
40894 -357960 -153041 111613 40052 -29698 302309 790110 967712 844378 717280 621028
40884 621028 393172 60675 -192642 -285759 -239081 -102657 -41510 -238804 -568106 -662466
40874 -662466 -469237 -398032 -710879 -1102160 -1140855 -841873 -534656 -402615 -392811 -385265 -267380
40863 -267380 -28128 115510 -68188 -412839 -476560 -170005 109088 85100 -74416 -207697
40853 -207697 -453877 -838202 -1015995 -775050 -427209 -369748 -586962 -871315 -1161490 -1350574
40843 -1350574 -1170202 -641417 -253518 -300593 -435006 -299014 -151063 -324315 -493162 -172846
40833 -172846 343310 308610 -336071 -872044 -842673 -504928 -180235 178487 579262 732284
40823 732284 500733 195849 133418 213422 206639 188265 380102 710850 829276 558222
40813 558222 150946 14185 231776 459329 339954 -61848 -369362 -361182 -124272 195064
40803 195064 481287 494212 26322 -667224 -997382 -786564 -500057 -532903 -700926 -710091
40793 -710091 -658247 -688158 -587658 -204726 120189 34698 -250699 -361281 -368742 -455446 -355150
40782 -355150 190702 721155 560972 -138295 -611578 -615067 -577323 -668300 -534468 -65671
40772 -65671 325692 401218 439420 645542 751447 452863 -151472 -720327 -955657 -719352
40762 -719352 -216639 25117 -229334 -507211 -327145 -37813 -254203 -717715 -644761 -100286
40752 -100286 42073 -398571 -564561 -20296 513892 369188 -95776 -296762 -318357 -370225
40742 -370225 -174662 373676 656162 214343 -418566 -520640 -242972 -107550 -23145 329940
40732 329940 626446 367375 -104036 -8267 635265 1054402 883401 458697 55089 -359321
40722 -359321 -639315 -523080 -212540 -173985 -323757 -128237 426884 718988 498355 290773
40712 290773 521346 875002 877816 589409 331864 141689 -106542 -311888 -261814 180
40702 180 195527 145706 -59725 -191674 -131513 -29264 -148751 -474690 -631632 -371665
40692 -371665 38931 174619 11323 -180777 -323142 -514140 -665784 -601867 -445658 -448444
40682 -448444 -468021 -118894 521649 877833 681574 326373 195837 84521 -378007 -1045602
40672 -1045602 -1395628 -1219829 -832712 -582794 -414198 -54464 471082 749069 532028
40663 532028 193327 291378 722410 767675 126552 -591415 -714811 -380904 -121121 -15680
40653 -15680 157216 279316 94021 -158023 -20563 365723 440212 162304 42710 215060
40643 215060 239441 -39435 -192069 4596 180009 82083 25552 252168 419657 157075
40633 157075 -337835 -657347 -727969 -642887 -379492 -62228 -91151 -583343 -1029735 -916307
40623 -916307 -389094 58935 242327 255519 124668 -91905 -129261 142949 426646 401498
40613 401498 183440 41335 -46451 -163848 -101859 284735 611005 382487 -254164 -670500
40603 -670500 -578343 -244457 38180 237233 354206 328842 220353 179854 229936 305186
40593 305186 432098 616358 686431 549119 442852 579302 689178 354994 -302608 -730641
40583 -730641 -698945 -493780 -355532 -193896 63475 280432 391828 483662 481866 164674
40573 164674 -362931 -613722 -358288 37114 159771 98544 143549 250330 197220 72664
40563 72664 167118 442938 520901 241804 -98445 -178547 -32695 134694 253360 309712
40553 309712 198122 -69720 -177905 106810 437304 212891 -537113 -1066858 -916571 -528476
40543 -528476 -496259 -648186 -443262 42273 240836 71307 19187 206172 178035 -175454
40533 -175454 -285057 122061 429531 59438 -591316 -763180 -430934 -151216 -166209 -287521
40523 -287521 -391586 -433882 -234956 168259 261615 -220985 -641790 -287588 428771 487859
40513 487859 -171496 -585611 -272447 202724 343669 403864 588435 500751 -78875 -617425
40503 -617425 -619929 -378433 -356324 -394613 -160320 101074 -47880 -428555 -476378 -73193
40493 -73193 385916 566818 392795 -73121 -491222 -306899 524637 1184562 955377 250048
40483 250048 -5616 231275 172752 -434031 -902311 -744780 -399394 -455965 -806311 -995787
40473 -995787 -917881 -715769 -394755 20492 261800 188949 123782 377391 672098 514589
40463 514589 -12655 -355609 -326284 -285207 -418476 -401116 -41663 225777 -72982 -686936
40453 -686936 -960188 -759738 -548747 -549015 -407110 112205 620732 668184 422447 325400
40443 325400 346618 132254 -242700 -285111 112332 450464 365675 82387 -87688 -194440
40433 -194440 -296394 -141994 376454 841515 857942 665641 698732 812082 548423 4872
40423 4872 -235461 -31010 102925 -165597 -510209 -544581 -400016 -383894 -428464 -237174
40413 -237174 224633 661160 744938 340466 -393802 -1012409 -1111473 -776478 -477324 -420461
40403 -420461 -314258 55662 371592 208953 -340536 -806839 -928808 -792906 -546953 -317633
40393 -317633 -307844 -620019 -1001636 -1066742 -780494 -479512 -420596 -546003 -682799 -731017
40383 -731017 -644686 -444742 -253142 -121847 107630 511728 732079 312051 -558802 -1053575
40373 -1053575 -665708 167015 645888 544285 253502 117196 118124 171527 346829 680918
40363 680918 999450 1071982 861699 549705 349500 303117 230891 -64823 -498749 -717216
40353 -717216 -530471 -204534 -116072 -201308 -35045 518120 1028696 1023032 565513 137937
40343 137937 78561 317365 561336 560824 267085 -90500 -127801 308537 881948 1053600
40333 1053600 649449 17161 -380248 -391070 -189912 -17138 40993 95767 295769 570874
40323 570874 620284 291720 -141624 -325448 -354800 -601063 -1010439 -1036879 -454265 210079
40313 210079 374881 153126 -12842 -106554 -358348 -557349 -254926 374356 599913 208097
40303 208097 -180065 -125227 -8704 -224443 -402594 -100200 260639 -6412 -612082 -599713
40293 -599713 146583 663279 393257 2443 239334 745297 697911 118376 -263447 -183607
40283 -183607 -81040 -207967 -260203 -50749 92546 -93680 -319438 -199723 148198 353000
40273 353000 388507 513396 735862 743861 389644 -67825 -294293 -252909 -164038 -234526 -494543
40262 -494543 -795915 -906913 -676115 -162664 392065 702973 570430 10845 -639482 -877837
40252 -877837 -491113 159198 463360 178848 -382160 -720142 -560957 4667 560586 588124
40242 588124 -67267 -917315 -1277585 -1026081 -624807 -363084 -21630 513590 786713 375396
40232 375396 -342542 -573922 -160621 266915 196405 -185322 -425288 -388793 -209509 15652
40222 15652 239998 380180 406302 379491 301818 99640 -179338 -362741 -403766 -391869 -278230
40211 -278230 74626 479774 473604 -11706 -420612 -313303 41337 171212 128964 239183
40201 239183 416193 304072 -68415 -344252 -459412 -636406 -801686 -626678 -204851 -59252
40191 -59252 -310933 -443935 -154762 142020 22898 -236819 -128606 289924 537604 381239
40181 381239 -72621 -708780 -1364491 -1652365 -1303670 -593025 -15749 333915 643013 802968
40171 802968 518640 -19798 -165224 322293 920759 1070350 827347 526478 184631 -358409
40161 -358409 -937816 -1143543 -876956 -503402 -392148 -521346 -618945 -538146 -367299 -229025
40151 -229025 -115034 11458 34749 -224216 -695936 -1006121 -867398 -413988 7489 263324
40141 263324 439545 527192 402549 132245 3347 143379 332591 322292 172066 139155
40131 139155 342189 633988 743972 527134 159311 39806 335196 677134 566133 56166
40121 56166 -290302 -187847 9855 -83578 -281623 -152620 277489 517506 230427 -412011
40111 -412011 -948941 -1007873 -551062 48388 261908 -54582 -450247 -396715 87500 539795
40101 539795 660280 551735 436636 417505 478662 468216 142604 -476558 -867370 -523827
40091 -523827 279746 674958 272656 -379032 -628204 -573321 -688588 -931337 -802733 -241026
40081 -241026 124106 -164418 -665800 -554327 295409 1123147 1232146 784552 410778 254428
40071 254428 -160092 -1061547 -1876099 -1860141 -1037640 -109342 443180 707014 811618 603857
40061 603857 81132 -304280 -178068 175299 178728 -220966 -496373 -263090 292036 734291
40051 734291 835878 654402 413914 368449 552768 621840 196687 -550737 -943897 -599708
40041 -599708 62300 332276 44969 -364329 -515582 -469929 -442857 -435119 -324966 -169141
40031 -169141 -176809 -364685 -421540 -67996 517517 846827 748192 599982 742630 891707
40021 891707 527194 -222920 -599815 -250622 240093 170017 -337544 -654750 -598861 -481264
40011 -481264 -361229 73304 779702 1132624 732243 9398 -337507 -215208 -85890 -254433
40001 -254433 -581942 -825924 -939493 -1012027 -1111552 -1207782 -1167837 -897345 -542905 -389376
39991 -389376 -457921 -432795 -151069 106901 81510 9978 234758 534469 362387 -287723
39981 -287723 -790094 -770352 -581490 -655932 -811471 -589102 -28134 330906 178062 -169706
39971 -169706 -192016 205669 607994 582954 174016 -149453 -29169 380804 616940 420569
39961 420569 -65862 -522398 -700910 -526117 -155390 106513 152863 251032 613032 907454
39951 907454 612947 -152012 -642719 -468461 -80132 -32060 -216788 -207850 23223 208344
39941 208344 328370 527456 625923 268080 -429250 -856193 -661483 -167507 103398 33562
39931 33562 -105564 -54262 208507 518469 697654 716683 688768 659431 499338 117408
39921 117408 -347327 -708227 -957313 -1102709 -969293 -483494 -14456 -22197 -405227 -612782
39911 -612782 -428390 -219005 -315737 -564171 -658168 -560055 -396022 -249071 -240539 -506049
39901 -506049 -896903 -1016821 -758354 -479644 -440537 -446974 -331941 -348291 -656032 -831283
39891 -831283 -472092 2830 -145568 -815335 -1138637 -740756 -190730 -30641 -78169 -22591
39881 -22591 -40660 -312604 -463979 -112845 396222 457703 152711 46037 182665 36230
39871 36230 -516680 -927927 -886851 -788493 -928585 -873187 -188012 671976 870912 345999
39861 345999 -197212 -342646 -378742 -608136 -835374 -756742 -424993 -76096 193113 351008
39851 351008 296497 21633 -277012 -418199 -406862 -291489 -76264 120789 102485 -48228
39841 -48228 63967 575185 1020199 884991 330421 17158 273020 741907 873874 531483
39831 531483 57500 -119698 103245 453440 643639 706379 803978 803260 414357 -190941
39821 -190941 -363167 171193 846151 986707 639876 282233 64306 -145609 -272812 -194683
39811 -194683 -175584 -504404 -853414 -702212 -315344 -495064 -1291614 -1800327 -1494777 -962283
39801 -962283 -910254 -1171140 -1233386 -1130269 -1137637 -1065426 -582923 40830 222516 -71997
39791 -71997 -376381 -508750 -678910 -871560 -764051 -318561 117388 405010 765573 1194942
39781 1194942 1284551 890638 487386 487887 604400 314577 -307954 -694138 -578737 -266278
39771 -266278 -130399 -234366 -480511 -767539 -884602 -588689 -7539 291779 -66702 -710936
39761 -710936 -913128 -493558 -5442 27559 -276379 -466817 -382349 -189686 -16539 108977
39751 108977 58618 -289822 -755763 -1006992 -1034605 -1118583 -1253336 -1041550 -379515 169859
39741 169859 77056 -373881 -478197 -118508 152590 24686 -137135 44556 359734 431811
39731 431811 378398 579065 967167 1066945 724141 304655 53317 -252914 -746547 -1022004
39721 -1022004 -700222 -130220 27480 -236788 -324778 10292 389453 577433 829921 1200693
39711 1200693 1188718 555685 -78429 -61938 314439 335192 -20026 -229504 -229353 -398751
39701 -398751 -646832 -417977 285859 720339 468860 -29257 -280648 -362505 -428571 -293437
39691 -293437 59733 187551 -96289 -269225 81832 488174 280732 -338557 -594603 -285570
39681 -285570 37245 -32124 -264455 -270056 -25723 208962 262438 233524 350393 612302
39671 612302 649148 192868 -382939 -451048 -84613 -17103 -468326 -715193 -235752 399166
39661 399166 372098 -199303 -608859 -653841 -660825 -743230 -744933 -708272 -774391 -821473 -731548
39650 -731548 -711927 -824221 -644565 -49434 199724 -467173 -1272756 -1099671 -270157 -46597
39640 -46597 -546014 -583909 276743 954886 576791 -281084 -691651 -657358 -602330 -500046
39630 -500046 -254737 -209367 -549757 -820523 -674051 -494164 -656823 -802710 -529219 -210747
39620 -210747 -371078 -736145 -696894 -325952 -163869 -285901 -301881 -70124 212651 422612
39610 422612 474595 163812 -425892 -712411 -400689 -75654 -324163 -673535 -249107 804148
39600 804148 1488028 1397617 1067078 898705 698635 407458 381357 657822 721472 347869
39590 347869 4938 50104 154984 -49346 -315439 -261987 -67467 -147553 -442230 -544708
39580 -544708 -370398 -230008 -294833 -369964 -222558 127093 487136 711675 810245 904817
39570 904817 1048808 1082030 789226 237353 -218254 -356521 -348251 -449328 -582788 -432863
39560 -432863 88910 658730 863011 598981 109038 -291601 -426602 -255409 157173 580444
39550 580444 684944 366987 -67377 -252973 -232533 -303212 -455988 -363375 16266 273040
39540 273040 183340 85232 313373 641376 667120 429747 222444 77582 -104415 -184802
39530 -184802 -71319 -136322 -730945 -1424421 -1412052 -670816 -23071 41274 -85987 34944
39520 34944 200377 94061 -61081 105530 448932 549329 373767 223616 177523 40284
39510 40284 -210912 -334483 -206657 24078 224282 453224 756961 989141 974078 740087
39500 740087 473617 300770 225592 263542 492201 876549 1131935 936817 318546 -305287
39490 -305287 -540361 -385370 -163740 -204209 -592734 -1059107 -1097327 -461562 396680 716973
39480 716973 380242 64561 223784 404798 32446 -570665 -614464 -45602 401762 288368
39470 288368 -96339 -414535 -697352 -924491 -832762 -413169 -68554 2253 99229 415082
39460 415082 597044 266480 -389500 -890381 -1038159 -931354 -678277 -376183 -154571 -25514
39450 -25514 103285 164939 -6119 -261842 -207379 162326 346022 67941 -339146 -517572
39440 -517572 -540074 -498639 -212549 263313 431612 160586 116711 753978 1405289 1159663
39430 1159663 235366 -370304 -303857 -31800 203128 617695 1090782 1104750 663887 411985
39420 411985 582449 634619 262970 1172 363758 1022384 1345300 1254476 1053790 832128
39410 832128 528405 249099 76870 -129665 -350016 -165127 636601 1518082 1747287 1275035
39400 1275035 624790 144745 -162211 -287649 -226989 -203186 -380617 -476834 -167072 247371
39390 247371 153838 -440578 -904669 -934085 -871341 -972876 -1029361 -947187 -1039400 -1365575 -1402215
39379 -1402215 -874771 -380002 -559990 -1089018 -1204483 -935552 -969556 -1415602 -1596917 -1194958
39369 -1194958 -740242 -625064 -403179 365195 1165525 1154852 419996 -126473 -21442 256968
39359 256968 171829 -91002 -23806 388429 617444 247280 -556406 -1235707 -1398301 -1154529
39349 -1154529 -889056 -742596 -493037 -22699 356923 315456 56096 79260 447327 683721
39339 683721 467132 66646 -53285 222637 655224 950453 936161 664095 450139 589461
39329 589461 940818 1055887 812695 584073 611017 589734 188670 -336973 -446064 -45415
39319 -45415 452111 681842 587913 232595 -270961 -650555 -650909 -375606 -194195 -269063 -400071
39308 -400071 -360871 -169320 7326 28816 -142562 -365911 -354863 -1236 365639 295097
39298 295097 -201781 -637390 -650180 -374817 -152721 -117717 -171766 -172189 -28341 242540 472121
39287 472121 468419 216832 -158989 -583099 -971043 -1061604 -646843 -12892 224923 -110569
39277 -110569 -497725 -458813 -243378 -418641 -995358 -1387168 -1189559 -619009 -127799 99914
39267 99914 152951 151069 176839 298803 480785 526990 262889 -227937 -635591 -711438 -488335
39256 -488335 -220834 -145238 -293657 -493173 -517294 -263291 175307 593224 829056 828076
39246 828076 570956 38838 -659694 -1202399 -1288030 -1002771 -771532 -829653 -908913 -637514
39236 -637514 -129534 93988 -224280 -729675 -874607 -533297 -92103 -6354 -337871 -693787
39226 -693787 -614836 -69630 483860 620970 452956 428219 682487 850569 589382 45340
39216 45340 -341145 -322517 7566 396314 595234 462251 82429 -275325 -453652 -575711
39206 -575711 -790859 -977317 -904758 -610795 -358517 -221772 19469 482931 925774 1064913
39196 1064913 994680 1042035 1254000 1288392 899276 324790 -3197 -39016 -160162 -580331
39186 -580331 -971165 -874336 -365240 -25869 -218892 -632816 -703876 -330672 58953 111910
39176 111910 -29530 -19811 154708 163086 -156246 -497919 -455402 -62637 239289 162382 -115112
39165 -115112 -267241 -258311 -308357 -543409 -857822 -1069470 -1057475 -781827 -315941 145538
39155 145538 423911 488303 379639 97226 -299554 -577275 -531072 -265300 -61101 16601
39145 16601 152844 424245 668375 772464 836238 926443 896058 627194 302967 244458
39135 244458 526911 875121 919452 526286 -62607 -417019 -333241 -44474 79620 -39492
39125 -39492 -225579 -379025 -479158 -356621 119349 617817 579459 -5561 -516782 -576667
39115 -576667 -493848 -552766 -422938 223431 947525 1027042 455618 -129584 -337129 -265425
39105 -265425 -33843 281420 328139 -217717 -991676 -1231605 -813239 -362812 -244429 -152415
39095 -152415 86009 86265 -308622 -536022 -172371 307584 279905 -11298 75295 456202
39085 456202 492553 96747 -153579 9429 220956 227770 241592 365321 332517 94097
39075 94097 56140 373593 552822 205510 -263471 -248849 132705 312005 229660 354828
39065 354828 760057 840106 193361 -695417 -1021781 -661211 -234755 -244708 -472254 -364158
39055 -364158 150412 481012 120840 -580116 -683693 197032 1293542 1493920 630212
39046 630212 -380996 -677610 -368829 -163501 -388524 -686363 -588008 -97214 350872 355964
39036 355964 -87390 -609792 -794834 -529157 -64363 257503 309724 212787 150965 234793
39026 234793 476742 765377 858758 545914 -94368 -668857 -818093 -589191 -372724 -443456
39016 -443456 -662143 -724457 -623823 -664173 -960614 -1153100 -841859 -186894 246009 253335
39006 253335 247181 563801 865597 608865 -92078 -550713 -443727 -166848 -118675 -127331
38996 -127331 74756 224125 -93949 -653735 -784439 -356330 20754 -49062 -165855 129166
38986 129166 506878 307946 -389258 -789661 -486868 6570 13098 -465446 -926917 -1060932
38976 -1060932 -929925 -663638 -320246 9029 211990 252324 108022 -270092 -745645 -900588
38966 -900588 -463567 228344 523226 217079 -281727 -562681 -627973 -614556 -504850 -330569
38956 -330569 -300814 -406710 -202460 591748 1453873 1518480 655049 -349162 -745341 -560470
38946 -560470 -272307 -170661 -277895 -543146 -772537 -613773 5387 570234 510694 -18000
38936 -18000 -294818 -1757 389822 349902 -93 -209224 -223892 -375462 -773202 -1132653
38926 -1132653 -1212323 -1044312 -673445 -67588 542328 629197 7298 -772080 -1046614 -860770
38916 -860770 -713660 -652511 -233524 551595 974352 541787 -243404 -579543 -448837 -427985
38906 -427985 -663646 -723608 -438815 -196025 -205983 -100866 382152 806935 602560 -92592
38896 -92592 -638855 -748117 -628136 -381454 172592 962629 1436476 1170013 453575 -17820
38886 -17820 68254 387785 465379 208944 -88496 -150381 1198 159977 215756 209138 153733
38875 153733 -19905 -298716 -546757 -729793 -986167 -1309292 -1368673 -929767 -321383 -143530
38865 -143530 -534501 -1044485 -1248276 -1166989 -1039555 -1008364 -1132391 -1403029 -1621539 -1549550
38855 -1549550 -1291398 -1197743 -1266755 -1060066 -447168 19940 -140386 -609076 -774652 -633711
38845 -633711 -593501 -638483 -419897 -82420 -202620 -778126 -1043310 -599191 -44569 -33128
38835 -33128 -288340 -149776 325198 489612 121884 -349465 -578074 -643301 -596627 -235289
38825 -235289 441566 970244 924187 452652 73100 73351 326280 596576 814350 1024708
38815 1024708 1200806 1211956 996659 696850 504734 381845 96137 -403717 -843396 -966289
38805 -966289 -815826 -522946 -75012 437474 613042 199235 -401921 -580748 -408393 -521679
38795 -521679 -1055710 -1308013 -761982 76641 333163 -79324 -479217 -437405 -253834 -376384
38785 -376384 -777406 -1091128 -1103614 -893989 -629680 -430008 -396259 -578298 -824515 -798795
38775 -798795 -334511 245713 380858 -77677 -677686 -954220 -934132 -807659 -416497 439069
38765 439069 1343046 1532793 896809 135141 -249921 -557139 -1179036 -1830806 -1963466 -1580047
38755 -1580047 -1138037 -883025 -751417 -740843 -895894 -1044325 -988011 -855067 -842600 -745124
38745 -745124 -245631 397818 540306 96772 -264685 -75939 292103 260010 -101361 -268335
38735 -268335 -81944 88875 -39101 -272359 -275615 -46221 138925 144363 124301 209249 240120
38724 240120 -2676 -403040 -593560 -444844 -222959 -202056 -372915 -613105 -845779 -894609
38714 -894609 -521178 164545 651174 659468 512747 560452 594651 289376 -98592 -50293
38704 -50293 364775 551692 254419 -176798 -376869 -341462 -213096 -140899 -324721 -754123
38694 -754123 -985778 -682112 -253638 -350055 -797594 -777387 -81537 608061 826731 870575
38684 870575 970879 790025 185666 -305845 -307473 -240296 -520036 -752059 -422459 159553
38674 159553 372747 283983 336335 418659 132435 -249283 -22736 781296 1331981 1192620
38664 1192620 813098 658930 564332 248171 -118691 -244956 -207406 -242652 -324353 -270074
38654 -270074 -112910 -110029 -418677 -878750 -1118150 -910983 -474971 -274028 -419727 -500972
38644 -500972 -221344 89402 -20574 -372892 -449124 -286436 -424243 -907106 -1037560 -429419
38634 -429419 267898 194294 -519252 -928354 -530316 192891 562946 558968 581874 686863
38624 686863 556508 212841 196026 739332 1221170 965382 295762 110385 523035 740945
38614 740945 396003 109612 368113 693707 530701 200847 214671 283869 -65889 -421003
38604 -421003 -73374 652452 793155 304706 57325 269652 172356 -523514 -1017823 -770994
38594 -770994 -410690 -636598 -1107664 -1185698 -1059517 -1257217 -1550530 -1261707 -421359 195534
38584 195534 144933 -212654 -352034 -216030 -117872 -300603 -648833 -741444 -311110 300204
38574 300204 447237 64732 -170836 180386 618668 383479 -510246 -1366707 -1684617 -1501327
38564 -1501327 -1083990 -727412 -703350 -994395 -1195569 -1021907 -730530 -675007 -681387 -348421
38554 -348421 207064 451697 219960 -129547 -340448 -515206 -673936 -587679 -254600 -92601
38544 -92601 -360117 -710472 -654161 -252118 897 -105635 -244664 -82967 209930 197028
38534 197028 -201026 -585091 -619585 -428343 -274568 -90255 335410 815725 843834 282147
38524 282147 -379340 -594895 -332109 28423 98671 -280904 -902166 -1206284 -787634 20128
38514 20128 444197 259840 7947 72174 126111 -166674 -490341 -427708 -191328 -203415
38504 -203415 -330270 -198980 7067 -214109 -793894 -1128595 -957117 -580886 -238843 108219
38494 108219 353305 247715 -62401 -102554 172445 254747 -89565 -433572 -408585 -293113
38484 -293113 -512359 -962973 -1254708 -1329604 -1416479 -1547937 -1519186 -1263520 -953253 -723552
38474 -723552 -517176 -229528 134605 475333 690167 740993 667771 546752 439826 367924
38464 367924 266175 -24567 -565811 -1077190 -1117309 -661793 -257937 -353752 -691693 -693310
38454 -693310 -260328 202287 426319 482448 401448 112486 -163863 35626 761930 1440580
38444 1440580 1563789 1286582 1078159 1050274 943277 616125 229961 -33503 -201587 -396079
38434 -396079 -603402 -649904 -423561 -72136 125139 104654 92551 257490 462478 489763
38424 489763 325818 59034 -288603 -606869 -613574 -227012 192005 316674 364248 717492
38414 717492 1213813 1294789 777483 17005 -623030 -997853 -979748 -571359 -178275 -203678
38404 -203678 -384455 -132107 465023 687135 341947 110284 443408 836808 644815 24452
38394 24452 -431849 -527046 -423933 -182195 166529 396505 396190 421035 641659 755198 470718
38383 470718 63063 -34054 85989 27199 -220970 -346738 -318884 -398974 -607278 -659014
38373 -659014 -457455 -259490 -295355 -510447 -713467 -773610 -700186 -678277 -898689 -1197490
38363 -1197490 -1099412 -472407 118190 66776 -458038 -757357 -532092 -154425 -59718 -258686
38353 -258686 -489950 -556895 -448031 -301529 -260954 -284464 -211772 -78367 -96273 -196300
38343 -196300 18173 585611 890989 510533 -28463 69523 687810 983692 639899 220038
38333 220038 230614 490896 605003 495437 241990 -131787 -463997 -452961 -102508 172537
38323 172537 113820 -36307 -2318 31751 -272121 -802547 -1044370 -706031 -85443 244726
38313 244726 57635 -262522 -145475 457369 968220 907903 477793 157629 398 -220830
38303 -220830 -368274 -82642 417029 371600 -413499 -1090619 -825585 95628 707517 616205
38293 616205 262055 73942 -42609 -269014 -431064 -316728 -154350 -354739 -806205 -830396
38283 -830396 -52941 951292 1245942 681027 53774 71723 566987 914699 827222 440831
38273 440831 -29425 -348485 -276636 60635 85172 -509778 -1214270 -1373937 -1121459 -1029830
38263 -1029830 -1103666 -888624 -446697 -336439 -569771 -491335 77915 442223 143852 -309060
38253 -309060 -288503 76014 372824 613935 898677 958394 656196 429934 609664 783308
38243 783308 507273 161742 331896 755227 731319 260100 -111416 -316046 -672410 -925887
38233 -925887 -461145 473544 831613 319727 -111397 257184 847754 757071 36191 -647457
38223 -647457 -1021962 -1196243 -1101634 -664355 -233849 -180246 -268347 -20793 470304 668304
38213 668304 398416 -23062 -358515 -580130 -501971 88896 861424 1088993 557968 -145710
38203 -145710 -447523 -425499 -401821 -345759 -69370 271429 289109 -113289 -608335 -782055
38193 -782055 -456221 206513 782553 920509 716767 572457 575920 337445 -339033 -962385
38183 -962385 -917991 -281782 369004 766370 1047209 1147942 746374 -75364 -691008 -713015
38173 -713015 -458671 -360507 -352617 -201764 -61878 -242501 -666266 -979600 -1028164 -865215
38163 -865215 -519685 -170283 -288030 -1044660 -1749952 -1547692 -656249 -202098 -669087 -1249864
38153 -1249864 -1111878 -631897 -730162 -1406813 -1731143 -1216309 -492427 -399991 -909256 -1286724
38143 -1286724 -1074625 -534742 -167556 -108578 -135557 -83107 -1094 72827 216722 372728
38133 372728 252579 -238479 -672963 -567751 -96056 90294 -232337 -584382 -541244 -306561
38123 -306561 -273241 -414473 -462419 -390366 -342344 -314358 -273902 -386390 -724316 -928400 -604049
38112 -604049 48096 449152 436274 367852 421705 300658 -192253 -719971 -835771 -567631
38102 -567631 -311145 -310130 -463435 -533955 -378836 -57935 163105 11716 -464285 -832589
38092 -832589 -662562 12542 656402 683052 21283 -743218 -908434 -421067 57877 -12154
38082 -12154 -378231 -429204 -86926 174337 110458 -7779 26435 -11053 -335260 -733959
38072 -733959 -870808 -728179 -501653 -302637 -194249 -272305 -470929 -527060 -374224 -310675
38062 -310675 -512301 -669558 -458322 -110122 -78223 -307224 -305821 110601 582190 722847
38052 722847 522505 221946 97180 341538 836351 1079060 697176 397 -363760 -261606
38042 -261606 -118718 -122354 44492 517511 876372 775564 487327 438737 575915 572682
38032 572682 352888 15527 -455439 -972238 -1108444 -586180 179618 523986 389742 235289
38022 235289 199573 -32546 -497812 -708377 -356947 217478 534185 549820 467210 329864
38012 329864 130759 34246 133353 195505 11230 -154735 142762 816747 1202758 826075
38002 826075 -41565 -721416 -838577 -535772 -113154 287962 593098 628718 314572 -30296
37992 -30296 95106 710168 1191855 1029253 493100 198629 208920 73880 -314083 -501279
37982 -501279 -236736 107417 153421 73694 167738 289458 134125 -199061 -374680 -323813
37972 -323813 -152357 220679 827728 1223844 896185 117485 -180728 432037 1291612 1449364
37962 1449364 761630 -86338 -423063 -176984 289390 660981 881335 988634 943380 751619
37952 751619 622298 715977 778169 427474 -111086 -76282 738265 1473237 1258949 362698
37942 362698 -285156 -337315 -126858 144549 467433 467228 -235492 -1085638 -1014467 -2625
37932 -2625 760162 609469 271656 444136 550557 -169415 -1119186 -1056571 27713 864058
37922 864058 667334 -23098 -365869 -241977 -5845 137941 170834 69438 -162982 -489381
37912 -489381 -913537 -1325404 -1365217 -823550 -113011 112104 -194762 -472273 -427956 -384504
37902 -384504 -608281 -820041 -666920 -283427 -54732 -108415 -345388 -731042 -1217523 -1518717
37892 -1518717 -1297645 -590879 139808 412517 133863 -340301 -514544 -209833 259413
37883 259413 452547 329380 250417 442072 669575 540617 -15247 -685945 -1108683 -1172730
37873 -1172730 -1029892 -852727 -610466 -169863 368738 641003 479132 198116 159627 220244
37863 220244 -30329 -577575 -947606 -880757 -631505 -491806 -380047 -77112 400416 826742
37853 826742 980191 768823 354367 134201 292818 404792 -79270 -918114 -1200497 -568038
37843 -568038 249164 452930 193115 86467 192911 114318 -169800 -262392 -75404 14014
37833 14014 -218753 -564479 -781702 -850871 -763800 -463298 -72005 185001 343737 612801
37823 612801 881982 768252 274340 -61715 102614 447339 526338 386728 308249 255963
37813 255963 30666 -226594 -127844 393792 933476 1042579 613396 -91596 -611083 -609906
37803 -609906 -240493 -33753 -223254 -415894 -245832 -60296 -426052 -1128876 -1339843 -811424
37793 -811424 -207493 -29157 81236 526070 869520 458851 -426103 -803523 -296106 444056
37783 444056 674250 366207 -60670 -314668 -313661 -71364 238615 346554 194052 -26616
37773 -26616 -222369 -495116 -782433 -769619 -378093 -6582 -3920 -194914 -250997 -250107 -449890
37762 -449890 -695878 -540664 74535 670730 806622 483931 -28630 -435858 -453918 12793
37752 12793 612562 796031 479396 158685 200086 351534 224659 -45715 -19438 340991
37742 340991 613406 544048 337665 247417 222497 111285 -72669 -278180 -566999 -909616
37732 -909616 -1037350 -774919 -369109 -180713 -161641 12271 355558 537114 458664 421187
37722 421187 571671 625261 386646 137561 161126 235733 18101 -364481 -572608 -664103
37712 -664103 -925263 -1271946 -1386422 -1349533 -1538430 -1911805 -1995939 -1633574 -1165125 -783064
37702 -783064 -304445 277285 609199 531124 255095 -142315 -764062 -1271998 -1007402 -63156
37692 -63156 555136 302199 -142034 -36989 282278 165674 -189782 -244390 -190082 -513457
37682 -513457 -922154 -765319 -245606 -158492 -577231 -811124 -589902 -302539 -106296 201418
37672 201418 435196 190524 -193002 51518 683028 510504 -772890 -1965162 -2070138
37663 -2070138 -1550876 -1234113 -1008113 -462601 42720 -46496 -413840 -332624 203462 648549
37653 648549 858426 1063299 1166549 883549 415005 228512 263399 55287 -382240 -473282
37643 -473282 43487 702358 909826 573177 54684 -204940 -6852 413981 568103 286957
37633 286957 -34709 -977 225017 250957 86826 1297 -71337 -456775 -1089833 -1407460
37623 -1407460 -1019935 -209350 348470 228523 -367041 -784454 -560604 49468 368496
37614 368496 154935 -164749 -220691 -188452 -279836 -235533 207632 716680 775900 460492
37604 460492 267998 347419 412750 323788 276468 452982 846869 1339075 1626354 1284254
37594 1284254 321699 -527367 -553053 33209 437850 376456 265823 388903 471089 199076
37584 199076 -306220 -686184 -704951 -367779 43427 99742 -289173 -596900 -258103 537081
37574 537081 1017584 767768 114969 -380642 -443831 -125245 287491 398663 81162 -300502
37564 -300502 -337392 -127539 -35130 -80159 -35121 13289 -234620 -655713 -741480 -355811 46007
37553 46007 82032 -107927 -216297 -189164 -143625 -159998 -268690 -424394 -474897 -360294 -269533
37542 -269533 -368708 -521830 -554530 -578841 -714142 -751568 -526874 -339308 -477913 -628752
37532 -628752 -384332 -64393 -271148 -822350 -974893 -629452 -426205 -617160 -745440 -575930
37522 -575930 -455532 -528830 -453692 -177613 -152269 -418875 -307813 479569 1225606 1175503
37512 1175503 566521 151448 184928 364789 375972 99147 -357753 -567867 -139699 647977
37502 647977 1054572 851630 492041 216411 -219963 -737420 -777399 -331994 -187830 -637627
37492 -637627 -896910 -443130 15192 -279651 -859635 -900842 -625707 -776477 -1268668 -1453786
37482 -1453786 -1285016 -1169694 -1034190 -587524 -198680 -434168 -958157 -971465 -562183 -504544
37472 -504544 -827447 -778470 -266064 -124312 -668330 -1097519 -779432 -182021 4013 -109010
37462 -109010 -35972 230561 381722 388079 422357 444464 249110 -211942 -742871 -1005870
37452 -1005870 -727610 -72594 287421 -100850 -751440 -764928 -52030 559811 493878 63965
37442 63965 -198611 -218798 -125953 88875 335415 322456 10937 -247043 -285277 -391193
37432 -391193 -708004 -841511 -453672 134733 351316 99405 -289420 -572356 -705219 -657127
37422 -657127 -473710 -370258 -461521 -542617 -394528 -132953 17395 107911 291363 398535
37412 398535 98874 -486898 -709817 -148413 747026 1063498 517204 -129715 4748 733808
37402 733808 987722 267330 -626974 -700135 -138071 51187 -477821 -1034459 -1001874 -583568
37392 -583568 -246547 -72556 4807 -144225 -537081 -824296 -756996 -599825 -685155 -834963
37382 -834963 -662360 -249854 -55875 -208202 -324823 -104807 238839 292550 -5438 -306017
37372 -306017 -296030 -57584 106963 145565 342232 818975 1172314 910839 168347 -384551
37362 -384551 -381164 -155869 -167551 -356296 -320619 82480 589940 879147 823771 454250
37352 454250 -101799 -591632 -735602 -510419 -279742 -452280 -937559 -1132611 -652401 84641
37342 84641 331823 -11876 -348194 -306228 -150314 -83487 208963 891631 1412620 1185817
37332 1185817 432058 -236275 -670116 -991857 -976353 -424855 152518 100327 -342156 -449864
37322 -449864 -262029 -410459 -808355 -672728 40784 416535 86860 -202592 16116 123076
37312 123076 -368067 -840148 -647977 -271953 -474772 -1013934 -1134327 -779263 -396049 -23906
37302 -23906 500929 843175 614938 209968 262522 526188 253359 -461924 -725850 -257035
37292 -257035 198662 79545 -182012 78909 773452 1223638 983487 233838 -452686 -631699
37282 -631699 -395158 -212367 -267408 -211508 209551 656407 716290 555107 537695 534520 232067
37271 232067 -136896 -97434 186551 98454 -391697 -632152 -328958 28282 -17037 -262681
37261 -262681 -311552 -160602 -15842 123260 400208 810990 1145187 1137069 713670 198164
37251 198164 58590 258349 203351 -319760 -606451 -24919 872423 1045631 513629 247873
37241 247873 589519 805851 401097 -122117 -201655 -70179 -159906 -326273 -220199 57830
37231 57830 181455 114049 9789 -73797 -70110 142257 440495 487757 251850 63587 3122
37220 3122 -230601 -630346 -685951 -209339 254376 246302 46280 56545 108024 -84623 -295886
37209 -295886 -205903 -3815 -981 -68809 -42459 -218573 -765510 -1076668 -536027 373447
37199 373447 610606 78406 -297358 15164 520698 635417 485162 466154 603832 685983
37189 685983 618901 391530 23346 -271575 -198206 193540 512439 562208 530928 548576
37179 548576 463287 239900 177847 440118 675811 465007 -38122 -257560 50875 487828
37169 487828 526430 157880 -130441 21212 426422 674949 713921 810688 971183 820924
37159 820924 242698 -280368 -302175 -64786 -79756 -316241 -324592 -20326 212530 168555
37149 168555 36132 -69097 -262748 -483211 -429132 -75094 203411 212457 212345 392098 522150
37138 522150 431074 403879 702261 1023420 908344 474013 242292 332088 326660 9813
37128 9813 -220769 80755 708768 991503 601352 -103546 -609702 -865278 -1136121 -1402249
37118 -1402249 -1306530 -792444 -365157 -397050 -509538 -135155 503007 595335 -46263 -613935
37108 -613935 -380635 363730 808768 661094 269656 -4506 -88700 -7840 185926 315329
37098 315329 230434 63380 86260 331963 579426 682345 671344 540211 196299 -300429
37088 -300429 -657306 -639751 -345265 -90809 -66414 -152962 -74731 275871 668535 729897
37078 729897 337507 -214987 -479147 -262522 219368 562664 547262 315399 154606 112534
37068 112534 -32570 -355254 -561494 -397366 -76406 30966 -15071 120236 367577 259928
37058 259928 -288078 -736113 -687337 -435202 -426139 -585659 -575959 -408743 -356661 -432563 -350341
37047 -350341 75911 746056 1357194 1502173 947991 52988 -395761 -58610 545441 802657
37037 802657 782457 833498 846352 552633 246401 457591 1025038 1217898 779819 194908
37027 194908 -114323 -200083 -134537 171727 514521 398724 -221108 -719703 -599789 -79636
37017 -79636 341697 482109 435205 347403 416796 703375 825992 349278 -410522 -589194
37007 -589194 -7418 479302 226456 -280968 -270963 159105 376773 249771 147730 194737
36997 194737 175843 31117 -100335 -200371 -293065 -223004 75622 313347 269072 218148
36987 218148 488307 877156 1011973 986271 1063565 1038334 565205 -81492 -292174 -51655
36977 -51655 117136 62255 128374 388073 500452 422655 535310 893391 1032133 739020
36967 739020 393027 288519 211290 -35551 -234035 -182955 -35325 82378 315702 669983
36957 669983 832784 706457 641351 812711 842392 420393 -143493 -414590 -484025 -666083
36947 -666083 -872542 -762743 -288088 319646 889626 1283380 1273575 842474 394729 305472
36937 305472 453808 536551 583608 756120 878480 659884 244460 73831 272520 582900
36927 582900 840974 1096160 1286611 1213175 890858 601346 543529 680836 926951 1226089
36917 1226089 1462607 1532618 1482083 1370413 1100221 644554 315692 450685 876831 1051082
36907 1051082 745580 277667 48614 170292 559260 1051156 1355835 1234411 834820
36898 834820 575437 613234 720803 766698 949860 1374480 1747576 1799707 1749098 1989897
36888 1989897 2454635 2643505 2271931 1602181 1096952 969508 1120963 1309204 1288100 950454
36878 950454 466213 195799 375944 940829 1658607 2298550 2628531 2494437 2092081 1947756
36868 1947756 2323144 2769118 2643923 2019757 1620961 1794968 2051312 1857796 1409249
36859 1409249 1206900 1266982 1259379 1161875 1198618 1262885 997751 465693 209388 545683
36849 545683 1218575 1828709 2209887 2317231 2157977 1940979 1924190 2016705 1878811 1478434
36839 1478434 1179051 1214113 1444914 1677199 1822349 1734932 1348458 992728 1064931 1348638
36829 1348638 1237938 721884 505052 976445 1703051 2175176 2396413 2449324 2161267 1597838
36819 1597838 1265922 1393020 1570399 1515300 1573139 1999287 2378544 2332650 2232110 2564801
36809 2564801 3078355 3208581 2973972 2818671 2885043 3006973 3144911 3345727 3548813 3799921
36799 3799921 4289629 4868399 5016360 4627209 4255054 4257549 4374494 4496544 5004263 5882424
36789 5882424 6436884 6467583 6716656 7497273 8029143 7968464 8326025 9764050 11267154
36780 11267154 11870751 12478802 14364213 16999605 19181919 21302747 24556148 28810233
36772 28810233 33337091 38778506 46183563 55052452 64848131 77447548 95196352 117799020
36764 117799020 145063176 181317883 230297983 283302287 318566636 318387599 285688790
36757 285688790 240426695 201292403 174082016 155712822 143598735 138625615 141772467
36750 141772467 151603883 166735048 189882151 226029267 272867004 313931792 327031689
36743 327031689 303309124 255772528 206433320 167563815 138127438 114059042 94941813
36736 94941813 80890214 69569217 59170166 50767366 45460452 41850803 38263409 35156988
36728 35156988 33462191 32480155 31248643 30360216 30664951 31496058 31798538 31865448 32420406
36719 32420406 32970012 32544100 31274247 29900539 28418551 26479094 24531667 23374865
36711 23374865 23008948 22924634 23076337 23669616 24437229 24948422 25176082 25034616 23946623
36702 23946623 21694794 19153386 17297469 15943386 14306932 12351971 10686611 9473100
36694 9473100 8347554 7227495 6401947 5927968 5585721 5322307 5211158 5131117 4945444
36685 4945444 4786385 4749516 4582687 4084365 3499743 3131779 2907897 2697913 2636001 2734769
36675 2734769 2668208 2388914 2434977 3086191 3722804 3626999 2973374 2418972 2149153 1957859
36665 1957859 1844096 1853124 1694813 1184072 731149 785633 1159281 1482550 1858140 2381488
36655 2381488 2535981 1905222 1043205 734846 799763 612953 415853 929015 1878205 2197885
36645 2197885 1738509 1503930 1959855 2343055 2104843 1896454 2420135 3207187 3361049
36636 3361049 2881556 2435532 2249962 2041769 1816065 1959547 2503027 2869111 2558209
36627 2558209 1793711 1296994 1508582 2141507 2544902 2464726 2269035 2343957 2553533 2579070
36617 2579070 2509245 2603135 2630900 2085798 1105627 548578 898424 1599745 1810111 1420289
36607 1420289 973113 874250 1067356 1317904 1476113 1512512 1507880 1575195 1702563 1773952
36597 1773952 1777645 1802010 1781676 1516592 1051284 740624 755164 802502 592207 327870
36587 327870 397708 724341 803267 388833 -175405 -394357 -148682 338885 866505 1369618
36577 1369618 1751056 1850833 1687777 1558816 1696354 1895094 1727083 1160899 705134 794808
36567 794808 1249471 1531317 1363935 881108 336328 -57942 -123369 149789 521466 808521
36557 808521 1156234 1686249 2017686 1623234 673889 11589 113107 545426 705236 650228
36547 650228 788389 1080639 1094125 741502 455780 551761 802655 814979 552868 287799
36537 287799 184425 140362 976 -202016 -260536 -20445 396200 642579 498507 140438
36527 140438 -58819 15457 142700 180203 308835 681977 1027174 912982 367423 -82941
36517 -82941 -46882 324781 646044 735128 619453 389662 258991 509483 1102131 1547081
36507 1547081 1468807 1125800 1032124 1224495 1307535 1115846 867287 682288 445698 229496
36497 229496 365005 884516 1283012 1105255 511784 44385 31016 372674 714669 712077
36487 712077 329981 -46990 -24570 273270 386525 220111 148879 355286 524586 367386
36477 367386 23779 -240362 -344483 -248470 64892 319888 170080 -151676 -19376 524422
36467 524422 630899 -34921 -622563 -353746 283992 399475 128436 234825 712049 834249
36457 834249 413697 10306 -75033 -109245 -197037 -87744 198471 332763 371332 726261
36447 726261 1309985 1476203 1030613 585299 637681 947878 1119197 1180342 1255366 1196113
36437 1196113 898875 561498 353383 223120 202009 427165 705439 607336 210285 153410
36427 153410 647191 1023725 695990 55717 -78894 453764 1084266 1259224 907148 397664
36417 397664 294533 864745 1632049 1787420 1240569 791053 991088 1405831 1431556 1282668
36407 1282668 1528256 2048809 2197340 1835660 1514993 1602001 1794759 1656546 1246772 1042413
36397 1042413 1409631 2219263 2895437 2895866 2232273 1421378 891127 653088 611201 833978
36387 833978 1299846 1686265 1719191 1534688 1442550 1513815 1611091 1622253 1469167 1112494
36377 1112494 734734 659128 887576 994897 689791 195389 -122079 -173143 7502 435374
36367 435374 923725 1057177 744006 424415 418101 479880 338943 195405 253681 266644
36357 266644 68785 66551 576026 1136966 1193507 1023034 1174704 1372159 944718 122659
36347 122659 -150897 316763 706616 512302 170631 144532 277740 377393 597484 857133
36337 857133 669928 15311 -345474 56204 663255 784038 578032 515068 460593 101782
36327 101782 -176178 233309 1026307 1255698 716225 195146 191033 220231 -210687 -641193
36317 -641193 -291260 737850 1580706 1807660 1861985 2187535 2504125 2321155 1782930 1479166
36307 1479166 1562719 1605862 1366889 1144748 1161750 1111719 701427 232627 178602 488153
36297 488153 797345 1043116 1301040 1289075 755972 211241 429941 1200995 1451808 835643
36287 835643 301579 644255 1302511 1259079 514656 -98810 -170150 -6488 98707 184765
36277 184765 284358 345565 466250 752564 1030116 1118211 1226680 1586809 1865467 1553997
36267 1553997 851908 495101 666603 749254 325006 -212174 -318518 -31488 303448 581197
36257 581197 824932 888164 684449 472875 545547 810350 993499 1064655 1132188 1081731
36247 1081731 692016 59677 -397676 -371763 85014 669874 1010982 854143 304552 -190843
36237 -190843 -316953 -262205 -399641 -715880 -855640 -673225 -405179 -270651 -214669 -132110
36227 -132110 -63293 -27499 110978 434550 775306 891014 761036 581372 500350 447212
36217 447212 243755 -110419 -301642 -630 627906 927453 491003 -267473 -600730 -363158
36207 -363158 -52616 16089 54941 224292 261968 -29260 -378810 -488515 -497015 -616041
36197 -616041 -651599 -340634 128062 426602 669145 1123491 1546833 1463139 1023537 895622
36187 895622 1237418 1470027 1250488 995585 1111530 1306656 1132259 741640 582584 650128
36177 650128 581044 311045 137918 203685 351021 494756 760267 1174809 1486955 1401145
36167 1401145 876631 184511 -249040 -127854 458655 1108303 1504020 1645860 1645372 1484746
36157 1484746 1119764 664572 317818 206529 373385 743778 1034816 937301 508382 142372
36147 142372 39886 -644 -132770 -173038 19678 251677 361860 509654 774204 861927
36137 861927 614710 420243 635788 965061 956435 792985 974500 1493367 1971212 2334737
36127 2334737 2626825 2423431 1344912 22016 -439278 -9537 232630 -222285 -648123
36118 -648123 -441638 -105915 -271161 -609867 -486027 -32297 196068 162394 220064 419878
36108 419878 598316 814246 1085838 1039521 449170 -196367 -301359 -41516 4379 -199173
36098 -199173 -253246 -114554 -54556 -48258 68056 55517 -319566 -569173 -113136 513019
36088 513019 171034 -1077070 -1808019 -1196527 -70441 476652 508884 590977 615306 223390
36078 223390 -216046 -58297 501186 666013 237420 -230726 -391824 -443397 -473150 -207757
36068 -207757 389624 856790 832094 504933 244357 109109 -65965 -343351 -614809 -707593
36058 -707593 -511504 -168084 -80469 -458204 -890804 -732817 45138 755328 845135 501308
36048 501308 251977 294166 429690 408743 113462 -396427 -818502 -772165 -224577 405186
36038 405186 732477 816089 899866 949828 721995 196906 -302001 -423475 -108114 342761
36028 342761 447540 -49834 -825334 -1185249 -786917 -9135 520319 562856 278959 -122059
36018 -122059 -452622 -491256 -219880 9427 -120286 -434433 -544988 -431194 -332697 -202264
36008 -202264 205889 723267 822075 410587 31429 37329 71686 -287177 -773812 -761035
35998 -761035 -106204 711042 1174294 1170427 947263 850839 1024825 1258811 1264755 1109136
35988 1109136 1074503 1072195 672277 -100501 -542728 -208678 414510 621088 416681 196238
35978 196238 -40679 -442884 -648229 -230048 385890 347023 -326640 -767534 -631451 -479650
35968 -479650 -590503 -416358 306688 846628 564654 -28749 -94791 245658 307650 83131
35958 83131 132477 452630 408075 -185347 -733304 -763847 -461528 -120416 295721 782180
35948 782180 1028179 846683 463855 113223 -272321 -704364 -884017 -648853 -333076 -288017
35938 -288017 -314101 -10038 494722 646017 275685 -142293 -148917 137704 286566 119242
35928 119242 -203966 -496790 -698187 -754534 -578991 -212466 97589 107776 -137620 -318226
35918 -318226 -178248 171895 339179 42065 -596596 -1156537 -1303226 -1046279 -633057 -263626
35908 -263626 2566 101994 -70117 -431818 -614363 -334414 188234 457386 358633 284382
35898 284382 509211 787149 797701 672234 716553 836720 686759 285172 16592 20567
35888 20567 46692 -6373 101483 417075 548767 279434 12603 176854 498106 374509
35878 374509 -210341 -685285 -725598 -545434 -337044 14523 483085 680149 390270 -42971
35868 -42971 -180408 -33866 153757 366220 677231 911553 872585 736954 793656 933427
35858 933427 860242 691228 795864 1059961 919633 256412 -328791 -377797 -169660 -126817
35848 -126817 -139780 64451 295027 178625 -190022 -390459 -296325 -98949 112443 330565
35838 330565 363072 92613 -133742 84891 505483 532858 144955 -107702 -19434 58515
35828 58515 7515 159123 474218 317564 -474636 -1028583 -596590 269202 474335 -64922
35818 -64922 -458734 -257452 22759 -141814 -541529 -710409 -597331 -431767 -283934 -93282
35808 -93282 60075 -7311 -321147 -666578 -765395 -529535 -173906 -15353 -96528 -136392
35798 -136392 35997 190517 50596 -247102 -356710 -270043 -307437 -595517 -895775 -979400
35788 -979400 -866656 -648855 -367782 -148477 -176002 -418169 -576774 -422748 -32138 350535
35778 350535 511541 321581 -169421 -608098 -525946 189813 1099920 1577509 1345131 675221
35768 675221 126157 23280 131430 -42955 -551037 -843383 -514762 72469 271810 42509
35758 42509 -106983 64192 292611 357839 324738 199576 -96090 -303574 21784 723777
35748 723777 1012211 555293 39228 172508 627779 586435 11485 -310744 76386 698275
35738 698275 803228 230821 -499021 -759266 -430479 -24942 -96620 -486730 -461618 239464
35728 239464 919961 842934 214370 -264102 -445001 -642680 -763401 -414551 140990 96389
35718 96389 -577191 -829750 -65295 806177 585634 -510114 -1232316 -1066205 -664431 -570484
35708 -570484 -480557 -64317 295138 129757 -273036 -275049 151947 455209 362000 165505
35698 165505 159866 294629 482163 781132 1077233 981690 339918 -430577 -790860 -661516
35688 -661516 -318690 36913 301281 298351 -9287 -288485 -224636 -35755 -162713 -533629
35678 -533629 -656502 -445698 -371638 -648704 -868651 -729365 -572576 -757844 -951331 -594865
35668 -594865 189775 733412 733961 524031 452630 463392 361604 148838 -22265 -23359 152788
35657 152788 331941 268455 -31467 -245138 -180333 -66751 -138135 -198898 2143 232581
35647 232581 136053 -65295 128253 553627 460921 -341363 -1086528 -1069254 -511147 -89052
35637 -89052 -75875 -299178 -548419 -657287 -494991 -181861 -28297 -47949 91428 426585
35627 426585 509707 168755 -107751 10346 85116 -260231 -475779 91956 910366 815315
35617 815315 -276742 -1232659 -1329797 -997278 -702981 -156834 822414 1523430 1222929 319377
35607 319377 -186343 -21105 254864 258545 192719 272940 353545 241818 -26365 -324983
35597 -324983 -557385 -600499 -388681 -61290 193538 392817 630752 800672 729066 490386
35587 490386 273021 35121 -327598 -556506 -256464 406089 723090 349400 -213923 -280657
35577 -280657 194969 704823 838857 595343 242469 109856 365030 802704 992926 770146
35567 770146 388145 82373 -230066 -617214 -823812 -624595 -250930 -109508 -248301 -437419
35557 -437419 -584371 -670891 -463009 211127 970855 1195861 843956 455009 314798 195588
35547 195588 42739 240706 854515 1227990 869958 268122 193554 541203 581367 172438
35537 172438 -77167 114321 256588 -20738 -315422 -133883 289018 393114 175733 78921
35527 78921 163427 20114 -441259 -673292 -224123 573611 985913 778873 415625 382545
35517 382545 603569 640959 302111 -162920 -447386 -551882 -634624 -659875 -450380 -56615
35507 -56615 223516 277346 330569 492963 476623 107196 -157182 247005 1012064 1121853
35497 1121853 181467 -939975 -1154992 -461890 234442 333696 52300 -165792 -203011 -135092
35487 -135092 16734 180778 156060 -140763 -498443 -634412 -497647 -270311 -171279 -289703
35477 -289703 -484288 -448310 -50690 397821 453532 122064 -164368 -203373 -289431 -661900
35467 -661900 -1055086 -1077322 -742733 -317833 86768 420655 465120 152264 -94304 133938
35457 133938 494908 251769 -619350 -1271515 -1090308 -419404 45502 93234 -71298 -273872
35447 -273872 -359593 -106144 418123 693905 378228 -161271 -383923 -381087 -586239 -881148
35437 -881148 -693681 1826 494909 366619 80929 189012 464864 328759 -218264 -628398
35427 -628398 -599270 -317374 25856 460308 912579 1099889 945328 786128 927508 1186115
35417 1186115 1126737 669176 241934 304708 820707 1247662 1063499 331880 -296954 -260949
35407 -260949 252983 492172 26956 -743249 -1100835 -835449 -334097 22101 233379 438565
35397 438565 609090 651356 620672 624656 599740 375306 -55198 -480511 -710372 -752107 -708760
35386 -708760 -593651 -326178 102455 513286 641005 398061 29906 -76032 215799 651917
35376 651917 898605 895167 802915 714067 607015 549263 691411 980920 1103926 871039
35366 871039 500092 319203 309793 199471 -32790 -48808 341156 800668 818246 346096
35356 346096 -120208 -109281 325385 711290 657032 193779 -301842 -452203 -183735 241900
35346 241900 490138 460213 321913 266913 299421 305319 240676 157027 88534 34296 43695
35335 43695 184209 383842 436393 257381 35952 3635 113309 107882 -97688 -281584
35325 -281584 -239413 -93118 -117071 -323974 -424670 -249559 -41043 -177554 -675496 -1130666
35315 -1130666 -1164395 -787576 -287984 84064 222359 119463 -96699 -169559 28553 285580
35305 285580 328248 290453 587227 1225795 1590072 1184318 345540 -151680 -76525 87527
35295 87527 -36278 -169758 122693 693834 915823 447336 -365175 -874007 -748965 -185431
35285 -185431 350435 502742 251423 -113531 -228277 53274 525036 779561 556026 -6025
35275 -6025 -474481 -531645 -272389 -62244 -111912 -258376 -203184 79013 263020 62162
35265 62162 -359544 -514117 -195275 199244 143468 -310418 -581177 -321465 194204 563468
35255 563468 791040 1059734 1248718 1076102 598083 181371 8616 -58453 -149426 -259087
35245 -259087 -444534 -783990 -1100453 -1099546 -857993 -778824 -927366 -834680 -209154 526473
35235 526473 741371 381529 -74110 -245383 -137372 42236 71276 -147673 -408495 -335808
35225 -335808 83058 346267 110460 -253140 -175236 259271 456421 181060 -228271 -462847
35215 -462847 -549479 -531326 -343129 -83704 52682 189684 606946 1065088 896893 30772
35205 30772 -669281 -497518 155865 440632 185509 -160523 -364619 -522529 -547802 -246513
35195 -246513 152456 186780 -97639 -197893 6977 103160 -58658 -97807 113879 95791
35185 95791 -401039 -826826 -668704 -331504 -503446 -1028780 -1182956 -849433 -608271 -701353
35175 -701353 -720512 -444383 -223249 -271704 -264061 -2809 109881 -269819 -784691 -898452
35165 -898452 -675416 -517389 -443857 -202442 125566 217351 98334 92984 227735 196703
35155 196703 -65922 -263677 -248373 -211289 -271756 -276224 -129506 16995 29131 -37542 -95264
35144 -95264 -90441 83458 432063 661630 508137 208809 187793 320861 98077 -436905
35134 -436905 -590905 -70859 545521 722417 705882 908533 1156131 1111356 944445 949641
35124 949641 904817 488319 3413 -31856 218995 169724 -174345 -229813 147639 403291
35114 403291 165103 -254531 -420115 -301139 -65117 179973 277939 100883 -134420 -61238
35104 -61238 224783 225124 -173189 -494905 -440558 -302103 -347400 -332981 -15810 310175 254670
35093 254670 -15677 -24008 316985 633979 584272 148451 -400698 -625571 -276092 283648
35083 283648 338508 -233257 -690546 -473986 -68668 -258075 -877179 -1050860 -538164 -59351
35073 -59351 -186101 -596987 -695207 -416463 -89979 87062 87764 -113529 -409578 -509993
35063 -509993 -343214 -275950 -580917 -903464 -710521 -158038 26285 -398879 -784635 -534364
35053 -534364 -12106 -31597 -677288 -1199992 -1062654 -522848 -20740 456690 1029010 1376068
35043 1376068 1077158 287844 -434167 -858913 -1135184 -1218692 -875589 -311229 -142611 -512093
35033 -512093 -807149 -576704 -181369 -131091 -300759 -331008 -347998 -626973 -880095 -634425
35023 -634425 -137955 -95438 -533328 -739713 -454323 -289293 -638025 -939317 -587977 13064
35013 13064 19088 -582243 -1002141 -843390 -564459 -652595 -915313 -870582 -471934 -128015
35003 -128015 -166847 -516614 -854272 -931243 -779503 -641136 -648318 -616261 -314535 75106
34993 75106 48366 -538102 -1126583 -1076440 -481826 -30383 -56181 -111270 341141 1106293
34983 1106293 1464054 1084242 386919 -53686 -156162 -216063 -368738 -439078 -271682 30180
34973 30180 256390 337169 356426 390323 402959 286280 -17690 -427171 -779453 -1013341
34963 -1013341 -1230503 -1472115 -1487564 -932778 116241 1030113 1205581 710850 150658
34954 150658 -87756 -196282 -471115 -762495 -681522 -223168 173037 226235 152837 235424
34944 235424 323331 59973 -513724 -909260 -776767 -293707 127199 337291 519569 845096
34934 845096 1199571 1280476 944757 431153 159324 262980 430263 322608 35724 -63747
34924 -63747 101334 194071 -54007 -483876 -750043 -732955 -574851 -441727 -381765 -334149
34914 -334149 -194451 51796 241365 211970 71897 94275 319859 512739 556401 579147
34904 579147 593871 418754 163562 316729 933156 1174936 302925 -1128039 -1813781 -1384087
34894 -1384087 -749250 -635732 -628563 -118858 530994 517199 -107595 -464920 -84891 577642
34884 577642 917078 865799 636808 299466 -82537 -247810 -18606 393162 617115 538354
34874 538354 305464 78793 -45608 -8337 121478 153736 61363 108750 473413 887740
34864 887740 951333 708034 571447 683317 701816 329791 -251609 -649413 -730307 -626570
34854 -626570 -436758 -156311 141365 255741 70536 -229969 -242716 232965 831333 890024
34844 890024 261778 -371499 -328692 127320 190054 -234226 -360028 227115 883574 900106
34834 900106 547412 503627 724288 658502 307723 227558 535724 717903 519253 309322
34824 309322 369262 475162 457528 562880 893895 1014490 556121 -170059 -599216 -645652
34814 -645652 -596594 -537520 -334663 -45949 68014 -84308 -335587 -523015 -633737 -722329
34804 -722329 -830619 -936985 -915339 -676742 -401369 -406723 -686842 -838444 -589100 -140427
34794 -140427 175552 300438 309498 159286 -159698 -453870 -570527 -603449 -631566 -504725
34784 -504725 -150119 165832 183808 30964 -47221 -96186 -257326 -387623 -251448 68834
34774 68834 300049 357804 274358 -48516 -621905 -1070653 -979972 -458881 6344 165359
34764 165359 129877 25494 -97183 -114293 27714 122025 6658 -97686 56218 249863
34754 249863 142598 -78813 36904 414828 547204 328488 149040 142430 24432 -222147
34744 -222147 -217706 52168 54331 -386238 -666182 -326503 205280 334162 237581 424237
34734 424237 727529 511106 -233857 -723520 -427045 284839 740830 769745 610700 360944
34724 360944 -73047 -578143 -790794 -560932 -186111 8470 118674 417860 816184 955352
34714 955352 808063 705829 667597 250689 -628538 -1263033 -1047138 -383714 -93902 -233417
34704 -233417 -188343 241481 605558 611618 459556 321141 154793 112840 455934 936084
34694 936084 945932 462005 157443 347422 526005 271819 -77215 -77071 117670 187894 245719
34683 245719 476386 641595 460620 112177 -110540 -281991 -540576 -675433 -469882 -117654
34673 -117654 112898 258940 323335 22025 -654239 -1104953 -901807 -448724 -268315 -131594
34663 -131594 365786 833179 616622 10462 -59351 520825 890264 567644 65697 -48825
34653 -48825 99615 194773 287192 480106 576911 394895 60899 -234651 -438565 -477556
34643 -477556 -311194 -224558 -569753 -1086662 -1039589 -257818 519789 663627 481591 584504
34633 584504 878474 775429 171850 -365522 -369351 17642 365536 457045 340654 113360
34623 113360 -155078 -332115 -226364 198009 647016 714703 356424 -24175 -89280 35236
34613 35236 80245 109318 318743 533382 371798 -100824 -346011 -85251 317133 349900
34603 349900 -67010 -633598 -1034936 -1124093 -952645 -719479 -540900 -296152 86575 294665
34593 294665 -50063 -752473 -1130461 -819379 -151998 309908 273710 -258105 -1017765 -1460013
34583 -1460013 -1180551 -460873 44150 219403 516955 952097 821286 -169790 -1172654
34574 -1172654 -1215517 -492349 26923 -56082 -295775 -276463 -58078 225367 594314 948036
34564 948036 1027456 780468 438100 174245 -19296 -122994 -70024 53956 80639 24356
34554 24356 11026 -4362 -144416 -294740 -227922 667 145251 210642 379450 525682
34544 525682 319513 -99370 -117458 446680 954882 824110 333851 105127 157025 64054
34534 64054 -183033 -144480 260524 555030 474308 380418 625115 969182 1034932 970651 1150972
34523 1150972 1424384 1246869 564418 -2425 -30798 141101 43735 -130325 153765 847445
34513 847445 1241526 877184 143197 -202884 125779 733274 1009447 688025 44594 -374530
34503 -374530 -284263 67017 234712 113631 -49840 -114326 -206203 -376589 -422501 -214788
34493 -214788 70216 259900 477426 846986 1112076 909960 341696 -98130 -173265 -144054
34483 -144054 -266390 -386609 -251346 20403 84823 -88903 -135333 193101 672724 922822
34473 922822 903122 864258 870176 667710 131063 -420993 -588575 -433951 -374731 -554367
34463 -554367 -613460 -202738 487077 892289 694730 137996 -252426 -188874 130439 269899
34453 269899 65759 -162512 -5738 478773 794175 633869 284179 240298 541127 707331
34443 707331 366298 -231050 -455138 -29618 620809 836911 444868 -142619 -481778 -498366
34433 -498366 -303655 42874 373663 332770 -175025 -654001 -561766 -74754 142133 -122612
34423 -122612 -426815 -456468 -442888 -596419 -649062 -312884 193557 454398 401895 205148
34413 205148 -103612 -495683 -666954 -338288 268018 636025 578913 329253 95137 -115527
34403 -115527 -269292 -273547 -208301 -286143 -510603 -613525 -398836 35937 453704 687576
34393 687576 688442 524878 348257 242306 140833 -11481 -129121 -149317 -163759 -195521 -38258
34382 -38258 403638 796431 762727 459225 353870 499314 499533 208229 -53715 -100844 -193161
34371 -193161 -505542 -754624 -694502 -579460 -701001 -795047 -452767 78318 143099 -261268
34361 -261268 -329829 382225 1186794 1142823 369294 -130155 137765 582559 517849 124931
34351 124931 2630 185322 218218 20949 6749 300652 474960 280566 80486 212793
34341 212793 397690 213742 -217444 -512038 -682769 -974157 -1262537 -1210822 -905537 -744684
34331 -744684 -726740 -453402 111270 485715 418417 230959 209630 187826 10316 -82316
34321 -82316 113079 359793 391631 367119 512006 625047 389487 -55960 -310900 -312963
34311 -312963 -303938 -319290 -164332 145775 348399 348486 298039 249599 115183 14118 239021
34300 239021 722806 933749 573576 88575 138485 703982 1074417 714171 -152751 -893087
34290 -893087 -1149086 -1014243 -708104 -344139 -13783 142133 73321 -91939 -211175 -282108
34280 -282108 -333023 -291993 -124627 19251 5921 -32820 100302 298062 286941 103179
34270 103179 72017 269028 379026 205676 -55891 -227539 -442228 -770809 -913411 -611484
34260 -611484 -99266 211943 278538 302066 279498 72499 -238039 -465164 -649739 -895678
34250 -895678 -1029874 -867041 -660906 -761084 -911318 -508394 399754 1019501 903764 541691
34240 541691 555704 842236 922478 729849 574395 594494 686732 793596 863644 690780
34230 690780 200230 -221015 -101307 434990 750729 505236 55152 -42664 326356 793255
34220 793255 919857 565816 -15008 -376550 -290772 7129 92397 -120541 -277159 -78607
34210 -78607 265017 238519 -336227 -1010784 -1174358 -759039 -319096 -354553 -736344 -957679
34200 -957679 -778479 -351518 154161 662380 947626 744864 227587 -52043 103610 283335
34190 283335 187547 124704 391618 611728 269597 -395355 -676808 -431365 -172866 -185607
34180 -185607 -195989 1996 213309 300801 426069 619183 614103 359900 212748 324633
34170 324633 309874 -101191 -491088 -310408 280211 618691 444420 136761 94836 277165
34160 277165 422178 448620 512129 759330 1085769 1179299 891681 492642 331308 310554
34150 310554 68235 -311473 -284888 262434 664297 399864 -106070 -132844 257992 415578
34140 415578 135487 -164562 -220087 -222477 -306195 -321346 -237530 -251069 -324730 -104151 478687
34129 478687 934980 828831 341978 -35992 -126585 -112080 -159797 -247727 -265940 -127741
34119 -127741 147542 395368 468260 457785 567725 740142 656887 198265 -353023 -691767
34109 -691767 -825478 -862089 -711212 -265657 261144 478847 304067 79081 133617 373774
34099 373774 438717 211689 -13260 32575 172328 60166 -218696 -228455 80283 202649
34089 202649 -101414 -318392 36984 574202 574022 91616 -190225 -46862 108453 86200
34079 86200 156460 330335 225607 -114186 -67193 529213 939724 627024 117586 170820
34069 170820 640221 832207 571427 224905 -9891 -169147 -133958 154896 293981 -99902
34059 -99902 -649690 -650547 -166789 24260 -371473 -739032 -520373 21966 321743 296394
34049 296394 233261 221316 103129 -139250 -268048 -78192 326636 569191 324866 -328260
34039 -328260 -932312 -1118213 -987786 -917443 -1072343 -1260624 -1191212 -745742 -94536 342870
34029 342870 208079 -380785 -895423 -1013063 -928087 -897127 -826170 -601827 -468842 -649309
34019 -649309 -881163 -822200 -655418 -739283 -880122 -615736 -112068 -45287 -533553 -889539
34009 -889539 -629980 -109453 126141 79585 61667 144026 211775 252533 274028 155085 -172706
33998 -172706 -556826 -775943 -697609 -280294 296895 538953 112484 -522525 -481955 353616
33988 353616 1052620 848555 144186 -141152 174792 485845 373099 63288 -70856 -15523
33978 -15523 -4540 -161667 -370485 -408047 -185290 126559 281722 265567 254827 272984 134872
33967 134872 -196471 -469230 -486830 -349849 -230439 -157742 -152358 -290468 -481503 -482502 -310369
33956 -310369 -309854 -588493 -745456 -477002 -104904 -85142 -269557 -163330 235078 394809
33946 394809 62281 -378306 -488929 -333275 -228348 -209442 -31536 375452 705866 631994
33936 631994 254859 32894 212943 498973 457440 117060 -118090 -89636 -43939 -114465
33926 -114465 -62754 243432 444611 125762 -551248 -979896 -807432 -271400 115084 45810
33916 45810 -371621 -773201 -909771 -848848 -737583 -514496 -129236 90664 -231414 -817003
33906 -817003 -915099 -345578 214739 253650 119890 281006 494263 334209 51915 153878
33896 153878 464650 435983 194419 387670 998523 1229802 786507 421210 776100 1386825
33886 1386825 1427348 944075 661466 815303 878622 458740 -119624 -331063 -145446 82953
33876 82953 178322 254256 346245 291700 69743 -35106 174876 458167 453906 228590 181965
33865 181965 458333 782254 878288 733477 452389 208260 308660 850721 1304508 1014110
33855 1014110 211064 -146920 227956 498539 79228 -358535 -2636 667107 562222
33846 562222 -300540 -838294 -521489 66874 347593 470452 688327 808078 611574 243034
33836 243034 -101374 -394381 -527097 -343919 -61349 -116837 -463913 -575554 -290138 -52255
33826 -52255 -130684 -232781 -142655 -96039 -202571 -133759 222022 402041 120170 -188885
33816 -188885 -72932 219847 265687 193931 264141 170494 -494506 -1375956 -1694114 -1295297
33806 -1295297 -715361 -320865 -32137 174523 155500 39273 192118 631086 946455 900365
33796 900365 671418 446447 226746 129144 405067 981701 1386329 1330942 1041408 832569
33786 832569 694758 509748 352816 303293 192829 -164687 -630990 -876441 -767646 -433932
33776 -433932 -32633 368482 718359 939638 955433 711789 257336 -140983 -105305 471586
33766 471586 1212466 1568003 1332199 760540 227513 -102829 -278329 -381865 -434480 -422993
33756 -422993 -358477 -291553 -261882 -239230 -176676 -157968 -383412 -865583 -1215362 -990693 -315699
33745 -315699 137176 -15402 -308865 -56017 638738 963009 492386 -298183 -762870 -833724
33735 -833724 -774410 -661833 -525524 -599806 -912067 -933552 -257806 580475 659824 -25548
33725 -25548 -547413 -390136 -59069 -109626 -298588 -135542 305187 657619 922109 1282708
33715 1282708 1546637 1335234 724143 226604 163728 388149 591548 600941 409081 146756
33705 146756 -5054 -22873 -72391 -236903 -391375 -446642 -465612 -409000 -95300 386217
33695 386217 591562 335668 23263 20600 74955 -195378 -577273 -571943 -182064 175891
33685 175891 371088 592290 794531 702040 346075 71924 5732 -7778 30052 256215
33675 256215 506681 425661 51946 -202919 -186446 -107821 -10412 273865 587098 488492
33665 488492 -12495 -349012 -199109 159709 446787 713321 891536 682687 184133 -32553
33655 -32553 189049 291552 -16791 -204931 142516 543000 426544 84194 66210 227175
33645 227175 200795 262982 743578 1052713 439314 -568769 -723709 26397 461469 46538
33635 46538 -349071 -54581 362998 296798 178794 492463 677956 86908 -680534 -563043
33625 -563043 260097 619095 126140 -411423 -373084 -89186 -10667 -16093 96654 160533
33615 160533 97041 225069 665913 932410 594806 -18903 -281649 -158312 -142631 -454492
33605 -454492 -776672 -777970 -515505 -255332 -168120 -277339 -504837 -680847 -641204 -398167
33595 -398167 -158189 -125044 -295423 -452452 -381600 -128738 13126 -121637 -282100 -95040
33585 -95040 359297 539604 115547 -604927 -1091110 -1207304 -1177839 -1108710 -862766 -394326
33575 -394326 53457 178256 -61791 -412078 -577517 -519854 -483481 -658277 -877517 -835977
33565 -835977 -579572 -484232 -675880 -815921 -654609 -445839 -480919 -501790 -50989 706619
33555 706619 1004684 415881 -562998 -1027543 -609943 184156 512745 57735 -649616 -854943
33545 -854943 -471076 -52186 103056 288193 611305 531844 -261510 -1039135 -886595 -52613
33535 -52613 425616 264950 153079 443033 660068 526329 482097 769402 886156 497526
33525 497526 118736 278361 677475 819659 837138 987518 937981 363062 -257739 -312626
33515 -312626 -93069 -225614 -452043 -55119 709257 784823 -24779 -692849 -525428 -62883
33505 -62883 -23939 -259442 -311837 -286159 -526434 -921103 -1105320 -1018615 -833909 -648135
33495 -648135 -563706 -704136 -867879 -630852 -110877 -72417 -815155 -1523654 -1342935 -618861
33485 -618861 -314363 -538717 -521219 81606 717242 857357 633793 356405 48562 -240510
33475 -240510 -194666 320541 907315 1043274 613978 -122418 -802117 -1033572 -586298 230356
33465 230356 690504 453112 -13720 -87602 211867 431799 425583 411066 418212 196181 -268663
33454 -268663 -573409 -416034 -13626 180036 14838 -230299 -183053 199884 498636 221188
33444 221188 -541462 -1050245 -799751 -260172 -260114 -746130 -823502 -133864 559984 543345 202628
33433 202628 277383 606067 454527 -189042 -551234 -290158 55227 -2748 -232036 -205988
33423 -205988 99942 525758 1014210 1378144 1272381 734354 316404 347617 488585 357512
33413 357512 143868 184078 355904 383012 375078 536963 652418 427111 108809 172657
33403 172657 532667 639887 295458 -164254 -463109 -664100 -826224 -818242 -552629 -118822
33393 -118822 305495 471777 174783 -368935 -524129 -1787 655145 778318 436816 92412
33383 92412 -188877 -489573 -418530 345450 1154995 1083863 398401 212741 669652 734050
33373 734050 35721 -442304 -81383 260344 -269649 -1009239 -841661 42812 596853 554889
33363 554889 472753 524891 413231 276223 588756 1172521 1278251 734873 178002 39894
33353 39894 87997 83984 156315 337226 394146 323553 423926 692679 709456 312319 -127039
33342 -127039 -283957 -246899 -150303 46392 235045 128990 -222213 -367287 -131862 97032
33332 97032 -5246 -258566 -410333 -529611 -661417 -556093 -125250 241181 228646 107010
33322 107010 238506 404970 162846 -332801 -434720 79525 678702 770764 381284 -7490
33312 -7490 -78314 27605 -16028 -257299 -376374 -143531 150562 -2297 -597841 -1056108
33302 -1056108 -1022750 -850296 -1002390 -1315708 -1265781 -762803 -228697 47531 193160 349352
33292 349352 378958 140268 -207923 -368687 -244746 27546 300446 536613 707075 663683
33282 663683 228581 -523657 -1158383 -1233293 -778754 -259404 -22499 17810 96538 268191
33272 268191 498913 801101 1040851 875693 218993 -418293 -434237 101141 553737 546601
33262 546601 295395 121319 30614 -104564 -266633 -346455 -263119 36301 465383 680392
33252 680392 407012 -63770 -113138 330878 604799 260607 -245846 -239332 177285 373969
33242 373969 218438 203658 562824 860493 626128 -58532 -772306 -1170728 -1064508 -509805
33232 -509805 14682 -11864 -360526 -164231 805044 1525346 1009320 -226189 -789966 -318076
33222 -318076 175868 -71849 -545306 -461135 -18820 39976 -366655 -641195 -467704 -118905
33212 -118905 126753 265594 236254 -118237 -597712 -645784 -67242 610505 772656 447786
33202 447786 120183 21755 -52951 -294578 -543064 -476524 1078 616603 943630 800206
33192 800206 459321 369533 616033 804236 596560 199288 77990 274449 327869 -57160
33182 -57160 -575677 -768425 -663997 -625974 -655381 -301853 567876 1300777 1132616 163583
33172 163583 -731643 -930214 -621147 -305327 -150112 -38231 74639 152131 239748 366521
33162 366521 409822 281794 123931 97951 113499 -5366 -208218 -314640 -303170 -264407
33152 -264407 -212067 -213432 -525657 -1223552 -1816257 -1679135 -852441 -13785 327072 204723
33142 204723 -169135 -617969 -800076 -382723 382193 769926 510511 119624 55027 91511
33132 91511 -92441 -249941 -20811 361948 406216 114626 -148155 -289667 -436654 -491282
33122 -491282 -342512 -309043 -707855 -1144962 -982003 -434584 -376676 -977141 -1396598 -1093260
33112 -1093260 -586162 -486997 -546056 -281426 55620 -102510 -627204 -837463 -487341 17651
33102 17651 300759 364918 315490 219283 217918 368835 429967 194108 -79174 -15036 226977
33091 226977 198028 -41017 -17344 246291 164323 -372822 -637040 -144508 540722 629445
33081 629445 227105 -4080 63578 -23868 -436077 -828990 -953183 -891719 -666041 -183920
33071 -183920 323100 373191 -61427 -416918 -334794 -126537 -153689 -211703 41684 407365
33061 407365 422860 136208 78725 477913 917432 853232 189876 -683105 -1195443 -968235
33051 -968235 -153720 604087 797533 603489 532351 631755 469609 -80987 -549355 -548016
33041 -548016 -296391 -176469 -152946 -8830 145766 39954 -262941 -457500 -471548 -455097
33031 -455097 -387410 -118096 231926 341898 199068 121852 196032 103603 -327574 -776174
33021 -776174 -845528 -539861 -130739 178061 271374 103775 -121800 -37512 391361 727848
33011 727848 665707 457850 441502 477563 283253 23855 35559 141664 -160991 -868738
33001 -868738 -1379780 -1290203 -798606 -265096 137391 247254 -80357 -609645 -838237 -672075
32991 -672075 -521644 -527890 -248570 528492 1181600 981309 74978 -758157 -1069394 -969928
32981 -969928 -647663 -221351 35003 -135815 -562839 -812852 -752643 -590750 -439411 -249509
32971 -249509 -125696 -246642 -451344 -346550 100620 474763 495282 302864 78595 -214304
32961 -214304 -549496 -663135 -377067 151730 650833 971087 1029045 809182 531702 505764
32951 505764 681080 667388 361246 197306 511033 952029 882324 197476 -575017 -932485
32941 -932485 -883780 -777589 -853440 -1048054 -1165899 -1129967 -984707 -703585 -213638 302299
32931 302299 408458 -32949 -555812 -656662 -435666 -288374 -228452 -50057 69530 -184264
32921 -184264 -534112 -390760 152885 415853 259240 213104 335083 -10090 -877509 -1334416
32911 -1334416 -899601 -362302 -477639 -913337 -1351829 -2444393 -4367309 -5479673 -4179793
32902 -4179793 -1524296 -122651 -617340 -1176824 -612851 25877 -368268 -1049682 -849099
32893 -849099 -123571 71823 -204231 -159313 182045 134427 -295218 -427833 -148274 -54270
32883 -54270 -379175 -692591 -728514 -676496 -550926 -67280 660774 1020695 777461 450221
32873 450221 505335 693800 541171 63308 -392350 -688141 -875638 -853263 -449795 210218
32863 210218 719009 784313 490646 217124 357517 960791 1548057 1513107 888958 458236
32853 458236 793860 1431734 1472637 877953 523939 850001 1161638 723998 -52563 -256176
32843 -256176 51358 -71503 -885090 -1452674 -1028201 -161257 147920 -202874 -589533 -755006
32833 -755006 -965114 -1267517 -1328911 -1009677 -525830 -41464 377304 449129 -73775 -796592
32823 -796592 -946815 -415439 32304 -192501 -783797 -1168657 -1330397 -1554205 -1725168 -1431162
32813 -1431162 -664296 17466 95223 -373783 -881317 -1001461 -733070 -351821 -36513 207042
32803 207042 295069 70181 -289842 -243149 386897 966944 804206 112190 -289730 -63555
32793 -63555 408830 714235 733733 421319 -75992 -196458 390398 1011128 727452 -184116
32783 -184116 -507502 47747 412894 -51365 -546890 -299636 85538 -276486 -932014 -720100
32773 -720100 436876 1432231 1439916 617629 -462682 -1296106 -1491792 -1054711 -551498 -443389
32763 -443389 -430874 -4608 621174 788104 421072 103463 211293 559040 830879 835043
32753 835043 421213 -355923 -1069199 -1321745 -1182164 -918950 -636144 -527276 -972336 -1825172
32743 -1825172 -2159485 -1473804 -643615 -776128 -1551373 -1751264 -1136672 -624338 -691014 -807927
32733 -807927 -595406 -413174 -496474 -476059 -132508 182841 219094 191905 205957 35998
32723 35998 -258888 -235318 153193 396877 303139 278507 475338 455151 24476 -400456
32713 -400456 -612631 -933008 -1284983 -901125 394839 1474785 1287218 268924 -447126
32704 -447126 -607726 -707466 -818589 -627238 -364251 -625204 -1280058 -1511907 -1072798 -671642
32694 -671642 -873812 -1339728 -1509530 -1444468 -1515177 -1662174 -1501226 -983944 -461499 -114200
32684 -114200 230878 602351 647662 209608 -206926 -44099 427196 466466 59646 -32324
32674 -32324 390142 482510 -268869 -1051011 -927109 -321600 -259467 -648240 -530175 235062
32664 235062 804426 790843 627857 454270 -106904 -873534 -1050083 -553040 -219272 -373018
32654 -373018 -393091 -72155 -94227 -624714 -755196 -75468 443731 -40631 -991229 -1557437
32644 -1557437 -1767475 -1867180 -1684852 -1472587 -2022091 -3070129 -3231596 -2598838 -3291022
32635 -3291022 -5593090 -5812580 -961152 5948609 8873295 6455959 3133130 2426832
32627 2426832 2991974 2474962 1601757 2058813 2982071 2426501 795975 118123 738310
32618 738310 1144960 699833 371421 736367 1101696 916756 591253 505313 364061 -37104
32608 -37104 -318064 -190081 80570 216415 350617 629585 898967 1037997 1189191 1434654
32598 1434654 1583804 1471382 1211637 1032334 1047616 1222471 1369105 1220865 738754 280543
32588 280543 217238 462837 652321 676545 704610 753669 639687 388434 317482 581263
32578 581263 917774 991979 779843 481418 234846 67210 1329 38946 66582 -87435
32568 -87435 -445574 -780056 -811494 -546007 -317024 -372535 -508147 -329863 138320 407432
32558 407432 193108 -159087 -144499 231444 561911 673466 769699 930037 851529 300778
32548 300778 -410105 -688047 -345153 223963 575555 684443 747414 749387 529180 203560
32538 203560 154967 480247 758291 584951 112316 -206918 -236283 -202549 -226524 -157367
32528 -157367 99908 379637 463794 299150 -49967 -479102 -802422 -808649 -490004 -139318
32518 -139318 -94603 -352857 -484787 -41876 879029 1600527 1584345 1088827 816437 968760
32508 968760 1065647 733903 170225 -338586 -805936 -1164468 -1049575 -389284 283336 572305
32498 572305 758802 1068745 1012488 232595 -532182 -342765 412834 505458 -243836 -722614
32488 -722614 -274951 457107 753386 814329 1032183 1160582 851022 365758 142708 116570
32478 116570 -32661 -343804 -652940 -820621 -640367 -2380 654214 660199 130606 -37294
32468 -37294 495362 947903 669837 156626 162274 504129 547286 328994 346258 604253
32458 604253 701440 608226 617664 726012 733950 746763 914681 913935 402963 -195671 -136174
32447 -136174 516804 952103 806503 553417 597866 686602 459271 23514 -316881 -502107
32437 -502107 -607508 -580763 -329741 88561 509378 785761 830996 651745 369074 154817
32427 154817 163645 471391 898887 964530 377073 -395682 -522759 86757 614847 511127
32417 511127 220793 319053 541024 307668 -255771 -547861 -427087 -234801 -125106 -30615
32407 -30615 -81504 -393495 -614718 -348469 115617 149439 -262409 -579224 -588861 -534329 -434526
32396 -434526 -27152 569076 830330 584440 214612 26658 -50081 -87708 -24069 52611
32386 52611 -23904 -150124 -155912 -245650 -667500 -1074967 -888568 -205453 363373 677438
32376 677438 1087267 1510045 1392958 715849 155460 67562 140642 211049 472060 636167
32366 636167 -31019 -1363513 -2026493 -1292847 -188465 -39916 -647949 -864993 -410830
32357 -410830 -43917 -203411 -493456 -512456 -384734 -344743 -384264 -446957 -548710 -614609
32347 -614609 -513394 -286167 -88296 69095 282887 505360 545554 313524 -57157 -288340
32337 -288340 -135625 367179 836373 920185 736487 657438 711330 589449 225885 -110661
32327 -110661 -331252 -587922 -759185 -518199 -65965 -70492 -583588 -774637 -192678 441836
32317 441836 323714 -190514 -170451 502092 1097526 1106416 658783 83743 -336098 -335960 65613
32306 65613 423842 426450 350493 526590 691782 428229 -64966 -256644 -106012 4937
32296 4937 -35495 -23138 98582 267114 563234 916962 876519 287480 -179317 60300
32286 60300 445233 70495 -738721 -794550 63214 652759 240958 -500056 -743483 -660012
32276 -660012 -721798 -771182 -545185 -431598 -868835 -1446077 -1389971 -676558 20483 291457
32266 291457 280397 161121 -56453 -212042 -32863 410250 679648 521592 145033 -158027
32256 -158027 -410057 -783261 -1180579 -1223613 -741141 -131414 2434 -373276 -595089 -166042
32246 -166042 529994 768172 525682 422329 669314 749808 339967 -92107 -11229 360506
32236 360506 459843 280886 290635 625009 929646 975542 928894 917539 763443 357376 -6914
32225 -6914 36284 379467 490228 36654 -703545 -1166069 -1142514 -928148 -826233 -744253
32215 -744253 -453638 -50373 159707 162122 251584 496415 562303 263202 -30366 143323
32205 143323 624750 740929 152296 -664044 -914847 -372975 388976 674544 445244 257373
32195 257373 455819 730592 638226 265496 23586 -19493 -127790 -279015 -100961 443595
32185 443595 809325 583062 65902 -173459 -21949 230156 392585 441997 286186 -108155
32175 -108155 -438038 -329879 106214 349623 155863 -165935 -279372 -298124 -494152 -760068
32165 -760068 -728026 -404936 -317700 -803051 -1383363 -1242782 -335136 407065 214907 -515203
32155 -515203 -791196 -372143 47230 -16036 -188210 -25818 166866 -133517 -698708 -786481
32145 -786481 -249476 246746 234366 110620 487557 1260967 1740533 1548176 1000818 595621
32135 595621 438357 329727 207533 236076 457676 599257 404129 40336 -84549 51869
32125 51869 -66203 -806632 -1743403 -2045038 -1504303 -830719 -762079 -1177810 -1383490 -1077170
32115 -1077170 -616235 -346215 -136367 215438 523346 537385 451392 609479 852926 715159
32105 715159 258769 97098 412137 590998 216080 -177041 73582 616894 544844 -207305
32095 -207305 -726075 -445350 110790 143704 -420861 -1037236 -1215827 -821233 -50933 620686
32085 620686 758054 423513 64047 -143993 -437324 -826495 -849826 -299735 282196 303982
32075 303982 -37485 -127089 122000 247818 23628 -292001 -471649 -584772 -671734 -578072
32065 -578072 -268716 -8697 -70652 -431941 -834203 -1011676 -872527 -607077 -559467 -809304
32055 -809304 -976757 -691124 -161174 42326 -255952 -640876 -705297 -498128 -269058 -86791
32045 -86791 105806 289095 406180 449972 389681 179600 -64109 -119357 -30163 -169457
32035 -169457 -700173 -1197703 -1135244 -617279 -261533 -374022 -622603 -619603 -456714 -428085
32025 -428085 -502054 -400761 -72969 241735 383336 407970 356571 200401 72251 215954
32015 215954 554483 619948 149363 -501083 -810729 -757825 -728903 -939555 -1278934 -1595957
32005 -1595957 -1777107 -1632496 -1096443 -512707 -342752 -581760 -800073 -730849 -449100 -47644
31995 -47644 373558 426842 -238950 -1213201 -1556314 -1013990 -399769 -427514 -769226 -756178
31985 -756178 -457231 -406638 -649239 -772482 -676748 -621618 -587663 -240895 423592 935958
31975 935958 932329 473593 -213861 -876736 -1119982 -665041 152394 581174 333637 -74936
31965 -74936 -31324 440908 850592 908060 796931 853010 1098297 1133564 585767 -315292
31955 -315292 -852985 -688694 -317933 -349824 -628798 -549878 -39051 369998 377873 241618
31945 241618 205068 177894 116750 200391 432764 530842 395481 253060 154031 -180101 -766139
31934 -766139 -1110786 -895372 -486811 -386338 -532002 -547513 -360752 -144616 80134 310311
31924 310311 234738 -436178 -1371316 -1817607 -1470143 -819431 -546391 -791337 -1086688 -877342
31914 -877342 -92138 730391 961971 598617 288993 523037 1012965 1121120 721637 308568
31904 308568 309483 610564 812846 726065 499417 363932 323585 121869 -428977 -1102294
31894 -1102294 -1397562 -1084519 -447361 80871 332433 365056 259405 133431 136170 216573
31884 216573 104233 -252961 -461168 -195206 252659 313441 -80746 -459809 -526317 -492767
31874 -492767 -635170 -883379 -1027500 -1045998 -1005405 -826796 -407853 95263 344225 223998
31864 223998 21666 93299 420363 643943 557894 387723 432401 578183 447328 7609
31854 7609 -285287 -74881 412217 647206 410793 -26464 -228167 -259 422682 573057
31844 573057 281446 -25729 170426 708826 890276 468188 -818 -24267 131131 15457
31834 15457 -194612 -24567 456222 721233 566512 255793 -19167 -290132 -465195 -354956
31824 -354956 -87557 -44999 -316706 -586070 -586488 -329024 91394 548947 801618 739982
31814 739982 634642 719247 683435 128522 -610953 -790219 -367274 -37003 -92306 -89430
31804 -89430 151252 125469 -339299 -504823 192585 1154513 1443231 1064654 691224 552903
31794 552903 399936 230461 212347 82616 -529196 -1250165 -1258514 -489171 201117 214534
31784 214534 -117672 -238062 -99762 81188 262451 417134 357815 59307 -160490 -71400
31774 -71400 139455 228533 303439 569681 891124 932575 642864 328188 259459 374230
31764 374230 385089 120630 -252407 -392539 -215140 -30899 -110026 -280193 -220575 2132
31754 2132 62998 -51314 -42605 144651 241848 182993 219746 388595 373325 104144 -7425
31743 -7425 279980 609009 584152 349240 244028 269040 273147 299959 342231 132707 -365966
31732 -365966 -649598 -379515 -29451 -206750 -661906 -707811 -382822 -355003 -747619 -937596
31722 -937596 -630324 -316586 -421479 -715310 -861066 -905370 -920378 -768853 -546192 -645201
31712 -645201 -1027525 -1066199 -540709 -128352 -349296 -667206 -367400 211671 208410 -342957
31702 -342957 -563380 -78004 566296 847619 820106 612945 148575 -417997 -641840 -435685
31692 -435685 -222567 -232587 -218214 -80032 -129221 -405932 -398693 91829 427475 80993
31682 80993 -413876 -219628 446821 575819 -110254 -740702 -568733 35367 195031 -334769
31672 -334769 -990593 -1088771 -434984 551395 1143255 923748 231243 -194703 -70596 203653
31662 203653 252718 255434 494615 744696 570707 64599 -221288 -85617 41730 -214824
31652 -214824 -598596 -612339 -246423 13840 -180926 -685150 -1099276 -1117296 -644213 138956
31642 138956 747317 729990 229897 -48948 284650 684197 335089 -637065 -1166168 -618583
31632 -618583 330016 578937 23013 -435013 -158588 503292 861784 756503 514477 390903
31622 390903 393343 473510 564110 504526 205862 -145817 -287820 -250920 -283755 -411647 -352358
31611 -352358 39647 490391 624464 398563 65538 -144129 -126898 167511 654820 998974
31601 998974 853120 304447 -129913 -91767 191728 267193 135691 270695 872349 1393661
31591 1393661 1119769 132127 -676830 -666961 -194976 -28111 -291407 -448525 -215470 71745
31581 71745 112361 99381 212420 159695 -278009 -637204 -347472 308311 523136 168712
31571 168712 -117605 -112710 -378723 -1107509 -1474179 -818488 197057 463931 23614 -167814
31561 -167814 143228 169769 -530098 -1302701 -1424110 -1107802 -950328 -929838 -580454 144602
31551 144602 763508 910783 672565 341536 150602 186328 323654 326683 184357 168339
31541 168339 355018 345104 -207367 -986389 -1342645 -1129038 -791997 -663964 -606014 -434257
31531 -434257 -287898 -358203 -523920 -495492 -190672 191852 382230 233180 -187185 -616673
31521 -616673 -809227 -773423 -700312 -649029 -479078 -141417 175025 306062 324059 314819 128252
31510 128252 -381613 -964529 -1141131 -798128 -334545 -104456 21009 330865 736963 884170
31500 884170 708334 524050 519095 513333 359603 246719 347699 437545 199814 -262230
31490 -262230 -577871 -648768 -661478 -658353 -528738 -390017 -490888 -685696 -518684 27589
31480 27589 387399 234373 -76360 -182936 -271424 -522302 -566652 -127401 252573 -85736
31470 -85736 -769993 -838441 -238649 50927 -470435 -1112623 -1146941 -844218 -798143 -877574
31460 -877574 -583449 -28108 223068 106584 123772 449658 636735 365432 -47442 -153178
31450 -153178 12449 124305 98262 78322 36166 -261168 -852037 -1395137 -1498975 -1132032
31440 -1132032 -630183 -362092 -435438 -655937 -696367 -366394 172254 485150 292918 -174083
31430 -174083 -406756 -246850 -82503 -275124 -596981 -519728 28382 528754 543332 216674
31420 216674 -35154 -83989 -106262 -200691 -276330 -296300 -368912 -515311 -551373 -355058 -114725
$$ [...]
##END NTUPLES=NMR SPECTRUM
##END=
