##TITLE=31Pdec_3E1603 AN
 CD3CN, 24 sc
 17.3.2023
##JCAMPDX= 6.0         $$ Bruker NMR JCAMP-DX V2.0
##DATA TYPE= NMR SPECTRUM
##DATA CLASS= NTUPLES
##ORIGIN= UXNMR, Bruker Analytische Messtechnik GmbH
##OWNER= root
$$ XWIN-NMR		Version 3.5
$$ Fri Mar 17 14:46:55 2023 Russian Standard Time (UT+4h)  she@DPX200
##.OBSERVE FREQUENCY= 81.013821
##.OBSERVE NUCLEUS= ^31P
##.ACQUISITION MODE= SIMULTANEOUS
##.ACQUISITION SCHEME= undefined
##.AVERAGES= 24
##.DIGITISER RES= 16
##SPECTROMETER/DATA SYSTEM= spect
##.PULSE SEQUENCE= zgpg30
##.SOLVENT NAME= CD3CN
##.SHIFT REFERENCE= (INTERNAL, CD3CN, 0, 248.564)
##AUDIT TRAIL= $$ (NUMBER, WHEN, WHO, WHERE, WHAT)
$$ ##TITLE= Audit trail, XWIN-NMR		Version 3.5
$$ ##JCAMPDX= 5.01
$$ ##ORIGIN= Bruker BioSpin GmbH
$$ ##OWNER= she
$$ F:/spectra/data/she/nmr/P31/1/pdata/1/auditp.txt
$$ ##AUDIT TRAIL=  $$ (NUMBER, WHEN, WHO, WHERE, WHAT)
(   1,<2023-03-17 14:45:15.56 +0400>,<she>,<DPX200>,
      <created by zg, POWCHK disabled, PULCHK disabled
       configuration hash MD5:
       00 E9 B6 7A A2 85 ED C7 34 08 36 98 17 FE 4E 26
       data hash MD5: 32K
       BB 15 2A D7 F8 6A 84 61 F6 A7 C2 41 BA E4 68 D7>)
(   2,<2023-03-17 14:45:19.15 +0400>,<she>,<DPX200>,
      <Start of raw data processing
       efp BC_mod = 2 LB = 1 FT_mod = 6 PKNL = 1 PHC0 = -10808.24 PHC1 = -169.7899 SI = 64K 
       data hash MD5: 64K
       9F E7 B2 28 9C 9A F2 16 4D AC E0 EE F9 A7 B6 1A>)
(   3,<2023-03-17 14:45:58.07 +0400>,<she>,<DPX200>,
      <pk PHC0 = 76.6799 PHC1 = -150.2001 
       data hash MD5: 64K
       B5 73 08 5E 22 60 29 01 F0 15 F9 EB 58 03 CE B2>)
(   4,<2023-03-17 14:46:01.17 +0400>,<she>,<DPX200>,
      <abs ABSG = 5 
       data hash MD5: 64K
       8D E3 A3 87 F5 08 1F 97 72 69 42 8B 30 2F 61 EB>)
(   5,<2023-03-17 14:46:25.09 +0400>,<she>,<DPX200>,
      <pk PHC0 = -0.591233 PHC1 = 0 
       data hash MD5: 64K
       C4 DA 23 A2 A0 BE 40 F7 EC D8 0F 71 EE CB D7 2E>)
$$ ##END=
$$ 
$$ hash MD5
$$ 4C 25 44 1E B8 EA B1 6C D1 81 63 F5 DB BF B3 3E
##$RELAX= 
##$RELAX= 
##$RELAX= 
##$RELAX= 
##$RELAX= 
##$RELAX= 
##$RELAX= 
##$RELAX= 
##$RELAX= 
$$ Bruker specific parameters
$$ --------------------------
##$DU= <F:/spectra>
##$EXPNO= 1
##$NAME= <P31>
##$PROCNO= 1
##$TYPE= <nmr>
##$USER= <she>
##$AMP= (0..31)
100 100 100 100 100 100 100 100 100 100 100 100 100 100 100 100 100 100 
100 100 100 100 100 100 100 100 100 100 100 100 100 100 
##$AQSEQ= 0
##$AQ_mod= 1
##$AUNM= <au_zg>
##$AUTOPOS= <>
##$BF1= 81.014009
##$BF2= 200.13
##$BF3= 200.13
##$BF4= 200.13
##$BF5= 200.13
##$BF6= 200.13
##$BF7= 200.13
##$BF8= 200.13
##$BYTORDA= 1
##$CFDGTYP= 0
##$CFRGTYP= 5
##$CHEMSTR= <none>
##$CNST= (0..31)
1 1 145 1 1 1 1 1 1 1 1 1 1 1 1 1 1 1 1 1 1 1 1 1 1 1 1 1 1 1 1 1 
##$CPDPRG= <waltz16>
##$CPDPRG1= <>
##$CPDPRG2= <waltz16>
##$CPDPRG3= <>
##$CPDPRG4= <mlev>
##$CPDPRG5= <mlev>
##$CPDPRG6= <mlev>
##$CPDPRG7= <mlev>
##$CPDPRG8= <mlev>
##$CPDPRGB= <>
##$CPDPRGT= <>
##$D= (0..31)
$$ [...]
##$SUBNAM3= <"">
##$SUBNAM4= <"">
##$SUBNAM5= <"">
##$SUBNAM6= <"">
##$SUBNAM7= <"">
##$SUBNAM8= <"">
##$SUBNAM9= <"">
##$SW= 501.771253377433
##$SWIBOX= (0..15)
0 1 3 0 0 0 0 0 0 0 0 0 0 0 0 0 
##$SW_h= 40650.406504065
##$TD= 32768
##$TD0= 1
##$TE= 0
##$TE2= 300
##$TE3= 300
##$TEG= 300
##$TL= (0..7)
0 120 53 12 22 120 120 120 
##$TP= (0..7)
150 150 150 150 150 150 150 150 
##$TP07= 0
##$TPNAME0= <>
##$TPNAME1= <>
##$TPNAME2= <>
##$TPNAME3= <>
##$TPNAME4= <>
##$TPNAME5= <>
##$TPNAME6= <>
##$TPNAME7= <>
##$TPOAL= (0..7)
0.5 0.5 0.5 0.5 0.5 0.5 0.5 0.5 
##$TPOFFS= (0..7)
0 0 0 0 0 0 0 0 
##$TUNHIN= 0
##$TUNHOUT= 0
##$TUNXOUT= 0
##$USERA1= <user>
##$USERA2= <user>
##$USERA3= <user>
##$USERA4= <user>
##$USERA5= <user>
##$V9= 5
##$VALIST= <valist>
##$VCLIST= <CCCCCCCCCCCCCCC>
##$VD= 0
##$VDLIST= <DDDDDDDDDDDDDDD>
##$VPLIST= <PPPPPPPPPPPPPPP>
##$VTLIST= <TTTTTTTTTTTTTTT>
##$WBST= 1024
##$WBSW= 4
##$XGAIN= (0..3)
0 0 0 0 
##$XL= 0
##$YL= 0
##$YMAX_a= 413
##$YMIN_a= -822
##$ZGOPTNS= <>
##$ZL1= 120
##$ZL2= 120
##$ZL3= 120
##$ZL4= 120
##$ABSF1= 248.5645
##$ABSF2= -253.2056
##$ABSG= 5
##$ABSL= 3
##$ALPHA= 0
##$AQORDER= 0
##$ASSFAC= 0
##$ASSFACI= 0
##$ASSFACX= 0
##$ASSWID= 0
##$AUNMP= <proc_1d>
##$AZFE= 0.1
##$AZFW= 0.5
##$BCFW= 0
##$BC_mod= 2
##$BYTORDP= 0
##$COROFFS= 0
##$CY= -3
##$DATMOD= 1
##$DC= 0
##$DFILT= <>
##$DTYPP= 0
##$F1P= 0
##$F2P= 0
##$FCOR= 1
##$FTSIZE= 65536
##$FT_mod= 6
##$GAMMA= 0
##$GB= 0
##$INTBC= 1
##$INTSCL= 6.047779e-11
##$ISEN= 30
##$LB= 1
##$LEV0= 0
##$LPBIN= 0
##$MAXI= 10000
##$MC2= 0
##$MEAN= 0
##$ME_mod= 0
##$MI= 50
##$NCOEF= 0
##$NC_proc= -10
##$NLEV= 6
##$NOISF1= 182.463
##$NOISF2= 159.3651
##$NSP= 0
##$NTH_PI= 0
##$NZP= 0
##$OFFSET= 248.5645
##$PC= 4
##$PHC0= -10732.15
##$PHC1= -319.99
##$PH_mod= 1
##$PKNL= yes
##$PPARMOD= 0
##$PSCAL= 0
##$PSIGN= 0
##$REVERSE= no
##$SF= 81.0140089999694
##$SI= 65536
##$SIGF1= 159.3651
##$SIGF2= -187.1042
##$SINO= 113.3802
##$SIOLD= 16384
##$SREGLST= <1H.CDCl3>
##$SSB= 0
##$STSI= 65536
##$STSR= 0
##$SW_p= 40650.406504065
##$SYMM= 0
##$S_DEV= 0
##$TDeff= 32768
##$TDoff= 0
##$TI= <>
##$TILT= no
##$TM1= 0
##$TM2= 0
##$TOPLEV= 0
##$USERP1= <user>
##$USERP2= <user>
##$USERP3= <user>
##$USERP4= <user>
##$USERP5= <user>
##$WDW= 1
##$XDIM= 65536
##$YMAX_p= 466419246
##$YMIN_p= -37872444
$$ End of Bruker specific parameters
$$ ---------------------------------
##NTUPLES= NMR SPECTRUM
##VAR_NAME=  FREQUENCY,     SPECTRUM/REAL,   SPECTRUM/IMAG
##SYMBOL=    X,             R,               I
##VAR_TYPE=  INDEPENDENT,   DEPENDENT,       DEPENDENT
##VAR_FORM=  AFFN,          ASDF,            ASDF
##VAR_DIM=   65536,         65536,           65536
##UNITS=     HZ,            ARBITRARY UNITS, ARBITRARY UNITS
##FACTOR=    0.620285442955139, 1,           1
##FIRST=     20137.2065510682, 0,            0
##LAST=      -20513.1999529968, 0,           0
##MIN=       -20513.1999529968, -37872444,   0
##MAX=       20137.2065510682, 466419246,    0
$$ Real data points
##PAGE= N=1
##DATA TABLE= (X++(R..R)), XYDATA
$$ [...]
$$ plain form
39582 -1694738 -1740219 -1117932 -849098 -1041966 -1097360 -880540 -664855 -301930 517076 1386205
39572 1386205 1541761 1007916 530237 446542 459765 455254 620352 691960 32589 -1281379
39562 -1281379 -2286510 -2432172 -2319633 -2622500 -2868687 -2032426 -129681 1471861 1529736
39553 1529736 351198 -574075 -277232 714163 1256810 1030028 571117 168350 -382876
39544 -382876 -846149 -427669 895036 1875151 1580674 652509 111224 -233297 -1015726
39535 -1015726 -1715010 -1314161 -143362 495092 346909 270313 389042 -48611 -829717
39526 -829717 -719986 267703 505729 -514621 -1028724 187018 1667401 1563871 529976
39517 529976 318187 721215 209351 -1098586 -1503338 -581053 281004 346541 394756 722132
$$ packed form
39582a694738m5481O22287K68834j92868n5394K16820K15685L62925Q19006Q69129
39572A386205J55556n33845m77679q3695J3223m511J65098P1608o59371j313968
39562a281379j005131j45662J12539l02867k46187Q36261J902745J601542N7875
39553A529736j178538r25273K96843R91395N42647k26782m58911m02767n51226
39544c82876m63273M18480J322705R80115k94477r28165n41285l44521p82429
39535a015726o99284M00849J170799O38454j48183p6596J18729m37653p81106
39526h29717J09731R87689K38026j020350n14103J215742J480383j03530j033895
39517E29976k11789M03028n11864j307937m04752R22285Q62057O5537M8215L27376
$$ plain form
39507 722132 374709 -825955 -1370702 -315095 1063078 1120221 158658 -421733 -303587
39498 -303587 -208099 -381333 -488571 -550406 -705441 -390723 951560 2523139 2800048 1566034
39488 1566034 189311 -254073 -47489 184892 441295 820668 1005559 888665 941643
39479 941643 1290536 1105785 -282468 -2151475 -3128701 -2872283 -2167722 -1564043 -905523
39470 -905523 -273465 -314144 -1118815 -1624259 -942449 212300 372448 -571203 -1138181 -388866
39460 -388866 697672 703543 -73887 -86473 1012518 1676267 714214 -858407 -1230007 -380958
39450 -380958 56120 -634371 -1268451 -781454 71706 -24309 -908372 -1367200 -1060068 -699717
39440 -699717 -498688 170926 1335297 1917303 1249590 85865 -559952 -718779 -881591
$$ packed form
39507G22132l47423j200664n44747J055607J378173N7143r61563n80391J18146
39498c03587R5488j73234j07238o1835j55035L14718J342283J571579K76909j234014
39488A566034j376723m43384K06584K32381K56403L79373J84891j16894N2978
39479I41643L48893j84751j388253j869007r77226K56418P04561O03679O58520
39470i05523O32058m0679q04671n05444O81810J154749J60148r43651n66978P49315
39460c88866J086538N871p77430j2586J098991O63749r62053j572621l71600Q49049
39450c80958M37078o90491o34080M86997Q53160r6015q84063m58828L07132L60351
39440f99717K01029O69614J164371N82006o67713j163725o45817j58827j62812
$$ plain form
39431 -881591 -937664 -620873 -354711 -611207 -921581 -638933 -303117 -968219 -2318038 -2838272
39421 -2838272 -2045902 -1190972 -1258411 -1533741 -960886 91761 460777 -62910 -669819
39412 -669819 -879037 -968288 -1141372 -1099305 -570577 267166 982728 1156996 545663 -588070
39402 -588070 -1377637 -1088511 -21269 713936 436575 -395773 -844438 -612240 -303342
39393 -303342 -603988 -1360074 -1657040 -914396 308596 908594 505158 -318004 -937848
39384 -937848 -1231221 -1141590 -505304 339360 527047 -177904 -822630 -522371 289128 626053
39374 626053 423879 278309 115386 -681734 -1881475 -2363038 -1751182 -1024639 -995288 -1092798
39364 -1092798 -377995 881055 1481336 855188 -332410 -1080393 -1011674 -436973 97686
$$ packed form
39431h81591n6073L16791K66162k56496l10374K82648L35816o65102j349819n20234
39421b838272P92370Q54930o7439k75330N72855J052647L69016n23687o06909
39412f69819k09218q9251j73084M2067N28728Q37743P15562J74268o11333j133733
39402e88070p89567K89126J067242P35205k77361q32348m48665K32198L08898
39393c03342l00646p56086k96966P42644J222992N99998m03436q23162o19844
39384i37848k93373Q9631O36286Q44664J87687p04951o44726L00259Q11499L36925
39374F26053k02174j45570j62923p97120j199741m81563O11856P26543K9351r7510
39364a092798P14803J259050O00281o26148j187598p47983O8719N74701N34659
$$ plain form
39355 97686 207327 -120592 -558659 -742971 -567136 -180865 173116 238514 -164232 -898974
39345 -898974 -1415322 -1165418 -264215 436850 207877 -624291 -909578 -24402 1311287
39336 1311287 1938566 1756303 1725099 2366302 2933767 2421268 916628 -482872 -841735
39327 -841735 -165076 727811 864153 -27571 -1095163 -1182008 -278348 396372 85319 -430587
39317 -430587 -53777 974469 1480698 992847 85110 -607429 -817623 -320252 834443
39308 834443 1802927 1606132 410291 -634167 -886864 -769632 -798240 -934466 -1060038
39299 -1060038 -1267305 -1439075 -1262328 -861100 -715873 -802934 -566722 92455 607333 704391
39289 704391 713174 685604 173878 -706759 -950574 -1945 1335116 1906696 1460288 415496
$$ packed form
39355I7686J09641l27919m38067j84312J75835L86271L53981O5398m02746p34742
39345h98974n16348K49904R01203P01065k28973q32168k85287Q85176J335689
39336A311287O27279j82263l1204O41203N67465n12499j504640j399500l58863
39327h41735O76659Q92887J36342q91724j067592q6845R03660O74720l11053n15906
39317d30587L76810J028246N06229m87851r07737o92539k10194M97371J154695
39308H34443R68484j96795j195841j044458k52697J17232k8608j36226j25572
39299a060038k07267j71770J76747M01228J45227q7061K36212O59177N14878R7058
39289G04391Q783k7570n11726q80637k43815R48629J337061N71580m46408j044792
$$ plain form
39279 415496 -820883 -1718266 -1612986 -618053 84314 -372984 -1390652 -1818426 -1439806
39270 -1439806 -813130 -253064 150875 47901 -620759 -946345 -1754 1651841 2361542
39261 2361542 1330828 -539225 -1723271 -1378017 237486 1929630 2314630 1154185
39253 1154185 -156736 -166172 751132 969980 -45126 -1076724 -1034914 -428848 -421628 -1217975
39243 -1217975 -2057983 -2305485 -1913985 -1123775 -264988 259076 213214 -235921 -686592 -800802
39233 -800802 -380613 562228 1597493 1972022 1230656 -272656 -1631254 -2155158 -1882906
39224 -1882906 -1441681 -1438271 -1893920 -2266112 -2088317 -1487926 -918618 -528116 -102556 413237
39214 413237 734156 690084 533003 578945 771239 824047 631107 302668 -53020 -297892
$$ packed form
39279D15496j236379q97383J05280R94933P02367m57298j017668m27774L78620
39270a439806O26676N60066M03939j02974o68660l25586R44591J653595P09701
39261B361542j030714j870053j184046L45254J615503J692144L85000j160445
39253A154185j310921r436R17304K18848j015106j031598M1810O06066P220p96347
39243a217975q40008k47502L91500P90210Q58787N24064m5862m49135m50671j14210
39233h00802M20189R42841J035265L74529p41366j503312j358598n23904K72252
39224a882906M41225L410m55649l72192J77795O00391N69308L90502M25560N15793
39214D13237L20919m4072j57081M5942J92294N2808j92940l28439l55688k44872
$$ plain form
39204 -297892 -123831 648306 1565172 1783796 1115064 456720 687241 1364672 1241262 102730
39194 102730 -747667 -249044 927491 1362016 806125 201380 82909 25487 -275727 -387934
39184 -387934 40279 602688 708026 297834 -328552 -910965 -1179094 -908654 -307711 92047
39174 92047 104798 -39638 -353814 -1093280 -1923977 -1965638 -1076445 -259409 -258623 -569719 -500880
39163 -500880 -391594 -872772 -1540541 -1403342 -345249 753845 1194601 1039924 704898
39154 704898 599267 980706 1607192 1781227 1223134 524320 231972 12844 -620065 -1322879
39144 -1322879 -1485064 -1261110 -1118944 -833255 32724 1024932 1292967 899974 505863
39135 505863 55688 -869126 -1570213 -721344 1395712 2695800 1961277 401434 -252638
$$ packed form
39204b97892J74061P72137R16866K18624o68732o58344K30521O77431j23410j138532
39194A02730q50397M98623J176535M34525n55891o04745j18471n7422l01214j12207
39184c87934M28213N62409J05338m10192o26386n82413k68129K70440O00943L99758
39174I2047J2751j44436l14176p39466q30697m1661Q89193Q17036P86l11096O8839
39163e00880J09286m81178o67769J37199J058093J099094M40756j54677l35026
39154G04898j05631L81439O26486J74035n58093o98814k92348k19128o32909p02814
39144a322879j62185K23954J42166K85689Q65979R92208K68035l92993l94111
39135E05863m50175r24814p01087Q48869K117056J300088p34523j559843o54072
$$ plain form
39126 -252638 -65106 -281943 -1245113 -2092732 -2152496 -1610252 -892818 -195826 307902 386091
39116 386091 59611 -314971 -415349 -280546 -217529 -401666 -556319 -122967 1092738 2513043
39106 2513043 3230623 2841616 1725282 647702 250767 671596 1354299 1449048 729782
39097 729782 -86275 -227596 226777 673114 802939 626654 145583 -357680 -158854 946617
39087 946617 1874773 1425133 49970 -578269 215561 1322925 1458641 648600 -191301
39078 -191301 -428326 -133503 145916 -156453 -966842 -1388832 -685811 691962 1667863
39069 1667863 1890749 1770557 1475821 931506 635213 1242123 2260823 2392503 1404016
39060 1404016 472315 356205 461211 176681 -126601 -128964 -427319 -1441567 -2341343 -2050612
$$ packed form
39126b52638J87532k16837r63170q47619n9764N42244P17434O96992N03728P8189
39116C86091l26480l74582j00378J34803O3017j84137j54653M33352J215705J420305
39106B513043P17580l89007j116334j077580l96935M20829O82703R4749p19266
39097G29782q16057j41321M54373M46337J29825j76285m81071n03263J98826J105471
39087I46617R28156m49640j375163o28239P93830J107364J35716q10041q39901
39078a91301k37025K94823K79419l02369q10389m21990P03021J377773R75901
39069A667863K22886j20192k94736n44315k96293O06910J018700J31680r88487
39060A404016r31701j16110J05006k84530l03282k363k98355j014248q99776K90731
$$ plain form
39050 -2050612 -749289 450065 867710 633494 163265 -105480 164465 816468 1241956
39041 1241956 1154464 905373 777394 522386 -99054 -889804 -1598287 -2132766 -2219150 -1605087
39031 -1605087 -818448 -819664 -1558299 -1832752 -1045978 -114511 -19009 -386290 -265717 450786
39021 450786 1119322 1214397 516049 -887406 -2241237 -2518696 -1713693 -955439 -854030
39012 -854030 -690222 168687 1131966 1446421 1352299 1303209 1058951 528877 496026 1373206
39002 1373206 2143025 1707202 473380 -530380 -1217747 -1860706 -1882524 -777715 440395
38993 440395 318115 -915910 -1747352 -1520273 -801071 -820 891751 1458918 1175536
38984 1175536 460488 150713 138407 -235566 -749510 -624387 -20487 188189 -59944 -91388
$$ packed form
39050b050612J301323J199354M17645k34216m70229k68745K69945O52003M25488
39041A241956q7492k49091j27979k55008o21440p90750p08483n34479q6384O14063
39031a605087P86639j216p38635k74453P86774R31467R5502l67281J20573P16503
39021D50786O68536R5075o98348j403455j353831k77459Q05003P58254J01409
39012h54030J63808Q58909R63279L14455r4122m9090k44258n30074l2851Q77180
39002A373206P69819m35823j233822j003760o87367o42959k1818J104809J218110
38993D40395j22280j234025q31442K27079P19202Q00251Q92571N67167k83382
38984A175536p15048l09775j2306l73973n13944J25123O03900K08676k48133l1444
$$ plain form
38974 -91388 113605 35102 -95414 377495 1075735 1006968 303402 -75513 -231642 -1108814
38964 -1108814 -2395919 -2629558 -1649922 -960575 -1169694 -1084036 -78065 609443 -12322
38955 -12322 -1033139 -1324996 -1359429 -1994448 -2706799 -2477377 -1557938 -1050510 -1323195 -1833960
38945 -1833960 -1965205 -1322416 57741 1181842 746556 -977613 -1995875 -1190022 73325
38936 73325 12076 -1023522 -1443637 -945071 -553739 -665414 -630732 -175887 106148 -198908
38926 -198908 -771684 -1148699 -1147379 -745056 -156265 112072 -147693 -423983 -190129 304767
38916 304767 509707 421228 313805 56734 -535547 -1004663 -693313 293017 1222603 1648711
38906 1648711 1635683 1337992 885470 413277 -217621 -1301893 -2488224 -2763456 -1843279
$$ packed form
38974i1388K04993p8503j30516M72909O98240o8767p03566l78915j56129q77172
38964a108814j287105k33639R79636O89347k09119Q5658J005971O87508o21765
38955a2322j020817k91857l4433o35019p12351K29422R19439N07428k72685n10765
38945a833960j31245O42789J380157J124101m35286j724169j018262Q05853J263347
38936G3325o1249j035598m20115M98566L91332j11675L4682M54845K82035l05056
38926a98908n72776l77015J320M02323N88791K68337k59765k76290K33854M94896
38916C04767K04940q8479j07423k57071n92281m69116L11350R86330R29586M26108
38906A648711j3028k97691m52522m72193o30898j084272j186331k75232R20177
$$ plain form
38897 -1843279 -842035 -753962 -1018616 -617887 116530 108556 -525936 -635524 7452 378916
38887 378916 -2749 -324792 60011 603323 599749 332065 474876 981784 1245742 1015632
38877 1015632 612898 400584 396056 370613 193466 65188 285815 712602 770576 254179
38867 254179 -294662 -414988 -439030 -748948 -819236 72509 1449113 1997610 1330298 401662
38857 401662 50134 100172 177739 436690 944776 1126992 508909 -437971 -799280 -322845
38847 -322845 417586 772613 560270 -37739 -808816 -1635933 -2305226 -2298759 -1149241 755264
38837 755264 2115313 1987599 889702 109663 133849 385149 319762 -2885 -401478 -809884
38827 -809884 -936005 -440162 389440 835855 766120 743168 1028019 1287646 1455448 1924037
$$ packed form
38897a843279J001244Q8073k64654M00729P34417p974o34492j09588O42976L71464
38887C78916l81665l22043L84803N43312l574k67684J42811N06908K63958k30110
38877A015632m02734k12314m528k5443j77147j28278K20627M26787N7974n16397
38867B54179n48841j20326k4042l09918p0288Q91745J376604N48497o67312r28636
38857D01662l51528N0038P7567K58951N08086J82216o18083r46880l61309M76435
38847c22845P40431L55027k12343n98009p71077q27117o69293O467J149518J904505
38837G55264J360049j27714j097897p80039K4186K51300o5387l22647l98593m08406
38827h09884j26121M95843Q29602M46415o9735k2952K84851K59627J67802M68589
$$ plain form
38817 1924037 2520579 2284983 906476 -445544 -507446 456348 1169203 997440 344962
38808 344962 -215239 -435390 -243847 212277 465020 160521 -505200 -1092557 -1372097 -1171415
38798 -1171415 -257555 1123962 2064865 1997411 1525100 1600582 2225282 2682988 2718686 2615174
38788 2615174 2328187 1552573 660369 562462 1358218 1965099 1498258 359794 -469558
38779 -469558 -664520 -603001 -602581 -627374 -558262 -365026 -96582 82788 -37007 -467511 -977162
38768 -977162 -1342160 -1447154 -1142815 -335058 689517 1347662 1309413 720123 -147638 -1079544
38758 -1079544 -1697575 -1592489 -971222 -701317 -1258364 -1941724 -1646001 -278109 1057582
38749 1057582 1286587 423553 -640134 -1123303 -994753 -737344 -610786 -311306 470145
$$ packed form
38817A924037N96542k35596j378507j352020o1902R63794P12855j71763o52478
38808C44962n60201k20151J91543M56124K52743l04499o65721n87357k79540K00682
38798a171415R13860J381517R40903o7454m72311P5482O24700M57706L5698j03512
38788B615174k86987p75614q92204r7907P95756O06881m66841j138464q29352
38779d69558j94962O1519M20k4793O9112J93236K68444J79370j19795m30504n09651
38768i77162l64998j04994L04339Q07757J024575O58145l8249n89290q67761r31906
38758a079544o18031J05086O21267K69905n57047o83360K95723J367892J335691
38749A057582K29005q63034j063687m83169J28550K57409J26558K99480P81451
$$ plain form
38740 470145 1296518 1240676 34563 -1449017 -2143554 -1883243 -1242567 -658846 -208262
38731 -208262 -17313 -292883 -903250 -1349242 -1241254 -590507 264893 748161 284995 -1072335
38721 -1072335 -2392703 -2752084 -2269736 -1686727 -1065049 202678 1940515 2785365 1895440
38712 1895440 321764 -205661 550028 1287806 1116629 572363 509019 810036 697492
38703 697492 -143851 -1254862 -2010603 -2163529 -1880114 -1531391 -1423155 -1539026 -1562182 -1265285
38693 -1265285 -809769 -524097 -459925 -346259 39789 637630 1244795 1680922 1730112 1168020
38683 1168020 101299 -858604 -1123368 -863225 -848087 -1389230 -1806104 -1277995 64016
38674 64016 1343105 2015247 2149732 1731419 496355 -1236046 -2291527 -1844705 -527564
$$ packed form
38740D70145Q26373n5842j206113j483580o94537K60311O40676N83721M50584
38731b08262J90949k75570o10367m45992J07988O50747Q55400M83268m63166j357330
38721a072335j320368l59381M82348N83009O21678J267727J737837Q44850q89925
38712A895440j573676n27425P55689P37778j71177n44266o3344L01017j12544
38703F97492q41343j111011p55741j52926K83415L48723J08236j15871k3156K96897
38693a265285M55516K85672O4172J13666L86048N97841O07165M36127M9190n62092
38683A168020j066721r59903k64764K60143J5138n41143m16874N28109J342011
38674F4016J279089O72142J34485m18313j235064j732401j055481M46822J317141
$$ plain form
38665 -527564 290826 117809 -403499 -729860 -1135783 -1948780 -2692032 -2544245 -1467717
38656 -1467717 -417654 -348484 -1235510 -2184143 -2388837 -1844636 -1131417 -693460 -515369
38647 -515369 -416924 -369673 -432012 -602687 -854406 -1090684 -976144 -163403 1051487 1656767
38637 1656767 970990 -413820 -1212726 -898121 -103863 371185 394549 224134 2079
38628 2079 -127544 131442 751819 1040542 366818 -822039 -1307949 -602224 367631 431928
38618 431928 -347386 -913291 -712820 -256767 -99386 -13095 375792 718151 381441 -569218
38608 -569218 -1495887 -2045935 -2190360 -1687026 -444306 685668 584335 -496446 -1084627
38599 -1084627 -596655 -117873 -552426 -1250108 -1303467 -988423 -811361 -305590 787135
$$ packed form
38665e27564Q18390j73017n21308l26361m05923q12997p43252J47787J076528
38656a467717J050063O9170q87026r48633k04694N44201P13219M37957J78091
38647e15369R8445M7251o2339j70675k51719k36278J14540Q12741J214890O05280
38637A656767o85777j384810p98906L14605P94258M75048K3364j70415k22055
38628B079j29623K58986O20377K88723o73724j188857m85910P05725R69855O4297
38618D31928p79314n65905K00471M56053J57381Q6291L88887L42359l36710r50659
38608e69218r26669n50048j44425N03334J242720J129974j01333j080781n88181
38599a084627M87972M78782m34553o97682n3359L15044J77062N05771J092725
$$ plain form
38590 787135 1207941 -100047 -1714461 -1326479 709362 1743163 875059 167131 1093233
38581 1093233 2212647 1810245 793930 965608 1830746 1405216 -474806 -1814201 -1330644
38572 -1330644 152095 1332494 1858250 1777017 999575 -43574 -293686 632860 1734766
38563 1734766 1851955 1062296 298768 50572 76052 126772 285040 530600 464372 -224729
38553 -224729 -1146675 -1393224 -545038 649790 979916 210531 -605371 -469209 365339
38544 365339 931461 855683 519768 199612 -194688 -530453 -349913 394152 1036417 941684
38534 941684 194263 -680164 -1323078 -1614998 -1485000 -1023193 -596646 -491595 -511296 -244616
38524 -244616 275119 504890 119506 -449506 -487376 66220 493618 246233 -286517 -289381
$$ packed form
38590G87135M20806j307988j614414L87982K035841J033801q68104p07928R26102
38581A093233J119414m02402j016315J71678Q65138m25530j880022j339395M83557
38572a330644J482739J180399N25756q1233p77442j043149k50112R26546J101906
38563A734766J17189p89659p63528k48196K5480N0720J58268K45560o6228o89101
38553b24729r21946k46549Q48186J194828L30126p69385q15902J36162Q34548
38544C65339N66122p5778l35915l20156l94300l35765J80540P44065O42265r4733
38534I41684p47421q74427o42914k91920J29998M61807M26547J05051j9701K66680
38524b44616N19735K29771l85384n69012l7870N53596M27398k47385n32750k864
$$ plain form
38514 -289381 346330 854853 643969 105893 123220 1003503 2167995 2765538 2395288 1359773
38504 1359773 415876 165914 479907 601407 35512 -748797 -784006 188847 1268584
38495 1268584 1391408 644330 194043 763915 1595600 1429334 288513 -518786 -312222
38486 -312222 -3351 -555085 -1354653 -1167423 -144219 426427 162497 -24163 283733
38477 283733 282354 -466817 -1043147 -617835 123432 -10175 -1028220 -2020938 -2480980 -2435378
38467 -2435378 -1824963 -757475 24332 -96983 -673646 -887612 -849920 -1261629 -2075197
38458 -2075197 -2553175 -2533012 -2565182 -2749511 -2448496 -1380459 -167705 465195 397049 -124816
38448 -124816 -781749 -1127434 -879017 -424287 -487523 -1192478 -1965084 -2346432 -2320069 -1910328
$$ packed form
38514b89381O35711N08523k10884n38076J7327Q80283J164492N97543l70250j035515
38504A359773r43897k49962L13993J21500n65895p84309l5209R72853J079737
38495A268584J22824p47078m50287N69872Q31685j66266j140821q07299K06564
38486c12222L08871n51734p99568J87230J023204N70646k63930j86660L07896
38477B83733j379p49171n76330M25312P41267j33607j018045r92718m60042M5602
38467b435378O10415J067488P81807j21315n76663k13966L7692m11709q13568
38458b075197m77978K0163l2170j84329L01015J068037J212754O32900o8146n21865
38448a24816o56933l45685K48417M54730o3236p04955p72606l81348K6363M09741
$$ plain form
38438 -1910328 -1171666 -558938 -534986 -777641 -591439 -154096 -394838 -1419352 -2078845
38429 -2078845 -1581779 -642217 -391855 -844329 -1117732 -692793 147063 757497 565342
38420 565342 -540080 -1860382 -2373313 -1908899 -1320615 -1162241 -923739 -128702 596140
38411 596140 417591 -317646 -601056 -307279 -177375 -464661 -711720 -866255 -1424631 -2171539
38401 -2171539 -1953236 -388163 1123114 1035542 -261931 -1011868 -455517 409625 479914
38392 479914 -60975 -417928 -478728 -759663 -1452478 -2183896 -2607281 -2737159 -2741370 -2789152
38382 -2789152 -3032051 -3351819 -3225358 -2301541 -1077799 -495248 -793503 -1251808 -1184856
38373 -1184856 -715341 -379021 -416086 -687463 -916460 -812014 -296522 273079 510454 656930
$$ packed form
38438a910328P38662O12728K3952k42655J86202M37343k40742j024514o59493
38429b078845M97066R39562K50362m52474k73403M24939Q39856O10434j92155
38420E65342j105422j320302n12931M64414N88284J58374K38502P95037P24842
38411E96140j78549p35237k83410K93777J29904k87286k47059j54535n58376p46908
38401b171539K18303J565073J511277q7572j297473p49937N56351Q65142P0289
38392D79914n40889l56953o0800k80935o92815p31418m23385j29878m211m7782
38382b789152k42899l19768J26461R23817J223742N82551k98255m58305O6952
38373a184856M69515L36320l7065k71377k28997J04446N15492N69601K37375J46476
$$ plain form
38363 656930 1268213 2189502 2593430 2227328 1745963 1462483 797245 -397766 -1031003
38354 -1031003 -292198 880658 1066070 446333 288577 779153 864614 155371 -456491
38345 -456491 -270639 373778 989328 1540218 1836319 1426598 520878 32122 260146 472475
38335 472475 234288 138514 592875 860397 173237 -932935 -1342028 -932604 -514656 -472816
38325 -472816 -355120 202146 853370 1051567 793856 629798 976026 1501383 1387489 402911
38315 402911 -549145 -456020 405607 809674 305665 -274049 -265948 -178023 -645669 -1187709
38305 -1187709 -906255 -10690 304775 -515075 -1638165 -1935669 -1322314 -655867 -508736
38296 -508736 -469712 128925 1061266 1339129 601833 -280038 -454909 -313660 -671145 -1243474
$$ packed form
38363F56930O11283R21289M03928l66102m81365k83480o65238j195011o33237
38354a031003P38805J172856J85412o19737j57756M90576Q5461p09243o11862
38345d56491J85852O44417O15550N50890K96101m09721r05720m88756K28024K12329
38335D72475k38187r5774M54361K67522o87160j106172m09093M09424M17948M1840
38325d72816J17696N57266O51224J98197k57711j64058L46228N25357j13894r84578
38315D02911r52056R3125Q61627M04067n04009n79714Q101Q7925m67646n42040
38305a187709K81454Q95565L15465q19850j123090k97504O13355O66447J47131
38296e08736L9024N98637R32341K77863p37296q81871j74871J41249l57485n72329
$$ plain form
38286 -1243474 -1076503 -283851 -41359 -675595 -1066484 -470320 236998 -64351 -1025761
38277 -1025761 -1419389 -842612 36527 535904 489725 10306 -592824 -831626 -521194 -99606
38267 -99606 -77698 -394643 -670923 -810347 -956561 -1103439 -1135663 -1079240 -1012197 -871560
38257 -871560 -536998 25878 718874 1198648 994519 178920 -331039 161162 981333 934891
38247 934891 179151 37038 820349 1225666 388141 -811354 -1254067 -1165024 -1222169 -1172577
38237 -1172577 -485628 443639 890273 946068 1032412 927408 344961 -151977 53862 480321
38227 480321 306606 -264253 -575786 -877790 -1754898 -2621351 -2292029 -920622 76282
38218 76282 86049 -51852 351887 846705 815837 391713 -21582 -330982 -524229 -523977 -488925
$$ packed form
38286a243474J66971P92652K42492o34236l90889N96164P07318l01349r61410
38277a025761l93628N76777Q79139M99377m6179m79419o03130k38802L10432M21588
38267i9606K1908l16945k76280j39424j46214j46878l2224N6423O7043J40637
38257h71560L34562N62876O92996M79774k04129q15599n09959M92201Q20171m6442
38247I34891p55740j42113P83311M05317q37525j199495m42713Q9043n7145M9592
38237a172577O86949R29267M46634N5795Q6344j05004n82447m96938K05839M26459
38227D80321j73715n70859l11533l02004q77108q66453L29322J371407R96904
38218G6282R767j37901M03739M94818l0868m24124m13295l09400j93247K52L5052
$$ plain form
38207 -488925 -673930 -911696 -806602 -377470 122662 813438 1795905 2386223 1785901 463205
38197 463205 -241409 9810 178796 -427278 -1188197 -1339070 -1063882 -818706 -421821 434489
38187 434489 1310525 1375211 438146 -791613 -1384903 -1019774 -305604 -220541 -989552 -1781963
38177 -1781963 -1890390 -1713172 -1855057 -1805415 -679583 991231 1619341 848732 111774
38168 111774 471506 1177832 1052231 233154 -308431 -195748 254904 760987 1104346 878169
38158 878169 -63377 -1164453 -1720088 -1651413 -1368801 -1164133 -1067254 -1017937 -931258 -842137
38148 -842137 -1006403 -1435154 -1454797 -491695 721621 737570 -576245 -1702140 -1632576 -1202519
38138 -1202519 -1500296 -2074646 -1867922 -1096021 -838505 -1205457 -1281030 -790833 -579881 -1250304
$$ packed form
38207d88925j85005k37766J05094M29132N00132O90776R82467N90318o00322j322696
38197D63205p04614K51219J68986o06074p60919j50873K75188K45176L96885Q56310
38187D34489Q76036O4686r37065j229759n93290L65129P14170Q5063p69011p92411
38177a781963j08427J77218j41885M9642J125832J670814O28110p70609p36958
38168A11774L59732P06326j25601q19077n41585J12683M50652N06083L43359k26177
38158H78169r41546j101076n55635O8675K82612K04668R6879M9317Q6679Q9121
38148h42137j64266m28751j9643R63102J213316J5949j313815j125895O9564M30057
38138a202519k97777n74350K06724P71901K57516l66952p5573M90197K10952o70423
$$ plain form
38128 -1250304 -2311485 -2959088 -2932756 -2358632 -1424593 -486473 68961 311003 616902
38119 616902 872224 426702 -834887 -1953436 -1929345 -923399 82916 539653 651570
38110 651570 604471 195051 -575808 -1142504 -1036225 -552598 -314663 -421728 -507708 -432600
38100 -432600 -329500 -83133 537243 1191667 1179335 533039 139949 452311 848227 687578
38090 687578 185064 -300836 -955019 -1751940 -1929061 -1183676 -569439 -1071883 -2051138 -2354653
38080 -2354653 -2181724 -2314727 -2268118 -1151362 120277 -239272 -1794663 -2151449 -694706
38071 -694706 401374 -264928 -1189620 -732698 201004 44813 -686803 -591153 56116 27208
38061 27208 -574148 -777570 -681446 -961208 -1187706 -677668 -369971 -1613011 -3481960 -3695930
$$ packed form
38128a250304j061181o47603K6332N74124R34039R38120N55434K42042L05899
38119F16902K55322m45522j261589j118549K4091J005946J006315M56737J11917
38110F51570m7099m09420p70859n66696J06279M83627K37935j07065q5980P5108
38100d32600J03100K46367O20376O54424j2332o46296l93090L12362L95916j60649
38090F87578n02514m85900o54183p96921j77121P45385O14237n02444r79255l03515
38080b354653J72929j33003M6609J116756J271639l59549j555391l56786J456743
38071f94706J096080o66302r24692M56922R33702j56191p31616R5650O47269k8908
38061B7208o01356k03422R6124k79762k26498N10038L07697j243040j868949k13970
$$ plain form
38051 -3695930 -2152984 -1102388 -1488114 -1608046 -222809 1328417 1436656 745567 745341
38042 745341 1238673 950257 -187314 -985695 -826272 -216107 241292 353966 3967
38033 3967 -753630 -1349059 -1223035 -598987 -108671 149232 517687 960967 1089376 944118
38023 944118 1032994 1486695 1781269 1488809 855117 413041 319962 286289 28061 -325960
38013 -325960 -284356 450929 1432975 1713152 847996 -508651 -1247979 -903697 75002 928934
38003 928934 1190189 863744 343085 55934 -51884 -501545 -1444904 -2100845 -1571646 -146563
37993 -146563 842235 618572 -175490 -539269 -468129 -643844 -1121364 -1161542 -462101 217578
37983 217578 121811 -332352 -135704 745945 1135670 173636 -1502964 -2523662 -2364398
$$ packed form
38051c695930J542946J050596l85726j19932J385237J551226J08239o91089k26
38042G45341M93332k88416j137571p98381J59423O10165M57399J12674l49999
38033C967p57597n95429J26024O24048M90316K57903L68455M43280J28409j45258
38023I44118Q8876M53701K94574k92460o33692m42076r3079l3673k58228l54021
38013c25960M1604P35285R82046K80177q65156j356647p39328L44282R78699Q53932
38003I28934K61255l26445n20659k87151j07818m49661r43359o55941N29199J425083
37993a46563R88798k23663p94062l63779P1140j75715m77520m0178O99441O79679
37983B17578r5767m54163J96648Q81649L89725r62034j676600j020698J59264
$$ plain form
37974 -2364398 -1662899 -1145239 -839177 -469939 -119706 -88957 -298054 -251999 303026 931276
37964 931276 917215 76953 -998940 -1546998 -1337998 -695434 25945 714350 1261998 1374202
37954 1374202 852484 -45765 -755179 -929484 -706681 -437868 -256038 3506 454891
37945 454891 840619 749443 224926 -77611 379648 1243033 1583944 1015725 147807 -180186
37935 -180186 196781 761362 889745 260544 -971710 -2130370 -2409064 -1649652 -603717
37926 -603717 -169929 -474212 -874094 -722615 23460 785650 859345 167429 -453650 -131881
37916 -131881 822201 1200054 603972 42884 303924 652812 126056 -653812 -343973 816517
37906 816517 1181897 288360 -347862 402730 1567182 1684105 980509 696957 988700
$$ packed form
37974b364398P01499N17660L06062L69238L50233L0749k09097M6055N55025O28250
37964I31276j4061q40262j075893n48058K09000O42564P21379O88405N47648J12204
37954A374202n21718q98249p09414j74305K22803K68813J81830K59544M51385
37945D54891L85728r1176n24517l02537M57259Q63385L40911n68219q67918l27993
37935a80186L76967N64581J28383o29201j232254j158660k78694P59412J045935
37926f03717M33788l04283l99882J51479P46075P62190P3695o91916o21079L21769
37916a31881R54082L77853n96082n61088K61040L48888n26756p79868L09839J160490
37906H16517L65380q93537o36222P50592J164452J16923p03596k83552K91743
$$ plain form
37897 988700 843849 -209155 -1508446 -2332401 -2590823 -2403857 -1840986 -1193955 -817209
37888 -817209 -620490 -316745 -100049 -351095 -753094 -613457 -127957 -289415 -1247716 -1840183
37878 -1840183 -1323281 -551929 -589524 -1026740 -820046 -187699 -280645 -1132470 -1382528 -384885
37868 -384885 650936 367582 -764540 -1133127 -203056 925120 1114939 470125 -257849
37859 -257849 -818476 -1405491 -1809248 -1436654 -346510 398065 -51264 -1113570 -1456203
37850 -1456203 -762986 -45945 -66668 -318840 -79330 306009 37791 -699155 -904280 -256795
37840 -256795 470362 592586 314699 120037 23294 -245606 -770508 -1400120 -1825592 -1659468
37830 -1659468 -877359 -161619 -238972 -881551 -1235987 -1158328 -1382567 -2192464 -2847952 -2719817
$$ packed form
37897I88700j44851j053004j299291q23955k58422J86966N62871O47031L76746
37888h17209J96719L03745K16696k51046m01999J39637M85500j61458r58301n92467
37878a840183N16902P71352l7595m37216K06694O32347r2946q51825k50058R97643
37868c84885J035821k83354j132122l68587R30071J128176J89819o44814p27974
37859b57849n60627n87015m03757L72594J090144P44575m49329j062306l42633
37850a456203O93217P17041k0723k52172K39510L85339k68218p36946k05125O47485
37840b56795P27157J22224k77887j94662r6743k68900n24902o29612m25472J66124
37830a659468P82109P15740p7353o42579l54436P7659k24239q09897o55488J28135
$$ plain form
37820 -2719817 -2146596 -1683201 -1314050 -985744 -1119910 -1859791 -2453425 -2157000 -1255317
37811 -1255317 -516487 -158436 -22760 -197367 -697152 -1031449 -865097 -638472 -788729
37802 -788729 -907132 -517660 -139034 -582246 -1608556 -2261634 -2171749 -1607487 -680084 465440
37792 465440 1093770 663212 -146156 -297904 61600 103595 -67633 285416 892125 688841
37782 688841 -354983 -1133476 -1208270 -1250608 -1551774 -1568414 -1153384 -783338 -370374 615935
37772 615935 1637536 1421856 190781 -267708 625801 1243348 391754 -851843 -1077184
37763 -1077184 -658597 -602058 -706247 -314420 265837 473379 600713 930019 798279 -221008
37753 -221008 -1235767 -1380367 -1170698 -1265928 -1096700 -170446 525081 125847 -297357 545214
$$ packed form
37820b719817N73221M63395L69151L28306j34166p39881n93634K96425R01683
37811a255317P38830L58051J35676j74607m99785l34297J66352K26625j50257
37802g88729j18403L89472L78626m43212j026310o53078Q9885N64262R27403J145524
37792D65440O28330m30558q09368j51748L59504M1995j71228L53049O06709k03284
37782F88841j043824p78493p4794m2338l01166j6640M15030L70046M12964R86309
37772F15935J021601k15680j231075m58489Q93509O17547q51594j243597k25341
37763a077184M18587N6539j04189L91827N80257K07542J27334L29306j31740j019287
37753b21008j014759j44600K09669r5230J69228R26254O95527l99234m23204Q42571
$$ plain form
37743 545214 1733273 1596087 659037 658646 1257517 509444 -1511263 -2383340 -1132373 243004
37733 243004 -45869 -1131010 -1423584 -1071541 -1033943 -1175918 -843332 -375008 -604759 -1390653
37723 -1390653 -1782485 -1355142 -569209 -63937 -164641 -808928 -1512494 -1650174 -1059312
37714 -1059312 -167258 508153 686621 345724 -81571 180020 1240043 2008563 1591197
37705 1591197 809856 1083718 2091482 2128654 802944 -380236 -484242 -394332 -891676
37696 -891676 -1232909 -753359 -321826 -766991 -1113102 -54183 1668211 2135063 1105677
37687 1105677 307276 820546 1638442 1286270 -114914 -1028255 -354465 1287336 2141808
37678 2141808 1220807 -472470 -1047088 -32694 1169122 1336946 909828 814156 892351
$$ packed form
37743E45214J188059j37186r37050l91N98871p48073k020707q72077J250967J375377
37733B43004k88873j085141k92574L52043L7598j41975L32586M68324k29751p85894
37723a390653l91832M27343P85933N05272j00704o44287p03566j37680N90862
37714a059312Q92054O75411J78468l40897m27295K61591J060023P68520m17366
37705A591197p81341K73862J007764L7172j325710j183180j04006Q9910m97344
37696h91676l41233M79550M31533m45165l46111J058919J722394M66852j029386
37687A105677p98401N13270Q17896l52172j401184r13341O73790J641801Q54472
37678B141808r21001j693277n74618J014394J201816J67824m27118r5672P8195
$$ plain form
37669 892351 610833 537503 1658119 3478748 4201621 2947169 740658 -899715 -1426121
37660 -1426121 -1134555 -542767 -280223 -805513 -1758196 -2160254 -1629498 -843101 -467490
37651 -467490 -276882 150322 446234 -83473 -1280319 -2140676 -1984449 -1069844 -28969
37642 -28969 786785 1284134 1431557 1345453 1275391 1283999 1171634 862189 547824 251089
37632 251089 -351832 -1290133 -1865255 -1452056 -510719 -99529 -438922 -729009 -497997 -286299
37622 -286299 -625758 -1115102 -1091677 -631579 -246526 -62476 48113 -53203 -443513 -651554
37612 -651554 -261986 280531 281385 -14035 262853 1187749 1895629 1948104 1915443 2271800
37602 2271800 2510898 1892616 581744 -477038 -621842 -82203 404585 430666 321253
$$ packed form
37669H92351k81518p3330J120616J820629P22873j254452k206511j640373n26406
37660a426121K91566N91788K62544n25290r52683m02058N30756P86397L75611
37651d67490J90608M27204K95912n29707j196846q60357J56227R14605J040875
37642b8969Q15754M97349J47423q6104p0062Q608j12365l09445l14365k96735
37632B51089o02921r38301n75122M13199R41337M11190l39393k90087K31012K11698
37622b86299l39459m89344K3425M60098L85053J84050J10589j01316l90310k08041
37612f51554L89568N42517Q54k95420K76888R24896P07880N2475l2661L56357
37602B271800K39098o18282j310872j058782j44804N39639M86788K6081j09413
$$ plain form
37593 321253 577491 964137 641071 -540720 -1477497 -1133405 56533 829141 749194
37584 749194 395714 196520 13893 -222541 -347326 -397050 -482391 -362723 116108 449012
37574 449012 221537 67294 752538 1610792 1260962 -194999 -1157491 -860167 -277319
37565 -277319 -396733 -966331 -1373481 -1477459 -1145474 -225402 651363 590262 88528 608001
37555 608001 2063213 2562984 1402834 351028 790954 1512119 935679 -186250 -233575
37546 -233575 506131 646524 252657 403428 952195 922030 634359 1225023 2289736 2229511
37536 2229511 950818 52909 102330 -106854 -1054384 -1399745 -348480 743673 439641
37527 439641 -507654 -397679 835142 1704422 1355789 431472 -110338 -78440 147325 261231
$$ packed form
37593C21253K56238L86646l23066j181791r36777L44092J189938P72608p9947
37584G49194l53480j99194j82627k36434j24785m9724q5341J19668M78831L32904
37574D49012k27475j54243O85244Q58254l49830j455961r62492K97324N82848
37565b77319j19414n69598m07150j03978L31985R20072Q76765o1101n01734N19473
37555F08001J455212M99771j160150j051806M39926P21165n76440j121929m7325
37546b33575P39706J40393l93867J50771N48767l0165k87671N90664J064713o0225
37536B229511j278693q97909M9421k09184r47530l45361J051265J092153l04032
37527D39641r47295J09975J232821Q69280l48633r24317n41810L1898K25765J13906
$$ plain form
37517 261231 240905 136737 -159258 -782224 -1461722 -1546700 -822700 7465 177602 -110248
37507 -110248 -152686 78510 71647 -144507 -56703 271373 261033 -1686 230750 978180
37497 978180 1283142 711088 222 -252754 -455913 -953907 -1154085 -525620 402204 862460
37487 862460 889198 745315 170586 -846188 -1374697 -780809 37826 -44310 -424629 334782
37477 334782 1971325 2634553 1690056 685497 917581 1575187 1289875 321275 -47601
37468 -47601 472086 1001887 907031 286530 -625643 -1492963 -1569481 -499030 673938 475689
37458 475689 -924366 -1806562 -1320290 -552972 -650693 -1111883 -849079 46779 688191 807301
37448 807301 670079 150624 -917414 -1859641 -1832893 -1125623 -638647 -353908 364407 1133538
$$ packed form
37517B61231k0326j04168k95995o22966o79498q4978P24000Q30165J70137k87850
37507a10248m2438K31196o863k16154Q7804L28076j0340k62719K32436P47430
37497I78180L04962n72054p10866k52976k03159m97994k00178O28465R27824M60256
37487H62460K6738j43883n74729j016774n28509N93888Q18635q2136l80319P59411
37477C34782J636543O63228r44497j004559K32084O57606k85312r68600l68876
37468d7601N19687N29801r4856o20501r12173q67320p6518J070451J172968j98249
37458D75689j400055q82196M86272P67318r7721m61190K62804Q95858O41412J19110
37448H07301j37222n19455j068038r42227K6748P07270M86976K84739P18315P69131
$$ plain form
37438 1133538 772718 -678748 -1680058 -1321808 -338726 450040 1193971 1816668 1347692
37429 1347692 -425175 -1922542 -1693710 -382452 478664 672208 881092 941807 213949
37420 213949 -786048 -852824 -83793 168398 -576896 -1283778 -1123705 -541522 -213505 -65206
37410 -65206 192155 448491 571978 670168 643432 189853 -453415 -506947 258536 1078241
37400 1078241 1199628 749698 255721 -138391 -563703 -951205 -1067664 -817956 -322265
37391 -322265 115320 104716 -460692 -1135368 -1319578 -862365 -10911 979371 1783266 1922133
37381 1922133 1358402 855707 1017599 1270981 684598 -447500 -898252 -316984 376196
37372 376196 514517 457503 535999 327657 -478452 -1353120 -1605287 -1147178 -252612 736967
$$ packed form
37438A133538l60820j451466j001310L58250R83082P88766P43931O22697m68976
37429A347692j772867j497367K28832J311258Q61116J93544K08884O0715p27858
37420B13949r99997o6776P69031K52191p45294p06882J60073N82183L28017J48299
37410f5206K57361K56336J23487R8190k6736m53579o43268n3532P65483Q19705
37400A078241J21387m49930m93977l94112m25312l87502j16459K49708M95691
37391c22265M37585j0604n65408o74676j84210M57213Q51454R90282Q03895J38867
37381A922133n63731n02695J61892K53382n86383j132098m50752N81268O93180
37372C76196J38321n7014P8496k08342q06109q74668k52167M58109Q94566R89579
$$ plain form
37362 736967 1221574 731670 -157722 -228099 667449 1287490 893459 341221 543956 956145
37352 956145 634629 -98607 -277269 71026 165689 -77242 -82189 148760 48045 -345648
37342 -345648 -361118 106840 400901 221015 -15263 -87195 -299767 -649172 -575771 66132
37332 66132 602274 561208 394393 658224 1089466 1077384 585324 23597 -428262 -812103
37322 -812103 -991441 -796187 -356942 156693 859588 1697096 1962249 984031 -756504
37313 -756504 -1885105 -1637309 -586648 211183 279764 -155979 -520865 -184605 1000178
37304 1000178 2196486 2209128 937599 -387739 -775667 -584134 -576065 -706483 -680175 -928841
37294 -928841 -1813520 -2343194 -1135225 1410879 3282484 3373627 2552082 1948209 1559862
$$ packed form
37362G36967M84607m89904q89392p0377Q95548O20041l94031n52238K02735M12189
37352I56145l21516p33236j78662L48295R4663k42931m947K30949j00715l93693
37342c45648j5470M67958K94061j79886k36278p1932k12572l49405P3401O41903
37332F6132N36142m1066j66815K63831M31242j2082m92060n61727m51859l83841
37322h12103j79338J95254M39245N13635P02895Q37508K65153r78218j740535
37313g56504j128601K47796J050661P97831O8581m35743l64886L36260J184783
37304A000178J196308J2642j271529j325338l87928J91533Q069j30418K6308k48666
37294i28841q84679n29674J207969K546104J871605R1143q21545o03873l88347
$$ plain form
37285 1559862 1118078 1017654 1494208 1862125 1463506 603652 -167834 -830722 -1228189
37276 -1228189 -674356 796664 1784412 1294619 287874 199085 755218 726426 112760
37267 112760 -110622 66481 -170146 -603284 -166431 918195 1034187 -383446 -1940509
37258 -1940509 -2348228 -1869740 -1110536 68085 1519672 2069018 988026 -684872 -1373417
37249 -1373417 -860615 -70492 424088 755408 1034490 1107662 906123 567529 346215 516235
37239 516235 963236 899596 -292124 -1882821 -2400380 -1612651 -858150 -1048741 -1502085
37230 -1502085 -1337080 -850424 -672064 -614790 -366620 -411384 -1134524 -1746519 -1286906 -185160
37220 -185160 311037 -109824 -661970 -706923 -186656 834169 2057180 2680409 2250041
$$ packed form
37285A559862m41784j00424M76554L67917l98619q59854p71486o62888l97467
37276a228189N53833J471020R87748m89793j006745q8789N56133k8792o13666
37267A12760k23382J77103k36627m33138M36853J084626J15992j417633j557063
37258a940509m07719M78488P59204J178621J451587N49346j080992j672898o88545
37249a373417N12802P90123M94580L31320K79082P3172k01539l38594k21314J70020
37239E16235M47001o3640j191720j590697n17559P87729P54501j90591m53344
37230a502085J65005M86656J78360N7274K48170m4764p23140o11995M59613J101746
37220a85160M96197m20861n52146m4953N20267J020825J223011O23229m30368
$$ plain form
37211 2250041 1549833 1659714 2359875 2500930 1764147 935956 526614 314453 333964 1054095
37201 1054095 2222204 2697475 2033038 1265308 1391811 1829405 1282514 -315192 -1678132
37192 -1678132 -1896530 -1455535 -1307473 -1537723 -1432983 -630463 344269 803472 738784 586408
37182 586408 418479 -95551 -940696 -1527153 -1390980 -683018 215450 1076840 1593658 1341842
37172 1341842 435873 -233358 40033 879840 1383429 1284236 1037283 993636 1073855 1157347
37162 1157347 1269560 1374337 1347142 1148775 818579 450924 342314 811468 1589416 1818273
37152 1818273 1082364 23430 -569424 -824902 -1288398 -1779846 -1620418 -807922 -85181
37143 -85181 145094 154173 89516 -306748 -955839 -1184362 -591364 380493 1080435 1370650
$$ packed form
37211B250041p00208J09881P00161J41055p36783q28191m09342k12161J9511P20131
37201A054095J168109M75271o64437p67730J26503M37594n46891j597706j362940
37192a678132k18398M40995J48062k30250J04740Q02520R74732M59203o4688j52376
37182E86408j67929n14030q45145n86457J36173P07962Q98468Q61390N16818k51816
37172A341842r05969o69231K73391Q39807N03589r9193k46953m3647Q0219Q3492
37162A157347J12213J04777k7195j98367l30196l67655j08610M69154P77948K28857
37152A818273p35909j058934n92854k55478m63496m91448J59428Q12496P22741
37143h5181K30275R079o4657l96264o49091k28523N92998R71857O99942K90215
$$ plain form
37133 1370650 1392165 1106756 518841 6557 -56408 137536 37346 -531475 -1108859 -1095542
37123 -1095542 -361921 639157 1287947 1324764 980470 604309 286987 -48486 -339777
37114 -339777 -409529 -251584 -66220 6034 29915 168032 549602 1171614 1793291 2055901
37104 2055901 1891095 1647624 1569982 1364870 678804 -154633 -393588 61994 468984 273791
37094 273791 -205687 -463945 -635834 -1066563 -1421986 -991765 175849 1182729 1471073
37085 1471073 1413603 1435866 1285706 733326 352329 763862 1493306 1533599 887205 566034
37075 566034 1059386 1809881 2317951 2674519 2757696 2123140 1155778 1023765 1770756 1834380
37065 1834380 502872 -571211 190553 1602124 1409692 -206922 -1064125 -469289 77743
$$ packed form
37133A370650K1515k85409n87915n12284o2965J93944j00190n68821n77384J3317
37123a095542P33621J001078O48790L6817l44294l76161l17322l35473k91291
37114c39777o9752J57945J85364P2254K3881J38117L81570O22012O21677K62610
37104B055901j64806k43471p7642k05112o86066q33437k38955M55582M06990j95193
37094B73791m79478k58258j71889m30729l55423M30221J167614J006880K88344
37085A471073n7470K2263j50160n52380l80997M11533P29444M0293o46394l21171
37075E66034M93352P50495N08070L56568Q3177o34556r67362j32013P46991O3624
37065A834380j331508j074083P61764J411571j92432j616614q57203N94836N47032
$$ plain form
37056 77743 -301019 -696890 -502735 -449922 -802412 -554958 570218 1179626 434717 -441868
37046 -441868 -180631 528053 468285 -17308 35323 306546 -74459 -666936 -233365 1329771
37036 1329771 2942196 3836461 3952123 3307449 2118788 1131643 813444 654816 130842
37027 130842 -307353 -123424 237257 239564 334994 920515 1163533 361728 -365445 518033
37017 518033 2449987 3436942 2828683 1657218 559431 -690310 -1661126 -1300492 183162
37008 183162 1205259 1002562 438140 252676 50713 -474388 -773471 -557806 -428123
36999 -428123 -726081 -865706 -443149 19723 88914 226014 876647 1528810 1395593 513620
36989 513620 -385971 -727246 -498198 -172455 -348698 -1071789 -1534339 -911883 613307
$$ packed form
37056G7743l78762l95871J94155N2813l52490K47454J125176O09408p44909q76585
37046d41868K61237P08684n9768m85593N2631K71223l81005n92477M33571J563136
37036A329771J612425Q94265J15662o44674j188661r87145l18199j58628n23974
37027A30842m38195J83929L60681K307R5430N85521K43018q01805p27173Q83478
37017E18033J931954R86955o08259j171465j097787j249741r70816L60634J483654
37008A83162J022097k02697n64422j85464k01963n25101k99083K15665J29683
36999d28123k97958j39625M22557M62872O9191J37100O50633O52163j33217q81973
36989E13620q99591l41275K29048L25743j76243p23091m62550O22456J525190
$$ plain form
36980 613307 2100798 2824276 2524728 1293733 -52506 -217323 923572 1679183 817947
36971 817947 -386149 -46166 1253908 1467181 633147 764854 2146323 2577969 1055990
36962 1055990 -431614 -19425 1375552 1938025 1546471 969955 243457 -531098 -339989
36953 -339989 1076493 2096538 1479260 464304 791306 1825051 1706179 457520 -232190
36944 -232190 201097 735361 880567 1274208 2077819 2526673 2350596 2184865 2275788 2074236
36934 2074236 1452403 1167579 1676661 2382021 2474047 1905842 1280467 1219883 1877462 2691131
36924 2691131 2812382 2176527 1709114 1942654 2100500 1412386 639430 1043120 2279351
36915 2279351 2759713 2010923 1244617 1393539 1907776 1938187 1611469 1564019 2027550 2868309
$$ packed form
36980F13307J487491P23478k99548j230995j346239j64817J140895P55611q61236
36971H17947j204096L39983J300074K13273q34034J31707J381469M31646j521979
36962A055990j487604M12189J394977N62473l91554n76516p26498p74555J91109
36953c39989J416482J020045o17278j014956L27002J033745j18872j248659o89710
36944b32190M33287N34264J45206L93641Q03611M48854j76077j65731R0923k01552
36934B074236o21833k84824N09082P05360R2026n68205o25375o0584O57579Q13669
36924B691131J21251o35855m67413K33540J57846o88114p72956M03690J236231
36915B279351M80362p48790p66306J48922N14237L0411l26718m7450M63531Q40759
$$ plain form
36905 2868309 3857701 4518660 4373978 3739253 3640474 4528698 5627605 5954337 5471030
36896 5471030 4810222 4343977 4025706 3822459 3801766 3922585 4080533 4276106 4532487 4760359
36886 4760359 4855498 4819761 4710170 4621066 4746268 5220821 5817281 6050744 5734636 5222267
36876 5222267 4914227 4708079 4212669 3463853 3106391 3656481 4732878 5353972 5081144
36867 5081144 4551213 4617031 5213894 5491886 4962689 4046074 3448061 3436387 3834087 4312874
36857 4312874 4514766 4225801 3630846 3172112 3073619 3242390 3603502 4151265 4661034 4792577
36847 4792577 4563142 4329684 4268852 4277926 4346343 4518114 4547406 4225491 4030628 4690675
36837 4690675 5985759 6783520 6511844 5849526 5659079 5969292 6384661 6814825 7341233
$$ packed form
36905B868309R89392O60959j44682o34725r8779Q88224J098907L26732m83307
36896E471030o60808m66245l18271k03247k0693J20819J57948J95573K56381K27872
36886D760359R5139l5737j09591q9104J25202M74553N96460K33463l16108n12369
36876E222267l08040k06148m95410p48816l57462N50090J076397O21094k72828
36867E081144n29931O5818N96863K77992n29197r16615n98013j1674L97700M78787
36857D312874K01892k88965n94955m58734r8493J68771L61112N47763N09769J31543
36847D792577k29435k33458o0832R074O8417J71771K9292l21915j94863O60047
36837D690675J295084P97761k71676o62318j90447L10213M15369M30164N26408
$$ plain form
36828 7341233 7869445 8273625 8501799 8434917 8128276 8106988 8711447 9302262 9065671 8456739
36818 8456739 8627004 9489635 9850199 9580370 9913641 11144571 11911842 11559591 11328758
36809 11328758 12089559 12724870 12216671 11675343 12576667 14366294 15620474 16403383 17630510
36800 17630510 19127596 20189809 21179437 22777170 24555552 26094878 28497686 32793721
36792 32793721 37835011 41999771 46129190 52397323 60970555 70286127 80170892 92277298
36784 92277298 107883219 127587854 152598247 184143083 222854775 270942104 331404509
36777 331404509 398770318 452039729 465944652 433807735 374870790 315985170 270443856
36770 270443856 237160261 213189037 199013327 194338411 196762128 205509002 221918607
$$ packed form
36828G341233N28212M04180K28174o6882l06641k1288O04459N90815k36591o08932
36818H456739J70265Q62631L60564k69829L33271J230930P67271l52251k30833
36809A1328758P60801O35311n08199n41328R01324J789627J254180P82909J227127
36800A7630510J497086J062213R89628J597733J778382J539326K402808M296035
36792C2793721N041290M164760M129419O268133Q573232R315572R884765J2106406
36784I2277298J5605921J9704635K5010393L1544836L8711692M8087329O0462405
36777C31404509O7365809N3269411J3904923l2136917n8936945n8885620m5541314
36770B70443856l3283595k3971224j4175710m674916K423717Q746874J6409605
$$ plain form
36763 221918607 246672578 280889356 327981374 386766108 441449032 466419246 446959879
36756 446959879 392780407 328006241 270725053 225022354 188208346 158525454 135359411
36749 135359411 117322914 103068263 92276610 84526525 78466373 72948925 67978223
36742 67978223 63996370 61114130 59369856 58810287 58890694 58505944 56928175 54167198 50402872
36733 50402872 45875246 41439255 38282169 36680235 35706347 34493590 33164017 32267340
36725 32267340 32050870 32647461 34205525 36275311 37706335 37765231 36842138 35518121 33570457
36716 33570457 30633382 27266926 24428670 22211977 20011185 17680998 15592612 13738238
36708 13738238 11818664 10158377 9443157 9464554 9220044 8427255 7775981 7414034 6526515
$$ packed form
36763B21918607K4753971L4216778M7092018N8784734N4682924K4970214j9459367
36756D46959879n4179472o4774166n7281188m5702699l6814008k9682892k3166043
36749A35359411j8036497j4254651j0791653p750085o060152n517448m970702
36742F7978223l981853k882240j744274n59569Q0407l84750j577769k760977l764326
36733E0402872m527626m435991l157086j601934r73888j212757j329573q96677
36725C2267340k16470N96591J558064K069786J431024N8896r23093j324017j947664
36716C3570457k937075l366456k838256k216693k200792k330187k088386j854374
36708A3738238j919574j660287p15220K1397k44510p92789o51274l61947q87519
$$ plain form
36699 6526515 4991608 4077032 4547262 5300608 5091572 4555186 5040805 6192686 6358558
36690 6358558 5064850 3494707 2606132 2288770 2430978 3265606 4302322 4325909 3055411
36681 3055411 1714777 1400167 1831553 2194636 2239351 2010829 1439733 787294 610008
36672 610008 727096 201454 -993353 -1373716 22895 1962590 2578575 1908171 1534567
36663 1534567 2131976 2794674 2745858 2369317 2262507 2346460 2359495 2425461 2660245 2817502
36653 2817502 2767949 2855667 3341110 3841731 3766157 3114722 2474085 2279591 2362362 2248501
36643 2248501 1715213 949437 244159 -268508 -482555 -123617 965926 2369648 3336589
36634 3336589 3609417 3628561 3761838 3847671 3824888 4193027 5157114 5760008 4835240 2754749
$$ packed form
36699F526515j534907r14576M70230P53346k09036n36386M85619J151881J65872
36690F358558j293708j570143q88575l17362J42208Q34628J036716K3587j270498
36681C055411j340634l14610M31386L63083M4715k28522n71096o52439j77286
36672F10008J17088n25642j194807l80363J396611J939695O15985o70404l73604
36663A534567N97409O62698m8816l76541j06810Q3953J3035O5966K34784J57257
36653B817502m9553Q7718M85443N00621p5574o51435o40637j94494Q2771j13861
36643B248501n33288p65776p05278n12667k14047L58938J089543J403722R66941
36634C336589K72828J9144J33277Q5833k2783L68139R64087O02894r24768k080491
$$ plain form
36624 2754749 1230882 1129335 1420634 860120 -119692 -133154 984800 1856346 1498820
36615 1498820 602766 426324 1132313 1867315 2050893 1871785 1698588 1678492 1883581 2232917
36605 2232917 2234340 1416913 127268 -700730 -696862 -339491 24558 601521 1276203 1294493
36595 1294493 477357 -147517 182744 688766 379400 -75954 692963 2331053 3033486
36586 3033486 2311920 1724286 2336082 3103817 2712267 1630750 1087494 1000966 356968
36577 356968 -904944 -1757930 -1650695 -1015966 -228324 848561 2043411 2532093 1805804
36568 1805804 473080 -342557 -169049 511179 949482 884385 624025 524970 555853 474085
36558 474085 252846 27408 -267181 -742661 -1058972 -687014 155047 469247 -260187 -1363614
$$ packed form
36624B754749j523867j01547K91299n60514r79812j3462J117954Q71546l57526
36615A498820q96054j76442P05989P35002J83578j79108j73197k0096K05089L49336
36605B232917J423q17427j289645q27998L868L57371L64049N76963O74682J8290
36595A294493q17136o24874L30261N06022l09366m55354P68917J638090P02433
36586C033486p21566n87634O11796P67735l91550j081517n43256q6528o43998
36577C56968j261912q52986J07235O34729P87642J076885J194850M88682p26289
36568A805804j332724q15637J73508O80228M38303o5097k60360r9055L0883q1768
36558D74085k21239k25438k94589m75480l16311L71958Q42061L14200p29434j103427
$$ plain form
36548 -1363614 -2016790 -2396600 -3137692 -4069237 -4322493 -3563104 -2372213 -1372023 -608614
36539 -608614 62538 510931 502113 25661 -728025 -1515389 -2070389 -2183145 -1856986 -1286181
36529 -1286181 -638535 52169 753219 1268648 1312495 866514 442567 671567 1409521 1634323
36519 1634323 749405 -321070 -161085 1066313 1580104 346339 -1461523 -2014410 -1106739
36510 -1106739 -72289 77219 -461188 -1015324 -1194738 -879708 -110590 831275 1567008
36501 1567008 1901808 1812291 1358081 849934 804198 1348969 1917143 1925905 1546855 1399211
36491 1399211 1658297 1861602 1500675 560440 -366299 -400424 783473 2268153 2614950
36482 2614950 1590912 533650 563596 1194527 1376863 1102010 978379 896405 399756
$$ packed form
36548a363614o53176l79810p41092r31545k53256P59389J190891J000190P63409
36539f08614O71152M48393q818m76452p53686p87364n55000j12756L26159N70805
36529a286181O47646O90704P01050N15429M3847m45981m23947K29000P37954K24802
36519A634323q84918j070475J59985J227398N13791j233765j807862n52887R07671
36510a106739J034450J49508n38407n54136j79414L15030P69118R41865P35733
36501A567008L34800q9517m54210n08147m5736N44771N68174Q762l79050j47644
36491A399211K59086K03305l60927r40235r26739l4125J183897J484680L46797
36482B614950j024038j057262K9946O30931J82336k74853j23631q1974m96649
$$ plain form
36473 399756 -1298 679245 2120184 2798256 2161909 1431132 1708594 2412506 2346970 1473093
36463 1473093 714616 531697 585051 585109 674366 940922 1158823 1191247 1262949 1594955 1982551
36452 1982551 2016226 1686861 1472916 1664908 1873773 1572410 936434 594853 604256 407244
36442 407244 -36395 45883 934614 1670638 1385449 708494 907792 2084360 3193903
36433 3193903 3542314 3273757 2609894 1651146 862817 768322 1131822 1310541 1351747 1792586
36423 1792586 2434132 2408244 1577171 796755 571813 481517 215331 143917 464889 726819
36413 726819 646294 562862 693689 751854 631207 601246 533403 -64105 -889798 -859048 215883
36402 215883 1113444 1013672 625269 700446 684538 -33048 -652623 -154325 858605 975794
$$ packed form
36473C99756m01054O80543J440939O78072o36347p30777K77462P03912o5536q73877
36463A473093p58477j82919N3354N8Q9257K66556K17901L2424P1702L32006L87596
36452A982551L3675l29365k13945J91992K08865l01363o35976l41581R403j97012
36442D07244m43639Q2278Q88731P36024k85189o76955J99298J176568J109543
36433C193903L48411k68557o63863r58748p88329r4495L63500J78719M1206M40839
36423A792586O41546k5888q31073p80416k24942r0296k66186p1414L20972K61930
36413G26819q0525q3432J30827N8165j20647k9961o7843n97508q25693L0750J074931
36402B15883Q97561r9772l88403P5177j5908p17586o19575M98298J012930J17189
$$ plain form
36392 975794 108766 -583213 -499883 -8228 606184 1241602 1306635 368968 -647873 -369345
36382 -369345 899256 1412614 545806 -381738 -276730 189315 -42286 -736860 -1033073
36373 -1033073 -898359 -915180 -1182181 -1302307 -1093362 -638134 9290 602221 614478 -33956
36363 -33956 -579932 -359403 251932 484533 348940 387628 581590 431304 13836 -33227
36353 -33227 255237 -98174 -1574269 -3151071 -3392688 -2185248 -789782 -325553 -711385
36344 -711385 -1068841 -716932 321755 1453761 1980899 1635676 809688 175267 52702
36335 52702 261625 547789 891355 1316818 1675837 1820076 1804586 1709379 1417222 815251
36325 815251 117440 -256635 -79282 568625 1441649 2177055 2374619 1948839 1303637 870633
$$ packed form
36392I75794q67028o91979Q3330M91655O14412O35418O5033r37667j016841K78528
36382c69345J268601N13358q66808r27544J05008M66045k31601o94574k96213
36373a033073J34714j6821k67001j20126K08945M55228O47424N92931J2257o48434
36363c3956n45976K20529O11335K32601j35593L8688J93962j50286m17468m7063
36353c3227K88464l53411j476095j576802k41617J207440J395466M64229l85832
36344g11385l57456L51909J038687J132006N27138l45223q25988o34421j22565
36335E2702K08923K86164L43566M25463L59019J44239j5490r5207k92157o01971
36325H15251o97811l74075J77353O47907Q73024P35406J97564m25780o45202m33004
$$ plain form
36315 870633 623501 374993 304223 651467 1049069 831192 21145 -653408 -795459 -688139
36305 -688139 -510639 -32474 644576 902636 600353 430089 775818 1077531 970461 1112904
36295 1112904 1972812 2681517 2273258 1336020 1050022 1145659 435093 -893412 -1304830
36286 -1304830 -394066 417216 171846 -261326 55092 439676 -198414 -1500768 -2214102
36277 -2214102 -1924308 -1167531 -339474 495466 1073254 1106318 765604 353265 -145307 -628243
36267 -628243 -550686 286121 1204050 1658489 2117387 3024102 3604404 2925343 1607588 1091966
36257 1091966 1502546 1679974 1183640 702300 419053 -333060 -1351998 -1176235 708811
36248 708811 2626090 2754624 1413925 210336 -248193 -547822 -919969 -790278 175339
$$ packed form
36315H70633k47132k48508p0770L47244L97602k17877q10047o74553j42051J07320
36305f88139J77500M78165O77050K58060l02283j70264L45729L01713j07070J42443
36295A112904Q59908P08705m08259r37238k85998R5637p10566j328505m11418
36286a304830R10764Q11282k45370m33172L16418L84584o38090j302354p13334
36277b214102K89794P56777Q28057Q34940N77788L3064l40714m12339m98572m82936
36267f28243P7557Q36807R17929M54439M58898R06715N80302o79061j317755n15622
36257A091966M10580J77428m96334m81340k83247p52113j018938J75763J885046
36248G08811J917279J28534j340699j203589m58529k99629l72147J29691R65617
$$ plain form
36239 175339 1494486 2411809 2477689 1708381 653089 95072 235884 452135 271584
36230 271584 137851 625563 1365086 1532953 1118322 877809 1158256 1529126 1559826 1288338
36220 1288338 895619 490377 240253 245172 327555 349159 532735 1000396 1310683 1091559
36210 1091559 828415 1239618 2080828 2423113 1992501 1345311 797187 158189 -440019
36201 -440019 -498596 -137743 -154095 -805972 -1431418 -1537775 -1355511 -1062843 -505606 -34361
36191 -34361 -451603 -1572554 -2028636 -1255392 -488048 -801864 -1329439 -734957 508726
36182 508726 909272 414315 391694 1370984 2409720 2755419 2652740 2286919 1356352 133918
36172 133918 -333151 289068 968758 782276 156287 15978 509395 1227571 1930652 2350942
$$ packed form
36239A75339J319147R17323O5880p69308j055292n58017J40812K16251j80551
36230B71584j33733M87712P39523J67867m14631k40513K80447L70870L0700k71488
36220A288338l92719m05242k50124M919Q2383K1604J83576M67661L10287k19124
36210A091559k63144M11203Q41210L42285m30612o47190n48124o38998n98208
36201d40019n8577L60853j6352o51877o25446j06357J82264K92668N57237M71245
36191c4361m17242j120951m56082P73244P67344l13816n27575N94482J243683
36182E08726M00546m94957k2621R79290J038736L45699j02679l65821r30567j222434
36172A33918m67069O22219O79690j86482o25989j40309M93417P18176P03081M20290
$$ plain form
36162 2350942 1987631 914577 213415 722569 1774489 2056514 1411493 850148 924889
36153 924889 1072307 710589 145816 13546 377439 797957 986235 1030783 1091619 1115878
36143 1115878 899357 393052 -114518 -266668 -90379 87467 236725 708689 1481658
36134 1481658 1836142 1299738 498491 375004 861100 1173464 1250116 1812171 2837847
36125 2837847 3131035 2012023 511455 56054 656885 1331682 1771179 2441581 3272805
36116 3272805 3473537 2813349 2056844 1796241 1724754 1449562 1197528 1221285 1261111 1169549
36106 1169549 1339636 1811148 1666436 274334 -1363044 -1607538 -327667 1000711 1275885
36097 1275885 806279 297721 -69851 -189099 327905 1409894 2153206 1850467 905781
$$ packed form
36162B350942l63311j073054p01162N09154J051920K82025o45021n61345P4741
36153I24889J47418l61718n64773j32270L63893M20518J88278M4548O0836K4259
36143A115878k16521n06305n07570j52150J76289J77846J49258M71964P72969
36134A481658L54484n36404q01247j23487M86096L12364P6652N62055J025676
36125B837847K93188j119012j500568m55401O00831O74797M39497O70402Q31224
36116C272805K00732o60188p56505k60603p1487k75192k52034K3757L9826r1562
36106A169549J70087M71512j44712j392102j637378k44494J279871J328378K75174
36097A275885m69606n08558l67572j19248N17004J081989P43312l02739r44686
$$ plain form
36088 905781 196350 -1739 52051 192249 318319 173664 -210526 -213305 578044 1571138
36078 1571138 1844694 1362886 803772 408784 -155064 -855293 -1123263 -803679 -478905
36069 -478905 -521834 -504151 13862 645451 665900 15948 -685538 -966722 -917793 -851909
36059 -851909 -904528 -993159 -947453 -654480 -223338 9401 -201306 -657361 -828353 -425394
36049 -425394 178131 242498 -526465 -1545958 -1920796 -1442965 -798726 -681764 -951618 -903818
36039 -903818 -198338 783319 1436689 1489075 1038051 307658 -499828 -1221016 -1704131 -1800653
36029 -1800653 -1482233 -1024494 -919830 -1419390 -2211011 -2701250 -2586493 -2040805 -1417061
36020 -1417061 -921840 -576186 -365986 -341539 -506427 -605651 -230422 636793 1349866 1260863
$$ packed form
36088I05781p09431j98089N3790J40198J26070j44655l84190k779P91349R93094
36078A571138K73556m81808n59114l94988n63848p00229k67970L19584L24774
36069d78905m2929J7683N18013O31589K0449o49952p01486k81184M8929O5884
36059h51909n2619q8631M5706K92973M31142K32739k10707m56055j70992M02959
36049d25394O03525O4367p68963j019493l74838M77831O44239J16962k69854M7800
36039i03818P05480R81657O53370N2386m51024p30393q07486p21188m83115r6522
36029a800653L18420M57739J04664m99560p91621m90239J14757N45688O23744
36020a417061M95221L45654K10200K4447j64888r9224L75229Q67215P13073q9003
$$ plain form
36010 1260863 580637 93880 22033 -190786 -778145 -1066168 -464173 550297 1078942
36001 1078942 1045693 1123818 1641337 2168234 2096188 1191026 -247410 -1382193 -1320735 -111886
35991 -111886 1061887 1243625 857767 825564 1011783 597128 -248641 -341020 674971 1624232
35981 1624232 1464742 731645 632252 1329279 1862207 1473390 420209 -434706 -487760 92776
35971 92776 560141 380529 -197786 -573730 -634770 -744571 -1002087 -1079775 -815206 -402307
35961 -402307 42508 523439 766416 473361 48236 285609 1162140 1778242 1769560 1841325
35951 1841325 2440044 2861246 2408171 1603859 1323881 1339846 745857 -533321 -1638639
35942 -1638639 -1984409 -1701688 -1032608 -136166 591833 835921 939972 1335624 1492904
$$ packed form
36010A260863o80226m86757p1847k12819n87359k88023O01995J014470N28645
36001A078942l3249P8125N17519N26897p2046r05162j438436j134783O1458J208849
35991a11886J173773J81738l85858l2203J86219m14655q45769r2379J015991R49261
35981A624232j59490p33097r9393O97027N32928l88817j053181q54915n3054N80536
35971I2776M67365j79612n78315l75944o1040j09801k57516p7688K64569M12899
35961d02307M44815M80931K42977k93055m25125K37373Q76531O16102q682P1765
35951A841325N98719M21202m53075q04312k79978J5965n93989j279178j105318
35942a638639l45770K82721O69080Q96442P27999K44088J04051L95652J57280
$$ plain form
35933 1492904 505938 -1160078 -1748418 -586379 765622 674393 -203081 -62746 1079978
35924 1079978 1275304 -308559 -1877563 -1488754 186579 946405 208154 -531305 -254990
35915 -254990 221377 -75704 -711081 -856413 -731790 -868557 -780936 233872 1446442
35906 1446442 1360942 2109 -878061 -193352 1089175 1479997 876899 245854 142933
35897 142933 361274 643293 982846 1272677 1153628 377013 -770938 -1495472 -1176110
35888 -1176110 -181313 338345 -187281 -1004009 -1153563 -805222 -666879 -593590 56462 991009
35878 991009 1288798 1073359 1362375 2047079 1686312 -68413 -1446913 -983481 339943
35869 339943 588809 -486789 -1574339 -1800599 -1333810 -488041 562857 1401583 1635055
$$ packed form
35933A492904r86966j666016n88340J162039J352001r1229q77474J40335J142724
35924A079978J95326j583863j569004L88809J675333P59826p38251p39459K76315
35915b54990M76367k97081o35377j45332J24623j36767Q7621J014808J212570
35906A446442q5500j358833q80170O84709J282527L90822o03098o31045j02921
35897A42933K18341K82019L39553K89831j19049p76615j147951p24534L19362
35888a176110R94797N19658n25626q16728j49554L48341J38343P3289O50052R34547
35878I91009K97789k15439K89016O84704l60767j754725j378500M63432J323424
35869C39943K48866j075598j087550k26260M66789Q45769J050898Q38726K33472
$$ plain form
35860 1635055 1400229 1014604 519302 97935 294299 1096253 1475084 674242 -641384
35851 -641384 -1329958 -1215341 -763535 -87966 728916 1068655 644169 253742 550098 827127
35841 827127 297720 -283240 137221 804954 216772 -1171310 -1394650 -70543 1048039
35832 1048039 843200 147301 -179721 -547334 -1273488 -1687391 -1503388 -1544101 -2128379 -2181384
35822 -2181384 -1028399 230697 321616 -343562 -605276 -385711 -357987 -595931 -733970
35813 -733970 -780078 -686855 143387 1766605 2835647 2130465 389712 -681994 -714763
35804 -714763 -583169 -481159 244042 1422772 1914310 1415530 918942 907707 535849 -662106
35794 -662106 -1568132 -1089170 -32676 -97157 -1466036 -2643745 -2573002 -1782189 -1209623
$$ packed form
35860A635055k34826l85625m95302m21367J96364Q01954L78831q00842j315626
35851f41384o88574J14617M51806O75569Q16882L39739m24486l90427K96356K77029
35841H27127n29407n80960M20461O67733n88182j388082k23340J324107J118582
35832A048039k04839o95899l27022l67613p26154m13903J84003m0713n84278n3005
35822b181384J152985J259096R0919o65178k61714K19565K7724k37944j38039
35813g33970m6108R3223Q30242J623218J069042p05182j740753j071706l2769
35804g14763J31594J02010P25201J178730M91538m98780m96588j1235l71858j197955
35794f62106r06026M78962J056494o4481j368879j177709P0743P90813N72566
$$ plain form
35785 -1209623 -837983 -55567 1153347 1997197 1755479 533207 -817393 -1360692 -810625
35776 -810625 163042 453616 -408748 -1723910 -2348831 -1893195 -975157 -402527 -464593 -1010748
35766 -1010748 -1746974 -2267116 -2210322 -1685002 -1217642 -1004580 -585067 365716 1297368 1378274
35756 1378274 582604 -398445 -1160105 -1835016 -2371499 -2276670 -1320008 -11975 858289
35747 858289 857565 35400 -1151055 -1950954 -1841787 -1136103 -674521 -758657 -826102 -385450
35737 -385450 212159 296171 -186906 -672361 -715081 -376792 15862 216782 193716 84431
35727 84431 16824 -47464 -210139 -435595 -629585 -827149 -1025797 -933734 -306128 474571
35717 474571 664595 156599 -275572 -1720 616911 768661 257959 -391808 -702195 -653535
$$ packed form
35785a209623L71640P82416J208914Q43850k41718j222272j350600n43299N50067
35776h10625R73667K90574q62364j315162o24921M55636R18038N72630o2066n46155
35766a010748p36226n20142N6794N25320M67360K13062M19513R50783R31652Q0906
35756A378274p95670r81049p61660o74911n36483R4829R56662J308033Q70264
35747H58289p24q22165j186455p99899J09167P05684M61582q4136o7445M40652
35737c85450N97609Q4012m83077m85455m2720L38289L92654K00920k3066j09285
35727H4431o7607o4288j62675k25456j93990j97564j98648R2063O27606P80699
35717D74571J90024n07996m32171K73852O18631J51750n10702o49767l10387M8660
$$ plain form
35707 -653535 -379003 111769 723151 1071544 847345 390749 531530 1503566 2233830 1368427
35697 1368427 -820147 -2260270 -1398836 806702 2002227 1259961 -135546 -682333 -402116
35688 -402116 -205484 -365274 -337171 247695 1009418 1224137 575989 -447637 -918321 -428548
35678 -428548 391344 649372 346187 242318 672481 1182310 1396925 1472882 1463297 1045032
35668 1045032 309036 84197 863495 1952613 2307107 1779931 949021 160893 -534299
35659 -534299 -835654 -419530 353646 697842 456544 306850 753389 1407735 1514478 884334
35649 884334 69085 -252149 62497 498620 429962 -148090 -535422 -135206 779183 1365976
35639 1365976 1238564 876850 922874 1338765 1509222 1057955 253746 -442379 -917053 -1266224
$$ packed form
35707f53535K74532M90772O11382L48393k24199m56596J40781R72036P30264q65403
35697A368427k188574j440123Q61434K205538J195525p42266j395507n46787K80217
35688d02116J96632j59790K8103N84866P61723K14719o48148j023626m70684M89773
35678d28548Q19892K58028l03185j03869M30163N09829K14615P5957r585m18265
35668A045032p35996k24839P79298J089118L54494n27176q30910p88128o95192
35659e34299l01355M16124P73176L44196k41298j49694M46539O54346J06743o30144
35649H84334q15249l21234L14646M36123o8658n78052l87332M00216R14389N86793
35639A365976j27412l61714M6024M15891J70457m51267q04209o96125m74674l49171
$$ plain form
35629 -1266224 -1397321 -1204033 -1009222 -1269150 -1782350 -1803945 -1135566 -430385 -91689 347468
35619 347468 1169545 1617535 1018245 119256 159094 1012031 1501437 1310276 1201501 1377473
35609 1377473 1130521 412746 260738 1059032 1724532 1414658 851740 996687 1449991
35600 1449991 1279939 621027 277896 341876 358959 423706 932909 1500323 1240452 103305
35590 103305 -996152 -1391008 -1226844 -851560 -413021 -80223 56598 356666 1217984
35581 1217984 2216565 2344840 1331349 156219 -63601 664799 1342290 1133544 153521
35572 153521 -778530 -956333 -311458 744925 1735463 2244314 1990097 1235540 894317
35563 894317 1569978 2565807 2614895 1603902 639038 245786 -330638 -1499014 -2183314
$$ packed form
35629a266224j31097J93288J94811k59928n13200k1595O68379P05181L38696M39157
35619C47468Q22077M47990n99290q98989L9838Q52937M89406j91161j08775J75972
35609A377473k46952p17775j52008P98294O65500l09874n62918J44947M53304
35600A449991j70052o58912l43131O3980J7083O4747N09203N67414k59871j137147
35590A03305j099457l94856J64164L75284M38539L32798J36821L00068Q61318
35581A217984R98581J28275j013491j175130k19820P28400O77491k08746r80023
35572A53521r32051j77803O44875J056383R90538N08851k54217p54557l41223
35563H94317O75661R95829M9088j010993r64864l93252n76424j168376o84300
$$ plain form
35554 -2183314 -1289769 547541 1801734 2043832 1985023 1970805 1619885 810150 -20795
35545 -20795 -559140 -792409 -604008 36372 630712 694525 562643 818172 1130947 662292
35535 662292 -449695 -1083393 -750301 -235456 -362590 -978184 -1465783 -1513971 -1084425 -329199
35525 -329199 185012 -111382 -853319 -951122 -118802 540943 -3574 -1316092 -2189557 -2226256
35515 -2226256 -1976295 -1792128 -1341613 -316590 937610 1695554 1500141 524739 -431330
35506 -431330 -352871 1117012 2992016 3541885 2057858 -149114 -1085009 -413828 248498
35497 248498 -347784 -1352120 -1214617 -126279 265523 -585885 -1342145 -945025 -206532
35488 -206532 -416305 -1412691 -2065834 -1942766 -1431096 -743601 91763 552215 13648 -1209470
$$ packed form
35554b183314Q93545J837310J254193K42098n8809j4218l50920q09735q30945
35545b0795n38345k33269J88401O40380N94340O3813j31882K55529L12775m68655
35535F62292j111987o33698L33092N14845j27134o15594m87599m8188M29546P55226
35525c29199N14211k96394p41937r7803Q32320O59745n44517j312518q73465l6699
35515b226256K49961J84167M50515J025023J254200P57944j95413r75402r56069
35506d31330P8459J469883J875004N49869j484027k206972r35895O71181O62326
35497B48498n96282j004336J37503J088338L91802q51408p56260L97120P38493
35488b06532k09773r96386o53143J23068N11670O87495Q35364M60452n38567j223118
$$ plain form
35478 -1209470 -2074578 -2086663 -1684164 -1378159 -1155646 -781361 -179701 536369 1105820 1286045
35468 1286045 1187061 1150653 1121170 670809 -71876 -277221 265343 489930 -474940 -1863580
35458 -1863580 -2246394 -1411425 -315820 370403 682652 728718 636210 809442 1329608 1484697
35448 1484697 800274 48371 229444 1087887 1747681 2223168 2979093 3538096 3059479
35439 3059479 1948181 1314181 1103376 425136 -465480 -364611 660164 1149534 662184
35430 662184 463627 1283113 2116210 1978916 1319069 909052 712969 615485 967648 1605908
35420 1605908 1520314 305292 -1077927 -1617552 -1317275 -515831 626070 1483151 1190608
35411 1190608 122819 -250037 385655 631128 -143706 -489512 765761 2431030 2693329
$$ packed form
35478a209470q65108j2085M02499L06005K22513L74285O01660P16070N69451J80225
35468A286045r8984l6408k9483m50361p42685k05345N42564K24587r64870j388640
35458a863580l82814Q34969J095605O86223L12249M6066r2508J73232N20166J55089
35448A484697o84423p51903J81073Q58443O59794M75487P55925N59003m78617
35439C059479j111298o34000k10805o78240q90616J00869J024775M89370m87350
35430F62184j98557Q19486Q33097j37294o59847m10017j96083r7484L52163O38260
35420A605908q5594j215022j383219n39625L00277Q01444J141901Q57081k92543
35411A190608j067789l72856O35692K45473p74834l45806J255273J665269K62299
$$ plain form
35402 2693329 1667157 699565 237570 -58364 -16110 626542 1191025 924159 330335
35393 330335 339512 769836 901424 913421 1378586 1909584 1691976 879486 165342 -482720
35383 -482720 -1311954 -1614170 -618561 860668 1268673 580421 184200 604140 867359
35374 867359 231232 -826456 -1521587 -1525092 -746413 544439 1380334 990079 5203 -316326
35364 -316326 55709 90652 -377956 -354787 488364 1105549 677490 -239526 -689246 -496961
35354 -496961 -24598 427364 596462 369310 156039 428468 807113 488658 -366006 -745547
35344 -745547 -469173 -558651 -1513860 -2385187 -2224460 -1479554 -1187717 -1572283 -2194058 -2806474
35334 -2806474 -3264132 -3141040 -2285656 -1418494 -1415212 -2166277 -2756678 -2645002 -2113978 -1605755
$$ packed form
35402B693329j026172r67592m61995k95934M2254O42652N64483k66866n93824
35393C30335R177M30324J31588J1997M65165N30998k17608q12490p14144o48062
35383d82720q29234l02216R95609J479229M08005o88252l96221M19940K63219
35374H67359o36127j057688o95131l505P78679J290852Q35895l90255r84876l21529
35364c16326L72035L4943m68608K3169Q43151O17185m28059r17016m49720J92285
35354d96961M72363M51962J69098k27152k13271K72429L78645l18455q54664l79541
35344g45547K76374q9478r55209q71327J60727P44906K91837l84566o21775o12416
35334b806474m57658J23092Q55384Q67162L282p51065n90401J11676N31024N08223
$$ plain form
35324 -1605755 -1126635 -459974 308524 690625 247505 -895337 -2090860 -2767940 -2815167
35315 -2815167 -2334302 -1419915 -451653 -118797 -600906 -1077223 -706126 175197 539870
35306 539870 112806 -503897 -952053 -1359969 -1483846 -753398 512445 1004886 126940
35297 126940 -1044343 -1183046 -437724 43488 -151360 -297902 239527 1096884 1389286
35288 1389286 724678 -418914 -1163499 -988758 -79765 992593 1790504 2119151 1838847
35279 1838847 924725 -256333 -1018886 -909046 -187367 294569 -120600 -1041557 -1197371
35270 -1197371 47373 1537799 1530423 94546 -797494 10006 1295145 1460410 850517
35261 850517 743844 1058928 806470 209325 430296 1356025 1581456 762782 120531 196577
$$ packed form
35324a605755M79120O66661P68498L82101m43120j142842j195523o77080m7227
35315b815167M80865R14387R68262L32856m82109m76317L71097Q81323L64673
35306E39870m27064o16703m48156m07916j23877P30448J265843M92441q77946
35297A26940j171283j38703P45322M81212j94848j46542N37429Q57357K92402
35288A389286o64608j143592p44585J74741R08993J072358P97911L28647k80304
35279A838847r14122j181058p62553J09840P21679M81936m15169r20957j55814
35270a197371J244744J490426p376j435877q92040Q07500J285139J65265o09893
35261H50517j06673L15084k52458n97145K20971R25729K25431q18674o42251P6046
$$ plain form
35251 196577 -40592 -1139403 -1946183 -1457457 -427992 8919 55072 342049 443079
35242 443079 -274277 -1122709 -907251 204614 960643 876386 600173 621615 763847 912861
35232 912861 1215909 1482848 1262441 624064 147519 73773 114436 115983 233951 366326
35222 366326 65541 -777380 -1629199 -1883194 -1436419 -666224 -117983 -154439 -585777 -731161
35212 -731161 -178482 659049 1119164 1212697 1435426 1789273 1664772 812563 -161246 -530066
35202 -530066 -239134 303761 841895 1328643 1637878 1582391 1100870 167551 -1295651 -3048180
35192 -3048180 -4216292 -3910987 -2323581 -747417 -219078 -520077 -849812 -980652 -1119085
35183 -1119085 -1059311 -438582 310839 364366 -45032 202040 1146607 1343075 177024 -817766
$$ packed form
35251A96577k37169j098811q06780M88726J029465M36911M6153K86977J01030
35242D43079p17356q48432K15458J111865P56029q4257k76213K1442J42232J49014
35232I12861L03048K66939k20407o38377m76545p3746M0663J547J17968J32375
35222C66326l00785q42921q51819k53995M46775P70195N48241l6456m31338j45384
35212g31161N52679Q37531M60115R3533K22729L53847j24501q52209r73809l68820
35202e30066K90932N42895N38134M86748L09235n5487m81521r33319j463202j752529
35192c048180j168112L05305J587406J576164N28339l00999l29735j30840j38433
35183a119085N9774O20729P49421N3527m09398K47072R44567J96468j166051r94790
$$ plain form
35173 -817766 -220130 899207 521789 -1235967 -2471955 -2434985 -2066368 -1748377 -716941
35164 -716941 885826 1474611 423474 -699711 -352225 897788 1532641 1136739 276335
35155 276335 -593963 -1114241 -896952 -345250 -590406 -1715295 -2166650 -987459 528358
35146 528358 677683 -236762 -780035 -719290 -851739 -1225453 -1262916 -1205895 -1741098 -2455465
35136 -2455465 -2311393 -1523425 -1332521 -1891058 -1955548 -877470 551582 1499135 1975293
35127 1975293 2040017 1489043 732564 701921 1378669 1578505 707331 -387899 -845764 -928910
35117 -928910 -1108381 -1130279 -789362 -634392 -998793 -1188380 -616655 -24466 -489846 -1735089
35107 -1735089 -2507712 -2324696 -1776116 -1265826 -542704 415836 1039767 1036520 887972 1041650
$$ packed form
35173h17766N97636J119337l77418j757756j235988L6970L68617L17991J031436
35164g16941J602767N88785j051137j123185L47486J250013O34853l95902q60404
35155B76335q70298n20278K17289N51702k45156j124889m51355J179191J515817
35146E28358J49325r14445n43273O0745j32449l73714l7463N7021n35203p14367
35136b455465J44072P87968J90904n58537o4490J078078J429052R47553M76158
35127A975293O4724n50974p56479l0643O76748J99836q71174j095230m57865q3146
35117i28910j79471k1898L40917J54970l64401j89587N71725N92189m65380j245243
35107a735089p72623J83016N48580N10290P23122R58540O23931l247j48548J53678
$$ plain form
35097 1041650 1159561 683216 -228242 -902129 -1131899 -1358032 -1812676 -2065502 -1739118
35088 -1739118 -1209326 -1059064 -1128331 -805877 -181287 -74147 -713203 -1232138 -958587 -434874
35078 -434874 -450290 -723442 -497855 57 -167060 -1029890 -1500196 -982918 -218498 -97217
35068 -97217 -409914 -334562 336171 1000862 1041866 434530 -312404 -626866 -382145 18687
35058 18687 178613 198747 393540 717550 870627 803940 661456 387795 -72177 -358529
35048 -358529 -124976 245087 82276 -479944 -688429 -455911 -505531 -1015884 -1127925 -309110
35038 -309110 642088 644817 -194896 -835035 -618998 232513 1138161 1652954 1666094 1470559
35028 1470559 1426306 1371591 770928 -352994 -1199541 -1246318 -933314 -833071 -757795 -339395
$$ packed form
35097A041650J17911m76345r11458o73887k29770k26133m54644k52826L26384
35088a739118N29792J50262o9267L22454O24590J07140o39056n18935K73551N23713
35078d34874j5416k73152K25587M97912j67117q62830m70306N17278P64420J21281
35068i7217l12697P5352O70733O64691M1004o07336p46934l14462K44721M00832
35058A8687J59926K0134J94793L24010J53077o6687j42484k73661m59972k86352
35048c58529K33553L70063j62811n62220k08485K32518m9620n10353j12041Q18815
35038c09110R51198K729q39713o40139K16037Q51511R05648N14793J3140j95535
35028A470559m4253n4715o00663j123922q46547m6777L13004J00243P5276M18400
$$ plain form
35018 -339395 46056 -223446 -899673 -1110885 -631129 -114199 -23234 -49272 232553 737918
35008 737918 1172794 1493168 1751327 1797490 1458531 871918 399563 247642 309566 375618
34998 375618 398963 485337 628835 591464 191452 -376988 -750567 -892370 -1079029 -1369920
34988 -1369920 -1461969 -1198336 -827587 -531795 -90104 642839 1256136 1229412 666139 144341
34978 144341 -29573 30130 278061 804378 1305884 1063419 -138203 -1367696 -1335515 159829
34968 159829 1950967 2778988 2496946 1767021 979522 84664 -660665 -642721 105639 619978
34958 619978 325530 21677 729230 2023516 2552232 1998372 1371949 1286317 1139601 372436
34948 372436 -569692 -1117380 -1456535 -1812873 -1711302 -801205 273899 746673 898251
$$ packed form
35018c39395L85451k69502o76227k11212M79756N16930R0965k6038K81825N05365
35008G37918M34876L20374K58159M6163l38959n86613m72355j51921O1924O6052
34998C75618K3345Q6374J43498l7371m00012n68440l73579j41803j86659k90891
34988a369920r2049K63633L70749K95792M41691P32943O13297k6724n63273n21798
34978A44341j73914N9703K47931N26317N01506k42465j201622j229493L2181J495344
34968A59829J791138Q28021k82042p29925p87499q94858p45329J7944P48360N14339
34958F19978k94448l03853P07553J294286N28716n53860o26423q5632j46716p67165
34948C72436r42128n47688l39155l56338J01571R10097J075104M72774J51578
$$ plain form
34939 898251 1408662 2033034 2004894 1447515 1246237 1595720 1749809 1300271 727750 497253
34929 497253 482612 519519 713548 923645 708160 106296 -239307 -73608 59096 -238956
34919 -238956 -581795 -565947 -461029 -559422 -517004 -68705 203565 -264752 -814194 -311598
34909 -311598 991376 1473433 305175 -1340155 -1789177 -924769 -63145 -153264 -830470
34900 -830470 -1214477 -1017882 -636149 -516080 -749641 -1152050 -1465644 -1471406 -1095818 -523596
34890 -523596 -116962 -72446 -138997 195146 1133385 2236656 2766666 2384703 1465188 725218
34880 725218 596256 938038 1268536 1222987 835457 432442 276289 339732 442360 533781
34870 533781 731807 1092401 1476952 1711511 1782466 1778217 1682211 1338969 690718 40180
$$ packed form
34939H98251N10411O24372k8140n57379k01278L49483J54089m49538n72521k30497
34929D97253j4641L6907J94029K10097k15485o01864l45603J65699J32704k98052
34919b38956l42839J5848J04918r8393M2418M48299K72270m68317n49442N02596
34909c11598J302974M82057j168258j645330m49022Q64408Q61624r0119o77206
34900h30470l84007J96595L81733J20069k33561m02409l13594n762L75588N72222
34890e23596M06634M4516o6551L34143R38239J103271N30010l81963r19515p39970
34880G25218j28962L41782L30498m5549l87530m03015j56153O3443J02628R1421
34870E33781J98026L60594L84551K34559P0955m249r6006l43242o48251o50538
$$ plain form
34860 40180 -34457 749326 1797267 1931738 679814 -859309 -1040785 282619 1403658
34851 1403658 888107 -561295 -1134909 -381251 416019 274814 -249570 -292513 -114911
34842 -114911 -482037 -1254155 -1572372 -1224376 -948781 -1307017 -1900697 -1927624 -1144585 -86542
34832 -86542 527726 551173 548045 997167 1449792 1038668 -52030 -446199 547986 1714028
34822 1714028 1502109 232472 -477754 -189663 -137174 -1091486 -2095870 -1940931 -861554
34813 -861554 41003 364580 551337 867943 1021476 714829 93245 -384180 -353219 52820
34803 52820 204579 -302519 -961084 -886643 -60938 608281 607202 450209 690796 1044753
34793 1044753 944888 293041 -808768 -2341156 -3786365 -4049152 -2822828 -1421627 -1248274
$$ packed form
34860D0180p4637P83783J047941J34471j251924j539123j81476J323404J121039
34851A403658n15551j449402n73614P53658P97270j41205n24384m2943J77602
34842a14911l67126p72118l18217L47996K75595l58236n93680k6927P83039J058043
34832h6542O14268K3447l128M49122M52625m11124j090698l94169R94185J166042
34822A714028k11919j269637p10226K88091N2489r54312j004384J54939J079377
34813h61554R02557L23577J86757L16606J53533l06647o21584m77425L0961M06039
34803E2820J51759n07098o58565P4441Q25705O69219j079j56993K40587L53957
34793A044753r9865o51847j101809j532388j445209k62787J226324J401201J73353
$$ plain form
34784 -1248274 -1861815 -1668842 -303720 890410 873117 274796 283604 970036 1352038 721051
34774 721051 -639265 -1910552 -2534040 -2526157 -2197216 -1716814 -1077064 -419826 -89749 -242703
34764 -242703 -694850 -1268912 -1865991 -2032276 -1119434 622594 1743338 1183315 -232541
34755 -232541 -786448 -105907 581103 361045 -302174 -677667 -888888 -1320165 -1685356 -1489319
34745 -1489319 -1004834 -1001528 -1587807 -1937778 -1284960 168793 1443802 1672793 766259
34736 766259 -591312 -1498105 -1525247 -1007933 -631986 -642726 -535697 261315 1438014 1964315
34726 1964315 1443745 805775 1045923 1663256 1315434 -39607 -842786 -160710 939447
34717 939447 1021786 315353 47001 455863 739627 610434 622198 1023516 1437534 1729016
$$ packed form
34784a248274o13541J92973J365122J194130j7293n98321Q808O86432L82002o30987
34774G21051j360316j271287o23488P883L28941M80402O39750O57238L30077j52954
34764b42703m52147n74062n97079j66285R12842J742028J120744n60023j415856
34755b32541n53907O80541O87010k20058o63219l75493k11221m31277l65191J96037
34745a489319M84485L306n86279l49971O52818J453753J275009K28991r06534
34736G66259j357571r06793k7142N17314L75947j0740J07029P97012J176699N26301
34726A964315n20570o37970K40148O17333l47822j355041q03179O82076J100157
34717I39447Q2339p06433k68352M08862K83764j29193J1764M01318M14018K91482
$$ plain form
34707 1729016 2116160 2318864 1693622 477369 -135671 446612 1474057 2071891 2312482
34698 2312482 2569369 2631522 2119273 1186194 224827 -608435 -1076922 -671445 610139
34689 610139 1735441 1593491 288977 -1006645 -1308167 -562985 573312 1309465 1273727
34680 1273727 800554 480665 333076 -143129 -960526 -1348706 -863641 -158957 -61614 -372823
34670 -372823 -257145 520508 1404043 1846171 1690922 967594 -77359 -849648 -861338 -294191
34660 -294191 263553 504800 488356 310501 152584 406995 1228603 2113665 2374573 1865712
34650 1865712 902720 -145113 -723898 -143136 1437235 2553589 2022384 671416 281655
34641 281655 953964 998458 -328572 -1574270 -1324821 -269079 136374 -59523 152824
$$ packed form
34707A729016L87144K02704o25242j216253o13040N82283J027445N97834K40591
34698B312482K56887O2153n12249r33079r61367q33262m68487M05477J281584
34689F10139J125302j41950j304514j295622l01522P45182J136297P36153l5738
34680A273727m73173l19889j47589m76205q17397l88180M85065P04684R7343l11209
34670c72823J15678P77653Q83535M42128j55249p23328j044953p72289j1690N67147
34660b94191N57744K41247j6444j77855j57917K54411Q21608Q85062K60908n08861
34650A865712r62992j047833n78785N80762J580371J116354n31205j350968l89761
34641B81655O72309M4494j327030j245698K49449J055742M05453j95897K12347
$$ plain form
34632 152824 657089 388875 -574837 -785636 387345 1744809 2013187 1425700 802367
34623 802367 120258 -946084 -1818555 -1616172 -668788 -249886 -781934 -1332952 -1089870
34614 -1089870 -415387 -70689 -133673 -168787 48584 404983 656269 483807 -207429 -826655
34604 -826655 -534049 548141 1273202 1087181 890655 1517828 2147909 1403402 -418850
34595 -418850 -1546591 -1112264 -109509 177396 -438921 -1490771 -2534118 -2919814 -1974761
34586 -1974761 -111970 1116414 839902 13398 -28686 556896 643661 -26658 -627523
34577 -627523 -650380 -517426 -774214 -1452414 -2284294 -2909502 -2867858 -2005519 -908095 -368984
34567 -368984 -437660 -542241 -486955 -670125 -1276109 -1908565 -2168392 -2036818 -1565699 -744865
$$ packed form
34632A52824N04265k68214r63712k10799J172981J357464K68378n87487o23333
34623H02367o82109j066342q72471K02383R47384M18902n32048n51018K43082
34614a089870O74483L44698o2984l5114K17371L56399K51286j72462o91236o19226
34604h26655K92606J082190P25061j86021j96526O27173O30081p44507j822252
34595d18850j127741M34327J002755K86905o16317j051850j043347l85696R45053
34586a974761J862791J228384k76512q26504m2084N85582Q6765o70319o00865
34577f27523k2857J32954k56788o78200q31880o25208M1644Q62339J097424N39111
34567c68984o8676j04581N5286j83170o05984o32456k59827J31574M71119Q20834
$$ plain form
34557 -744865 178990 779417 986964 1065889 1030420 715951 469551 919230 1787136 1850107
34547 1850107 636613 -659676 -729841 48806 279128 -464659 -1340161 -1661614 -1518112
34538 -1518112 -1001393 33659 1153602 1346890 415131 -443678 -138460 826228 1115719
34529 1115719 386417 -477147 -720619 -484702 -205577 8074 193988 264186 159337 -43353
34519 -43353 -270587 -403077 -142830 610422 1283939 1132448 303369 -253958 -144690 -76891
34509 -76891 -687389 -1546453 -1892277 -1692084 -1253617 -391114 1059886 2278631 2105824
34500 2105824 613918 -907522 -1567958 -1593239 -1399438 -969749 -415055 -186739 -290511
34491 -290511 -108887 532147 908124 516357 -133093 -431596 -570046 -795370 -587891 425339
$$ packed form
34557g44865R23855O00427K07547P8925l5469l14469k46400M49679Q67906O2971
34547A850107j213494j296289p0165P78647K30322p43787q75502l21453J43502
34538a518112N16719J035052J119943J93288r31759q58809L05218R64688K89491
34529A115719p29302q63564k43472K35917K79125K13651J85914P0198j04849k02690
34519d3353k27234j32490K60247P53252O73517j51491q29079n57327J09268O7799
34509g6891o10498q59064l45824K00193M38467Q62503J451000J218745j72807
34500B105824j491906j521440o60436k5281J93801M29689N54694K28316j03772
34491b90511J81624O41034L75977l91767o49450k98503j38450k25324K07479J013230
$$ plain form
34481 425339 1380012 1179720 227527 -55512 699351 1404392 1212037 451565 -340184 -1196455
34471 -1196455 -2097360 -2542804 -2318879 -1940120 -1807341 -1617559 -1106526 -640477 -480055
34462 -480055 -198259 439596 720510 12440 -1028096 -1311041 -953442 -935139 -1391433 -1518077
34452 -1518077 -1148556 -1074266 -1493824 -1434812 -331012 907018 1160532 554119 -165356
34443 -165356 -869230 -1694742 -2138518 -1655734 -793150 -613167 -1149405 -1428764 -946696 -197218
34433 -197218 222669 168283 -335646 -1063298 -1348586 -793322 -126698 -351037 -1112243 -1080137
34423 -1080137 47617 1220706 1816451 2266780 2603231 2028111 613051 -175157 401543
34414 401543 1162482 996160 552248 675141 667477 -217509 -877873 51214 1683475 2052965
$$ packed form
34481D25339R54673k00292r52193k83039P54863P05041j92355p60472p91749q56271
34471a196455r00905m45444K23925L78759J32779J89782N11033M66049J60422
34462d80055K81796O37855K80914p08070j040536k82945L57599J8303m56294j26644
34452a518077L69521P4290m19558N9012J103800J238030K53514o06413p19475
34443a65356p03874q25512m43776M82784Q62584J79983n36238k79359M82068P49478
34433a97218M19887n4386n03929p27652k85288N55264O66624k24339p61206L2106
34423a080137J127754J173089N95745M50329L36451n75120j415060p88208N76700
34414D01543P60939j66322m43912J22893p664q84986o60364R29087J632261L69490
$$ plain form
34404 2052965 1120866 484812 568418 319768 -496849 -932474 -821788 -999828 -1401492 -1066107
34394 -1066107 -302949 -638372 -2075982 -2601171 -1224411 511137 1002636 651636 409722
34385 409722 112407 -503358 -778940 -426102 -363606 -1045946 -1421662 -764301 -16422 -28436
34375 -28436 -64974 485199 586687 -499791 -1329451 -388643 1202995 1295221 -46312 -1130499
34365 -1130499 -1544176 -2058103 -2330240 -1308681 314948 594328 -587713 -1229643 -337629
34356 -337629 789093 887075 364547 -53751 -550812 -1278002 -1649468 -1383113 -1094962 -1229513
34346 -1229513 -1418531 -1336270 -1163188 -896815 -311533 152637 -294975 -1298695 -1534682
34337 -1534682 -833355 -703046 -2021009 -3515063 -3518827 -2210928 -1020985 -510272 34208
$$ packed form
34404B052965r32099o36054Q3606k48650q16617m35625J10686j78040m01664L35385
34394a066107P63158l35423j437610n25189J376760J735548M91499l51000k41914
34385D09722k97315o15765k75582L52838O2496o82340l75716O57361P47879j2014
34375b8436l6538N50173J01488j086478q29660R40808J591638R2226j341533j084187
34365a130499m13677n13927k72137J021559J623629K79380j182041o41930Q92014
34356c37629J126722R7982n22528m18298m97061p27190l71466K66355K88151j34551
34346a229513j89018Q2261J73082K66373N85282M64170m47612j003720k35987
34337a534682P01327J30309j317963j494054l764J307899J189943N10713N44480
$$ plain form
34328 34208 1157014 2310294 2532336 1644768 526601 105736 210481 -69390 -788839
34319 -788839 -833519 233570 1091381 540998 -490632 -348582 678324 920949 172049
34310 172049 -43641 941182 2004722 2164604 1685714 961249 15097 -552258 83682
34301 83682 1238385 1164615 -244678 -1111880 -599858 -223140 -1113035 -1996199 -1364713 12582
34291 12582 427917 -130734 -294587 570901 1888226 2810668 2655683 1226142 -448675
34282 -448675 -694142 641071 1739379 1418917 829385 1397363 2459947 2452892 1369864
34273 1369864 432036 69594 -279027 -892556 -1519171 -1915934 -1750771 -713577 502823
34264 502823 434703 -1001938 -1893900 -1031711 188519 23426 -889997 -877661 -50305 277466
$$ packed form
34328C4208J122806J153280K22042q87568j118167m20865J04745k79871p19449
34319g88839m4680J067089Q57811n50383j031630J42050J026906K42625p48900
34310A72049k15690R84823J063540J59882m78890p24465r46152n67355O35940
34301H3682J154703p3770j409293q67202N12022L76718q89895q83164O31486J377295
34291A2582M15335n58651j63853Q65488J317325R22442j54985j429541j674817
34282d48675k45467J335213J098308l20462n89532N67978J062584p055j083028
34273A369864r37828l62442l48621o13529o26615l96763J65163J037194J216400
34264E02823o8120j436641q91962Q62189J220230j65093r13423J2336Q27356L27771
$$ plain form
34254 277466 31826 110413 368619 -29200 -761816 -831653 -404504 -269155 -82772 768899
34244 768899 1214408 -188296 -2386061 -2887399 -1601840 -927643 -1767000 -2253680 -1197008
34235 -1197008 -103790 -469080 -1298347 -939802 292599 954506 749065 520947 771075
34226 771075 1297625 1701963 1509565 481867 -676670 -808358 16375 335336 -622974
34217 -622974 -1777554 -1812072 -924998 -161892 108031 208272 351671 574649 932889 1230346
34207 1230346 1099853 674818 472839 379171 -310931 -1508015 -2086347 -1572831 -1000090
34198 -1000090 -1343735 -2061720 -2027998 -1156408 -274525 18993 -321083 -1037800 -1554071 -1282587
34188 -1282587 -492171 -275012 -1159572 -2356085 -2793054 -2226065 -967493 615338 1843933
$$ packed form
34254B77466k45640P8587K58206l97819p32616o9837M27149J35349J86383Q51671
34244G68899M45509j402704k197765n01338J285559O74197q39357m86680J056672
34235a197008J093218l65290q29267L58545J232401O61907k05441k28118K50128
34226G71075N26550M04338j92398j027698j158537j31688Q24733L18961r58310
34217f22974j154580l4518Q87074P63106K69923J00241J43399K22978L58240K97457
34207A230346j30493m25035k01979r3668o90102j197084n78332N13516N72741
34198a000090l43645p17985L3722Q71590Q81883K93518l40076p16717n16271K71484
34188a282587P90416K17159q84560j196513m36969N66989J258572J582831J228595
$$ plain form
34179 1843933 1901648 940595 234909 593521 1389478 1750553 1798899 1959554 1952253 1404703
34169 1404703 716580 374299 92107 -426424 -583619 167958 1068746 935260 -77300
34160 -77300 -759504 -655279 -438971 -575847 -736919 -693583 -809001 -1285701 -1625343 -1251699
34150 -1251699 -294744 528772 635582 76821 -561869 -759993 -587163 -506241 -730815 -1112832
34140 -1112832 -1580327 -2122221 -2332628 -1728777 -722355 -440374 -1182033 -1866925 -1544874
34131 -1544874 -658780 -153647 -106967 -77205 -162316 -732245 -1495009 -1731200 -1237591 -347263
34121 -347263 665519 1515723 1652340 894087 22603 -72842 402603 593049 361264 304424
34111 304424 565563 633731 411262 540151 1330807 2057715 1766650 428844 -1022368
$$ packed form
34179A843933N7715r61053p05686L58612P95957L61075M8346J60655p301n47550
34169A404703o88123l42281k82192n18531j57195P51577R00788j33486j012560
34160g7300o82204J04225K16308j36876j61072M3336j15418m76700l39642L73644
34150a251699R56955Q23516J06810n58761o38690j98124J72830Q0922k24574l82017
34140a112832m67495n41894k10407O03851J006422K81981p41659o84892L22051
34131a544874Q86094N05133M6680K9762q5111n69929p62764k36191M93609Q90328
34121c47263J012782Q50204J36617p58253q71484r5445M75445J90446k31785n6840
34111C04424K61139O8168k22469J28889P90656P26908k91065j337806j451212
$$ plain form
34102 -1022368 -1636063 -1282937 -647114 -407659 -448679 -85283 919363 1950424 2270838
34093 2270838 1708247 493605 -958788 -1861942 -1437872 -27866 880078 386603 -701377
34084 -701377 -1175549 -1091434 -1174531 -1265971 -662038 335232 577509 -197827 -996798 -1085235
34074 -1085235 -762551 -358805 432857 1689364 2605194 2398301 1354487 417603 105007
34065 105007 245370 438251 353465 -163280 -880038 -1202473 -703777 421571 1571354
34056 1571354 2273763 2381990 1911193 955975 -195686 -1064332 -1302298 -1040169 -736572
34047 -736572 -588724 -322238 218760 573519 213861 -590732 -1021263 -745259 -118325 548378
34037 548378 1175317 1403782 828140 -84368 -249305 556925 1389164 1593039 1519402 1413178
$$ packed form
34102a022368o13695L53126O35823K39455m1020L63396J004646J031061L20414
34093B270838n62591j214642j452393r03154M24070J410006R07944m93475j087980
34084g01377m74172Q4115q3097r1440O03933R97270K42277p75336p98971q8437
34074a085235L22684M03746P91662J256507R15830k06893j043814r36884l12596
34065A05007J40363J92881q4786n16745p16758l22435M98696J125348J149783
34056A571354P02409J08227m70797r55218j151661q68646k37966K62129L03597
34047g36572J47848K66486N40998L54759l59658q04593m30531K76004O26934O66703
34037E48378O26939K28465n75642r12508j64937Q06230Q32239K03875p3637j06224
$$ plain form
34027 1413178 853185 -56037 -252212 607591 1301250 958196 531923 1029182 1589922
34018 1589922 1062800 329862 926740 2158202 1999466 515549 -154037 646770 1079517
34009 1079517 16775 -1064390 -540287 871883 1447936 906450 190971 -194678 -425357
34000 -425357 -631611 -884491 -1331750 -1724940 -1508674 -843332 -609111 -893699 -609706 684588
33990 684588 1782660 1578577 688047 216208 -47089 -878322 -1890963 -1996292 -1099041
33981 -1099041 -50406 675980 1078572 882155 -6055 -699088 -369683 217520 -319697
33972 -319697 -1684440 -2224655 -1579498 -1195377 -1779577 -2080220 -1138428 -125224 -525693
33963 -525693 -1660089 -1660265 -273054 948654 1003209 418959 -173425 -887128 -1536680 -1166917
$$ packed form
34027A413178n59993r09222j96175Q59803O93659l43054m26273M97259N60740
34018A589922n27122p32938N96878J231462j58736j483917o69586Q00807M32747
34009A079517j062742j081165N24103J412170N76053n41486p15479l85649k30679
34000d25357k06254k52880m47259l93190K16266O65342K34221k84588K83993J294294
33990F84588J098072k04083q90530m71839k63297q31233j012641j05329Q97251
33981a099041J048635P26386M02592j96417q88210o93033L29405N87203n37217
33972c19697j364743n40215O45157L84121n84200l00643R41792J013204m00469
33963e25693j134396j76J387211J221708N4555n84250n92384p13703o49552L69763
$$ plain form
33953 -1166917 464507 1925152 1693363 106325 -1268035 -1720134 -1761898 -1718960 -1264649
33944 -1264649 -483785 -189039 -696246 -1207334 -972919 -316944 69012 148627 190203 12961
33934 12961 -617167 -1237245 -1102045 -147640 1006063 1744009 1713940 871953 -177855 -433246
$$ packed form
33953a166917J631424J460645k31789j587038j374360m52099m1764M2938M54311
33944a264649P80864K94746n07207n11088K34415O55975L85956P9615M1576j77242
33934A2961o30128o20078J35200R54405J153703P37946l0069q41987j049808k55391
$$ [...]
##END NTUPLES=NMR SPECTRUM
##END=
