##TITLE=31Pdec_3E1503
 DMSO-d6, 64 sc
 16.3.2023
##JCAMPDX= 6.0         $$ Bruker NMR JCAMP-DX V2.0
##DATA TYPE= NMR SPECTRUM
##DATA CLASS= NTUPLES
##ORIGIN= UXNMR, Bruker Analytische Messtechnik GmbH
##OWNER= root
$$ XWIN-NMR		Version 3.5
$$ Thu Mar 16 13:56:34 2023 Russian Standard Time (UT+4h)  she@DPX200
##.OBSERVE FREQUENCY= 81.013821
##.OBSERVE NUCLEUS= ^31P
##.ACQUISITION MODE= SIMULTANEOUS
##.ACQUISITION SCHEME= undefined
##.AVERAGES= 24
##.DIGITISER RES= 16
##SPECTROMETER/DATA SYSTEM= spect
##.PULSE SEQUENCE= zgpg30
##.SOLVENT NAME= CDCl3
##.SHIFT REFERENCE= (INTERNAL, CDCl3, 0, 248.564)
##AUDIT TRAIL= $$ (NUMBER, WHEN, WHO, WHERE, WHAT)
$$ ##TITLE= Audit trail, XWIN-NMR		Version 3.5
$$ ##JCAMPDX= 5.01
$$ ##ORIGIN= Bruker BioSpin GmbH
$$ ##OWNER= she
$$ F:/spectra/data/she/nmr/P31/1/pdata/1/auditp.txt
$$ ##AUDIT TRAIL=  $$ (NUMBER, WHEN, WHO, WHERE, WHAT)
(   1,<2023-03-16 13:55:10.25 +0400>,<she>,<DPX200>,
      <created by zg, POWCHK disabled, PULCHK disabled
       configuration hash MD5:
       00 E9 B6 7A A2 85 ED C7 34 08 36 98 17 FE 4E 26
       data hash MD5: 32K
       41 9F BB 30 D6 59 8C FC 75 B5 3E DF 62 39 6D E6>)
(   2,<2023-03-16 13:55:12.70 +0400>,<she>,<DPX200>,
      <Start of raw data processing
       efp BC_mod = 2 LB = 1 FT_mod = 6 PKNL = 1 PHC0 = -10956.57 PHC1 = 21.01018 SI = 64K 
       data hash MD5: 64K
       9A 6C 80 70 B3 BB EB 6C 65 29 41 2F 54 96 B4 4F>)
(   3,<2023-03-16 13:55:50.90 +0400>,<she>,<DPX200>,
      <pk PHC0 = 76.59373 PHC1 = 0 
       data hash MD5: 64K
       99 4A 14 0D AF 65 46 39 0B 61 25 8F B3 61 7C B9>)
(   4,<2023-03-16 13:56:05.50 +0400>,<she>,<DPX200>,
      <abs ABSG = 5 
       data hash MD5: 64K
       FE 2A FA 05 3D 72 47 46 47 EC DF AC 86 60 B6 D1>)
$$ ##END=
$$ 
$$ hash MD5
$$ 44 F4 57 04 7A 3C 26 19 9B 75 17 64 ED F8 E9 0E
##$RELAX= 
##$RELAX= 
##$RELAX= 
##$RELAX= 
##$RELAX= 
##$RELAX= 
##$RELAX= 
##$RELAX= 
##$RELAX= 
$$ Bruker specific parameters
$$ --------------------------
##$DU= <F:/spectra>
##$EXPNO= 1
##$NAME= <P31>
##$PROCNO= 1
##$TYPE= <nmr>
##$USER= <she>
##$AMP= (0..31)
100 100 100 100 100 100 100 100 100 100 100 100 100 100 100 100 100 100 
100 100 100 100 100 100 100 100 100 100 100 100 100 100 
##$AQSEQ= 0
##$AQ_mod= 1
##$AUNM= <au_zg>
##$AUTOPOS= <>
##$BF1= 81.014009
##$BF2= 200.13
##$BF3= 200.13
##$BF4= 200.13
##$BF5= 200.13
##$BF6= 200.13
##$BF7= 200.13
##$BF8= 200.13
##$BYTORDA= 1
##$CFDGTYP= 0
##$CFRGTYP= 5
##$CHEMSTR= <none>
##$CNST= (0..31)
1 1 145 1 1 1 1 1 1 1 1 1 1 1 1 1 1 1 1 1 1 1 1 1 1 1 1 1 1 1 1 1 
##$CPDPRG= <waltz16>
##$CPDPRG1= <>
##$CPDPRG2= <waltz16>
##$CPDPRG3= <>
##$CPDPRG4= <mlev>
##$CPDPRG5= <mlev>
##$CPDPRG6= <mlev>
##$CPDPRG7= <mlev>
##$CPDPRG8= <mlev>
##$CPDPRGB= <>
##$CPDPRGT= <>
##$D= (0..31)
0 1 0 0 0 0 0 0 0 0 0 0.03 2e-05 3e-06 0 0 0 0 0 0 0 0 0 0 0 0 0 0 0 0 
0 0 
##$DATE= 1678960509
##$DBL= (0..7)
120 120 120 11 120 120 24 19 
##$DBP= (0..7)
150 150 150 150 150 150 150 150 
##$DBP07= 0
##$DBPNAM0= <>
##$DBPNAM1= <>
$$ [...]
##$SUBNAM3= <"">
##$SUBNAM4= <"">
##$SUBNAM5= <"">
##$SUBNAM6= <"">
##$SUBNAM7= <"">
##$SUBNAM8= <"">
##$SUBNAM9= <"">
##$SW= 501.771253377433
##$SWIBOX= (0..15)
0 1 3 0 0 0 0 0 0 0 0 0 0 0 0 0 
##$SW_h= 40650.406504065
##$TD= 32768
##$TD0= 1
##$TE= 0
##$TE2= 300
##$TE3= 300
##$TEG= 300
##$TL= (0..7)
0 120 53 12 22 120 120 120 
##$TP= (0..7)
150 150 150 150 150 150 150 150 
##$TP07= 0
##$TPNAME0= <>
##$TPNAME1= <>
##$TPNAME2= <>
##$TPNAME3= <>
##$TPNAME4= <>
##$TPNAME5= <>
##$TPNAME6= <>
##$TPNAME7= <>
##$TPOAL= (0..7)
0.5 0.5 0.5 0.5 0.5 0.5 0.5 0.5 
##$TPOFFS= (0..7)
0 0 0 0 0 0 0 0 
##$TUNHIN= 0
##$TUNHOUT= 0
##$TUNXOUT= 0
##$USERA1= <user>
##$USERA2= <user>
##$USERA3= <user>
##$USERA4= <user>
##$USERA5= <user>
##$V9= 5
##$VALIST= <valist>
##$VCLIST= <CCCCCCCCCCCCCCC>
##$VD= 0
##$VDLIST= <DDDDDDDDDDDDDDD>
##$VPLIST= <PPPPPPPPPPPPPPP>
##$VTLIST= <TTTTTTTTTTTTTTT>
##$WBST= 1024
##$WBSW= 4
##$XGAIN= (0..3)
0 0 0 0 
##$XL= 0
##$YL= 0
##$YMAX_a= 1418
##$YMIN_a= -1396
##$ZGOPTNS= <>
##$ZL1= 120
##$ZL2= 120
##$ZL3= 120
##$ZL4= 120
##$ABSF1= 248.5645
##$ABSF2= -253.2056
##$ABSG= 5
##$ABSL= 3
##$ALPHA= 0
##$AQORDER= 0
##$ASSFAC= 0
##$ASSFACI= 0
##$ASSFACX= 0
##$ASSWID= 0
##$AUNMP= <proc_1d>
##$AZFE= 0.1
##$AZFW= 0.5
##$BCFW= 0
##$BC_mod= 2
##$BYTORDP= 0
##$COROFFS= 0
##$CY= -3
##$DATMOD= 1
##$DC= 0
##$DFILT= <>
##$DTYPP= 0
##$F1P= 0
##$F2P= 0
##$FCOR= 1
##$FTSIZE= 65536
##$FT_mod= 6
##$GAMMA= 0
##$GB= 0
##$INTBC= 1
##$INTSCL= 6.047779e-11
##$ISEN= 30
##$LB= 1
##$LEV0= 0
##$LPBIN= 0
##$MAXI= 10000
##$MC2= 0
##$MEAN= 0
##$ME_mod= 0
##$MI= 50
##$NCOEF= 0
##$NC_proc= -7
##$NLEV= 6
##$NOISF1= 182.463
##$NOISF2= 159.3651
##$NSP= 0
##$NTH_PI= 0
##$NZP= 0
##$OFFSET= 248.5645
##$PC= 4
##$PHC0= -10879.98
##$PHC1= 21.01018
##$PH_mod= 1
##$PKNL= yes
##$PPARMOD= 0
##$PSCAL= 0
##$PSIGN= 0
##$REVERSE= no
##$SF= 81.0140089999694
##$SI= 65536
##$SIGF1= 159.3651
##$SIGF2= -187.1042
##$SINO= 113.3802
##$SIOLD= 16384
##$SREGLST= <1H.CDCl3>
##$SSB= 0
##$STSI= 65536
##$STSR= 0
##$SW_p= 40650.406504065
##$SYMM= 0
##$S_DEV= 0
##$TDeff= 32768
##$TDoff= 0
##$TI= <>
##$TILT= no
##$TM1= 0
##$TM2= 0
##$TOPLEV= 0
##$USERP1= <user>
##$USERP2= <user>
##$USERP3= <user>
##$USERP4= <user>
##$USERP5= <user>
##$WDW= 1
##$XDIM= 65536
##$YMAX_p= 443592911
##$YMIN_p= -9699192
$$ End of Bruker specific parameters
$$ ---------------------------------
##NTUPLES= NMR SPECTRUM
##VAR_NAME=  FREQUENCY,     SPECTRUM/REAL,   SPECTRUM/IMAG
##SYMBOL=    X,             R,               I
##VAR_TYPE=  INDEPENDENT,   DEPENDENT,       DEPENDENT
##VAR_FORM=  AFFN,          ASDF,            ASDF
##VAR_DIM=   65536,         65536,           65536
##UNITS=     HZ,            ARBITRARY UNITS, ARBITRARY UNITS
##FACTOR=    0.620285442955139, 1,           1
##FIRST=     20137.2065510682, 0,            0
##LAST=      -20513.1999529968, 0,           0
##MIN=       -20513.1999529968, -9699192,    0
##MAX=       20137.2065510682, 443592911,    0
$$ Real data points
##PAGE= N=1
##DATA TABLE= (X++(R..R)), XYDATA
$$ [...]
39905C04265k03501l78892k48510K2973J94447J93783Q1115n1597j06027l5954
39895b27898P8032J02537K4052l0429K9442J30006J35199L8131k8748K495J4867
39884B67686j01817k11827r1971J68478K00216j00120l43543j87586J59175K71899
39874C0590J28816K8032M9391J9620p1605n4393M1691Q175j23561r1430J20618
39863H5944K13879O3576j02225j10035o5276n9890n142J17372J58700P9869L4126
39852D10898P6381P7485m763o6404j07157k16103k92283j46045J08299J68940
39842I248O7208J11174K84654K32974p1130k21015q3114k0353j99947k78594n8269
39831b27164J32777N4162j6926J43146K45768L6280k06756j80559q7863j72555
$$ y = [304265, 100764, -278128, -526638, -503665, -309218, -115435, -34320, -85917, -191944, -227898, -149866, -47329, -23277, -53706, -24264, 105742, 240941, 279072, 250324, 252819, 267686, 165869, -45958, -137929, 30549, 230765, 130645, -212898, -400484, -241309, 30590, 159406, 187438, 236829, 256449, 184844, 130451, 172142, 180317, 56756, -34674, 85944, 299823, 363399, 261174, 151139, 85863, 25973, 20831, 138203, 296903, 376772, 410898, 487279, 564764, 560001, 493597, 386440, 170337, -121946, -267991, -159692, 9248, 76456, 187630, 472284, 705258, 634128, 413113, 329999, 309646, 109699, -168895, -227164, -94387, -40225, -57151, 85995, 331763, 368043, 161287, -19272, -107135, -279690]
39821b79690j95219Q8843L59149K23999q2788j00583P9287M8206j66366k00523
39811b25685j6086J16939J42101J83678J57403n6680k20742n6723K03797J37798
39801C65800j52958k18910k7839N2021m6240k7970J30656J01263j80255l68127
39791c72559k73912q9381M0404J93154L29958K45493k0697j43019l885J47831
39781E3387J32313O5877N8608L9273k3358m8850n9140j46821k06795n3075J81018
39770g563J56393j16116k54139j13826J5898m6206q0211R1284K63305K00603J1707
39759A21129p4180m5562n913L8266Q8118N6122o3091j11492r600R7669O5783n5817
39747A01432j60138k19917j90818P459K93255M13038K62187L3809o5545n7623
$$ y = [-279690, -474909, -386066, -26917, 197082, 114294, 13711, 92998, 141204, -25162, -225685, -241771, -124832, 17269, 200947, 358350, 301670, 80928, 24205, 228002, 365800, 212842, -6068, -33907, 18114, -28126, -56096, 74560, 175823, -4432, -372559, -646471, -735852, -695448, -502294, -172336, 73157, 52460, -90559, -94444, 53387, 185700, 251577, 310185, 349458, 326100, 277250, 218110, 71289, -135506, -188581, -7563, 148830, 32714, -221425, -335251, -319353, -365559, -445770, -354486, -91181, 109422, 121129, 46949, 1387, -4526, 33740, 121858, 177980, 114889, 3397, -6203, 91466, 157249, 101432, -58706, -278623, -469441, -461982, -168727, 244311, 506498, 540307, 474762, 417139]
39737D17139l9694j899N7765L1098j18079k27196j56600n606M8308M488k4346
39726a4622k3238n1157p5681n751J23834J47191j4538k18782k49389p3928J15235
39715c40826J50849J11171J75635K96672K16970j21222m01932l32785m0846J36336
39705a49978J13972O9441Q7069O7248l4730j21776j21369n5859M5927J47221J53706
39694B00872L2324p7403m5122L4898K014r5016j08200p6335j33882k17465j58433
39683f41748p507M4586K2116J01717K25627J54589p7720j62061l2191K4358j02561
39672d50795j25189J22384L38498K25148j8486k8704J33020J15703j22491k44001
39662e4913n7042K17317K82936J35433k4089q5456j05960j57517k14402k06542
$$ y = [417139, 377445, 375546, 433311, 464409, 346330, 119134, -37466, -43072, 5236, 9724, -14622, -37860, -89017, -164698, -170449, -46615, 100576, 86038, -132744, -382133, -456061, -340826, -189977, -78806, 96829, 393501, 610471, 489249, 87317, -245468, -286314, -149978, -36006, 33435, 120504, 187752, 153022, 31246, -90123, -145982, -100055, 47166, 200872, 233196, 155793, 110671, 145569, 147583, 52567, -55633, -131968, -265850, -483315, -641748, -649255, -604669, -582553, -480836, -255209, -100620, -178340, -340401, -372592, -348234, -450795, -575984, -453600, -115102, 110046, 91560, 62856, 195876, 311579, 189088, -54913, -111955, 105362, 388298, 523731, 499642, 414186, 308226, 150709, -63693, -270235]
39652b70235j23943k2546N9764J35716J98858J88056P8294m6796q6337m6926p214
39641E6691m295k9867q3316j39878j25643k7380L4035l8088j37281p3716J53594
39630d15144L40470L27713J51056n5581j98868k55181k37354j54528J150J91614
39620c04653K83438J83877K3169J8532J27936Q3095j48517k36019l389K31199
39610B58668J22519j55252j90084L0080J59633O0160p8852j29993j52430j37490
39600b13041P092J97635K26741R8267Q153p477q1751j74947q1956J70513K85916
39589D35145J42323m5339r5392q0621q5694n3791J0873j8139j26467j15950N1248
39578A8196J41572J6464j55511j90626j36753q8058q679J05461J31677M5881J3854
$$ y = [-270235, -394178, -416724, -356960, -221244, -22386, 165670, 243964, 197168, 110831, 63905, 56691, 52396, 22529, -60787, -200665, -326308, -353688, -319653, -357741, -495022, -568738, -415144, -74674, 253039, 404095, 348514, 149646, -105535, -342889, -497417, -496267, -304653, -21215, 162662, 185831, 204363, 332299, 415394, 266877, 30858, 27469, 258668, 381187, 225935, 35851, 65931, 225564, 285724, 206872, 76879, -75551, -213041, -205949, -8314, 218427, 316694, 324847, 317370, 235619, 60672, -21284, 149229, 435145, 577468, 532129, 436737, 356116, 270422, 216631, 227504, 209365, 82898, -33052, 18196, 159768, 176232, 20721, -169905, -306658, -394716, -403395, -297934, -166257, -120376, -106522]
39567a06522J03872J38466n517j75130j91756j08850m5806K3631J31299J66152
39557g0161O6475j9015L8586J20601N7712r7203j79597j47913l1063J88404M32227
39546C59053M37126O7745l88590n01217k18298J17964K37984J94845J42455Q6423
39536E35490n2014k44913l33706j91129J12265L26328K56880k1351k57369l12207
39526a81726k43364j20627O3255K54347K99057J50645k6401o2492K3139J12630
39516B68463J39628P4717q0831j98213j00002J45319K08271n2526l24251k53922
39506a73347L8779J53249O448r7322J5243J42180Q2265l8090n545J13654Q2814
39495C20328j25621k85849k40821q0067L7043P8343R2378R2091P6373P2080O0824
$$ y = [-106522, -2650, 135816, 130299, -44831, -236587, -345437, -391243, -367612, -236313, -70161, -3686, -22701, 15885, 136486, 194198, 96995, -82602, -230515, -261578, -73174, 359053, 796179, 863924, 475334, -25883, -244181, -126217, 111767, 306612, 449067, 535490, 483476, 238563, -95143, -286272, -174007, 152321, 409201, 387850, 130481, -181726, -425090, -545717, -482462, -228115, 70942, 221587, 195186, 132694, 155833, 268463, 408091, 482808, 401977, 203764, 103762, 249081, 457352, 404826, 80575, -173347, -134568, 18681, 25129, -72193, -56950, 85230, 167495, 129405, 123860, 237514, 320328, 194707, -91142, -331963, -412030, -374987, -296644, -204266, -112175, -35802, 36278, 97102]
39484I7102m1582k18463k69254o4332J93082J81854q0803k41517j00019J55363
39474c88569K73883K40826J29879o7681k77242k61616M0404L06858K42797J4265
39464B53804l6038O0218L422k14905k72687m8273J87251J92250N4953l6277n8926
39453H4792p2349p9120q0132j04450j16560m6802N8381Q6309N9450Q5480J15256
39442i745K201j78682j62253P9722K37707J25017l9132o76J16937L2049k14999
39431a1854k88325l6678K84231L28411O5407k11748k37096n5635P3026J1933j08233
39420a86561j06975j712N6037Q354o0982n6604M4798J89966K57634J52460m3537
39409B52878j28598n8140l471m9301n3280N0300O4270j30540k96558j86274N3735
$$ y = [97102, 55520, -162943, -432197, -496529, -303447, -121593, -202396, -443913, -543932, -388569, -114686, 126140, 256019, 188338, -88904, -350520, -310116, -3258, 239539, 253804, 217766, 277984, 281406, 66501, -206186, -254459, -67208, 125042, 179995, 143718, 84792, 12443, -66677, -146809, -251259, -367819, -414621, -356240, -269931, -210481, -125001, -9745, -7544, -186226, -348479, -268757, -31050, 93967, 54835, 54159, 171096, 203145, -11854, -300179, -336857, -52626, 275785, 341192, 129444, -107652, -163287, -90261, -78328, -186561, -293536, -295248, -239211, -230857, -291839, -348443, -303645, -113679, 143955, 296415, 252878, 124280, 66140, 62669, 13368, -39912, 10388, 74658, -55882, -352440, -538714, -484979]
39398d84979J41749J09717J38383J55564J3104j20703j2670J41293r626l07875
39388b36043k68416J08306L03455J11623r5671o3228j0776r2577p4231J58391
39378a59167K84048Q8417j28868o8519M7902j04254l44886k68934P9164K71945
39368c03152J46361j4566N3046K49849K93816P3395k31116l26036j17662J63407
39358a2658K29352P4364r4678j79006k11101j42530P9503K67160J81234m0799
39348A50841l5520J86075K23135n5333k94901k41435r1943p0448q3589k2354l504
39337c38976p3810n6244Q2186J02181m3889n0558J78263K68951J1801k06686k0170
39326a46951K83240K22327j15851k77566j53715j485O0140J21132J74108J28817
$$ y = [-484979, -343230, -233513, -95130, 60434, 73538, -47165, -59835, 81458, 71832, -236043, -504459, -396153, -92698, 18925, -76746, -139974, -150750, -243327, -317558, -159167, 124881, 213298, 84430, 15911, 63813, -40441, -385327, -654261, -575097, -303152, -156791, -171357, -118311, 131538, 425354, 498749, 267633, -58403, -176065, -12658, 216694, 291058, 196380, 17374, -193727, -336257, -256754, 10406, 191640, 150841, 115321, 301396, 524531, 469198, 174297, -67138, -159081, -229529, -313118, -335472, -338976, -412786, -469030, -386844, -284663, -328552, -379110, -200847, 68104, 79905, -126781, -146951, 136289, 358616, 242765, -34801, -188516, -190001, -129861, -8729, 165379, 294196]
39316B94196L0419l8542j22628k03642q5146K42393M05246J62173j73165k12098
39306B99206r2279j49164k73502j31070J80003K52846M2275j13360p5499k3358
39296h3902l5619j5238N066p9863j31390N2880K94889K33673o6435j87873l9399
39285e3211L8162j00624j79249l3242R5345K61j34491n3768J76826L03573K10413
39274B69995k3577k28100k40628o7190N8533l2451j59879o2586J44307J41690
39264a99886k5083K75K34931K59982p0717l09940r1783K76230K75953m6754j95908
39253A07300K0855K63876J95401q8690k66812k13275o6355J2967K71n4809j21215
39242b10486j60450r6465Q2206K33840K08150O6546N817N5792M2393j00238j94352
$$ y = [294196, 324615, 286073, 163445, -40197, -125343, 117050, 522296, 684469, 511304, 299206, 206927, 57763, -215739, -346809, -166806, 86040, 128315, 14955, -60544, -83902, -119521, -134759, -129693, -209556, -340946, -288066, 6823, 240496, 174061, -13812, -53211, -15049, -115673, -294922, -328164, -232819, -232558, -367049, -420817, -243991, 59582, 269995, 246418, 18318, -222310, -289500, -230967, -263418, -423297, -485883, -341576, -199886, -224969, -224694, 10237, 270219, 199502, -110438, -202221, 74009, 349962, 303208, 107300, 128155, 392031, 587432, 498742, 231930, 18655, -47700, -34733, -34462, -89271, -210486, -370936, -467401, -385195, -151355, 56795, 123341, 129158, 184950, 227343, 127105, -67247]
39231f7247r9741O8668J36252R9916L0413o5888j42900p6877J01110J45908m2017
39220H7597k15374j45329L7155R5730N3513M6683M4412o512Q266J20635R5522
39209B22298j70253l40390j27751J80681J52317q5896j04959O9360O1173j23542
39199b66962j15874J02336J52851l2612r6615O0079J07469n4431r0190J10259
39189a23690J80579l7505j53266P9926K84668R7629j98848j67242O1073P0022
39179I3346j29667j89823k9223J24360J65233J68008J20087k8578j37308m2730
39169A13705J19273P9831j36507k46009j16114J15882K75265K73353Q5219j75388
39159C88510k69405j38104m4084j67091k63806n8706K27168J70996j51182k48092
$$ y = [-67247, -166988, -98320, 37932, 137848, 168261, 102373, -40527, -117404, -16294, 129614, 87597, -127777, -273106, -235951, -140221, -86708, -40025, 4387, -2125, 6141, 126776, 222298, 52045, -288345, -416096, -235415, -83098, -168994, -273953, -204593, -143420, -266962, -382836, -280500, -127649, -160261, -256876, -196797, -89328, -143759, -233949, -123690, 56889, 19384, -133882, -53956, 230712, 328341, 129493, -37749, 23324, 93346, -36321, -226144, -255367, -131007, 34226, 202234, 322321, 293743, 156435, 113705, 232978, 312809, 176302, -69707, -185821, -69939, 205326, 478679, 563898, 388510, 119105, -18999, -63083, -230174, -493980, -552686, -325518, -154522, -305704, -553796]
39149e53796K2976K72575K28876Q7239N7273J7319j38366k06848m0401J16769
39139a36384L381j90192j01206K15770L58353J70160q4547j49168p8529m9244
39129d1606r3480j13478k8962J38258K48818J49871j08066k48623j09763J10676
39119i6355J49548P6023J02706J32551q5489l85288k81189K39585N41959K37536
39109F31587k16412k15567Q8925J11535k06929l62012j27700J45667J45250J1383
39099E727j6994K6046J3476k1968n656K5410K9680M0284M6475j9969j20126j26734
39087a24349m8587k2926n7997k5054O6142N5358n9853q8146K3216J07598R0723
39076h3875Q0079Q5342j2430j40632o3201J64654J81494q7278k58693j24900L171
$$ y = [-553796, -530820, -258245, -29369, 57870, 115143, 132462, -5904, -212752, -253153, -136384, -133003, -323195, -424401, -208631, 149722, 319882, 235335, 86167, 7638, -41606, -135086, -248564, -277526, -139268, 109550, 259421, 151355, -97268, -207031, -96355, 53193, 129216, 231922, 364473, 278984, -106304, -387493, -147908, 394051, 631587, 415175, 199608, 288533, 400068, 193139, -168873, -296573, -150906, -5656, 5727, -11267, 14779, 28255, 6287, 631, 26041, 55721, 96005, 142480, 122511, 2385, -124349, -172936, -195862, -253859, -278913, -212771, -157413, -217266, -305412, -282196, -174598, -83875, -3796, 81546, 69116, -71516, -134717, 29937, 211431, 124153, -134540, -259440, -256269]
39065b56269j22814k20832J2458L22325K93868K3072r8217l2368l3450j07550
39055b19777m2453J15001R5031j02093j81357m1589R0965N9559k6324m8670m8993
39044c50700p0983o3612k6P3789J26077J45250R6263n836n5993j2126K8514K1114
39032f8269O5137J60525J01620j74243l66466k06256J34970L10566K66174J52089
39022C75847k190j84004j92721O2381K49390L4736l35137l42058J7251K49901
39012f6604J37563j6414L6765J38057P7022q0300j78197j97612j67350p9852J8568
39001c78354M9826N1243J12993J81711J32182k67p8101j00079j48205j61326j8984
38990c57361J98090K80399J78052K945j67197k72737k01161K2417J44215M9077
$$ y = [-256269, -379083, -599915, -587457, -265132, 28736, 51808, -46409, -78777, -112227, -219777, -262230, -147229, -52198, -154291, -335648, -377237, -286272, -226713, -253037, -301707, -350700, -421683, -485295, -485321, -411532, -285455, -140205, -43942, -49778, -105771, -117897, -89383, -68269, -3132, 157393, 259013, 84770, -281696, -487952, -352982, -42416, 223758, 375847, 373657, 189653, -3068, 59313, 308703, 343439, 8302, -333756, -316505, -66604, 70959, 54545, 91310, 229367, 306389, 226089, 47892, -149720, -317070, -396922, -378354, -328528, -277285, -164292, 17419, 149601, 149334, 71233, -28846, -177051, -338377, -357361, -159271, 121128, 299180, 302125, 134928, -137809, -338970, -316553, -172338, -123261]
38980a23261j616J78937K87209J487l87887l67373l1590R0963o5246n7504K09284
38969b66597K82537l3180l12725k02509O3534J28369M2545L2060R7149J21489
38959d7328J04426P3375L208n0188J0302Q9026P811j23200k1183K43458K74346
38948E64053q915k18852j29074J3956p628l9903M4186M9114j48171k97049j73197
38937c51480N3837J34391J04808Q2200J8984p8714k5805J73603J83499j27266
38927A68057l56806j45654K37865L00937N1065j23359r2743m4575l1602P3633
38917C6818K12334J57157o9394j65470j8198J19274M0872r4566m1004J27237J17754
38906D22814j28274l11769j78878J10749J95666K8938o3889R8731K51172R1463
$$ y = [-123261, -124877, 54060, 341269, 342756, -45131, -412504, -444094, -353131, -418377, -475881, -266597, 15940, -17240, -329965, -532474, -468940, -340571, -298026, -265966, -168817, -47328, 57098, 130473, 133681, 83493, 93795, 182821, 190632, 67432, 46249, 289707, 564053, 555138, 336286, 207212, 221168, 213540, 173637, 217823, 266937, 118766, -178283, -351480, -297643, -163252, -58444, 23756, 42740, -35974, -61779, 111824, 295323, 168057, -188749, -334403, -96538, 204399, 255464, 132105, 39362, -5213, -36815, 36818, 249152, 406309, 336915, 171445, 153247, 272521, 313393, 218827, 177823, 305060, 422814, 294540, -17229, -196107, -85358, 110308, 139246, 75357, 174088, 425260, 516723]
38896E16723k24905k96306n5868J74132J59405r114j42501j53010l0176J44409
38886H2789J78294j4725k34731k55151j49324r3202r277K27718L90100J70507
38876B92998k32652l17923n0202J05432m5533j76574o5116Q2286R9120J30459
38866a77705K25933J61682q5839j65687O8222K50382Q3637j84866j95024j3064
38856c2329R2415Q6209N6023l6776j88031k02659K731K03119K09280J31331Q3901
38845D05214m2875k70130l35231j05127J34620J09860k6209j5718O6015K6007
38835e3574o7478n7279o976k6657k6394O6709J00968k857k8402J52921K72522
38824C23503Q8523j71297j82234p0521j50005l26427k40186J13750L54992K68840
$$ y = [516723, 291818, -4488, -60356, 113776, 273181, 264067, 121566, -31444, -61620, 82789, 261083, 246358, 11627, -243524, -392848, -486050, -495327, -267609, 122491, 292998, 60346, -257577, -307779, -202347, -247880, -424454, -489570, -407284, -308164, -177705, 48228, 209910, 124071, -41616, 26606, 276988, 360625, 175759, -19265, -32329, 60086, 146295, 202318, 165542, -22489, -225148, -222417, -19298, 189982, 321313, 405214, 362339, 92209, -243022, -348149, -213529, -103669, -129878, -145596, -79581, -53574, -121052, -178331, -185307, -211964, -238358, -171649, -70681, -73538, -101940, 50981, 323503, 412026, 240729, 58495, -12026, -162031, -488458, -728644, -614894, -259902, 8938]
38814H938K2562j49717j76582q3452N6640J28469R6639M6100k018j27977k49454
38803d29852j09400K69562M44832J63015k03248j93506M9726O5301j72842k78394
38793c94806j13683N7827O3328L2878P2020Q4146P945m4257J9671J27296J54045
38782F6410O2481p7455j33906l8824Q0505L0414j33316j32847Q9849K31080R6408
38771A40799p6811j2569J60995J64012K5954m0894l7441r4699j44733l8113J10788
38760A57288N5087j57222k23089m8619J24335R2978m8304r2352M348J03397P1177
38749C9024n3974r8614J831P5095k5506j34084j6194J79753J01342j85145k25823
38738c42295O9221K27736j3178k60820j27016J45438J43083l8668o1048L5246
$$ y = [8938, 31500, -118217, -294799, -378251, -321611, -193142, -96503, -50403, -52421, -180398, -429852, -539252, -269690, 175142, 338157, 134909, -58597, -8871, 56430, -116412, -394806, -508489, -450662, -387334, -354456, -282436, -198290, -190345, -234602, -214931, -87635, 66410, 128891, 51436, -82470, -121294, -40789, -10375, -143691, -276538, -186689, 44391, 140799, 63988, 51419, 212414, 376426, 402380, 361486, 324045, 229346, 84613, 46500, 157288, 212375, 55153, -167936, -216555, -92220, 758, -47546, -139898, -135550, -32153, 39024, -14950, -113564, -111733, -36638, -62144, -196228, -212422, -32669, 68673, -116472, -342295, -273074, -45338, -58516, -319336, -446352, -300914, -157831, -196499, -257547, -222301]
38728b22301j4883j53051j06761R7918J84443R3555K0435O3520J50786K17135
38718C30796J96672o599k96394l46572n3170K20059J39464j20037k08989j27874
38708b72644o3309M649J33276J38447q5495k34963l7859K34992J80704o3654q6750
38697a52606P6382O1472j35419j68127K6744J48952O8736l6721o6847q8152p3765
38686c39351M9243J52221Q1628k2266L4904J02799m0631j98834m1247K74950L10554
38675C63970N7882j08724j02426j59004k63064j52735J05274J53641p848j4102
38665a27136J69010J63090r6993j88230N5852K27920M6279j67386m6581K23037
38655B58862K29874n3051l05421k94521m6816K35257K93946M7798k28951j87881
$$ y = [-222301, -237184, -390235, -496996, -399078, -214635, -121080, -100645, -37125, 113661, 330796, 527468, 520869, 224475, -122097, -175267, 44792, 184256, 64219, -144770, -272644, -335953, -331304, -198028, -59581, -145076, -380039, -417898, -182906, -2202, -65856, -152606, -76224, -14752, -150171, -318298, -291554, -142602, -73866, -110587, -177434, -265586, -339351, -290108, -137887, -56259, -78525, -43621, 59178, 18547, -180287, -221534, 53416, 363970, 421852, 313128, 210702, 51698, -211366, -364101, -258827, -105186, -113034, -127136, 41874, 204964, 107971, -80259, -24407, 203513, 249792, 82406, 35825, 258862, 488736, 435685, 130264, -164257, -211073, 24184, 318130, 365928, 136977, -50904]
38645e0904J06691K52140Q3232j55359k42321k22939j56079P566J90934J87794
38635G55J2824p1339K2129Q7131K8168J9694J27690J33817p4926k61109k00538
38624a75704l3046k4556j63369j98492J6070L39726M66879K33203j41124k34203
38614H5384K5229K02450o973k59375q7976K94967K85691j34188l48519p4861K51512
38603B33341K29076M6287K5189R8838N3640q5656j93624k54517k25359j5844K15049
38592A26420J18497k73748m33609o6045M16549M68704J29664j79935k79475k55968
38582b28946j14217J63478L46932J79389j64591k24144J02886L83718K32962j73336
38572E04131l43141j03630K03648J75445j51451l71273k30649R0129K62004K03089
$$ y = [-50904, 55787, 307927, 391159, 235800, -6521, -229460, -385539, -377973, -187039, 755, 13579, -57760, -35631, 51500, 79668, 99362, 227052, 360869, 285943, 24834, -175704, -208750, -233306, -396675, -595167, -579097, -239371, 227508, 460711, 319587, 85384, 110613, 313063, 306090, 46715, -41261, 253706, 539397, 405209, 56690, -18171, 233341, 462417, 508704, 533893, 632731, 686371, 600715, 407091, 152574, -72785, -88629, 126420, 244917, -28831, -462440, -528485, -111936, 356768, 486432, 306497, 27022, -228946, -343163, -179685, 167247, 346636, 182045, -42099, 60787, 444505, 677467, 504131, 160990, 57360, 261008, 436453, 285002, -86271, -316920, -226791, 35213, 238302]
38562B38302O8573j5073m0729l5727l8890r1371j40877o9575Q3790J13485j0029
38551F1879l5601J28122J65429j36846m20156k30250K45110M13869J43710j24809
38541B10457r8191M3290Q2810O1112L4894m9913j35069o2380R9279Q6847j13751
38530A59385k04206m7437J30166J17894l824p4314o7894j0883P6639J10501L9235
38519B25262n310R6810J81757L8924j74108j44317M3916K8588j79767j79891J20989
38508E2853L03255R3423k24775k71528p6658Q8217R3749n305q4342r792K01823
38497A60920K85117M6183k76100l01444q3768P351r3635j21120k5972j9396o9290
38486d91154P7245L21651K67484n5038j48737J06599K23291m2895k67717j16991
$$ y = [238302, 306875, 291802, 251073, 215346, 176456, 85085, -55792, -125367, -41577, 71908, 61879, 26278, 154400, 319829, 182983, -237173, -467423, -222313, 191556, 335266, 210457, 112266, 155556, 238366, 299478, 334372, 284459, 149390, 87010, 186289, 273136, 159385, -44821, -92258, 37908, 155802, 151978, 77664, 9770, -1113, 75526, 186027, 225262, 219952, 316762, 498519, 537443, 363335, 219018, 262934, 291522, 111755, -68136, 52853, 356108, 449531, 224756, -46772, -123430, -35213, 58536, 53231, -31111, -40903, 160920, 446037, 492220, 216120, -85324, -169092, -161741, -255376, -376496, -402468, -421864, -491154, -413909, -92258, 175226, 120188, -28549, 78050, 301341, 258446, -9271, -126262]
38476a26262R5069K3589r6710N3599K55342J53783r4911j13774M7441O6014o6828
38465A96352r0058M0907J32192J16258Q4386L7478r1570k32644k44184j26511
38455a77394J1907J19613J92411J99130J28046R530j47854l06880l15170r4091
38445c80752J29482Q2913j01187p0656J37364J43411q5716j39604J10044K53834
38435G9133N5023j31634J6547K40098J69060o9506j42304p3436r0564j67941j26529
38424b42053j100L5960l1286j04468j47378j28017J2922J79889J60316j8580p6478
38413c60273M5103O9699q9101j26660R3918K38396O7098j36719p0858P0286M086
38402a95025r7335M9944K64433J73092j46603k78808r3443J54762K50664J88797
$$ y = [-126262, -31193, -7604, -104314, -50715, 204627, 358410, 263499, 149725, 197166, 263180, 196352, 106294, 147201, 279393, 395651, 480037, 517515, 425945, 193301, -50883, -177394, -165487, -45874, 146537, 345667, 473713, 483243, 335389, 28509, -286661, -380752, -251270, -168357, -269544, -340200, -202836, -59425, -145141, -284745, -174701, 79133, 134156, 2522, 19069, 259167, 428227, 358721, 216417, 142981, 52417, -115524, -242053, -243153, -207193, -238479, -342947, -490325, -618342, -605420, -425531, -265215, -283795, -360273, -315170, -245471, -334572, -461232, -367314, -128918, -61820, -198539, -269397, -199111, -195025, -292360, -242416, 22017, 195109, 48506, -230302, -323745, -168983, 81681, 270478]
38392B70478J4107j95691k70837j26752Q5613J87094J87855J53995O2485n9936
38382C08411r0309m5726r6442k20454j81204J9996Q0426m9437l0291K17318K76553
38371A88841k0783j94043P8937L22758L7813l83537k51111K65364L81471o7327
38361C58383m27014k59715J22586K69012J58914q69r8664q0266P1159K07796J44761
38350D66083l9448r0581K8219J00567J5527j01675j29305q6815k6919J3787k3200
38339A26240j29620j54289R314K21054K48669O3597j57587k49394j64173K8458
38329a57731J57258J00566k0274J1620J39936J01771q4254q4409J53907K12245
38319E30635j30464m59353l16396J11214K98944J20168j23148k06705j53742m5018
$$ y = [270478, 284585, 88894, -181943, -308695, -223082, -35988, 151867, 305862, 368347, 308411, 218102, 172376, 75934, -144520, -325724, -305728, -225302, -274739, -305030, -87712, 188841, 168058, -25985, 52952, 375710, 413523, 29986, -221125, 44239, 425710, 358383, -68631, -328346, -205760, 63252, 222166, 221297, 122633, 42367, 113526, 321322, 466083, 426635, 336054, 364273, 464840, 480367, 378692, 249387, 162572, 135653, 149440, 126240, -3380, -157669, -148355, 72699, 321368, 384965, 227378, -22016, -186189, -157731, -473, 100093, 79819, 91439, 231375, 333146, 248892, 164483, 318390, 530635, 400171, -59182, -375578, -264364, 34580, 154748, 31600, -175105, -328847, -373865]
38309c73865L8293J1691n8388K0449K26460K79461J01110k9358K3951J5724j62400
38298I3128k02033L4263J39570j66147m53228k18804K81596M32991J83015l7566
38288H6785o8785r2720j33291n9091M5553K0522o532J29893K16258k317k73636
38277a37361j76154J68029K77632O7085j33646j80139j83849j12451J18049K72505
38267b0300Q7936j82692j05994J73580J48497j68440k64610j3481J66099R4878
38257h4527P5968K16466J84383j35114l52856k16927n415N443k4114R5664J81477
38246e9552L1997j60369j05184J24196K32340J27534m6727j68279k12834j68013
38236d04891l8633R8954J36312K5600j49812j84887N1461L70042L99142R2238
$$ y = [-373865, -335572, -323881, -382269, -361820, -135360, 144101, 245211, 215853, 239804, 255528, 93128, -108905, -74642, 64928, -101219, -554447, -773251, -491655, -58664, 124351, 86785, 18000, -74720, -208011, -267102, -221549, -201027, -207559, -77666, 138592, 136275, -137361, -313515, -145486, 132146, 199231, 65585, -114554, -298403, -410854, -292805, -20300, 67636, -115056, -221050, -47470, 101027, -67413, -332023, -345504, -179405, -84527, -8559, 207907, 392290, 257176, -95680, -312607, -318022, -312579, -336693, -241029, -59552, -27555, -187924, -293108, -168912, 63428, 190962, 144235, -24044, -236878, -404891, -443524, -344570, -208258, -182658, -332470, -517357, -465896, -95854, 303288, 395526]
38226C95526j45273l8845J26911k6436l41161l69984o8144K05500K64180K28165
38216B30439J57267r928j73670j44146J417O378j28878j63629n4649q47m7864
38205c28110k4913R1379J06269m1077j65479j35995k8088N7834J03319R8156O1576
38194b05129R2619K12596K56868J17141n9047j20723j58342k47753k07720O4020
38184b55470K75416J43690j28664j88434r4408j01117j34279J3038J85657J10313
38174a74258n8512K474J61374O3603j68519j12039J80874K43147j1162j93153
38164f6171j33003m4999k23J41072K60822Q1861k37330k46681K1339Q5245j26636
38153b64704j61138J04432K27464K0117j10321Q2042K47316R2355j25551j09703
$$ y = [395526, 250253, 211408, 338319, 311883, -29278, -399262, -467406, -261906, 2274, 230439, 387706, 377778, 204108, 59962, 61379, 67757, -61121, -224750, -279399, -280246, -328110, -353023, -261644, -155375, -196452, -361931, -497926, -526014, -468180, -364861, -266705, -205129, -112510, 100086, 356954, 474095, 415048, 294325, 135983, -111770, -319490, -255470, 19946, 163636, 34972, -153462, -247870, -348987, -483266, -470228, -284571, -174258, -232770, -230296, -68922, -5319, -173838, -285877, -105003, 138144, 126982, -66171, -199174, -244173, -244396, -103324, 157498, 239359, 2029, -244652, -223313, -138068, -264704, -425842, -321410, -93946, -73829, -184150, -102108, 145208, 237563, 112012, 2309]
38143B309m635k0275m6083L4789P8001J4253L2880J70642J51350j08159k74281
38132C0791j41663L9541M5770L5471J35767J31291j04149k87978j87316j3922
38122c16397k3665q9476j5463P4006J1826o2371K3735J37410J02542K7943O6269
38111f3641J09549K5526n7839L759Q8072M8837M72Q1547J62069O1961j39757k56433
38099F4122k54015j56189P1846L31797L43937L4083k70144k71236r3919m607R352
38088a94973R4602J83475J09501o4301j18124k697J18948R9888n6675k14584j86349
38077b31289P0023K99747J98676j44582l11858j36358P6066L5972j23839j26137
38067c93579K9839J54137J76157J51953J03169K6594l7758o2545o3136l0519M0624
$$ y = [2309, -2326, -22601, -68684, -33895, 44106, 58359, 91239, 261881, 413231, 305072, 30791, -110872, -71331, -25561, 9910, 145677, 276968, 172819, -115159, -302475, -316397, -340062, -429538, -445001, -370995, -359169, -421540, -397805, -260395, -157853, -129910, -63641, 45908, 71434, 13595, 17354, 105426, 154263, 154735, 236282, 398351, 460312, 320555, 64122, -189893, -346082, -274236, 57561, 401498, 435581, 165437, -105799, -199718, -204325, -194973, -100371, 83104, 192605, 128304, 10180, 7483, 126431, 226319, 169644, -44940, -231289, -161266, 138481, 337157, 192575, -119283, -255641, -179575, -143603, -267442, -393579, -363740, -209603, -33446, 118507, 221676, 248270, 210512, 147967, 84831, 54312, 94936]
38056I4936O8108k288m7499L8378Q2798j13593l35280j77604K80367M85979J89687
38045E63989k29224l54198k24284o1853P8821J74891J21522j8171J0671K22005
38035B84169K78436K1128k51903k70620j87646k12138k02054M4953L74789M86600
38025C65714L49985J33722p7421k39626k33482m9490R0385K5994j01969j05178
38015A58634m1786m9496p8404r844J12967J61785J01603l2549j85163k29919o9995
38004a62167J51825J84638N1839J680M0725q9767l75953m26032j00069K06935
37994e16346J83678O6626J42154K03981m2728l62796k95640J01769L13760J10478
37984i5064j86961k03172N4782L09143L36179J33421j07662j91366j32627j04538
$$ y = [94936, 163044, 160756, 113257, 151635, 234433, 120840, -214440, -392044, -111677, 374302, 563989, 334765, -19433, -243717, -305570, -226749, -51858, 69664, 51493, 62164, 284169, 562605, 583733, 331830, 61210, -126436, -338574, -540628, -495675, -120886, 365714, 715699, 849421, 772000, 532374, 298892, 249402, 339787, 365781, 263812, 158634, 116848, 67352, -11052, -20896, 92071, 253856, 355459, 322910, 137747, -92172, -162167, -10342, 174296, 226135, 227815, 268540, 178773, -197180, -623212, -723281, -516346, -332668, -266042, -123888, 80093, 37365, -325431, -621071, -519302, -205542, -95064, -282025, -485197, -430415, -121272, 214907, 348328, 240666, 49300, -83327, -187865]
37974a87865j47953j09403O3085J81961J08075k3322j4524J26778K60349K85589
37964E42770J41041j67208m36275l95141q2170J43136Q7700l8319j3592O0506
37954a57552J9930m7720j391P2118M1473O334J20598K85974K79824Q8457j06781
37943F01264j93104j91586j40308p5864o1182j00354r6843L315J11390J21177
37933b2095M2707n0831j07243q2682L7963J70354J94052J01702k2848j38087k15028
37922i2036j53924O2213K10617Q5346j49735j58056O2506J94401J03084k5581
37912A38835o4387r6327j33773m5771J43051K07914P6643o3322q1046m1142J2558
37901E3233J09316J61182M1323j30201j15720K7661L8743n8629N028J97370J64456
$$ y = [-187865, -335818, -445221, -382136, -200175, -92100, -115422, -129946, -3168, 257181, 542770, 683811, 516603, 80328, -314813, -396983, -253847, -166147, -204466, -218058, -157552, -137622, -185342, -186733, -114615, -73142, -66808, 53790, 339764, 619588, 708045, 601264, 408160, 216574, 76266, 402, -60780, -161134, -257977, -254662, -143272, -22095, 20612, -30219, -137462, -220144, -182181, -11827, 182225, 283927, 261079, 122992, -92036, -245960, -183747, 26870, 112216, -37519, -195575, -133069, 61332, 164416, 138835, 74448, -21879, -155652, -201423, -58372, 149542, 226185, 162863, 81817, 40675, 53233, 162549, 323731, 365054, 234853, 119133, 146794, 185537, 126908, 131936, 329306, 493762]
37890D93762j50195l50618k00600N4288J38424J00301N2020l9912j34950o9244
37880a06724J21311J85021O7699k8562n7565j68553k83672j35676J85173K57845
37870C6297K6218r3446M9005R7083j01230j71943Q8713K94355J19745j61377j85418
37859a998o1157k4233J3809J58189J90859m1000k59611j73185O9712J85819J80127
37848B37331J46843J0530k10337k49785l4785Q7271j05397l04778j64436J58066
37838d29477L05960K42759J22303m6785k65836l55466k10787l783R7243J37955
37828d05914J47705M6587p1273K7119K46008J98222j26244k58528j6178K07104
37818e392J58328J11292K33842K17639p9546k58383q0831O6726j16814k82250
$$ y = [493762, 343567, -7051, -207651, -153363, -14939, 85362, 137382, 97470, -37480, -106724, 14587, 199608, 267307, 238745, 181180, 12627, -271045, -406721, -221548, 36297, 62515, -30931, 18074, 115157, 13927, -158016, -69303, 225052, 344797, 183420, -1998, -63155, -87388, -73579, 84610, 275469, 234469, -25142, -198327, -128615, 57204, 237331, 384174, 394704, 184367, -65418, -100203, -12932, -118329, -423107, -587543, -429477, -123517, 119242, 241545, 194760, -71076, -426542, -637329, -641112, -543869, -405914, -258209, -211622, -282895, -255776, -9768, 188454, 62210, -196318, -212496, -5392, 152936, 264228, 498070, 715709, 636163, 377780, 296949, 363675, 246861, -35389]
37808c5389r0560J49826O6010j10211l8288Q6525j8280j24720M4186K24217R5803
37797B49119r2363m930J19796p0851l45396k94303m2228O8766J04627K27494J94376
37786A14107j66956m13956j31833K86277K38125r6268j31989J08827J66106K0938
37776f622K055P3984l74m7131J83610L49391J7531m31254l07105J94555K73623
37765C02263j24561k61256Q4923K85067P664k51243q9745J60127Q8246j48901
37755E2584k10829r4566L6073J33710J55677L0871j19850q1592O3895K2249j97084
37744b08862k56195l5029J98185K27959J35106M7010k0072m1800p017l0184j60716
37733a51615j88560L7442K54546J35511j69322k69444j50686p7840l6327J83603
$$ y = [-35389, -125949, 23877, 89887, -20324, -58612, 27913, 9633, -115087, -70901, 153316, 249119, 156756, 151826, 271622, 200771, -144625, -438928, -481156, -412390, -307763, -80269, 114107, -52849, -466805, -598638, -312361, -74236, -170504, -302493, -193666, -27560, -6622, -4567, 69417, 69043, 21912, 205522, 554913, 572444, 141190, -165915, 28640, 302263, 177702, -83554, 1369, 286436, 294100, 42857, -46888, 113239, 201485, 52584, -158245, -252811, -216738, -83028, 72649, 103520, -16330, -97922, -34027, -11778, -208862, -465057, -500086, -301901, -73942, 61164, 108174, 88102, 46302, 39285, 9101, -151615, -340175, -302733, -48187, 87324, -81998, -351442, -502128, -579968, -616295, -432692]
37723d32692M36855L37826o7628k81312p3898K32581K80329P7368j76044l13540
37713A9845k23068M9371K25768J07410j09858j18765K6335M9348p1545j30234
37703a75393p5512j1446O3750J76725J80265k1436k10407j56475J0823P0828J04425
37692d3853K33237K47066m6041l49832k63719P0138K04914Q4203l323J5482o351
37681A41921l3716O0968J43131J3678j86766k01713r9454o8675j3802J97368L49776
37670C02716K18789P117l2497o9273k71422l20385K9392L23014O9675l47370k49023
37659c39267J77692K09647j49065k13262J58239L55847R5082j89381j64381l2713
37649i1562R812O5134J43075Q8318k3471K1098R7228n1409k15258k024L69176
$$ y = [-432692, 4163, 341989, 274361, -6951, -80849, 151732, 432061, 509429, 333385, 19845, -203223, -153852, 71916, 179326, 69468, -49297, -22962, 26386, -45159, -175393, -250905, -262351, -198601, -21876, 158389, 136953, -73454, -229929, -219106, -148278, -43853, 189384, 436450, 390409, 40577, -223142, -153004, 51910, 136113, 132790, 148272, 141921, 108205, 169173, 312304, 325982, 139216, -62497, -161951, -230626, -244428, -47060, 302716, 521505, 528622, 496125, 426852, 155430, -164955, -135563, 187451, 257126, -90244, -339267, -161575, 48072, -100993, -314255, -156016, 199831, 294913, 105532, -58849, -91562, -81750, -16616, 126459, 214777, 191306, 212404, 309632, 258223, 42965, 40941, 410117]
37638D10117L08394j48281l69507j66061J0708l6981N620K00994J63769j57158
37628B21614k75774q735J94061L7164j62741r6347O7012J12237J26992J54875
37618C70358K3076k40770l12385j05558O7969M4860L3132J34010J43109N78m8713
37607A09666P6835J26887j7244j46115j28575r3887j00863m6032K1160p1555k12445
37596d82168q5487K73072M51392K73693Q709r5342q1095n1857m5606j25969k53965
37585b14623j81838J48990L18435J2089l61691k26580K36146L94241J80943M9598
37575C55710P7073o5097l21883k74010N2481J91733O7653M1295J34488J6874k24573
37564E1744j52100J45912J16104k46868l41265k7454J53362p613p1682J35829
$$ y = [410117, 718511, 570230, 200723, 34662, 45370, 8389, 14009, 215003, 378772, 221614, -54160, -62895, 131166, 168330, 5589, -90758, -23746, 88491, 215483, 370358, 393434, 152664, -159721, -265279, -197310, -152450, -119318, 14692, 157801, 158379, 109666, 186501, 313388, 296144, 150029, 21454, -72433, -173296, -219328, -198168, -269723, -482168, -567655, -294583, 156809, 430502, 439211, 343869, 262774, 210917, 165311, 39342, -214623, -396461, -247471, 70964, 83053, -278638, -505218, -269072, 125169, 306112, 355710, 432783, 367686, 45803, -228207, -175726, 16007, 83660, 124955, 259443, 276317, 51744, -100356, 45556, 161660, -85208, -426473, -453927, -300565, -308178, -379860, -244031]
37554b44031K10285K2685p772K11654J92882j80476l33369j5108K30733M0814
37544A28297j62919j9487J21973p0628k67711j13983J39126J64355J20601J90814
37534B30438J48645j25240k66741n4483J37954n364j77485k4796K25465K14062
37524C02455N8717K7677L3184q5945j73283p8212M720q8423j49681K937J66150
37513B0296J37140P4446J35117J38423o3521k45540j76645N077P9849Q0040P8722
37502B63404j2362j87565k27339n5733J08489J28577J25349J44079M7695j24789
37492B09805j24318M5933Q1727p5749j21197M1558J09706n5001j69868m6955J00922
37481c437P9121M42l3784j20765k52641k28014j4536J72036K35873K72516K58239
$$ y = [-244031, -33746, -11061, -18833, 192821, 385703, 205227, -128142, -143250, 87483, 128297, -34622, -54109, 67864, -2764, -270475, -384458, -245332, -80977, 39624, 230438, 379083, 253843, -12898, -67381, 70573, 65209, -112276, -137072, 88393, 302455, 361172, 388849, 422033, 336088, 162805, 84593, 89313, 890, -148791, -145854, 20296, 157436, 231882, 366999, 505422, 441901, 196361, 19716, 24793, 104642, 184682, 263404, 251042, 63477, -163862, -219595, -111106, 17471, 142820, 286899, 334594, 209805, 85487, 131420, 213147, 137398, 16201, 57759, 167465, 112464, -57404, -104359, -3437, 75684, 76126, 42342, -78423, -331064, -559078, -573614, -401578, -165705, 106811, 365050]
37470C65050Q8734r2326n9725N3580k5863j61797m1077J73869Q0805j84672j32520
37459F4058J89407K49815m6584k64087k42582k20600j88620O1695K89762Q0362
37449b7374k88283j90057J97019J33319l08966k88346K92700N55464J64153j60514
37439G9115K503J20183j43767k92935l7009J35575k7052j8486L63614M88750M0156
37428G10647l32528j49062J05110k5365j60453L0194J08182k21012m02363j5773
37418c52423M04351L07809M2375O1751P3981k13821l45411K6177L26529O153m38710
37407a01239l09300J15489J74408k5989J069J39723J1591j78926l6385K07667
37397a892J09965j42629j04669Q9902L4064j53106p6917J81818K48036J18014
$$ y = [365050, 453784, 361458, 301733, 355313, 329450, 167653, 126576, 300445, 381250, 196578, 64058, 253465, 503280, 456696, 192609, -49973, -270573, -459193, -397498, -107736, -27374, -315657, -505714, -308695, -175376, -484342, -772688, -479988, 75476, 239629, 79115, 81618, 201801, 58034, -234901, -271910, -136335, -163387, -181873, 181741, 670491, 710647, 378119, 229057, 334167, 308802, 148349, 178543, 286725, 65713, -336650, -352423, 51928, 359737, 402112, 463863, 537844, 324023, -21388, 4789, 331318, 337471, -101239, -410539, -295050, -120642, -146631, -145562, -5839, 5752, -173174, -209559, -1892, 108073, -34556, -139225, -49323, -15259, -168365, -245282, -63464, 184572, 302586]
37387C02586M6948M0808k4276o8913l0545o9579j95740j28345J43190K06555k7122
37376A95567p2719K38897L47077o9391m51448k74101J03475J37942j0140M6662
37366A91821J65143N7319j09936j08620j10034k16175j22395K33169L40005j9616
37356C00681k74401j7866K67946Q4381k14891j28448J09299Q2585j0103J46562
37346C45745K87120Q3777j91515j85307q7483j37521j12321J13385J57209j37276
37336A35813k69519K0819K00225p8115k70718O0231L90088J75043j62803o1070
37326A39994J42014r0543m46650l43256N6976K62179K90226L12770J14238l28384
37316A09564m35903K3892L40224J6429l14566k2484L53368R9358l43794j90384
$$ y = [302586, 349534, 390342, 366066, 297153, 266608, 197029, 1289, -127056, 16134, 222689, 195567, 122848, 361745, 708822, 639431, 187983, -86118, 17357, 155299, 145159, 191821, 356964, 414283, 304347, 195727, 85693, -130482, -252877, -19708, 320297, 300681, 26280, 8414, 276360, 360741, 145850, 17402, 126701, 209286, 199183, 345745, 632865, 716642, 525127, 339820, 252337, 114816, 2495, 115880, 273089, 135813, -133706, -112887, 87338, 9223, -261495, -201264, 188824, 363867, 201064, 139994, 282008, 191465, -255185, -598441, -541465, -279286, 10940, 323710, 437948, 109564, -326339, -302447, 37777, 54206, -260360, -282844, 70524, 169882, -173912, -364296]
37306c64296K73898K68167r7089j72430J4368R248p7808J02787K79894L9362k90277
37295a4176j93867O7615j2283k11252p6999J43380K5297j42116N4174K57302J8032
37284h4893k46466O344L66970K07575j26199J5808L20381R9579l76294l45766
37274a62961Q0239J98560k7082j08331n7950j91516k83213K7179L70385K10396
37264E5706j45420r9457J38529K7893k21690j00190J62092P0425j13848R4219
37254a31741L60719J26395k67558j72108J55896P1965k26644j43736J42358J08365
37244B3911k0687K13624M23101L2469m97782l70971J15658J27717j93334r8499
37234b44793L12165L36958J5653o5318L7571j22320l15208n8882K91628J14599
$$ y = [-364296, -90398, 177769, 80680, -91750, -77382, -68134, -145942, -43155, 236739, 276101, -14176, -208043, -140428, -152711, -363963, -440962, -297582, -272285, -414401, -360227, -102925, -84893, -331359, -325015, 41955, 249530, 123331, 139139, 459520, 559099, 182805, -162961, -82722, 115838, 88756, -19575, -77525, -269041, -552254, -525075, -154690, 55706, -89714, -189171, -50642, -22749, -244439, -344629, -182537, -112112, -225960, -131741, 228978, 355373, 87815, -84293, 71603, 143568, -83076, -226812, -84454, 23911, 3224, 216848, 639949, 672418, 174636, -196335, -80677, 47040, -146294, -244793, 67372, 404330, 419983, 354665, 392236, 269916, -45292, -104174, 187454, 302053]
37224C02053k54886j23595K22567Q7549k37475l4733L69813J56413m00602l90700
37214c03596O2660R8133k46171k06182J76060J92746j00091n6305K03240N3105
37204a26401k85881j15201L11597K16421j54943L2151N11928L07886m02150n02063
37194b06656Q6255L25473m8689k07288J27722K91715O5284r372J65932Q6627k24791
37183D52212k26871N02r9975l62427j47254L45026L54944j1027k0392K29793M8889
37172E63420l73376k54785K08969J39616l20350k29119L45523M09562j11288k83431
37162I4741O8444J66929j06416n8178K89612J67080l51088l58218J61081K54256
37152C28243k10246l14463J60392L72758M3454j23258J07059J29475j73795j89041
$$ y = [302053, 47167, -76428, 146139, 233688, -3787, -38520, 331293, 487706, 87104, -303596, -240936, -142803, -388974, -595156, -419096, -226350, -326441, -382746, -179506, -126401, -412282, -527483, -215886, 535, -154408, -122257, 389671, 697557, 295407, -206656, -120401, 205072, 156383, -50905, 76817, 368532, 433816, 424444, 590376, 677003, 452212, 225341, 225843, 125868, -236559, -383813, -38787, 316157, 305130, 284738, 514531, 563420, 190044, -64741, 144228, 283844, -36506, -265625, 79898, 489460, 378172, 94741, 163185, 330114, 223698, 165520, 455132, 622212, 271124, -87094, 73987, 328243, 117997, -196466, -36074, 336684, 380138, 256880, 363939, 493414, 319619, 130578]
37142A30578J35019J56747j41886j05198K37937J83665k29934k60862P0237L7056
37132B13359k87404j30732L87117L61008j82910k94530J39180K60024r2830j97576
37122A74706L7231j1025k60112n5657L43824J10046m41205k72465L73572L14183
37112C13098l36644l21988L86743N19520r3535k53692K58591K93870l64257n22233
37102a20527J33892M29458q0457l81095n8551j5687n02820m85325L11031O99695
37092g0386J39088l35601m2756K80673Q1431p2675J37084J31802k12017j81264
37082a44621K71188K79930k39031l48359Q2561J07846l79076l62580K70540M03080
37072e8522j70767l08456K75857M52402j02850k47988L83988N97426j21544o19314
$$ y = [130578, 265597, 422344, 280458, 175260, 413197, 596862, 366928, 106066, 176303, 213359, -74045, -204777, 182340, 543348, 360438, 65908, 205088, 465112, 372282, 174706, 211937, 200912, -59200, -114857, 228967, 339013, -102192, -374657, -1085, 313098, -23546, -345534, 41209, 560729, 467194, 213502, 472093, 765963, 401706, -120527, 13365, 442823, 362366, -18729, -77280, -92967, -595787, -1081112, -770081, -70386, 68702, -266899, -309655, -28982, 52449, -20226, 116858, 248660, 36643, -144621, 126567, 406497, 167466, -180893, -98332, 9514, -369562, -732142, -461602, -58522, -229289, -537745, -261888, 190514, 87664, -160324, 223664, 821090, 699546, 80232]
37062H0232j98905K18231n6968l17045k2357K11377J690p5116J70812J01913l03233
37051a89369k40195K72615L00132j43599m1055N57183M73897l03819m73093J31218
37041C43915K42394l27739l23579L81256L99148m43194o16929K17223N06714k42391
37031A36818n31788K25545N96851o3560l99094K46483N61794j17789n19627L6647
37021A72280L65319j33399k93861L51489N06326k84857n82381J67119M67702l27984
37011D07753o96840J11418N89816r7658n02811K18973O16891j69248o28004K00750
37001E1040P72542m9748p96328j49772O38122J95916m98167k03413K89257j512
36991B47937k82606J81243M06253k73209o52660O2773O12513N9275m33899O5023
$$ y = [80232, -118673, 99558, 42590, -274455, -296812, -85435, -83745, -158861, 11951, 113864, -189369, -429564, -156949, 143183, -416, -41471, 515712, 989609, 685790, 212697, 343915, 586309, 258570, -65009, 316247, 715395, 272201, -344728, -127505, 379209, 136818, -394970, -169425, 427426, 363866, -35228, 211255, 773049, 655260, 135633, 172280, 537599, 404200, 110339, 461828, 968154, 683297, 100916, 268035, 735737, 407753, -289087, -177669, 412147, 314489, -188322, 30651, 647542, 478294, -149710, 51040, 823582, 773834, -22494, -172266, 465856, 661772, 163605, -39808, 249449, 247937, -34669, 146574, 552827, 279618, -373042, -310269, 302244, 361519, -72380, -7357]
36981g357M58123j05056m96145R1509M82586r6591m01433L16348O76346j60877
36971G57453p39928n8436N13164p3270n46970P7431N44780n5512m22017K92928
36961B89623O74134j34791o01066J99338O41781l01257r32400m4565P20894K6404
36951E38095o40877K6968O25976m6999n39984K98067Q99660O1633n59032L70746
36941A034253J192028M17034m44826J01691P05182K2839o19236q0023J78059q19046
36931A687955j250786J2439R18804j5728q71662n6685O59131k26672r07395P9966
36921B9367Q34508j23935q01343L01524J032881k27703j196845k0807J063475
36912H91122P3526q44426K67174J195219n8400j153476Q3783J289376J05252j182141
$$ y = [-7357, 450766, 345710, -150435, -58926, 423660, 327069, -74364, 241984, 918330, 757453, 17525, -40911, 472253, 398983, -147987, -70556, 474224, 418712, -3305, 289623, 963757, 828966, 227900, 427238, 1069019, 767762, -164638, -209203, 511691, 538095, -102782, -75814, 550162, 503163, -36821, 261246, 1160906, 1222539, 663507, 1034253, 2226281, 2643315, 2198489, 2300180, 3005362, 3028201, 2408965, 2328942, 2507001, 1687955, 437169, 449608, 1368412, 1352684, 481022, 424337, 1083468, 856796, -50599, 29367, 863875, 739940, -61403, 240121, 1273002, 1045299, -151546, -172353, 891122, 964648, 120222, 387396, 1582615, 1524215, 370739, 454522, 1743898, 1849150, 667009]
36902F67009j25851J056396j00674j363062j93191J180841J42492j139224o3252
36893F1484J190680O0466j175556M6095J289194q1022j435672M9488J618379J95748
36883A819284j452886p0087J565917L4341j838599l82641J655193M39063j406899
36874C62686m7149J829438K94132j852568m42228J777722N02271j594921k24866
36865F04517J825763K23519k005630k99680K138899M38337k119720l76638K323789
36856B753156N34028k353212n87466K439934P35848k292702m79451K648853P52190
36847D151178k391897j91992L194521P35634l024467m37799L658059R54075l423447
36838C223865m23602M558971J683898l375929o881N642454K056257l832096Q56232
$$ y = [667009, 541158, 1597554, 1496880, 133818, -59373, 1121468, 1263960, 124736, 61484, 1252164, 1312630, 137074, 183169, 1472363, 1391341, -44331, 5157, 1623536, 1819284, 366398, 296311, 1862228, 1896569, 57970, -324671, 1330522, 1769585, 362686, 315537, 2144975, 2439107, 586539, 144311, 1922033, 2424304, 829383, 604517, 2430280, 2653799, 648169, 348489, 2487388, 2925725, 806005, 429367, 2753156, 3287184, 933972, 346506, 2786440, 3522288, 1229586, 750135, 3398988, 4151178, 1759281, 1567289, 4761810, 5497444, 2472977, 2035178, 5693237, 6647312, 3223865, 2800263, 7359234, 9043132, 5667203, 5660322, 11302776, 13359033, 9526937, 10383169]
36829A0383169Q399788M294088k732402L891417J4193638R278677J666012J4235463
36821F3609850L0749915K2541880J5746797N9720840J23151486J09053269N690666
36814D30264703o6578824k1070197N9762297M1214932o6483606j31308777r3821370
36807A51979158l0183011j6323094l0424944k3202175l215029k448426j3087479
36800C3095000r709202J617482M17770p739058n278356K866064J312203n432372
36792A1149531l493421L143038J840083l907354k495062L054534K068335k798028
36784H561656j614683L361744K897624j089059R5658M988412N321284J474873
36776B3997509R2421P83958j344158m159011k133369K343982K836173K19024m29036
$$ y = [10383169, 18782957, 23077045, 20344643, 24236060, 38429698, 47708375, 49374387, 63609850, 94359765, 116901645, 132648442, 192369282, 315520768, 424574037, 430264703, 363685879, 342615682, 402377979, 443592911, 377109305, 245800528, 151979158, 121796147, 105473053, 75048109, 51845934, 48630905, 46182479, 33095000, 23385798, 25003280, 25421050, 17681992, 12403636, 15269700, 16581903, 11149531, 7656110, 10799148, 12639231, 8731877, 6236815, 9291349, 11359684, 8561656, 6946973, 10308717, 13206341, 12117282, 12212940, 17201352, 22522636, 23997509, 24089930, 24873888, 23529730, 19370719, 17237350, 19581332, 22417505, 22636529, 22207493]
36767B2207493q7642k598570n440291l898315n44310q23179l031706k088910N91960
36758D286530L01061j636437q74889J117530J64417k022735j084172J338285P45845
36749B335435j468354q47497J422068R68349j230398r55904R87637O21010j271256
36740E61090q58160J053402O63914j271987r49782J046844J005166o89154n74326
36731a2993R78393O80761j046986r55072O15566N47033q50847o11193R01309P67272
36721A013243o65617n68776O89087L60361j088748q18651P93215Q88858l58160
36712B44812l37839P13570L52904r37653n61462R51250P65867p99809q39449O16808
36702A68999P85357n01964o58285N80954Q08302l12513n54638N12947R47881K82081
$$ y = [22207493, 22119851, 19521281, 14080990, 10182675, 9638365, 8815186, 5783480, 3694570, 4286530, 4587591, 2951154, 2076265, 3193795, 3358212, 1335477, 251305, 1589590, 2335435, 867081, 19584, 1441652, 2410001, 1179603, 223699, 1211336, 1832346, 561090, -297070, 756332, 1420246, 148259, -801523, 245321, 1250487, 561333, -12993, 965400, 1646161, 599175, -355897, 259669, 806702, -44145, -655338, 245971, 1013243, 347626, -221150, 467937, 828298, -260450, -1079101, -285886, 602972, 244812, -93027, 620543, 973447, 35794, -525668, 425582, 1191449, 391640, -447809, 168999, 954356, 452392, -205893, 375061, 1183363, 870850, 316212, 829159, 1777040, 2059121]
36692B059121j2391K15204j70288o64967N2238R76673K26817j151082p54287O79285
36682A456323N00120r48033j014800K93499N00170n73043o67103M36142O30986
36673F14261l02620l93627N04374M47793o58892p87738K95903O22257j98185m25248
36663b81722K97986M15434k88912l28463L61414K67001n58441m78086M66544N41622
36653D14377l20524m02324M55103O31587m0298n9936O00243L75299o96212q58807
36643I8508N7881L57958k81904l89451K70019L16522l48003l06634M60526M38782
36633F74204m02442m50738M32619O26468j39968l67285K19100K26051n07634n26651
36623b16276L17150M68447l48968o02720J17711M33940p3378j99259L11924K43665
$$ y = [2059121, 2046730, 2261934, 2091646, 1426679, 1478917, 2455590, 2682407, 1531325, 777038, 1456323, 1956443, 1008410, -6390, 287109, 787279, 214236, -452867, -16725, 614261, 311641, -81986, 422388, 870181, 211289, -576449, -280546, 341711, 143526, -281722, 16264, 431698, 142786, -185677, 175737, 442738, -115703, -593789, -127245, 414377, 93853, -308471, 146632, 778219, 737921, 677985, 1278228, 1653527, 957315, 98508, 156389, 514347, 232443, -157008, 113011, 429533, 81530, -225104, 235422, 674204, 271762, -178976, 253643, 880111, 740143, 372858, 591958, 818009, 310375, -216276, 100874, 569321, 220353, -382367, -264656, 169284, 95906, -103353, 208571, 452236]
36613D52236n33179o46143J24332L96746j27002j54934N37386N89145k70471o42002
36603b73886j14194P2318m17105l74103M19315N91722j97519n43758Q0162M33367
36593c23681k7856k05246L46306N30289p0057l44547J52283L48390j99798m34606
36583b28523J19843M48147J3864l12192l6449J20529j65379k03086J51123J23901
36573C1778l13302k49672L19194L52615k08958k69850K71958K93753l15276l71639
36563d59399K69282L54739l26498m54243K98740N75363j29549n30444L2114M50173
36553H0278L0018l05244M2704K24360k39110m28657J62533N81117J69539l01927
36543A5611j78415N970j60874j47028K57387L69928m433j24890J90039J79815
$$ y = [452236, -80943, -727086, -602754, -206008, -333010, -487944, 49442, 638587, 368116, -273886, -388080, -315762, -732867, -1106970, -687655, -95933, -293452, -837210, -757048, -323681, -351537, -556783, -210477, 319812, 249755, -94792, 57491, 405881, 206083, -228523, -108680, 339467, 353331, 41139, 4690, 125219, -40160, -243246, -92123, 31778, -281524, -531196, -212002, 140613, -68345, -338195, -66237, 227516, -87760, -459399, -190117, 164622, -161876, -616119, -317379, 257984, 128435, -402009, -369895, 80278, 110296, -194948, -152244, 72116, -166994, -595651, -433118, 147999, 317538, 15611, -162804, -156834, -317708, -464736, -207349, 162579, 158146, 33256, 223295, 403110]
36533D03110k59029k48434L19156M34767j28270l50943Q7321K35938k14136l26584
36523d7104J78315L23061j87192l46719J52389K61514l47566n38519J25231M69437
36513D2847r7222m51127J24738N93205J13619m40370j61811L12339J58102j70778
36503B3542l9647J47615o1377k13709K4135J21321j69266j94603K69156M13388
36493C20555r5614l97707j6553K67857o4009l19666j568K56448J0048j38650J64269
36482a4590K77025q1623j65480K97336M14738k05222n97528j49217L21583J29527
36472B26549j15067J24895K53048j40964l43607O7422K89897j73854m76534o252
36462b94467M05904K0961m29120j22790L69776K43115q6198O7669L31835J17487
$$ y = [403110, 144081, -104353, 214803, 649570, 521300, 170357, 257678, 493616, 279480, -47104, 131211, 454272, 267080, -79639, 72750, 334264, -13302, -551821, -426590, 42847, -54375, -505502, -380764, 212441, 326060, -114310, -276121, 36218, 194320, 23542, -16105, 131510, 70133, -143576, -119441, 1880, -167386, -361989, -92833, 320555, 224941, -172766, -189319, 78538, 14529, -305137, -306705, -50257, -40209, -178859, -14590, 262435, 180812, 15332, 312668, 727406, 522184, -75344, -224561, 97022, 226549, 111482, 236377, 489425, 348461, 4854, 72276, 362173, 188319, -288215, -294467, 111437, 132398, -296722, -419512, -49736, 193379, 107181, 174850, 506685, 624172]
36452F24172k03253j05506N0589j55908k98081j2028J61434j87163m55295j33960
36442g14999K20804O2711j35101J05805K96425m851k45713O1391L52709P7474
36432G6655k50670n5062K33693Q7984j09012O4833J64884j79814l89263J5363
36422c40409M28043K20087j32741J8082L15942J49263k29771k80165j19571o8344
36412c9584J970J58060O6472k22691j01672M18911M68830j45301m19741J21863
36402C07117N36324J39071l16902j25655R7028k54159n10857m3611M15595P8985
36392C22936m25099k29315K09495R0708k12307q171K98203N9817k34516J36801
36382H552O58970M39099j92262l26611n8391p1908k69936j30337J35496L0111
$$ y = [624172, 420919, 315413, 366002, 210094, -87987, -100015, 61419, -125744, -581039, -714999, -494195, -431484, -566585, -460780, -164355, -169206, -414919, -353528, -819, 76655, -174015, -229077, 4616, 92600, -16412, 48421, 213305, 33491, -355772, -340409, 87634, 307721, 174980, 193062, 509004, 658267, 428496, 148331, 28760, -39584, -37614, 120446, 186918, -35773, -137445, 281466, 750296, 604995, 185254, 307117, 843441, 982512, 665610, 539955, 636983, 382824, -128033, -171644, 243951, 322936, -102163, -331478, -121983, -31275, -243582, -251753, 46450, 106267, -128249, 8552, 667522, 1106621, 914359, 587748, 529357, 457449, 187513, 57176, 192672, 222783]
36372B22783j73420K975K03441q7113m44688k35294J80805J27907j32926Q541
36362c26989L05477K05108k6662R7616K19250j38836m53225p6875M22471J45223
36352C72558n11482n07334O0795K56320j5366m1109K63106L11332O2247J7900
36342B68967J56952L3090k17599p8223K97169K94256n6842j91795m7428k2195
36332D36352j10653k1837P1306j63505m17598j84300K55586K32906j70745l11054
36322c83542p3512J22040J70458K62566K70986J567k21568m6765J64622p1145
36312A95707m17277k68140J49360J94199l1201L9430L04828J96430k06958k96360
36302a39982k3639R6627l1391k2665J51197J29628q9390j55353m4497k0473m4542
$$ y = [222783, 49363, 52338, 255779, 168666, -276022, -511316, -330511, -202604, -335530, -326989, -21512, 183596, 156934, 254550, 473800, 334964, -118261, -195136, 227335, 372558, -138924, -646258, -585463, -329143, -344509, -385618, -122512, 188820, 251067, 268967, 425919, 459009, 241410, 163187, 460356, 754612, 697770, 505975, 458547, 436352, 325699, 303862, 375168, 211663, -205935, -390235, -134649, 98257, -72488, -383542, -457054, -335014, -164556, 98010, 368996, 370563, 148995, 102230, 266852, 195707, -221570, -489710, -340350, -146151, -177352, -137922, 166906, 363336, 156378, -139982, -163621, -66994, -98385, -121050, 30147, 159775, 70385, -84968, -129465, -149938, -194480]
36291a94480R4083K35728J09059p9055K4443K39095J63662r6971j73676j15004
36281B06884j79272k54849j23815L4241J3553N2791L17364L97833M360l65140
36271A03950j97048J41330Q3846j14305O6440L60236J97579k06995k37614K7289
36261B24708O5069r3183n9131N5597q7177k53506l9397K63684J33722j95270j54806
36250a39690J01973M4190j73953j2625L76695L92186O1779r7303n6695j49373
36240C47184k30280M2823L49518J47183k69609j88693K62839L47832J6501j18331
36230G06967L2941j7131k68665k11290J30904J80078j20707k07706N8206J96250
36220D79847M5240o527J58832J83901l0060j50135o1920L735J5893J45323K63150
$$ y = [-194480, -100397, 135331, 244390, 165335, 189778, 428873, 592535, 495564, 321888, 206884, 27612, -227237, -351052, -316811, -303258, -250467, 66897, 464730, 469090, 103950, -93098, 48232, 132078, 17773, 84213, 444449, 642028, 435033, 197419, 224708, 289777, 196594, 137463, 193060, 105883, -147623, -187020, 76664, 210386, 15116, -139690, -37717, 6473, -167480, -180105, 196590, 588776, 650555, 553252, 496557, 347184, 116904, 159727, 509245, 656428, 386819, 198126, 460965, 808797, 825298, 706967, 739908, 722777, 454112, 242822, 373726, 553804, 433097, 225391, 283597, 479847, 525087, 518560, 677392, 861293, 831233, 681098, 619178, 622913, 638806, 784129, 1047279]
36209A047279J06290j48865j46651k5807j29468k61914k3958L23926J96673k74050
36199F63455m11741j03342J20476L1634r3009j32530j93900j36801J96769M40495
36189C81506J84356k17344j59099J54320R2949k13363j26549K49984K08176k41764
36179C13172l37171Q7285L29950O3624j93874p7342J04459R6020R0520J60230
36169F36873O4973j72241k10636m1582j494q3163L9434K81014K13047j12921k01565
36158D11739m479L1738j53828j37286J34294K10228l1918k00895j38859j04141
36148A6593j37069M961K24575J53401j15554j25495R8811R4689j40484j28636
36138e4208J72317K76493O2666p2822j9148o6675j65442N1208M19415L34287j75668
$$ y = [1047279, 1153569, 1004704, 858053, 832246, 702778, 440864, 416906, 740832, 937505, 663455, 251714, 148372, 268848, 300482, 207473, 74943, -118957, -255758, -58989, 381506, 565862, 348518, 189419, 343739, 436688, 223325, 96776, 346760, 554936, 313172, -23999, 63286, 393236, 456860, 262986, 185644, 290103, 386123, 476643, 636873, 701846, 529605, 318969, 277387, 275893, 192730, 232164, 513178, 726225, 613304, 411739, 407260, 438998, 285170, 147884, 282178, 492406, 460488, 259593, 120734, 16593, -120476, -115515, 109060, 262461, 146907, 21412, 120223, 214912, 74428, -54208, 118109, 394602, 457268, 384446, 365298, 298623, 133181, 184389, 603804, 938091, 762423]
36127G62423l78128l4697K26581j2098l53165l47102j07935J01647K22020J49712
36117B29258j89642m20663r6196M46734M18968j63843m47852r7187K53591J29174
36107F2342j31008j54052r8007r2132P0166L33870K63190j41829k85533K8456
36097a44537K30809j5686k46753o1813J95210J16808p7512m6507N9017j4902j26037
36086a31903p6037j23k9224L899J79675K46552P9061m2987Q3314K21464R6169
36075F29860k00289m25296m74191l08439M4042L25532K72511M7041K5770J74484
36065A11025J34850q8987j19603Q6339J34451j15074l37251l21153k03810o2842
36055g82055J61344L04583J34036j20094j4676L25465L57649N3003p5744P5939
$$ y = [762423, 384295, 349598, 576179, 564081, 210916, -136186, -244121, -142474, 79546, 229258, 39616, -381047, -477243, -30509, 388459, 224616, -223236, -320423, -66832, 62342, -68666, -222718, -320725, -412857, -342691, -8821, 254369, 112540, -172993, -144537, 86272, 70586, -176167, -237980, -42770, 74038, -3474, -49981, 9036, -5866, -131903, -207940, -208063, -237287, -233388, -53713, 192839, 271900, 228913, 312227, 533691, 629860, 429571, 4275, -469916, -778355, -734313, -408781, -136270, -89229, -63459, 111025, 245875, 156888, 37285, 123624, 258075, 143001, -194250, -515403, -719213, -782055, -620711, -316128, -182092, -302186, -316862, 8603, 366252, 419255, 343511, 419450]
36045D19450M3630k77489l71479j9372K85846J56229j25623j73452m7235M4740
36035f4755P9870M3643j11566k15946o7694J25016L2537j42527L1097L49276K18933
36024B77884k61735l70558K2348K47905J5698j54769M6391J91278k2367k16644
36014b24569o2016J67880J66705P1325L4922n5090j66802n9179J66927J16279
36004A56382j47005j27558J79139K16546j05416k11060O5074J45748k02035l91807
35994d21992o8032K68324J86375L3155J71860K95231P3435k06568j98541p0192
35984F3055m3903J6755J46973O1771k16429k11539J47029K79465l1245k10665
35974A267N6765K30031n6200k44365J41865N49676K81811l28912m86105j58667
$$ y = [419450, 463080, 185591, -185888, -205260, 80586, 236815, 111192, -62260, -109495, -64755, 15115, 58758, -52808, -268754, -336448, -211432, -178895, -321422, -290325, 58951, 277884, 16149, -354409, -332061, -84156, -68458, -223227, -176836, 14442, -7925, -224569, -286585, -118705, 48000, 119325, 154247, 99157, -67645, -126824, 40103, 156382, 9377, -118181, 60958, 277504, 172088, -38972, 26102, 171850, -30185, -421992, -490024, -221700, -35325, -2170, 169690, 464921, 538356, 331788, 133247, 63055, 19152, 35907, 182880, 244651, 28222, -183317, -36288, 243177, 211932, 1267, 58032, 288063, 231863, -12502, 129363, 679039, 960850, 631938, 145833, -12834]
35964a2834P6521K1588o8063r1927j33897j32096l5262j8458j39338j31207J06667
35953e58306K52043J42324R3624K55832K39731j43624l75731l4953M29938L59062
35943F59940j20471l77194k16628L2302J15478N6617m2105o7522L1412P5466j15932
35932C1363k79845j0316M51421M24076r0663l13924M1626L10299N5850k16142
35922D03745m7161J73704K9438j39038L4435J89373m2700k72491o4003K36572
35912E01874J39641j28790j48005q1373j96539k20980N9822J85627j83001m72902
35902e44626q7513M92366M49522l6768j95795K1085N7419j38098j36744M6916
35892g2236J9015j50588m6532K41570K37529l3473q4909J51639K49804P3115o7512
$$ y = [-12834, 63687, 85275, 17212, -74715, -208612, -340708, -375970, -394428, -533766, -664973, -558306, -306263, -163939, -70315, 185517, 425248, 281624, -94107, -129060, 300878, 659940, 539469, 162275, -54353, -22051, 93427, 150044, 107939, 40417, 71829, 147295, 31363, -248482, -258798, 192623, 616699, 526036, 212112, 253738, 564037, 619887, 403745, 356584, 530288, 559726, 420688, 455123, 644496, 601796, 329305, 265302, 501874, 641515, 512725, 364720, 283347, 86808, -134172, -74350, 111277, -71724, -544626, -632139, -139773, 309749, 272981, 77186, 98271, 155690, 17592, -119152, -72236, -53221, -203809, -250341, -8771, 228758, 195285, 110376, 262015, 511819, 584934, 517422]
35881E17422m0032l6538r5151n3459L9755j2091j29804p9386P4039Q9976L221
35870B77952Q437N2917k2919j23068r1262m8489j29276j48012N4542K33765J39317
35859B03904l9548n7004o0769k09176k67823q0277K6664j56975k34138Q7187L47081
35848d40874J01324k25995o8539K43988J01015k18968l9598M23558L91043r0502
35838A76452k40126O6572J52487j66277k67250R6796L42051R9058j93176j16861
35828e0274P6113L9080j00290j17934q6032o9678O8538K91957K94766K1748j76029
35817A91965j14969m2194j15777j06044J18210K55001M9273k47335k41708K2597
35807b30981J73258N0585j31353j23348M3350J25447Q99j46250p1424J53159K25711
$$ y = [517422, 477390, 440852, 345701, 292242, 331997, 319906, 190102, 110716, 184755, 274731, 277952, 286389, 339306, 316387, 193319, 102057, 53568, -75708, -223720, -169178, 64587, 203904, 164356, 107352, 46583, -162593, -430416, -510693, -484029, -641004, -875142, -787955, -440874, -339550, -565545, -634084, -390096, -289081, -508049, -547647, -124089, 266954, 176452, -63674, 2898, 155385, -10892, -278142, -181346, 160705, 259763, 66587, -50274, 25839, 64919, -35371, -153305, -239337, -309015, -240477, 51480, 346246, 367994, 191965, 76996, 34802, -80975, -187019, -68809, 186192, 235465, -11870, -253578, -230981, -57723, -7138, -138491, -261839, -218489, -93042, -92143, -238393, -309817, -156658, 69053]
35796F9053Q7948L715Q0735Q4041r8207j96688k6091J71035J44788L1957J3919
35785C66205k9574j78221j95004K0883J33590n2307j72549N3823K46442R001l12833
35774a10544j89480J84785K66071Q8718N4668J01323j06197l82575k62808J09477
35764b46562J63335j12129j77458Q7401K27548O9175l4272Q6847J58972M2419
35754B65276n7353o4729j41001k40135j24392J18683J37985n8573j07853N1814
35744b20278J10186N668J2648J48078J00538j50165k32159k1244J71800J65088
35734I0160J19046R2648o0127k48093j64143J22731J62438j33041l02231q5274
35724d05886J76828J37431m3294n2174J05384K33417K27550N9813k21369l80386
$$ y = [69053, 157001, 160716, 241451, 325492, 227285, 30597, 4506, 175541, 320329, 352286, 366205, 336631, 158410, -36594, -15711, 117879, 65572, -106977, -53154, 193288, 202289, -110544, -300024, -115239, 150832, 239550, 294218, 395541, 289344, -93231, -356039, -246562, -83227, -195356, -372814, -285413, -57865, 11310, -22962, 63885, 222857, 265276, 207923, 143194, 2193, -237942, -362334, -243651, -105666, -164239, -272092, -220278, -110092, -104424, -91776, 56302, 156840, 6675, -225484, -246728, -74928, 90160, 209206, 301854, 241727, -6366, -170509, -47778, 114660, -18381, -320612, -405886, -229058, -91627, -134921, -187095, -81711, 151706, 379256, 439069, 217700, -162686]
35714a62686k04235J23188K06108J9793q4488K4170R7576K033q1009m2000q210
35703a09760k7696J1039P5481J1517q8946J6489K21719J61796j30240j93807R4899
35692D2491K79796P1433j84138r7584J44061J29431j21521k41043p8067J42450
35682H7309J59586l0339k08517j83600j5407N8787k7194n1478J18385K46411Q6965
35671B40908j80730k13188l1118Q0337N2338K2479j6957j41623j90853J5889K66981
35660i5537K23116o631l7102J34513J61268j9434j22589o8997o4548j18308k0479
35649c4728J65527J29823j04745j65360K4444J12990m9480j69004n0233J02586
35639c8180J00673M8994L9983k7500j61911j79180k7935J14860J55306J58261
$$ y = [-162686, -366921, -243733, -37625, -17832, -102320, -78150, 19426, 21459, -59550, -101550, -109760, -137456, -126417, -50936, -39419, -128365, -111876, 109843, 271639, 141399, -52408, 42491, 322287, 393720, 209582, 111998, 256059, 385490, 263969, 22926, -55141, 87309, 246895, 216556, 8039, -175561, -190968, -132181, -159375, -210853, -92468, 153943, 240908, 60178, -153010, -184128, -103791, -51453, -28974, -45931, -187554, -378407, -362518, -95537, 127579, 120948, 83846, 218359, 379627, 360193, 237604, 168607, 104059, -14249, -34728, 130799, 260622, 155877, -9483, 14961, 127951, 78471, -90533, -140766, -38180, 62493, 111487, 151470, 123970, -37941, -217121, -245056, -130196, 25110, 183371]
35629A83371R0309j28834l08216j55583J95945K85690J5545k13512j38352M8446
35619a25191J20802J13399P5719m1348j36016q593K26807K03871j06714k92628
35609C0108j22932J27790J36147m6602j77163j26516Q8337L06628K53613j27162
35599C42248m35410k81841J02458J81867n5002j34399P7373K07824Q8937M940
35589I8995R1612Q5744j22428k26513l0416K23942K72280J64416K0652j46343
35579D31941k33787q1261J81313K16110q425j84163j74933j26476p1450Q3255
35569C2124J93169M5595j37775J8474K95108J30512l61777m50731N325K82377
35559E2401r749l17321j33641K05212K17819O0495N8036O3663j38719l05805j58582
$$ y = [183371, 273680, 144846, -163370, -318953, -123008, 162682, 178227, -35285, -173637, -125191, -4389, 109010, 184729, 143381, 7365, -1228, 225579, 429450, 322736, 30108, -92824, 34966, 171113, 124511, -52652, -179168, -90831, 215797, 469410, 342248, -93162, -375003, -272545, -90678, -145680, -280079, -202706, 5118, 94055, 98995, 190607, 276351, 153923, -72590, -103006, 120936, 393216, 557632, 578284, 431941, 198154, 116893, 298206, 514316, 505891, 321728, 146795, 20319, -51131, 32124, 225293, 270888, 133113, 151587, 446695, 577207, 215430, -235301, -229976, 52401, 42652, -274669, -408310, -203098, 14721, 75216, 133252, 196915, 58196, -247609, -406191]
35548d06191R7144J53433R1061P4132K877j33180m9316K73812L53584j7611l17327
35537A22418j31876J24026n6613l61811k18207J80596K07571j30616k62546k5484
35527e52542J80888J47418Q2677R0676K5159r7013o0975J18227J81757O9097l1787
35516A53582o9793j54990k05644p432L26193L75466K0551l24736k55823R9254
35506d3372K78302N9930l06484l99818r1050L04192L73521Q9986j79072j57829
35496g1694L4616J39962J06377L7423k1768p2718o4737L2551J38035J46946M4333
35485D49326j06962k00318j25776Q0832J79428J4105k10672j99492k5603J7235
35475a27897n1294N4632L10829L45212O7722j48947p7499M1049j5653r0012j7406
$$ y = [-406191, -309047, -155614, -64553, 9579, 12456, -120724, -170040, 103772, 457356, 439745, 122418, -9458, 114568, 57955, -303856, -522063, -341467, -133896, -264512, -527058, -552542, -371654, -224236, -141559, -50883, -25724, -122737, -183712, -65485, 116272, 185369, 153582, 83789, -71201, -276845, -284277, 41916, 417382, 437933, 113197, -142626, -43372, 234930, 294860, -11624, -411442, -502492, -198300, 175221, 265207, 86135, -71694, -37078, 102884, 209261, 246684, 224916, 152198, 87461, 120012, 258047, 404993, 449326, 342364, 142046, 16270, 97102, 276530, 290635, 79963, -119529, -145132, -127897, -179191, -124559, 186270, 531482, 599204, 450257, 372758, 413807, 398154, 308142, 290736]
35464B90736M8968m3421j59976j60483j32866j33659m8762R1636M9917j65202
35454c63112k09643R440J30484j3487o3339J92761L46235M3330l41430k75599
35444e44360O4331J19298j19839j52294J74347M43819L29104K8j99633j47203
35434c2402M4653J78909J24518m3120j16824n8330m8062j36361j14024J06835
35424i4208K85557K41104J33886J10936P027k87422m88386l23845K69J30446J11080
35413a73556J88231K92928J72590j08626k36630j30186K0136J14631J94076K06105
35403E39699O7939r2210p4796N3662N0144j22572k67187k58652j39710L1816K01776
35392a0091K47064J03785q3397j25756l9487K7637K4223l176k7833j9701P0871
$$ y = [290736, 339704, 296283, 136307, -24176, -157042, -290701, -339463, -247827, -197910, -363112, -572755, -563315, -432831, -446318, -509657, -316896, 29339, 72669, -268761, -544360, -480029, -360731, -480570, -632864, -458517, -14698, 314406, 314434, 114801, -32402, 12251, 191160, 315678, 272558, 155734, 97404, 49342, -87019, -201043, -94208, 191349, 432453, 566339, 677275, 684302, 396880, -91506, -415351, -415082, -284636, -173556, 14675, 307603, 480193, 371567, 134937, 4751, 24887, 139518, 333594, 539699, 607638, 515428, 440632, 494294, 544438, 421866, 154679, -103973, -243683, -211867, -10091, 236973, 340758, 257361, 131605, 92118, 119755, 143978, 140802, 112969, 93268, 164139]
35381A64139J79109J30977q8032k48463j98013p1039l6790n7430n1917o5718j04750
35370d47927m4785J08222J27107n8701j65136J8029K55896K11320m9509j85530
35360b31014o3360J41459K09387O0770j96709k92201n2855K82969K86797m2469
35350A02774k38698p5792J10603K5250j14046k8123J13596L3297j41889j22987
35340c36015N1037J53534J59899J41051J6627k27948l24346q3661K50730L45846
35330A46754K28992Q0841j16251l62208l98860j11090J37448L0779j34644P0701
35320d27538M33648L97233l3532k99528j45640J00788J35158N3314L9046Q3894
35310C36843J18667J18036K2191j91086l58370k96250q6141K9899j5899r1331
$$ y = [164139, 343248, 474225, 386193, 137730, -60283, -131322, -168112, -225542, -277459, -343177, -447927, -492712, -384490, -257383, -316084, -481220, -463191, -207295, 4025, -45484, -231014, -294374, -152915, 56472, 117242, -79467, -371668, -424523, -141554, 145243, 102774, -135924, -211716, -101113, -75863, -189909, -218032, -104436, -71139, -213028, -336015, -284978, -131444, 28455, 169506, 186133, -41815, -366161, -449822, -199092, 146754, 375746, 456587, 340336, -21872, -420732, -531822, -394374, -363595, -498239, -427538, 6110, 403343, 369811, 70283, -75357, 25431, 160589, 213903, 252949, 336843, 455510, 573546, 595737, 404651, 46281, -249969, -336110, -306211, -322110, -413441]
35300d13441r3821j8690J01162J73212J07277O151O3338J82514N5956k45533k44563
35289c26438J39103L26949J6399k32753P9350M68039K28576l44242m11592L5573
35279b1036K42506L289j05294J41348K35096p5524l13619j52513K5739j06988
35269a26996k08360N5384L12832R5512l02426k50407J98299L87867P6865k46658
35259h088j47577J74459K92983J62197K6109l8154j43929k52078j59615J06715
35249A3022K05907k2512k45196j02652K13105K28343p9607k65902j26761M6615
35239a35638J4464p1474m0176J4376K0565R2520J99944R8919j83001k49603J3973
35228b25131J87318K8374r1319J26707L29250J36237j62520j35614K4346o7187
$$ y = [-413441, -507262, -525952, -424790, -251578, -144301, -138150, -74812, 107702, 163658, -81875, -326438, -187335, 139614, 156013, -76740, 2610, 470649, 699225, 354983, -56609, -21036, 221470, 224759, 119465, 260813, 495909, 420385, 106766, -45747, -20008, -126996, -335356, -279972, 32860, 128372, -174054, -424461, -226162, 161705, 238570, -8088, -155665, 18794, 311777, 473974, 500083, 461929, 318000, 65922, -93693, 13022, 218929, 196417, -48779, -151431, 61674, 290017, 210410, -55492, -182253, -135638, -121174, -192648, -232824, -218448, -197883, -105363, 94581, 193500, 10499, -239104, -225131, -37813, -9439, -100758, 25949, 355199, 491436, 328916, 193302, 217648, 150461]
35218A50461k04079P134K97805J17471l54958m29777l4932K06680K3374j77472
35208c98293j03281L8879P8350J34057J95187O8248j36025p2744J73788J36594
35198A14760j95947k72960Q4466L36650J16316j91248j49468L9605R168j09990
35188b18648j4519J69634J29727o2264j02397J4759N2151k5087n1972r137j7047
35177a34800n9417k6105K7917l4304j28747l1976K21470L12214R0854j81970j92737
35166a37601P423J30298Q2329L2033O5288M0331j12385j94362n1620J12995K4163
35155a108k06680k41988n0132J02475J42476K35902L36994J85585j54122k68866
35145H0536p0556L5612j28129j91136O4110K64258J15989n0959Q8108K14261n0246
$$ y = [150461, -53618, -46484, 251321, 368792, 13834, -415943, -450875, -244195, -220821, -398293, -501574, -462695, -384345, -250288, -55101, 13147, -122878, -195622, -21834, 114760, -81187, -354147, -269681, 66969, 183285, -7963, -157431, -117826, -108658, -218648, -233167, -63533, 66194, 3930, -98467, -83708, -31557, -56644, -108616, -117753, -134800, -194217, -220322, -192405, -226709, -355456, -387432, -165962, 146252, 237106, 55136, -137601, -130178, 120, 82449, 114482, 179770, 220101, 107716, -86646, -138266, -25271, -1108, -207788, -449776, -499908, -397433, -254957, -19055, 317939, 503524, 349402, 80536, 9980, 45592, -82537, -273673, -209563, 54695, 170684, 119725, 207833, 422094, 371848]
35134C71848l85715k76004J04479K05225J5871l6038J08866J29047k9475j33487
35124G4617j64935k45831k17399R6833L78969K13898j61073j83541R9168J51223
35114D1929q9786j45830J07438K42404O2634j14671q3952k7960m7373L128J05812
35103E3773N6521q1211l2992J52834J74675N5884O4657J18206o5441k83880q4005
35092A29021L33574K92021k01461l73770L8495L45010O6638l21877k65471K2551
35082F4731J03144M5623Q0579P4095j21458k54879j02476R4919N2433p9621m8121
35071i1031N7908O2523N6494J53537K11402R3568q6869k05046k83740k65718k4148
35060c21120K67601K42722m1822j16896J17433K12783k7485k14114j05056m843
$$ y = [371848, -13867, -289871, -185392, 19833, 35704, -334, 108532, 237579, 208104, 74617, -90318, -336149, -553548, -456715, -77746, 136152, -24921, -208462, -109294, 41929, -47857, -193687, -86249, 156155, 218789, 104118, 20166, -7794, -55167, -52039, 53773, 110294, 29083, -3909, 148925, 323600, 379484, 444141, 562347, 496906, 213026, 129021, 462595, 754616, 553155, 179385, 217880, 562890, 629528, 307651, 42180, 64731, 167875, 213498, 294077, 368172, 246714, -8165, -110641, -15722, 36711, -42910, -91031, -33123, 29400, 85894, 239431, 450833, 544401, 457532, 252486, -31254, -296972, -321120, -53519, 189203, 147381, 30485, 147918, 360701, 333216, 119102, 14046, 9203]
35050I203j01014q4703J68661K31513q8459k75099K9985L45771J65878j67162
35040B34574j13129J05788p617k53498j15200K39940K29362j01716j83881N0529
35030H5152J06180j22053j65372J38225L38954J67470k8711O1894J77540k7793
35020G31486l62530l78597n3715J88660Q8571j18212o7642J97823K61517p2881
35010D14480m34853l53054P0659K93496J03077j51167j66363q2828r0850o8869
35000d66272J07221K54741J95458P2931O1621N3163o9776j50134o8364l2636k00646
34989b42693l05947o4694K99513L67363J54499k886k0434p4772j62267j04398
34979a56716N3314O7725o9785r3576J03545L04074K90514R9879r3940j72824j24173
$$ y = [9203, -91811, -176514, -7853, 223660, 135201, -139898, -109913, 235858, 401736, 234574, 121445, 227233, 219616, -33882, -149082, 90858, 320220, 218504, 34623, 85152, 191332, 69279, -96093, 42132, 381086, 548556, 519845, 581739, 759279, 731486, 368956, -9641, -63356, 125304, 213875, 95663, 28021, 225844, 487361, 414480, -20373, -373427, -302768, -9272, 93805, -57362, -223725, -306553, -397403, -466272, -359051, -104310, 91148, 164079, 225700, 278863, 209087, 58953, -9411, -42047, -242693, -548640, -613334, -313821, 53542, 208041, 205155, 184721, 109949, -52318, -156716, -103402, -35677, -105462, -199038, -95493, 208581, 499095, 598974, 505034, 332210, 208037]
34968B08037k8895L578l3342l9345J0612J1395p3095j27887r8543r1963j57278
34957d16726j77388r8968m1191m4446L5591K29977L23100J99673N4129N1224N4367
34946A69342p6709j90646j15065J7550n298j25384j51793p3333L359N7842R1464
34935c98671L9936o4728m5515J33482K51902J66239J4633o2498j22456j79750
34925b67426q8265J41106K37062R3847l8529j096J2842j21628j88702n9366L1605
34914b48550m9940l9191K01066L19668P4068j71874n2779J32750n1346l68936
34904b55064k89452J08318K92406J48619K9300N4048J0052j07394o9330Q0111
34894A614N8235j02975p8021J42175J85628o9800k77098j61466J10500K33769
$$ y = [208037, 179142, 182720, 149378, 110033, 120645, 132040, 58945, -68942, -167485, -259448, -416726, -594114, -693082, -734273, -778719, -743128, -513151, -190051, 9622, 63751, 114975, 169342, 92633, -98013, -213078, -195528, -200826, -326210, -478003, -551336, -547977, -490135, -398671, -358735, -423463, -468978, -335496, -83594, 82645, 97278, 34780, -87676, -267426, -355691, -214585, 22477, 116324, 77795, 76699, 89541, -32087, -220789, -280155, -248550, -298490, -337681, -136615, 183053, 257121, 85247, 32468, 165218, 113872, -255064, -544516, -436198, -143792, 4827, 34127, 88175, 98227, -9167, -78497, 1614, 59849, -43126, -121147, 21028, 206656, 136856, -140242, -301708, -191208, 42561]
34884D2561J32323o6081j82148q8352J35948K11724K5819j58344j03230R512p4507
34873a14775j86116k6740K43145K28294j8662r0166O2157P6355j37836k30608
34863a94952l7765J35658L9223j37240j10650Q4326K19065J72127j4406j90954
34853c5568j73535M8852K08713Q3384j53369j77442j7162K7736j00013j58877
34843d47281m4620Q9507J53600K03669J93527Q575k20883k00410P2189K60111
34833F7984J66796l4701j12713m5452O9268J30801M7690j45266k25637p3225Q4688
34822f9767N054j42367n0848J64248J43414p9841j45131k9475o7235k65673k20839
34811g58460J30759L02414P3974p6028K36090N84966L56431k64280n28212k03230
$$ y = [42561, 174884, 108803, -73345, -161697, -25749, 185975, 211794, 53450, -49780, -40268, -114775, -300891, -327631, -84486, 143808, 125146, 34980, 97137, 173492, 35656, -194952, -232717, -97059, -57836, -195076, -305726, -221400, -2335, 169792, 155386, -35568, -209103, -160251, 48462, 131846, -21523, -198965, -216127, -188391, -288404, -447281, -491901, -402394, -248794, -45125, 148402, 156977, -63906, -264316, -192127, 67984, 234780, 200079, 87366, 41914, 111182, 241983, 289673, 144407, -81230, -154455, -69767, -64713, -207080, -257928, -93680, 49734, -30107, -175238, -204713, -271948, -537621, -758460, -627701, -325287, -251313, -327341, -91251, 493715, 850146, 585866, 57654, -145576]
34801a45576J55857N9878k69855l04847N2770M05199M12994J65242l7287q8089
34791D06286j20087k21648l00257k56357j17639O2985K61169L50534J50157k37495
34781b2352l76948l9245M02711M20593L3098k68959k15721k3404L2360k6097l9987
34770a23951R411J9778m7483r1154K1761K50479L30165Q2685k51995k66200Q968
34759e7536J16275j04118k57824q6387Q8180k3720j22548J11530L42192J12927
34749A18971k89497k39337J84832L31190M4520j68786n1423P7468P185m4817L7105
34738G411M2277p3176m3258J66230K19102O951j44572o7110j8011j37757j66974
34727b08887L4965J87195Q6087n4046l8367k2219j20810j31227N1611J65098L7711
$$ y = [-145576, 10281, 70159, -199696, -504543, -451773, -46574, 366420, 531662, 494375, 406286, 286199, 64551, -235706, -492063, -609702, -546717, -285548, 64986, 215143, -22352, -399300, -438545, -35834, 384759, 417857, 148898, -66823, -90227, -57867, -83964, -123951, -114540, -94762, -142245, -233399, -211638, 38841, 369006, 451691, 199696, -66504, -57536, 58739, -45379, -303203, -389590, -301410, -325130, -447678, -336148, 6044, 118971, -170526, -409863, -225031, 106159, 150679, -18107, -69530, 7938, 15123, -29694, 7411, 49688, -23488, -66746, 99484, 318586, 325537, 180965, 113855, 95844, -41913, -208887, -173922, 13273, 99360, 45314, 6947, -15272, -136082, -267309, -215698, -50600, -12889]
34716a2889r1677k8585J7808j27024k15257j5055K34505K16009N3036K7157P9811
34705A37839J5813p1814p428Q0279j859j10926k8499R8328J9319j19734k0479
34694i161J87187J23182j75652k91371j13103K3984n1407q6609J00086K94062
34684A198K66229J35733J08367J18566p918k16837l04186k25977j10420k2064
34674b57309Q8474K16774K60807J75286M4299m1469q2246j02483q7379n4738r2862
34663F7154k18060k73886j21663J19547K06714J23298P1407R9926K3446j91484
34653i3601k69602n8581J64712J00020j01143j01684P0184J22144K0504o429P2499
34642h0977N5227o6475o0452J08751J88410P0621n5706q5998j52449k60871j68591
$$ y = [-12889, -104566, -133151, -115343, -242367, -457624, -472679, -238174, -22165, 30871, 58028, 137839, 153652, 81838, 74410, 154689, 152830, 41904, 13405, 111733, 131052, 11318, -9161, 178026, 301208, 125556, -165815, -278918, -254934, -306341, -392950, -292864, 1198, 267427, 403160, 511527, 630093, 622175, 405338, 101152, -124825, -235245, -257309, -168835, 47939, 308746, 484032, 528331, 486862, 404616, 302133, 214754, 160016, 67154, -150906, -424792, -546455, -426908, -220194, -96896, -25489, 74437, 97883, -93601, -363203, -421784, -257072, -157052, -258195, -359879, -289695, -167551, -147047, -153476, -80977, -25750, -92225, -152677, -43926, 144484, 215105, 159399, 73401, -79048, -339919, -508510]
34631e08510J68563L89712K35164m4422p9746P1452R8673l3542r3416k4941k6596
34620A52391j65598k12113J7728L37623L80992O6911k73943k99742q3213J2156
34610f6808j44827k73765j15867J79248K93614J88918O8339K4864K146R386Q6353
34599B51601J19855j4823j81928j49404K4782Q1537j0022n2430j8638p3457j85967
34588b08894j21857J06486J76914l0198k19826j45194L7913O4363n9752j51953
34578e51998j18538K0209J92658K71310J77986L2001M074L9580k9524j43399j02722
34567b08363L3348J2405j45079j55884J3419Q7781J1776N6679K64243K83190k0500
34556B33015k66849j58641N6414M2632r2318q0110K5274K2555l9212L469R7455
$$ y = [-508510, -339947, 49765, 284929, 240507, 160761, 232213, 330886, 297344, 203928, 178987, 152391, -13207, -225320, -207592, 130031, 511023, 577934, 303991, 4249, -78964, -66808, -211635, -485400, -601267, -422019, -128405, 60513, 128852, 153716, 155862, 165248, 251601, 371456, 356633, 174705, 25301, 50083, 131620, 121598, 69168, 50530, -22927, -208894, -330751, -224265, -47351, -77549, -297375, -442569, -404656, -340293, -400045, -551998, -670536, -650327, -457669, -186359, -8373, 23628, 27702, 67282, 37758, -105641, -208363, -175015, -162610, -307689, -463573, -450154, -362373, -350597, -293918, -29675, 253515, 233015, -33834, -192475, -136061, -93429, -185747, -265857, -240583, -218028, -257240, -253771, -156316]
34545a56316R3366K5750R538K4226J5776K6363M8957j5289j03758o99K27959J85182
34533C81055k18157m77585k03710K51298L09311N295j74717p4953K3036l8424
34523b17551j08196q0819l0868J6024J11603J82697R9355n5812o0450J00784K06556
34512A63323J24584m2113j40383j28278n8124k5297r4981j91581j58553p001O0380
34501d98024k1406m5866J09132K34786J27616n6643o3340M2551K7614r6177j32963
34490c72720o3264k0509N267J15877K15394J03064j54452k58768j20306K4419
34480e25998M249m0685P0848K43896K31112j1788k43388k21612J0469J89305J64299
34469a29293O0134M7871Q4440L1462p6075r8527n6220p1617r9792o658J22904
$$ y = [-156316, -62950, -37200, -27662, -3436, 12340, 38703, 87660, 72371, -31387, -32086, 195873, 381055, 162898, -314687, -518397, -267099, 42212, 47507, -127210, -202163, -179127, -217551, -325747, -406566, -437434, -421410, -309807, -127110, -27755, -83567, -144017, -43233, 163323, 287907, 245794, 105411, -22867, -80991, -106288, -201269, -392850, -551403, -558404, -498024, -519430, -565296, -456164, -221378, -93762, -150405, -213745, -171194, -143580, -239757, -372720, -435984, -456493, -451226, -335349, -119955, -16891, -171343, -430111, -550417, -525998, -521749, -562434, -491586, -247690, -16578, -28366, -271754, -493366, -482897, -293592, -129293, -69159, -21288, 63152, 94614, 18539, -79988, -136208, -207825, -307617, -314275, -191371]
34458a91371R2465q686R0533L19032K92689m0393k59134j37801K4248l6140j36515
34447H927q5974n9118j83779k01352N8550K73108J34208j13185j02220M0507O677
34436b23651r7512p454J32907L0415j66147j15973P2802N3777p2603P3592L96865
34425G7018M02310K4590k52126j69202j641J4935J2976R6051J09792j1426r3894
34414B09383p4502j04912j82515r1354J50817K10118k1740k07467r5772R9880
34404a08064R0814n1083j03220n6607j4311L8233J15164Q3126j25227l03724k03728
34393f38627J24843L93189L97295J69542j01788k16953j22019K0075J4174r7752
34383e8021j00612M6210J26032J444j60503j27168P0148J85128P4576j35602j99815
$$ y = [-191371, -98906, -107592, -17059, 301973, 594662, 554269, 295135, 157334, 181582, 145442, 8927, -77047, -136165, -319944, -521296, -462746, -189638, -55430, -168615, -270835, -230328, -223651, -321163, -328617, -195710, -165295, -331442, -447415, -374613, -320836, -393439, -319847, 77018, 479328, 503918, 251792, 82590, 80949, 95884, 108860, 204911, 314703, 303277, 209383, 134881, 29969, -152546, -243900, -93083, 117035, 95295, -112172, -207944, -108064, -17250, -68333, -171553, -228160, -242471, -204238, -89074, -5948, -131175, -434899, -638627, -513784, -120595, 276700, 446242, 344454, 127501, 5482, 25557, 39731, -58021, -158633, -112423, 13609, 15053, -145450, -272618, -202470, -17342, 57234, -78368, -278183]
34372b78183l5243J65449J53406n1858j82982j03022K6010N1022O9043J71224
34362a5134J85462l9440k83862k31027M1677J94967J44915P9623M8919n3346j42203
34351f9449j2507K30593K46541J7705j02368J3474P2615q3161j83526k5723J42710
34340B46904M2693j62869j49941N6261J82846J45823P4851K1223p6936k01989
34330A78866k52973j94732o2730J04194K14231J31387j15407k61795j23846J27557
34320b55248J98052P7613P24N8008Q9746r133r5180K082J94872K20643j1379k78762
34308A92038l05689r1434J17665J50790O9166j3469q9056j48304j01410L9460
34298a80243P0873r7361k06910O24L19229L10271m0106k74678j30927J19473J40475
$$ y = [-278183, -313426, -147977, 5429, -46429, -229411, -332433, -306423, -255401, -186358, -15134, 170328, 130888, -152974, -384001, -342324, -147357, -2442, 77181, 126100, 72754, -69449, -81956, 148637, 395178, 412883, 310515, 323989, 396604, 313443, 129917, 104194, 246904, 289597, 126728, -23213, 33048, 215894, 361717, 436568, 457791, 380855, 178866, -74107, -268839, -331569, -227375, -13144, 118243, 2836, -258959, -382805, -255248, -57196, 20417, 21141, 79149, 168895, 159762, 64582, 66664, 261536, 482179, 470800, 192038, -113651, -205085, -87420, 63370, 132536, 119067, 30011, -118293, -219703, -180243, -109370, -206731, -413641, -413017, -93788, 216483, 176377, -98301, -229228, -109755, 30720]
34287C0720O449j7756Q2657J18188L0307o5310r5405r4934r5896q8876o2751M126
34275b48481J30439K41801J95461j2168j71067j15481L2368K5210j53048k56202
34265c31168j14528J29804J98862K6740j57719j10386J25754K65044J19505j82732
34255c0824l51241k40376L5871K30232J67378r4803k71645j27990K07532L54604
34245a21262J79730j9026L1342J65290P3013j78056k55502j02169O816n2388p7020
34234c49232O5925J94022J20474m0281o6739M3957J24685R7513K7493j3481j7430
34223A86906j4567m6197j22539j75104j13424M3175J59038J39671M0585q235M9116
34212A38425J37591J37929M2342r161P7238J69565Q5788q2741p5718Q3832P4255
$$ y = [30720, 37169, 19413, 102070, 220258, 250565, 185255, 89850, -5084, -100980, -189856, -252607, -248481, -118042, 123759, 319220, 307052, 135985, 20504, 52872, 78082, -74966, -331168, -445696, -315892, -117030, -90290, -248009, -358395, -232641, 32403, 151908, -30824, -382065, -622441, -586570, -356338, -188960, -283763, -555408, -683398, -475866, -121262, 58468, 39442, 70784, 236074, 309087, 131031, -124471, -226640, -219824, -272212, -349232, -283307, -89285, 31189, -9092, -75831, -31874, 92811, 190324, 217817, 204336, 186906, 172339, 126142, 3603, -171501, -284925, -241750, -82712, 56959, 97544, 89309, 138425, 276016, 413945, 456287, 447126, 524364, 693929, 779717, 696976, 621258, 705090, 779345]
34201G79345j71204k81044m9104J76338N8899j50648p1436J15037J2727k12312
34191B06598r4114K37921J87676k78641n05606j91529J86408K29305J76607K69786
34181D24411K48472o2533k78943j01592J01813o0356k67477n5327K89421J59201
34171C97090l17400m40319m9152K94516K45498P5720K9709m3673k05560j78857
34161a92428J16483K84156N0050k67608k45041K1459J47958O1554j6950j3983
34151e4350n1476j40594j55686q4592l6062j4210P5074K00044K14873J11669M5787
34140A10477O9901M7622r3553k07762j44043K4333J14902Q7250M6509N1593N1912
34129A59141O441l7775q400R9374J95200J44631r8616l74024m16150j63547J19055
$$ y = [779345, 608141, 327097, 277993, 454331, 513230, 362582, 291146, 406183, 418910, 206598, 112484, 350405, 538081, 259440, -246166, -437695, -251287, -21982, 154625, 424411, 672883, 610350, 331407, 229815, 331628, 271272, 3795, -51532, 237889, 397090, 79690, -360629, -409781, -115265, 130233, 205953, 235662, 191989, -13571, -192428, -75945, 208211, 258261, -9347, -254388, -232929, -84971, -23417, -40367, -54350, -105826, -246420, -402106, -486698, -522760, -536970, -461896, -261852, -46979, 64690, 110477, 180378, 228000, 134447, -73315, -217358, -193025, -78123, 9127, 55636, 107229, 159141, 165582, 127807, 119407, 218781, 413981, 558612, 459996, 85972, -330178, -493725, -374670]
34118c74670J53110J239o1347L4340R6506L2736r058N9287R1358j8215j19165
34107a13879o2961L0094q864q8400l0869R6234J17987R5531J93166K87764J06157
34096F21960k47184l18710K6568L46353K24457j78499m13217l31080j23312M1125
34086c51539J33209J24582l292j36632j15541N5814K14238K32026J11685n9647
34076B04903j57307r2150O6840J25411J5611r4028n7892J1988n2129j58959q9705
34065b77417J12258J58818m5385k39852j82868K4836J38324J22705J17810J49704
34055G8933R8297n2833j35168m2627P9170J9141j85960k66158o4938K40130L36279
34044A04266J36289j45648k54473j35196R3206K91182L56910K23783p0824l35483
$$ y = [-374670, -221560, -220321, -281668, -247328, -150822, -118086, -127144, -67857, 23501, 5286, -113879, -176840, -146746, -155610, -244010, -274879, -178645, -60658, 34873, 228039, 515803, 621960, 374776, 56066, 82634, 428987, 653444, 474945, 61728, -269352, -392664, -351539, -218330, -93748, -97040, -233672, -349213, -293399, -79161, 152865, 264550, 204903, 47596, -44554, 22286, 147697, 163308, 69280, 11388, 23376, -28753, -187712, -277417, -165159, -6341, -51726, -291578, -474446, -449610, -311286, -188581, -70771, 78933, 177230, 124397, -10771, -53398, 25772, 44913, -141047, -407205, -472143, -232013, 104266, 240555, 94907, -159566, -294762, -201556, 89626, 446536, 670319, 599495, 264012]
34034B64012l71444j94958q340P5511J44723K60282K84447R9246j31153j48166
34024B74160R601O2695o6807j61412j12510r3726j88129j77172N5321K20397O2421
34013a15161j62903o8369K05474K06360o2520j46829P4928J86271m1867k59126
34003a83742j26882J57133K40977J42570N3222n1217k35766l12922j04593J96797
33993b24423K72384J18756n0556j54864j93704n7909K51865M06837J44791k56585
33983B56592l08917k1198J39494m3915k85732k85795r4582R9832K39898L29718
33973B5395L21313J90860L210j54949k29481k07145j41817j05538o2966O9896
33963b91222K01501J34331o0405n9212J66693K08779j12866l60449j43346K23630
$$ y = [264012, -107432, -302390, -310730, -235219, -90496, 169786, 454233, 553479, 422326, 274160, 283761, 346456, 279649, 118237, 5727, -87999, -276128, -453300, -397979, -177582, -115161, -278064, -346433, -140959, 65401, 2881, -143948, -69020, 117251, 75384, -183742, -310624, -153491, 87486, 230056, 283278, 232061, -3705, -316627, -421220, -224423, 47961, 166717, 116161, -38703, -232407, -290316, -38451, 368386, 513177, 256592, -52325, -73523, 65971, 22056, -263676, -549471, -644053, -544221, -304323, 25395, 346708, 537568, 540778, 385829, 156348, -50797, -192614, -298152, -361118, -291222, -89721, 44610, -15795, -75007, 91686, 300465, 187599, -172850, -316196, -92566]
33953i2566K23402l8806q9132R9355J67173N7260M010k8313k35440m02028j46409
33942d81494K99550K97319j63526l93118r7293K12080J31627m7226L282Q3884
33932a54915k6464j03046L4941J00192j14495k42004P2965M86739M24186m0147
33922D37952l20121j71377R3842J64821P2432k5653p2935r0994j18453j70470
33912b00956j75021m5348J33039J63383M1817k5316L0311M7210l0906m4800M4378
33901f2209M9681o7794p6551R8726J96409P5047j9352J05529K37585J37561o0883
33890F13749j30799j32320k07684k69303j90750o0764J5668J06753K09529J31958
33880H6037j21502j97349O7135L08473J91275n6809o1387Q6672Q2335l1344l2785
$$ y = [-92566, 130836, 92030, 2898, 102253, 269426, 326686, 330696, 302383, 66943, -335085, -481494, -181944, 115375, -48151, -441269, -538562, -326482, -194855, -242081, -238799, -154915, -181379, -284425, -249484, -149292, -263787, -505791, -432826, 53913, 478099, 437952, 117831, -53546, 40296, 205117, 277549, 251896, 178961, 87967, -30486, -200956, -375977, -421325, -288286, -124903, -83086, -108402, -78091, -30881, -61787, -106587, -62209, -12528, -80322, -156873, -58147, 138262, 213309, 193957, 299486, 537071, 674632, 613749, 482950, 350630, 142946, -126357, -317107, -377871, -362203, -255450, -45921, 86037, -35465, -232814, -165679, 142794, 334069, 277260, 215873, 302545, 384880, 353536, 320751]
33869C20751k068j37408k96359k10645J1250P3389K2531J03492K34281J40244
33859B59458r4693j34788J2258K7284j19544j25567O0271J27262l2848j31957
33849a52864K798J50428J03446j1160n159P7615J14840J00770M5496q7277k20454
33838A18479j75143L2525J33414j1190j74022q2322J83612L03370J45639r0365
33828C83997j56928n3357K1609l9068j12664n1442P6193R5491J4002j1584K1159
33817A87408m0242j62025j01734J53202K59431L4401k17410j63035N9209J16566
33807A25771J2479j8018M7464N2778N390K2431L7032r5059k76379k83627j29061
33796d98799O350J10880K76476L76911J89527j76946l39136j63433P7056J21766
$$ y = [320751, 318683, 181275, -115084, -325729, -314479, -241090, -218559, -115067, 119214, 259458, 164765, 29977, 42235, 69519, -50025, -175592, -115321, 11941, -20907, -152864, -150066, 362, 103808, 92648, 87489, 165104, 279944, 380714, 426210, 338933, 118479, -56664, -24139, 109275, 98085, -75937, -158259, 25353, 328723, 474362, 383997, 227069, 173712, 195321, 156253, 43589, -7853, 68340, 163831, 177833, 166249, 187408, 147166, -14859, -116593, 36609, 296040, 330441, 113031, -50004, 9205, 125771, 138250, 120232, 167696, 220474, 225864, 248295, 285327, 190268, -86111, -369738, -498799, -492449, -381569, -105093, 271818, 461345, 284399, -54737, -218170, -141114, -19348]
33786a9348K4671k8191K4912J16426J41215K8892j56892k32786j24922J3828M2742
33775a69453L3940O9258L7854j30204k31107p6970J58396J92783O8016L808n394
33764d9073q0018j08460O8907K53845J20823k18363l37109j47490K8744M1011
33754d27183Q3164K22319K21770k0123k46061k24562m9250Q4647J31267J12970
33744a11042L7322k3356O228L4901o6447j87799j17537P2565J14117J889k540
33733b41699J50787K03590L6940j51475j97091j48055l3474J80227L38680K06391
$$ y = [-19348, 5323, -22868, 2044, 118470, 259685, 288577, 131685, -101101, -226023, -212195, -169453, -135513, -66255, -28401, -158605, -389712, -466682, -308286, -115503, -47487, -43679, -49073, -129091, -237551, -168644, 85201, 206024, -12339, -349448, -496938, -468194, -427183, -344019, -121700, 100070, 79947, -166114, -390676, -439926, -355279, -224012, -111042, -73720, -97076, -90848, -55947, -122394, -310193, -427730, -355165, -241048, -239159, -241699, -90912, 112678, 149618, -1857, -198948, -347003, -380477, -200250, 138430, 344821]
$$ [...]
##END NTUPLES=NMR SPECTRUM
##END=
