##TITLE=31Pdec_3DPAA1312
 CDCl3, 24 sc
 14.12.2021
##JCAMPDX= 6.0         $$ Bruker NMR JCAMP-DX V2.0
##DATA TYPE= NMR SPECTRUM
##DATA CLASS= NTUPLES
##ORIGIN= UXNMR, Bruker Analytische Messtechnik GmbH
##OWNER= root
$$ XWIN-NMR		Version 3.5
$$ Tue Dec 14 12:03:45 2021 Russian Standard Time (UT+4h)  she@DPX200
##.OBSERVE FREQUENCY= 81.013821
##.OBSERVE NUCLEUS= ^31P
##.ACQUISITION MODE= SIMULTANEOUS
##.ACQUISITION SCHEME= undefined
##.AVERAGES= 24
##.DIGITISER RES= 16
##SPECTROMETER/DATA SYSTEM= spect
##.PULSE SEQUENCE= zgpg30
##.SOLVENT NAME= CDCl3
##.SHIFT REFERENCE= (INTERNAL, CDCl3, 0, 248.564)
##AUDIT TRAIL= $$ (NUMBER, WHEN, WHO, WHERE, WHAT)
$$ ##TITLE= Audit trail, XWIN-NMR		Version 3.5
$$ ##JCAMPDX= 5.01
$$ ##ORIGIN= Bruker BioSpin GmbH
$$ ##OWNER= she
$$ F:/spectra/data/she/nmr/P31/1/pdata/1/auditp.txt
$$ ##AUDIT TRAIL=  $$ (NUMBER, WHEN, WHO, WHERE, WHAT)
(   1,<2021-12-14 12:02:38.37 +0400>,<she>,<DPX200>,
      <created by zg, POWCHK disabled, PULCHK disabled
       configuration hash MD5:
       00 E9 B6 7A A2 85 ED C7 34 08 36 98 17 FE 4E 26
       data hash MD5: 32K
       A5 AE C7 BF CB BE C4 E9 5E 8D 62 F3 0A 6E 82 8F>)
(   2,<2021-12-14 12:02:47.95 +0400>,<she>,<DPX200>,
      <Start of raw data processing
       efp BC_mod = 2 LB = 1 FT_mod = 6 PKNL = 1 PHC0 = -9024.763 PHC1 = -264.13 SI = 64K 
       data hash MD5: 64K
       D3 0D 64 ED 32 13 96 5A B2 7E F3 8D F1 FA 03 56>)
(   3,<2021-12-14 12:03:09.10 +0400>,<she>,<DPX200>,
      <pk PHC0 = 6.316446 PHC1 = 0 
       data hash MD5: 64K
       B2 2F 67 9F 77 87 6F 13 3C B6 1B 3D A6 DA 9D 67>)
(   4,<2021-12-14 12:03:12.12 +0400>,<she>,<DPX200>,
      <abs ABSG = 5 
       data hash MD5: 64K
       6C B3 F2 8C 9B 1E 37 2C DA D0 FC 0C D8 6F EE 24>)
$$ ##END=
$$ 
$$ hash MD5
$$ 94 5E 4F 8C 2E 36 45 7F B3 2B FB E8 91 E2 72 FA
##$RELAX= 
##$RELAX= 
##$RELAX= 
##$RELAX= 
##$RELAX= 
##$RELAX= 
##$RELAX= 
##$RELAX= 
$$ Bruker specific parameters
$$ --------------------------
##$DU= <F:/spectra>
##$EXPNO= 1
##$NAME= <P31>
##$PROCNO= 1
##$TYPE= <nmr>
##$USER= <she>
##$AMP= (0..31)
100 100 100 100 100 100 100 100 100 100 100 100 100 100 100 100 100 100 
100 100 100 100 100 100 100 100 100 100 100 100 100 100 
##$AQSEQ= 0
##$AQ_mod= 1
##$AUNM= <au_zg>
##$AUTOPOS= <>
##$BF1= 81.014009
##$BF2= 200.13
##$BF3= 200.13
##$BF4= 200.13
##$BF5= 200.13
##$BF6= 200.13
##$BF7= 200.13
##$BF8= 200.13
##$BYTORDA= 1
##$CFDGTYP= 0
##$CFRGTYP= 5
##$CHEMSTR= <none>
##$CNST= (0..31)
1 1 145 1 1 1 1 1 1 1 1 1 1 1 1 1 1 1 1 1 1 1 1 1 1 1 1 1 1 1 1 1 
##$CPDPRG= <waltz16>
##$CPDPRG1= <>
##$CPDPRG2= <waltz16>
##$CPDPRG3= <>
##$CPDPRG4= <mlev>
##$CPDPRG5= <mlev>
##$CPDPRG6= <mlev>
##$CPDPRG7= <mlev>
##$CPDPRG8= <mlev>
##$CPDPRGB= <>
##$CPDPRGT= <>
##$D= (0..31)
0 1 0 0 0 0 0 0 0 0 0 0.03 2e-05 3e-06 0 0 0 0 0 0 0 0 0 0 0 0 0 0 0 0 
0 0 
##$DATE= 1639468957
##$DBL= (0..7)
120 120 120 11 120 120 24 19 
##$DBP= (0..7)
150 150 150 150 150 150 150 150 
##$DBP07= 0
##$DBPNAM0= <>
##$DBPNAM1= <>
##$DBPNAM2= <>
$$ [...]
##$SUBNAM3= <"">
##$SUBNAM4= <"">
##$SUBNAM5= <"">
##$SUBNAM6= <"">
##$SUBNAM7= <"">
##$SUBNAM8= <"">
##$SUBNAM9= <"">
##$SW= 501.771253377433
##$SWIBOX= (0..15)
0 1 3 0 0 0 0 0 0 0 0 0 0 0 0 0 
##$SW_h= 40650.406504065
##$TD= 32768
##$TD0= 1
##$TE= 0
##$TE2= 300
##$TE3= 300
##$TEG= 300
##$TL= (0..7)
0 120 53 12 22 120 120 120 
##$TP= (0..7)
150 150 150 150 150 150 150 150 
##$TP07= 0
##$TPNAME0= <>
##$TPNAME1= <>
##$TPNAME2= <>
##$TPNAME3= <>
##$TPNAME4= <>
##$TPNAME5= <>
##$TPNAME6= <>
##$TPNAME7= <>
##$TPOAL= (0..7)
0.5 0.5 0.5 0.5 0.5 0.5 0.5 0.5 
##$TPOFFS= (0..7)
0 0 0 0 0 0 0 0 
##$TUNHIN= 0
##$TUNHOUT= 0
##$TUNXOUT= 0
##$USERA1= <user>
##$USERA2= <user>
##$USERA3= <user>
##$USERA4= <user>
##$USERA5= <user>
##$V9= 5
##$VALIST= <valist>
##$VCLIST= <CCCCCCCCCCCCCCC>
##$VD= 0
##$VDLIST= <DDDDDDDDDDDDDDD>
##$VPLIST= <PPPPPPPPPPPPPPP>
##$VTLIST= <TTTTTTTTTTTTTTT>
##$WBST= 1024
##$WBSW= 4
##$XGAIN= (0..3)
0 0 0 0 
##$XL= 0
##$YL= 0
##$YMAX_a= 10125
##$YMIN_a= -10902
##$ZGOPTNS= <>
##$ZL1= 120
##$ZL2= 120
##$ZL3= 120
##$ZL4= 120
##$ABSF1= 248.5645
##$ABSF2= -253.2056
##$ABSG= 5
##$ABSL= 3
##$ALPHA= 0
##$AQORDER= 0
##$ASSFAC= 0
##$ASSFACI= 0
##$ASSFACX= 0
##$ASSWID= 0
##$AUNMP= <proc_1d>
##$AZFE= 0.1
##$AZFW= 0.5
##$BCFW= 0
##$BC_mod= 2
##$BYTORDP= 0
##$COROFFS= 0
##$CY= -3
##$DATMOD= 1
##$DC= 0
##$DFILT= <>
##$DTYPP= 0
##$F1P= 0
##$F2P= 0
##$FCOR= 1
##$FTSIZE= 65536
##$FT_mod= 6
##$GAMMA= 0
##$GB= 0
##$INTBC= 1
##$INTSCL= 5.30512e-09
##$ISEN= 30
##$LB= 1
##$LEV0= 0
##$LPBIN= 0
##$MAXI= 10000
##$MC2= 0
##$MEAN= 0
##$ME_mod= 0
##$MI= 50
##$NCOEF= 0
##$NC_proc= -5
##$NLEV= 6
##$NOISF1= 182.463
##$NOISF2= 159.3651
##$NSP= 0
##$NTH_PI= 0
##$NZP= 0
##$OFFSET= 248.5645
##$PC= 4
##$PHC0= -9018.446
##$PHC1= -264.13
##$PH_mod= 1
##$PKNL= yes
##$PPARMOD= 0
##$PSCAL= 0
##$PSIGN= 0
##$REVERSE= no
##$SF= 81.014009
##$SI= 65536
##$SIGF1= 159.3651
##$SIGF2= -187.1042
##$SINO= 113.3802
##$SIOLD= 16384
##$SREGLST= <1H.CDCl3>
##$SSB= 0
##$STSI= 65536
##$STSR= 0
##$SW_p= 40650.406504065
##$SYMM= 0
##$S_DEV= 0
##$TDeff= 32768
##$TDoff= 0
##$TI= <>
##$TILT= no
##$TM1= 0
##$TM2= 0
##$TOPLEV= 0
##$USERP1= <user>
##$USERP2= <user>
##$USERP3= <user>
##$USERP4= <user>
##$USERP5= <user>
##$WDW= 1
##$XDIM= 65536
##$YMAX_p= 340175562
##$YMIN_p= -27640409
$$ End of Bruker specific parameters
$$ ---------------------------------
##NTUPLES= NMR SPECTRUM
##VAR_NAME=  FREQUENCY,     SPECTRUM/REAL,   SPECTRUM/IMAG
##SYMBOL=    X,             R,               I
##VAR_TYPE=  INDEPENDENT,   DEPENDENT,       DEPENDENT
##VAR_FORM=  AFFN,          ASDF,            ASDF
##VAR_DIM=   65536,         65536,           65536
##UNITS=     HZ,            ARBITRARY UNITS, ARBITRARY UNITS
##FACTOR=    0.620285442955139, 1,           1
##FIRST=     20137.2065510759, 0,            0
##LAST=      -20513.1999529892, 0,           0
##MIN=       -20513.1999529892, -27640409,   0
##MAX=       20137.2065510759, 340175562,    0
$$ Real data points
##PAGE= N=1
##DATA TABLE= (X++(R..R)), XYDATA
$$ [...]
39463A83258q2662l24948k62323p0608J87J2633J39392K68491J64214q1758j47771
$$ 183258 100596 -224352 -486675 -557283 -557096 -544463 -405071 -136580 27634 -54124 -201895
39452b01895j041P7868P672K0084J76746K09107K219j78509j51639j04406j69892
$$ -201895 -202936 -125068 -117396 -97312 79434 288541 290760 112251 -39388 -143794 -313686
39441c13686j36402J17349L05687K08888O0411P3000K2200k16595k07343L03496
$$ -313686 -450088 -332739 -27052 181836 242247 315247 337447 120852 -86491 217005
39431B17005O30542K3468r65788j019888L4038Q85966N68577l21971o71926l08859
$$ 217005 847547 871015 -94773 -1114661 -1080623 -194657 373920 51949 -619977 -928836
39421i28836J67733L92379M19879L05292Q4846n9752l6615j0713n2312K7621K02930
$$ -928836 -761103 -368724 51155 356447 441293 381541 344926 334213 281901 309522 512452
39410E12452O2251m78305p73748l06082M49191O17399J05420l98785l88715M3117
$$ 512452 574703 96398 -677350 -983432 -534241 83158 188578 -210207 -598922 -555805
39400e55805N33889O73953J63355o91401r43899j42076Q09702P34727j25011m91320
$$ -555805 -21916 652037 815392 123991 -819908 -961984 -152282 582445 457434 -33886
39390c3886j0865L36137l8832m29040j76873J99471L2946k62349q947L76862M0628
$$ -33886 -44751 291386 252554 -176486 -353359 -153888 -120942 -383291 -392238 -15376 25252
39379B5252o90552o43443K80507Q02149K04563n77250m41579K45907M04110j4968
$$ 25252 -665300 -1308743 -1028236 -226087 -21524 -598774 -1040353 -794446 -390336 -405304
39369d05304j16178L39773N36892k8295p17401p23816j77255K66519M06238M39641
$$ -405304 -521482 -181709 355183 326888 -390513 -1114329 -1291584 -1025065 -618827 -179186
39359a79186L25014p2312m00072j50177M44042N71630K3183m89978m19478r8363
$$ -179186 145828 73516 -326556 -476733 -32691 538939 562122 72144 -347334 -445697
39349d45697k0222n2548J10056K50814L5169k66600j46045K77317M17125J29520
$$ -445697 -465919 -518467 -408411 -157597 -122428 -389028 -535073 -257756 159369 288889
39339B88889j57001j66856m8832O5131K10981K80007R7840j42794p0970J87981
$$ 288889 131888 -34968 -83800 -18669 192312 472319 570159 427365 356395 544376
39329E44376J12811l27563n17909j53560K64250K38562K1264Q3708L00162K19653
$$ 544376 657187 329624 -188285 -341845 -77595 160967 182231 265939 566101 785754
39319G85754j36338l20254j80421l0967j04572k44121k12112j8878J48350J51499
$$ 785754 649416 329162 148741 117774 13202 -230919 -443031 -461909 -313559 -162060
39309a62060P003j32194j05850P4179K33304K75266K86823L18782K39845k5273
$$ -162060 -155057 -287251 -393101 -318922 -85618 189648 476471 795253 1035098 1009825
39299A009825k64933k18819K7086J23180o0354k49166j53058J15194J78076q1249
$$ 1009825 744892 526073 553159 676339 615985 366819 213761 328955 507031 425782
39289D25782l28354k32606M2563O9845j74276k56633j0146J41198j06977l39057
$$ 425782 97428 -135178 -92615 -22770 -197046 -453679 -463825 -322627 -429604 -768661
39279g68661n4229M26807L84705j23895l10198P9593L68267Q2020l02071k02922
$$ -768661 -822890 -396083 -11378 -135273 -445471 -365878 2389 84409 -217662 -420584
39269d20584J36073J67310k1194L1914K95954L40267J11725l3457l687o8630k63501
$$ -420584 -284511 -117201 -138395 -106481 189473 529740 641465 608008 604321 535691 272190
39258B72190k66155L977J52057j02867m56442m02694J00545N77958N91773K09650
$$ 272190 6035 10012 162069 59202 -397240 -799934 -699389 -121431 470342 679992
39248F79992j13391q3785R6317N1374k10871l31104j74913j9486o3376j33059
$$ 679992 566601 482816 579133 630507 419636 88532 -86381 -105867 -169243 -302302
39238c02302o4272J1023k873M9308J75333P9219k40338k61695J92505M27850p9869
$$ -302302 -366574 -355551 -358424 -309116 -133783 -54564 -294902 -556597 -364092 63758 -16111
39227a6111o48268l29741N04616O62660M2530k40743K37492N29632J3461n13503
$$ -16111 -664379 -994120 -489504 173156 215686 -25057 212435 742067 755528 242025
39217B42025k45141K23000l4454o20361m86575K50855M93385k0528l70842n1540
$$ 242025 -3116 219884 185430 -434931 -921506 -670651 -177266 -197794 -568636 -620176
39207f20176K76481J3166l99061k96054J58634L88823L30285K90414K56008j5058
$$ -620176 -343695 -330529 -729590 -1025644 -867010 -478187 -147902 142512 398520 383462
39197C83462m09472n39189l34370r7357l034O0401J67430K21572J58063N138k24369
$$ 383462 -26010 -565199 -899569 -996926 -999960 -939559 -772129 -550557 -392494 -387356 -611725
39186f11725m35847l41486J94240P50638P24146J50271k93668k30318m7702j69673
$$ -611725 -1047572 -1389058 -1194818 -444180 279966 430237 136569 -93749 -141451 -311124
39176c11124l43341j13084L39760M29483J05858o5641J70686L56111R6784k71401
$$ -311124 -654465 -767549 -427789 1694 107552 41911 212597 568708 665492 394091
39166C94091k36700L5947j8274l89514m35196J04828O23218M90693o8329l91662
$$ 394091 157391 193338 175064 -214450 -649646 -544818 78400 569093 500764 109102
39156A09102l40081k79322k89650p3982L15178L76415M2009l7671M32027O75480
$$ 109102 -230979 -510301 -799951 -873933 -558755 -182340 -140331 -178002 254025 929505
39146I29505n0540j102507j163461j47400O50676M36517r0454m1255L28074K98789
$$ 929505 878965 -223542 -1387003 -1534403 -883727 -447210 -537664 -578919 -250845 47944
39136D7944l5992p7087J61511J73521l6943J1912L07417K83542j65768m26133
$$ 47944 11952 -65135 96376 269897 232954 244866 552283 835825 670057 243924
39126B43924j53595J87632J16749j41848j45646M3933R8501L5450J02414K35697
$$ 243924 90329 277961 394710 252862 107216 151149 249650 285100 387514 623211
39116F23211R2995l80287p40370n17175J93578P00862L98637m66224r26634m26868
$$ 623211 716206 335919 -404451 -921626 -728048 -27186 371451 -94773 -1021407 -1448275
39106a448275M25074O37864J43425k66639j87370j7815m4273M8918L98471M76227
$$ -1448275 -1023201 -385337 -241912 -508551 -695921 -713736 -758009 -709091 -310620 165607
39096A65607m1600n48063l48469K28175L22497j45495m51417k32753R0193J20896
$$ 165607 124007 -424056 -772525 -544350 -221853 -367348 -818765 -1051518 -961325 -840429
39086h40429L3373J01724K11468J35120m4607o9491J16199L21793L57585K20840
$$ -840429 -807056 -705332 -493864 -358744 -403351 -472842 -356643 -34850 322735 543575
39076E43575P3629N1746Q2427k2235k52160l45257j53730J13797J67713l829j95943
$$ 543575 617204 668950 751377 729142 476982 131725 -22005 91792 259505 255676 59733
39065E9733k42745r0840J84306L34643J74144n4123P9319M45038L68824l10030
$$ 59733 -183012 -273852 -89546 245097 419241 365118 444437 889475 1258299 948269
39055I48269p77099l68844L52391L72077k75025o09173j77731M10557M91928J58850
$$ 948269 171170 -197674 154717 526794 251769 -357404 -535135 -124578 367350 526200
39045E26200j24915j43153M1935K26961J10486l76026p34754l97744L81109O96165
$$ 526200 401285 258132 300067 527028 637514 261488 -473266 -871010 -489901 206264
39035B06264K01837m14766m15137O3005L81065K62535q3169l70981m25265j79313
$$ 206264 408101 -6665 -421802 -358797 22268 284803 201634 -169347 -594612 -773925
39025g73925K26514M89969M45891J73744k09173n94700p38311m52997J2715K12084
$$ -773925 -547411 -57442 388449 562193 353020 -241680 -979991 -1432988 -1420273 -1208189
39015a208189J52984K13834L65875J48114l80660m29434L27478J030084P68949
$$ -1208189 -1055205 -841371 -475496 -327382 -708042 -1137476 -809998 220086 989035
39006I89035q5042m55919j11793K02793L2965k43365k29981j19994k02830l14144
$$ 989035 903993 448074 336281 539074 572039 328674 98693 -21301 -224131 -538275
38996e38275j49189K06694M04445L20065J54967J13609J58423J03862j04842k64637
$$ -538275 -687464 -480770 -76325 243740 398707 512316 670739 774601 669759 405122
38986D05122j56521R3383R7332k47585n35419l80354N8637L65472M56643M97327
$$ 405122 248601 341984 439316 191731 -343688 -724042 -665405 -299933 156710 654037
38976F54037M09731j5004n44912o10792j20729L35668L21448J03333M8948k8027
$$ 654037 1063768 1048764 503852 -106940 -227669 107999 429447 532780 581728 553701
38966E53701l98501o80931k91780M97711P25070Q6479n86359n20023l3970J28344
$$ 553701 155200 -525731 -817511 -319800 405270 491749 -94610 -614633 -648603 -520259
38956e20259j9597R2724N01150O17768K15603k38299l78693m02586m86927l78708
$$ -520259 -539856 -447132 54018 671786 887389 649090 270397 -132189 -619116 -997824
38946i97824N1048L83814K59479j4057M3157L14411L25049j1785l76446n40367
$$ -997824 -946776 -562962 -303483 -317540 -274383 40028 365077 353292 -23154 -563521
38936e63521m30257K5822O10997O86989k7610p98098o94743J08885O20220M79930
$$ -563521 -993778 -967956 -356959 330030 302420 -495678 -1190421 -1081536 -461316 18614
38926A8614K53796K65533J06970m25435p95146n78501j51261l3859j18063k7497
$$ 18614 272410 537943 644913 219478 -575668 -1154169 -1305430 -1339289 -1457352 -1484849
38916a484849K18863L54862L03548J14735j64366l08650o3493L11892K32319k27968
$$ -1484849 -1265986 -911124 -607576 -492841 -657207 -965857 -1029350 -717458 -485139 -713107
38906g13107k59751L78562P97308L29709l46064k81357K26299K27556k48315l23719
$$ -713107 -972858 -594296 203012 532721 186657 -94700 131599 359155 110840 -212879
38896b12879J76187M74006J92771j08814P591J82797l330l47946m61330l19383
$$ -212879 -36692 437314 630085 521271 528862 711659 708329 360383 -100947 -420330
38886d20330n7263K84787N25747L42504j96114n29701l32200N3905J67841J4941
$$ -420330 -477593 -192806 332941 675445 479331 -50370 -382570 -328665 -160824 -145883
38876a45883j69387l28829m30205k74880J44513L97285J39844l24413m19338q3340
$$ -145883 -315270 -644099 -1074304 -1349184 -1204671 -807386 -667542 -991955 -1411293 -1494633
38866a494633K27567K46415J77748K30733K70197J22000o6036n5701M5557p4509
$$ -1494633 -1267066 -1020651 -842903 -612170 -341973 -219973 -286009 -341710 -296153 -370662
38856c70662l64332l60800J16256N71968M85132Q0094l8739J47633J12359k22734
$$ -370662 -734994 -1095794 -979538 -407570 77562 157656 118917 266550 378909 156175
38846A56175k88207J15707L66458J5284m59449m59840j88374q8431Q947L49740
$$ 156175 -132032 -16325 350133 365417 -94032 -553872 -742246 -830677 -821730 -471990
38836d71990M51162j40354p39768l71388N44418O74171j24048n93831j54789K82487
$$ -471990 -20828 -161182 -900950 -1272338 -727920 -53749 -177797 -771628 -926417 -643930
38826f43930L7410k36054Q5841M28437J89836n1423L52614P54371K59984n94275
$$ -643930 -606520 -842574 -756733 -328296 -138460 -189883 162731 917102 1177086 582811
38816E82811o29891R888J63933l36798m86286L7459L19095j42430n55405j98916
$$ 582811 -47080 -37192 126741 -210057 -696343 -658884 -339789 -482219 -1037624 -1236540
38806a236540M17198M78463J21273p310J49384J48698j28432l80598l83027j20954
$$ -1236540 -819342 -340879 -219606 -226916 -77532 71166 -57266 -437864 -820891 -941845
38796i41845L31019O82859M86853k55277q20144n63024K01603N75819K19918l14684
$$ -941845 -610826 72033 558886 303609 -516535 -1079559 -877956 -302137 -82219 -396903
38786c96903l70695O8975M91090M69728P8291k39645j87776M1030O3078j38242
$$ -396903 -767598 -698623 -207533 262195 340486 100841 -86935 -45905 17173 -121069
38776a21069k38299j26260k6651k5J78382M43690L06174l25329p21098l02155
$$ -121069 -359368 -485628 -512279 -512304 -333922 109768 415942 90613 -630485 -932640
38766i32640L91506M10862k00742n17739j51240K93056L07168K07780L93533N52221
$$ -932640 -541134 -130272 -331014 -848753 -999993 -706937 -399769 -191989 201544 753765
38756G53765J90570m46101o10818r8543M54563L87112j97041o06115l92071J50119
$$ 753765 944335 498234 -112584 -211127 243436 630548 433507 -172608 -564679 -414560
38746d14560L64420L9694l67427l95519j81531j13764j38923R1959M93895N61343
$$ -414560 -50140 -10446 -377873 -773392 -954923 -1068687 -1207610 -1115651 -621756 -60413
38736f0413J86891j21220l5338J41052R6146K0559J10993J00140k18613m67163
$$ -60413 126478 5258 -30080 110972 207118 227677 338670 438810 220197 -246966
38726b46966k66418N3601k3141k96504j96145K13002L64327J98907K02705M39636
$$ -246966 -513384 -459783 -482924 -779428 -975573 -762571 -398244 -199337 3368 443004
38716D43004M10200J0957k15004m8828K240l43966n70486k53870J64171J21124
$$ 443004 853204 864161 649157 600329 602569 258603 -311883 -565753 -401582 -280458
38706b80458j41015r3742J31037R2703m4361J82533N38217L26938l86677o96328
$$ -280458 -421473 -515215 -384178 -291475 -335836 -153303 384914 711852 325175 -371153
38696c71153j88568M40673M48144M2561j48290p3796j34156l71078m02274r8977
$$ -371153 -559721 -119048 329096 371657 223367 149571 15415 -355663 -757937 -856914
38686h56914J87277J70705K5821N2209J96755J64667q7783k38794m6470K93748
$$ -856914 -669637 -498932 -473111 -420902 -224147 -59480 -147263 -386057 -432527 -138779
38676a38779M08934K43399N6248k4516j39938l29862l49400m8339L20169M11414
$$ -138779 270155 513554 569802 545286 405348 75486 -273914 -322253 -2084 409330
38666D09330K19510l2466k33002l49828k57477P3147L54229K92607K5647p9236
$$ 409330 628840 596374 363372 13544 -243933 -170786 183443 476050 501697 422461
38656D22461L5747J17082M6032o9180j63759k14924p7287K65560M10105J1305
$$ 422461 458208 575290 621322 552142 388383 173459 96172 361732 771837 783142
38646G83142n31016m86202R5433L90001O2527k47416l7833K28510j6690m09544
$$ 783142 252126 -234076 -138643 251358 313885 66469 28636 257146 240456 -169088
38636a69088k52234K69781L39112j79543n27090k39926J90820J37994k39997l09955
$$ -169088 -421322 -151541 187571 8028 -519062 -758988 -568168 -430174 -670171 -980126
38626i80126J10638N49306N25084J07659k38952k38884r2190j31522l13912k80229
$$ -980126 -869488 -320182 204902 312561 73609 -165275 -257465 -388987 -702899 -983128
38616i83128P6707M07294M11342K51801K14249K15130n836l71061n16893k99114
$$ -983128 -906421 -499127 -87785 164016 378265 593395 587559 216498 -300395 -599509
38606e99509O0328K89243K78504O2577j68525j54573Q6253J59848j66079n49389
$$ -599509 -539181 -249938 28566 91143 -77382 -231955 -145702 14146 -151933 -701322
38596g01322n67202l61891k98705k36141J90824P11482O60167J13096q7823L19477
$$ -701322 -1268524 -1630415 -1929120 -2165261 -1974437 -1262955 -602788 -489692 -577515 -258038
38586b58038N28510k7395o89568n68721J00518L88496M3820l60356m14266k45745
$$ -258038 270472 243077 -446491 -1015212 -914694 -526198 -482378 -842734 -1257000 -1502745
38576a502745j7429K54417M03720K55066O0273K17043N46132M43590j79260o90290
$$ -1502745 -1520174 -1265757 -862037 -606971 -546698 -329655 216477 660067 480807 -209483
38566b09483o06120j41525K61658M51279M38358K44314P5104J82753L63536J07889
$$ -209483 -815603 -957128 -695470 -244191 194167 438481 513585 696338 1059874 1167763
38556A167763n10309o79752M574P76186O44864k58166r02985p17508j08201K94460
$$ 1167763 657454 -22298 -17724 758462 1403326 1145160 242175 -475333 -583534 -289074
38546b89074L22747J41829p0224j48985k778J91070J06898k80002n83443m70862
$$ -289074 33673 175502 105278 -43707 -46485 144585 251483 -28519 -611962 -1082824
38536a082824n1938L22339M82434M97439M14170J51225k96186o80624o87137l07908
$$ -1082824 -1134762 -812423 -329989 167450 581620 732845 436659 -243965 -931102 -1239010
38526a239010J06328K56920K25329K41001K73579J29518j27569j99240j1015J91719
$$ -1239010 -1132682 -875762 -650433 -409432 -135853 -6335 -133904 -333144 -344159 -152440
38516a52440K59145K94018L16928J69440j17461k65805k22181k48441l60069k01072
$$ -152440 106705 400723 717651 887091 769630 503825 281644 33203 -326866 -527938
38506e27938K41482L90463k2852m03817k12750J26922k4679l67066j72976L69034
$$ -527938 -286456 104007 81155 -322662 -535412 -408490 -433169 -800235 -973211 -604177
38496f04177L81060k12240m82744L9928O59970O03432K9548m34797n27566l32411
$$ -604177 -223117 -435357 -918101 -878173 -218203 385229 414777 -20020 -547586 -879997
38486h79997L7554L81846M65289L59943L16133K20289k31902p57829o58893K9805
$$ -879997 -842443 -460597 4692 364635 680768 901057 669155 -88674 -747567 -717762
38476g17762M15137J10637j78544P3097L03352n3467m61463k06139L04539K50346
$$ -717762 -302625 -191988 -370532 -297435 5917 -47550 -509013 -715152 -410613 -160267
38466a60267j41899m8214L98377K93181l96326o64760j21034L92426K24983j03480
$$ -160267 -302166 -350380 47997 341178 -55148 -719908 -840942 -448516 -223533 -327013
38456c27013O5488M00172K32473k70286l90632R71L15270J54261k16171l37686
$$ -327013 -261525 138647 371120 100834 -289798 -288827 26443 180704 -35467 -373153
38446c73153j13742J81128K15539j07095n21468n85060j28596M92872P17077L56190
$$ -373153 -486895 -305767 -90228 -197323 -718791 -1303851 -1432447 -939575 -222498 133692
38436A33692k04675m12467j27088K47062K56902l8422j79876K0115K12862P3884
$$ 133692 -70983 -483450 -610538 -363476 -106574 -144996 -324872 -304757 -91895 -18011
38426a8011j81693j58054P7778J24026r5356k35034r1025J49045K82443L39287
$$ -18011 -199704 -357758 -279980 -155954 -251310 -486344 -577369 -428324 -145881 193406
38416A93406L37440J46007k12692m13969k33079R1101J51633o6816j85165J207
$$ 193406 530846 676853 464161 50192 -182887 -91786 59847 -6969 -192134 -190927
38406a90927J94777J3425l86364m15131J13908N79611L34802l21495m93122J9997
$$ -190927 3850 17275 -369089 -784220 -670312 -90701 244101 -77394 -570516 -550519
38396e50519M24067J27132m21303n06959j97534k4860m5772R8953M36624O31605
$$ -550519 -126452 680 -420623 -927582 -1125116 -1149976 -1195748 -1096795 -660171 -28566
38386b8566N65203L74926O8289l36016m74439r1437L42744J87250l18910l64404
$$ -28566 536637 911563 979852 643836 169397 77960 420704 607954 289044 -75360
38376g5360J24589L82837J10209q0419J83322L53153o9367o57389p50579m10029
$$ -75360 49229 432066 542275 461856 645178 998331 928964 271575 -479004 -889033
38366h89033q5600J40437L62837L69599M622l38967k31581O4021N053l17278l26443
$$ -889033 -974633 -834196 -471359 -101760 -97138 -436105 -667686 -603665 -598612 -915890 -1242333
38355a242333J03718M88478M76625K05521p9818k49416j34068L16640O72554L79551
$$ -1242333 -1138615 -650137 -173512 32009 -47809 -297225 -431293 -114653 557901 937452
38345I37452l67611o61104q1526O27280N31708j95530n33401m5404N67811M99394
$$ 937452 569841 -91263 -172789 454491 986199 790669 257268 211864 779675 1279069
38335A279069j14187n45654n03495k79475n6570K83564N94587L78568l89133r00477
$$ 1279069 1164882 619228 115733 -163742 -220312 63252 657839 1036407 647274 -253203
38325b53203n09512K98031N36004N6420m15583m37258k83299j93313L7618M57578
$$ -253203 -762715 -464684 71320 127740 -287843 -725101 -1008400 -1201713 -1164095 -706517
38315g06517O11771K08383l39264m52914j41571J45948J53074j9163j64241j27195
$$ -706517 -94746 113637 -225627 -678541 -820112 -674164 -521090 -540253 -704494 -831689
38305h31689J04809K97429J86720q0498o0440K75422L64185j25053o93137o41252
$$ -831689 -726880 -429451 -242731 -323229 -383669 -108247 255938 130885 -562252 -1203504
38295a203504q628N48439O14572L31262j3633k87216m13602l21453p0891J52096
$$ -1203504 -1212132 -663693 -49121 282141 268508 -18708 -432310 -753763 -824654 -672558
38285f72558K13327J23792k297k6465Q7269J88446J14002m3618l9159J35513K19562
$$ -672558 -459231 -335439 -337736 -364201 -276932 -88486 25516 -18102 -57261 78252 297814
38274B97814R7594m1234n7977p9706k12565l14350k29968k7753J50470K64404
$$ 297814 395408 354174 296197 216491 3926 -310424 -540392 -568145 -417675 -153271
38264a53271K85318J64342N521L3957K70371M45591L29001l7252m38647o20320
$$ -153271 132047 296389 301910 335867 606238 1051829 1380830 1343578 904931 284611
38254B84611m03744M8479K31727o1549l11160k348M47056K37665m70682o96790
$$ 284611 -119133 -70654 161073 99524 -211636 -213984 233072 470737 55 -696735
38244f96735j72071K69699Q5409k14919j24911K7695j09084j81942R7734K79179
$$ -696735 -868806 -599107 -513698 -728617 -853528 -825833 -934917 -1116859 -1019125 -739946
38234g39946J3456k03358P5176L56860R0553k82578j22229K43592K13055J37278
$$ -739946 -726490 -929848 -854672 -497812 -407259 -689837 -812066 -568474 -355419 -218141
38224b18141O18700J087181M78027q99380j573033r91056r5904K88571L65947
$$ -218141 400559 1487740 1965767 1066387 -506646 -1497702 -1593606 -1305035 -939088
38215i39088M07279J35681m29380n67593O8800P70941P68557K82624K7809J74759
$$ -939088 -531809 -396128 -825508 -1393101 -1324301 -553360 215197 497821 525630 700389
38205G00389L37888K34848p8917l89192m56342j90966J60544K54302J07249R654
$$ 700389 1038277 1273125 1194208 805016 348674 157708 318252 572554 679803 689457
38195F89457L0344J6664P996J37133J80456j90563p09105p22093j79766K50500
$$ 689457 719801 736465 744461 881594 1062050 871487 162382 -559711 -739477 -488977
38185d88977J98860M1506J22541K14433Q6852k494J90589L92412K53834o4273
$$ -488977 -290117 -248611 -126070 88363 175215 172721 363310 755722 1009556 945283
38175I45283j70932o2971q2368l73644o64654n93214j55239K20849J63157r2640
$$ 945283 774351 711380 629012 255368 -409286 -1002500 -1157739 -936890 -773733 -866373
38165h66373K2421M76828N27417j03696n92997k11206M61374M31639r5108j37744
$$ -866373 -843952 -367124 160293 56597 -536400 -747606 -286232 145407 50299 -87445
38155h7445L39259M15618j39829n32495l87660k43723l24532r7245N13948P04344
$$ -87445 251814 667432 527603 -4892 -392552 -636275 -960807 -1058052 -544104 160240
38145A60240J48434l51963k13452J7579j97900l91727l9432M34712M65964L13958
$$ 160240 308674 -43289 -256741 -239162 -437062 -828789 -868221 -433509 32455 346413
38135C46413L64724K95873j64753m49015q3264L31076R1469l38414j22488M84679
$$ 346413 711137 1007010 842257 393242 309978 641054 732523 394109 271621 756300
38125G56300O04832J85991j39400k40493m16267m90152j03573L63799K74745j07414
$$ 756300 1361132 1547123 1407723 1167230 750963 260811 157238 521037 795782 688368
38115F88368m7838L07737J94326l02869k86788M14302R38813P71075L41609O5639
$$ 688368 640530 948267 1142593 839724 552936 967238 1906051 2677126 3018735 3084374
38105C084374j82060m06372k90789P5761J67791n5163q0152J29051N866m76229
$$ 3084374 2902314 2495942 2205153 2280914 2448705 2393542 2313390 2442441 2448307 1972078
38095A972078n69527l0575L82438J69705j27147J4498J71687j79925o77127o99866
$$ 1972078 1402551 1371976 1754414 1924119 1796972 1811470 1983157 1803232 1126105 426239
38085D26239l74057j95911j68698k8052J13450L3149o1092J11734L41862K95668
$$ 426239 52182 -143729 -312427 -340479 -227029 -193880 -254972 -143238 198624 494292
38075D94292J05219M2030l1129l07334n00308k81950O7614Q4563q9146L683K97519
$$ 494292 599511 641541 610412 303078 -197230 -479180 -411566 -327003 -416149 -412466 -114947
38064a14947L34959O8973j19632r1510l0262L0515J76358K37418L5598j44149
$$ -114947 220012 288985 169353 77843 47581 78096 254454 491872 527470 383321
38054C83321M4443L07172J17084l29248l73599k8013O3805j82718j41802K97926
$$ 383321 427764 734936 852020 522772 149173 121160 184965 2247 -139555 158371
38044A58371M03841j19422n30328k82557J00902P5946P1178N47265R05442M43325
$$ 158371 562212 442790 -87538 -370095 -269193 -193247 -122069 425196 1330638 1773963
38034A773963k55502j51794M73024M52048k60898m94902J32993N96200K51597
$$ 1773963 1518461 1366667 1839691 2291739 2030841 1535939 1668932 2265132 2516729
38025B516729j31384J79686O22713M39569K5400J21101M26521J66194m76252o37741
$$ 2516729 2385345 2565031 3187744 3627313 3652713 3773814 4200335 4366529 3890277 3252536
38015C252536k10114N3471k65966q47319j282073j309533o24980O30090J409651
$$ 3252536 3042422 3095893 2829927 1982608 700535 -608998 -1233978 -603888 805763
38006H05763Q50070l16079n91821Q0782K89266m91589j010044l20794O41233N75909
$$ 805763 1655833 1339754 747933 828715 1117981 626392 -383652 -704446 -63213 512696
37996E12696j84955m02679R6670M42507K83307J12484J78393J34460j74765m18185
$$ 512696 327741 -74938 21732 464239 747546 860030 1038423 1172883 998118 579933
37986E79933l63327j23998J77240M29135L17220k91791q56688p16071o6220K94645
$$ 579933 216606 92608 269848 698983 1016203 724412 -132276 -848347 -914567 -619922
37976f19922J44984J6221J66384J90561j35003l69492j36107K41199K38673j23643
$$ -619922 -474938 -458717 -292333 -101772 -236775 -606267 -742374 -501175 -262502 -386145
37966c86145l82978k08693L31514Q28856P80798J11509n35913m61104J25077L47302
$$ -386145 -769123 -977816 -646302 182554 963352 1074861 538948 77844 202921 550223
37956E50223n0537l61288r3390K59967J13542k19549j22845K25302J71932k39769
$$ 550223 499686 138398 45008 304975 418517 198968 76123 301425 473357 233588
37946B33588k84252K41812O20572K77776l70183n44060j73965J36608M2029j32294
$$ 233588 -50664 191148 811720 1089496 719313 175253 1288 137896 179925 47631
37936D7631K5487L85205M83772J96451j13583j41436m5767j30780l38475l44629
$$ 47631 73118 458323 942095 1138546 1024963 883527 837760 706980 368505 23876
37926B3876o9825K09422K60151J30062m6272k16281l29277l31976k95409l06179
$$ 23876 -45949 163473 423624 553686 507414 291133 -38144 -370120 -665529 -971708
37916i71708k25219J23196N04096M51300J8993j49247K24035N41329K25256l39460
$$ -971708 -1196927 -1073731 -569635 -118335 -99342 -248589 -24554 516775 742031 402571
37906D02571l95651l3949l7895n68677q19387k14948P07874J024738N77287l2107
$$ 402571 6920 -27029 -64924 -633601 -1452988 -1667936 -960062 64676 641963 609856
37896F09856l04595k68862j79439j65424j86482j38791L637J13029Q5256P8409
$$ 609856 305261 36399 -143040 -308464 -494946 -633737 -630100 -517071 -431815 -353406
37886c53406L12737O06581N02583K21k94630l8919K93757J50514k56301m02418
$$ -353406 -40669 565912 1068495 1068716 774086 735167 1028924 1179438 923137 520719
37876E20719l41542m21559m33558N6919O74339N53922k13386n21713M5439N16266
$$ 520719 179177 -242382 -675940 -619021 55318 609240 395854 -125859 -80420 435846
37866D35846J01602n42874m60663M1685L4960m09736m19687J34149M58134J92155
$$ 435846 537448 -5426 -466089 -424404 -389444 -799180 -1218867 -1084718 -626584 -434429
37856d34429j08220j1437J76797J07443o4205j25941j69964k21975o5180K98289
$$ -434429 -542649 -554086 -377289 -269846 -334051 -459992 -629956 -851931 -917111 -618822
37846f18822N00415L49276P5321j11200k31670k00862J60182O06938N54961o9916
$$ -618822 -118407 230869 306190 194990 -36680 -237542 -77360 529578 1084539 1014623
37836A014623o00645n22788j14801P3502o5168k61696k63638K4890M41298N52126
$$ 1014623 413978 -108810 -223611 -150109 -215277 -476973 -740611 -715721 -274423 277703
37826B77703J68199k01354k082L87989J60043n09725o01000P0125N01851J82047
$$ 277703 445902 244548 242466 630455 790498 280773 -320227 -250102 251749 433796
37816D33796j42618N8236J39050l73915o98029j38927N48567L85293j66473j30173
$$ 433796 291178 349414 488464 114549 -583480 -722407 -173840 211453 44980 -85193
37806h5193J84437j49649p77418n08041N77667J100062N01263k82410m47736k74124
$$ -85193 99244 -50405 -827823 -1335864 -758197 341865 843128 560718 112982 -161142
37796a61142j63724K8457L14672K91328o1783k13549l4508l5054l66340m77458
$$ -161142 -324866 -296409 18263 309591 247808 34259 -249 -35303 -401643 -879101
37786h79101r3166L10655L34092J70102K5103j81261l02592M700M99237M91091
$$ -879101 -972267 -661612 -327520 -157418 -132315 -313576 -616168 -611468 -112231 378860
37776C78860R031j38698K29073K85900l08851o66230j20565O02697N46096j7978
$$ 378860 387891 249193 478266 764166 455315 -210915 -331480 271217 817313 799335
37766G99335k46663j30978k01743l70402j50755K70362K22316k90995n31150j62137
$$ 799335 552672 421694 219951 -150451 -301206 -30844 191472 -99523 -630673 -792810
37756g92810L06454L35920K4435k09062j80317j5158P4239j0321j57973j66273
$$ -792810 -486356 -150436 -126001 -335063 -515380 -530538 -456299 -466620 -624593 -790866
37746g90866P767K36837M43288N76269M17067j70117p71370p44789j40341K80949
$$ -790866 -783099 -546262 -102974 473295 890362 720245 -51125 -795914 -936255 -655306
37736f55306J49867l0450J82149M43734L17688O3530J08331K34060j1096m46851
$$ -655306 -505439 -535889 -353740 89994 407682 471212 579543 813603 802507 355656
37726C55656n06903j37570J76506J52852n4080k39819l04153j42154J97155L81790
$$ 355656 -151247 -288817 -112311 40541 -13539 -253358 -557511 -699665 -502510 -120720
37716a20720K13058o298Q6913L14397K43941q8656k28619o77K83349L23907K00851
$$ -120720 92338 86040 172953 487350 731291 642635 414016 413339 696688 1020595 1221446
37705A221446K00502M74174Q56472R52462N68449J04969K04897Q91245J464218
$$ 1221446 1421948 1896122 2752594 3705056 4273505 4378474 4583371 5474616 6938834
37696F938834J474504J340780J650537K269787K585614K285958J440711J38273
$$ 6938834 8413338 9754118 11404655 13674442 16260056 18546014 19986725 20124998
37688B0124998j403635k561657k719955j989586j159217q97029j185276j475253
$$ 20124998 18721363 16159706 13439751 11450165 10290948 9393919 8208643 6733390
37680F733390j265664o24726j60942k89296o38626n87224k41973k21119n02795
$$ 6733390 5467726 4843000 4682058 4392762 3754136 3166912 2924939 2703820 2201025
37671B201025l84963K15250M28694j39610o39531l15256K88408L10700l2745l5661
$$ 2201025 1816062 2031312 2460006 2320396 1680865 1365609 1654017 1964717 1931972 1896311
37661A896311J77269J0274l91462l93547l2283J02943q6946k30257k95714m50631
$$ 1896311 2073580 2083854 1692392 1298845 1266562 1369505 1282559 1052302 756588 305957
37651C05957l95302J68380O84979M30842j99331k45815J83511J24773m71658n91710
$$ 305957 -89345 79035 764014 1194856 995525 749710 933221 1057994 586336 -5374
37641e374N7176N11843J94828k06657m8648K52121J61712l8553K5422N9109k12090
$$ -5374 51802 563645 758473 551816 503168 755289 917001 878448 903870 962979 750889
37630G50889l78052r2166K15725Q4431j66601p8722J01045m5118k68875j14312
$$ 750889 372837 280671 496396 580827 414226 335504 436549 391431 122556 8244
37620H244K37802L17676J62547P1873l5221l09984m18614o4091K94233P9165l40362
$$ 8244 246046 563722 726269 798142 762921 452937 34323 -29768 264465 343630 3268
37609C268j52062N04259O59220O6434l94293j42866K18868l2308n59273n42673
$$ 3268 -148794 355465 1014685 1081119 686826 543960 762828 730520 171247 -371426
37599c71426M0602M59373L30218l576j61624j92935k34829k00899l8585O2539
$$ -371426 -330824 128549 458767 455191 293567 100632 -134197 -335096 -373681 -311142
37589c11142k1679j06857k0457Q5312K9647l4122Q2777J65525p4950l86474k57327
$$ -311142 -332821 -439678 -460135 -374823 -345176 -379298 -296521 -130996 -205946 -592420 -849747
37578h49747K26848M30734J45321j37852r4959j3864q5263J3539L85450M90048
$$ -849747 -622899 -192165 -46844 -184696 -279655 -293519 -378782 -365243 20207 510255
37568E10255M7929l05419L589M63669K84163k91138m36117j14233L7703o6719
$$ 510255 558184 252765 256354 720023 1004186 713048 276931 162698 200401 133682
37558A33682N9837L97295L91206J0572j84120p0046o4374j66901M1675L72851
$$ 133682 193519 590814 982020 992592 808472 738426 674052 507151 548826 921677
37548I21677J46797m93666n91636J3714L40032n7926l70026q6496P1277l89940
$$ 921677 1068474 574808 -16828 -3114 336918 278992 -91034 -177530 -106253 -496193
37538d96193o40766J3808P28640M65204k05628r9155N15489M35941l20568n38314
$$ -496193 -1136959 -1123151 -394511 70693 -134935 -234090 281399 717340 396772 -141542
37528a41542J12136N82319K43296k27634j70025N4828n7630k54957j43097N7670
$$ -141542 -29406 552913 796209 568575 398550 453378 395748 140791 -2306 55364
37518E5364J0491o6679J58094M49453L42485j19002m71965m76080k68457j7529
$$ 55364 65855 -824 157270 606723 949208 830206 358241 -117839 -386296 -403825
37508d03825K26718L99361M06198K48389L4411j04617p0261J33188L44728L80307
$$ -403825 -177107 222254 628452 876841 911252 806635 736374 869562 1214290 1594597
37498A594597K56009J62306K00851K76762K67470J69649O0467J7191O4975J08550
$$ 1594597 1850606 2012912 2213763 2490525 2757995 2927644 2988111 3005302 3070277 3178827
37488C178827l0072l77112o73092o36512l25042o8300n4768j45617j20004K3262
$$ 3178827 3148755 2771643 2098551 1462039 1136997 1068697 1013929 868312 748308 771570
37478G71570P2558j18070l92471m10544q2317K25470J26948k18017l00717j8348
$$ 771570 844128 726058 333587 -76957 -159274 66196 193144 -24873 -325590 -343938
37468c43938J84619L7898j56104q9070M7041l670l0619K36361N05912L12243j45346
$$ -343938 -159319 -121421 -277525 -366595 -319554 -323224 -353843 -117482 388430 700673 555327
37457E55327j94925K69465N55620J58106n22439p37604l33829J90894L92751L16207
$$ 555327 360402 629867 1185487 1343593 821154 83550 -250279 -59385 333366 649573
37447F49573K23329J45887j00397m90755o25763k12061M10234N72775J47975k75544
$$ 649573 872902 1018789 918392 427637 -198126 -410187 47 572822 720797 445253
37437D45253k39589j5388m5537j83901R896M50732N79689K06110k25096l07725
$$ 445253 205664 190276 144739 -39162 -29266 421466 1001155 1207265 982169 674444
37427F74444j70030j03020n6763J88240N40240O20118K80179j29242j43108K62241
$$ 674444 504414 401394 344631 532871 1073111 1693229 1973408 1844166 1701058 1963299
37417A963299O57801O93027M32970R8333k52029n56487n57199j72463J41347q7368
$$ 1963299 2621100 3314127 3747097 3845430 3593401 3036914 2479715 2307252 2448599 2361231
37407B361231n75138o24945j88926J04367L2239O7782L61684L30223k64267o68850
$$ 2361231 1786093 1161148 972222 1076589 1108828 1176610 1538294 1868517 1604250 935400
37397I35400k61562M01582M66133R0664l7131J8357k91768p69892o58210L341
$$ 935400 673838 1075420 1541553 1632217 1595086 1613443 1321675 551783 -106427 -103086
37387a03086L10163o7116l72605J500O21902P55783L34623k24382o15922o91333
$$ -103086 207077 139961 -232644 -231144 390758 1146541 1481164 1256782 640860 -50473
37377e0473l65465J55186L93761J44900k66444m34230k95858j0204K56988L30014
$$ -50473 -415938 -260752 133009 277909 11465 -422765 -718623 -728827 -471839 -141825
37367a41825J31195j33505j90986q8135l6369J5268K06263L09081L3063l16544
$$ -141825 -10630 -144135 -335121 -423256 -459625 -444357 -238094 70987 104050 -212494
37357b12494j77679K96116L79866m4829l08331j21488o904k36757k86516J36137
$$ -212494 -390173 -94057 285809 240980 -67351 -188839 -195743 -432500 -719016 -582879
37347e82879M17924P9978l10525q1739L77619L15152q1017q9265K33132K21101
$$ -582879 -164955 -84977 -395502 -477241 -99622 215530 134513 45248 278380 499481
37337D99481j34995j94201J07464J21569k76581l62245J84995O37037L37650k98099
$$ 499481 364486 170285 277749 399318 122737 -239508 -54513 582524 920174 622075
37327F22075n01513k54917l1924Q2876L09581N30653M41425J61496K8708q3033
$$ 622075 120562 -134355 -166279 -83403 226178 756831 1198256 1359752 1388460 1305427
37317A305427n10663r04539m52663P42651J363987N49187p71627j016403o8735
$$ 1305427 794764 -109775 -562438 180213 1544200 2093387 1321760 305357 236622
37308B36622O70138K98755m63636m85930K24184P51065N82469P9169j62874O4674
$$ 236622 906760 1205515 741879 255949 480133 1231198 1813667 1892836 1729962 1794636
37298A794636N03372O42142J44725o76752j042209o40111p6234k5706l13131l60076
$$ 1794636 2298008 2940150 3084875 2408123 1365914 725803 649569 623863 310732 -49344
37288d9344j86667k48409m86824l66303J52020M69009K95741J2318p2255q8286
$$ -49344 -236011 -484420 -971244 -1337547 -1185527 -716518 -420777 -408459 -480714 -569000
37278e69000m8892K84858O94861M95821l20198p47213j82714N73616N01566j23135
$$ -569000 -617892 -333034 361827 857648 537450 -209763 -392477 181139 682705 559570
37268E59570l21835j0643P9411j79736j22930M32808P76745M49991p0082k19997
$$ 559570 237735 227092 306503 126767 3837 436645 1213390 1663381 1593299 1373302
37258A373302j57785k60082m08060k98496l3875J01886J24114J39675k3670m60980
$$ 1373302 1215517 955435 547375 248879 215004 316890 441004 580679 557009 96029
37248I6029p21691l10941M46853O90963K31969j66213M1577L41847J204o95785
$$ 96029 -625662 -936603 -489750 201213 433182 266969 308546 650393 651597 -44188
37238d4188p79516n8140N28874K56403l47122l17593L21990O41462J80403m44492
$$ -44188 -823704 -881844 -352970 -96567 -443689 -761282 -439292 202170 382573 -61919
37228f1919m63874O0991M88170M50447J00630k62787m51869l80506j12540J08642
$$ -61919 -525793 -464802 23368 473815 574445 311658 -140211 -520717 -633257 -524615
37218e24615J04434R0K3502J29369P6882j23879j35631K08957N65232M72555l342
$$ -524615 -420181 -420091 -396589 -267220 -190338 -314217 -449848 -240891 324341 796896 793554
37207G93554l07296j29156J71984R2048k76190m02045j67104o8167l79775n89793
$$ 793554 486258 357102 529086 621134 344944 -57101 -224205 -292372 -672147 -1261940
37197a261940j20396O82323Q65128J40258o88032p14974J9395O71083N70398p4690
$$ -1261940 -1382336 -700013 165115 305373 -382659 -1097633 -1078238 -407155 163243 88553
37187H8553l84189K23602J192992J263516L2990j307379j377777m13968J78477
$$ 88553 -295636 -72034 1120958 2384474 2417464 1110085 -267692 -681660 -503183
37178e03183r0715k62097L20974R04454O16590j03297k91330R115L7909k84608
$$ -503183 -593898 -855995 -535021 369433 986023 882726 591396 600511 638420 353812
37168C53812l36151m455J33172q8620j03241L44122O58851L25950k53966l62753
$$ 353812 17661 13206 146378 57758 -45483 298639 957490 1283440 1029474 666721
37158F66721J9505L00508J44520j94022l24002j47426J92786N43774Q02760Q52968
$$ 666721 686226 986734 1131254 937232 613230 465804 658590 1202364 2005124 2858092
37148B858092O00549J49185j53607k5462L84083O33496N43449L68999L26161K52752
$$ 2858092 3458641 3607826 3454219 3428757 3812840 4446336 4989785 5358784 5684945 5937697
37138E937697n5773m55366o63877o29505m43881j60187L1999k02127p91164j049524
$$ 5937697 5881924 5426558 4762681 4133176 3689295 3529108 3561107 3358980 2567816 1518292
37128A518292n30600K13717L33576r8827k81842M2510L23147K37060J32499K01838
$$ 1518292 987692 1201409 1534985 1436158 1154316 1196826 1519973 1757033 1889532 2091370
37118B091370L9132n30308q77909m37593L48867O08287K50411l8308J48301N12687
$$ 2091370 2130502 1600194 722285 284692 633559 1241846 1492257 1453949 1602250 2114937
37108B114937O76573O55629N74781L77558O9692q6134N3467J43021k52615r20088
$$ 2114937 2791510 3447139 4021920 4399478 4469170 4383036 4436503 4579524 4326909 3406821
37098C406821j088972m57712K51222J87925m12479n43815N0611M47009k9447p00140
$$ 3406821 2317849 1860137 2111359 2299284 1886805 1342990 1393601 1840610 1811163 1111023
37088A111023n49943K07630N06366Q3971k69058j07941P4118q3252j35012K55001
$$ 1111023 561080 768710 1275076 1359047 1089989 982048 1056166 972914 837902 1092903
37078A092903N53722J94882m36183n82028k36080L6193P0000J62944L66881M24442
$$ 1092903 1646625 1841507 1405324 823296 587216 623409 693409 856353 1223234 1647676
37068A647676L26497L08891L49252K48654J50619L63713O90771N95304R9379j65928
$$ 1647676 1974173 2283064 2632316 2880970 3031589 3395302 4086073 4681377 4780756 4614828
37058D614828K8274J38427k07057n49895l55674J06251K07231r1776l38606l87795
$$ 4614828 4643102 4781529 4574472 4024577 3668903 3775154 3982385 3890609 3552003 3164208
37048C164208m72910n96974m82187j64105n4763k55578l20293L2055L92446K18965
$$ 3164208 2691298 2094324 1612137 1448032 1393269 1137691 817398 849453 1241899 1460864
37038A460864l54215o65385l71008K04633N55324N47606M20291M10293M88710
$$ 1460864 1106649 441264 70256 274889 830213 1377819 1798110 2208403 2697113
37029B697113M37737J63105j13827r2084J71831K60354o2143n03997o33888m43382
$$ 2697113 3134850 3297955 3184128 3092044 3263875 3524229 3462086 2958089 2324201 1880819
37019A880819k73167k94627l45323k34034M5252L81131O05722N38231K01105p5767
$$ 1880819 1607652 1313025 967702 733668 778920 1160051 1765773 2304004 2505109 2429342
37009B429342k9437J38696M5727k81141m70654m02046k93849k16846k1529J92180
$$ 2429342 2399905 2538601 2584328 2303187 1832533 1430487 1136638 919792 898263 1090443
36999A090443P8956l25361n17006k74824L0218J13278J89570L96085M13456J08917
$$ 1090443 1169399 844038 327032 52208 82426 195704 385274 781359 1194815 1303732
36989A303732l6322K93426N76078K25857m03790n26731r9427K60725K76910J78922
$$ 1303732 1267410 1560836 2136914 2362771 1958981 1432250 1332823 1593548 1870458 2049380
36979B049380O5666j37366k23304M5653L49562K16867j14784n4076K49772J02753
$$ 2049380 2115046 1977680 1754376 1800029 2149591 2366458 2251674 2197598 2447370 2550123
36969B550123m49431n47813Q3850O45041M92915J486k05383r8366Q9711L20633
$$ 2550123 2100692 1552879 1636729 2281770 2774685 2776171 2570788 2472422 2562133 2882766
36959B882766M68557K62048j13787n6108M44822O00588P2283l78455m0891P05647
$$ 2882766 3351323 3613371 3499584 3443476 3888298 4488886 4561169 4182714 4141823 4847470
36949D847470J128143J193229J216390J163294J033497J277249K061450K763516
$$ 4847470 5975613 7168842 8385232 9548526 10582023 11859272 13920722 16684238
36941A6684238K976651L308766M290433N265660N506696N754192P315495J0117025
$$ 16684238 19660889 22969655 27260088 32525748 38032444 43786636 51102131 61219156
36933F1219156J2994083J5330292J6659535J5063453Q429319j968317j1163085
$$ 61219156 74213239 89543531 106203066 121266519 129695838 127727521 116564436
36926A16564436j5105292j4365297j2222795j0476865q725098o752518n448204
$$ 116564436 101459144 87093847 74871052 64394187 55669089 48916571 43468367
36919D3468367n213171n117795m290861l134497k508380k416520k220832j752807
$$ 43468367 38255196 33137401 28846540 25712043 23203663 20787143 18566311 16813504
36911A6813504j463372j531470j489874r87363m56557n51328j115763j282626
$$ 16813504 15350132 13818662 12328788 11341425 10884868 10333540 9217777 7935151
36903G935151o74885M7837J36293k51030m72111m23120m94542p25320p07493l16916
$$ 7935151 7260266 7308103 7444396 7193366 6721255 6298135 5803593 5078273 4370780 4053864
36893D053864Q4577K20156J24732j80878o31404p62478j64513O32720N73650l86516
$$ 4053864 4138441 4358597 4483329 4302451 3671047 2908569 2744056 3376776 3950426 3563910
36883C563910j030779n71529K67852M48329Q9576l6935J52039J44286j35037l01266
$$ 3563910 2533131 1961602 2229454 2677783 2767359 2730424 2882463 3026749 2891712 2590446
36873B590446l00769l80045m08946n8160M12085L63051j74522m43919j00554L14034
$$ 2590446 2289677 1909632 1500686 1442526 1854611 2217662 2043140 1599221 1498667 1812701
36863A812701K65515n7369k25951k11752j82380j00142R9386K42991J57630n3884
$$ 1812701 2078216 2020847 1794896 1583144 1400764 1300622 1400008 1642999 1800629 1746745
36853A746745j96178k12442q4247K14011N11125N09059K26921M1251J05913J13506
$$ 1746745 1550567 1338125 1253878 1467889 1979014 2488073 2714994 2756245 2862158 2975664
36843B975664j34952l46309k55553j20289k54046m20594k35295R5462O8657k13334
$$ 2975664 2840712 2494403 2238850 2118561 1864515 1443921 1208626 1304088 1372745 1159411
36833A159411j27587M26606P42373L14072m14000o66965l11557J71614L89327
$$ 1159411 1031824 1458430 2200803 2514875 2100875 1433910 1122353 1293967 1683294
36824A683294L09360L8752k65090l66900j97463n4540k20893m58148k88802K22969
$$ 1683294 1992654 2031406 1766316 1399416 1201953 1147413 926520 468372 179570 402539
36814D02539M50924J18548k40255o5924L60050L37052j56894l96035p919M39473
$$ 402539 853463 972011 731756 665832 1025882 1362934 1206040 810005 802086 1241559
36804A241559K85830k25220l37446L3806J69674k88873o87265l12179M43264N54190
$$ 1241559 1527389 1302169 964723 998529 1168203 879330 192065 -120114 323150 877340
36794H77340j18957n55792n2495P15040O66508r3026m40962R5125O57428L39202
$$ 877340 758383 202591 150096 865136 1531644 1438618 997656 1092781 1750209 2089411
36784B089411m98877p61393j38880N47498N07717p3915m78770m32243k51004j83614
$$ 2089411 1590534 829141 690261 1237759 1745476 1671561 1192791 760548 509544 325930
36774C25930o5436K49838M74900K39368k89711n31188k70514O3798O7681p1166
$$ 325930 260494 510332 985232 1224600 934889 403701 133187 196985 264666 193500
36764A93500J3923K12884J58604r2883j39091P2036J71505K8365p9388n7497j69581
$$ 193500 207423 420307 578911 486028 346937 418973 590478 618843 539455 481958 312377
36753C12377m22381l94518Q512K53213O5494j6347M17057P53576K46810o37460
$$ 312377 -110004 -504522 -496010 -242797 -177303 -193650 223407 976983 1223793 586333
36743E86333p72993r0473L36358K770l17958L8907N18663L06217l25992m86770
$$ 586333 -186660 -277133 59225 61995 -255963 -217056 301607 607824 281832 -204938
36733b04938q8522R4262k73141n36334o3980P48266R35330K20481o04031o27245
$$ -204938 -293460 -199198 -472339 -1008673 -1072653 -324387 610943 831424 227393 -399852
36723c99852J20901P87347P58059K72316r6289j98590k41290k34660N249L56260
$$ -399852 -278951 508396 1266455 1538771 1442482 1243892 1002602 767942 773191 1129451
36713A129451L83412l0967m20920l10402J79247M88890K69216k49191m95778j89439
$$ 1129451 1512863 1481896 1060976 750574 929821 1418711 1687927 1438736 942958 753519
36703G53519K51425J38105n15659q16517j65142P65314Q54219R2931m83478l54241
$$ 753519 1004944 1143049 627390 -189127 -354269 411045 1265264 1358195 874717 520476
36693E20476p1114r3168n1778L54674O17560K68387k12446j42400K10704Q5207
$$ 520476 449362 356194 304416 659090 1276650 1545037 1332591 1190191 1400895 1486102
36683A486102m91823p59784m21133M4876K53999L37190L94193K29197j53309l60020
$$ 1486102 994279 234495 -186638 -141762 112237 449427 843620 1072817 919508 559488
36673E59488j75259J22262K31546K30459K93759L67583L56377L36824L61417L01346
$$ 559488 384229 506491 738037 968496 1262255 1629838 1986215 2323039 2684456 2985802
36663B985802R8401m0411R9896M60923Q37449J098709J142709Q52721L00890j91447
$$ 2985802 3084203 3043792 3143688 3604611 4442060 5540769 6683478 7536199 7837089 7645642
36653G645642m19213n58242q26555j052642r18414n36115l57313m57255l69519
$$ 7645642 7226429 6668187 5841632 4788990 3870576 3334461 2977148 2519893 2150374
36644B150374J33258N20773K05769n12211p64799k88584L00654M39311K06872
$$ 2150374 2283632 2804405 3010174 2497963 1733164 1444580 1745234 2184545 2391417
36635B391417j51293o01605r08898n67485L22215P72791K08641n47987m39721
$$ 2391417 2240124 1638519 729621 162136 484351 1257142 1465783 917796 478075
36626D78075K25513L94228M7842O7687N25096N59063N1168p3374M33785O21491
$$ 478075 703588 1097816 1145658 1213345 1738441 2297504 2348672 2275298 2709083 3330574
36616C330574J17789p3564N88757J010514K97040n48956k15873P01817P32332
$$ 3330574 3448363 3374799 3963556 4974070 5271110 4722154 4506281 5208098 5940430
36607E940430k5219k79836J10456N2211o63194r80045m99381j09069l17027m78236
$$ 5940430 5915211 5635375 5745831 5798042 5134848 4154803 3655422 3546353 3229326 2751090
36597B751090k02068j18668n68581p94862k50699L70226K92021p2774M5357M18323
$$ 2751090 2549022 2430354 1861773 1066911 816212 1186438 1478459 1405685 1451042 1869365
36587A869365L09588j93266l40010M1308L53852K29469n231M1385K38817J73354
$$ 1869365 2178953 1985687 1645677 1686985 2040837 2270306 2265075 2306460 2545277 2718631
36577B718631k52387o21777m49928J64574N40003K91552n8640J83386P65099P88485
$$ 2718631 2466244 1844467 1394539 1559113 2099116 2390668 2332028 2515414 3280513 4068998
36567D068998P4440n47188m47514L5863K85038J84995n9467k69241j75314M21174
$$ 4068998 4143438 3596250 3148736 3184599 3469637 3654632 3595165 3325924 3150610 3571784
36557C571784J083612R87602R1886n79654k56000N73670R45607O71422K70620
$$ 3571784 4655396 5642998 5734884 5155230 4899230 5472900 6418507 7089929 7360549
36548G360549J06148J64646M12800Q48204J305520J547125J505895J346434J398345
$$ 7360549 7466697 7631343 8044143 8892347 10197867 11744992 13250887 14597321 15995666
36539A5995666J932905K759440L270794L283417L482552M447460N687743O490531
$$ 15995666 17928571 20688011 23958805 27242222 30724774 35172234 40859977 47350508
36531D7350508P225993Q669439J0507024J1999685J3786254J7278159K2523723
$$ 47350508 54576501 63245940 73752964 85752649 99538903 116817062 139340785
36524A39340785K8679290L6001661M3933846M6753702L5816400R649878k0738781
$$ 139340785 168020075 204021736 247955582 294709284 330525684 340175562 319436781
36517C19436781m0569165m4513301l8657396l1113648k4885146j9601463j5399465
$$ 319436781 278867616 234354315 195696919 164583271 139698125 120096662 104697197
36510A04697197j2780418j1176607r806015q745359q040618p036746n511436m251259
$$ 104697197 91916779 80740172 70934157 62188798 54148180 47111434 41599998 37348739
36502C7348739l722369l363643k840652k681985k964088k737248j624738p04953
$$ 37348739 33626370 30262727 27422075 24740090 21776002 19038754 17414016 16709063
36494A6709063q41100j317107j160757p24726q17136j185794j054124m78138r1856
$$ 16709063 15867963 14550856 13390099 12665373 11848237 10662443 9608319 9130181 9038325
36485I038325n4696j66088m59849q45878p83612j63277J43655m70791j201692
$$ 9038325 8983629 8817541 8357692 7511814 6728202 6564925 6708580 6237789 5036097
36476E036097r36805N2737O06594M07345Q8773p3844m07198q57801q59502l18133
$$ 5036097 4099292 4152029 4758623 5165968 5254741 5180897 4773699 3915898 3056396 2738263
36466B738263J39430J00771j10220l1083L21696N82821M57260k5003m66696m51959
$$ 2738263 2877693 2978464 2868244 2837161 3158857 3741678 4198938 4173935 3707239 3255280
36456C255280j05148Q806k63425l93138n7008L01337K58518J20396K29562K16413
$$ 3255280 3150132 3158938 2895513 2502375 2445367 2746704 3005222 3125618 3355180 3571593
36446C571593k60758o20539j79042N76773O12215l0048l39991L9028M22375L69995
$$ 3571593 3310835 2690296 2511254 3088027 3700242 3670194 3330203 3369231 3791606 4161601
36436D161601K69187M08999M66404K65559J84177L83952L81356j48503p53577
$$ 4161601 4430788 4839787 5306191 5571750 5755927 6139879 6521235 6372732 5619155
36427E619155q55340n22098j76151K6296J19367L0290k27858l76914k60092j42714
$$ 5619155 4763815 4241717 4065566 4091862 4211229 4241519 4013661 3636747 3376655 3233941
36417C233941k86952m77353l41122K9132J52948j71230n74128n62110r9188L61772
$$ 3233941 2946989 2469636 2128514 2157646 2310594 2139364 1565236 1003126 903938 1265710
36407A265710M06889J14179j35506k15168l24988m71871l18638J77035M31452
$$ 1265710 1672599 1786778 1651272 1436104 1111116 639245 320607 497642 929094
36398I29094M5106m19156j49725O27803Q86581L27983j89717j9793K95447l3030
$$ 929094 974200 555044 405319 1033122 1919703 2247686 2057969 2038176 2333623 2300593
36388B300593p37483q84605k84021K62508J47208k55572k53407J60565L97349
$$ 2300593 1563110 678505 394484 656992 804200 548628 295221 455786 853135
36379H53135J78251j30211j66012j16250k88629m51488j33350N00160O84428J39269
$$ 853135 1031386 901175 735163 618913 330284 -121204 -254554 245606 930034 1069303
36369A069303m49950l73557J47639L86622J23383k53269l93515k60405M2436K89255
$$ 1069303 619353 245796 393435 780057 903440 650171 256656 -3749 38687 327942
36359C27942J88712j80835k74517J41762M79055J61612l96977l92213Q5792K40273
$$ 327942 516654 335819 61302 203064 682119 843731 446754 54541 140333 380606
36349C80606r7531k71635J1561K35333L5889k17863j22719J80919M26586N74454
$$ 380606 283075 11440 23001 258334 294223 76360 -46359 134560 561146 1135600
36339A135600M97176r132o29231o55079l7867L99789J79489j47199K026L04288
$$ 1135600 1632776 1623644 994413 339334 301467 701256 880745 733546 735572 1039860
36329A039860K12145q7034j09928L8749m3310k70761k76654r9035k3284j7140
$$ 1039860 1252005 1164971 1055043 1093792 1050482 779721 503067 404032 380748 363608
36319C63608Q1310R9714j49456l75066k40677o253j01197l32837k08939J76597
$$ 363608 444918 544632 395176 20110 -220567 -226820 -328017 -660854 -869793 -693196
36309f93196K99090Q2484q2216o0140q426J62006N85487Q18250K95557n78983
$$ -693196 -394106 -311622 -393838 -453978 -462404 -300398 285089 1103339 1398896 819913
36299H19913p30726L1063O67717M31246j43917k36543N8942J51853k8706j40051
$$ 819913 89187 120250 787967 1219213 1075296 838753 897695 1049548 1020842 880791
36289H80791j47247k52243l39974j26360K50208L39770O9251j46716l4806J85197
$$ 880791 733544 481301 141327 14967 265175 604945 674196 527480 492674 677871
36279F77871J95533L3293l8993L3110N043k80940n58119l97931J54310M93061
$$ 677871 873404 906697 867704 900814 905857 624917 66798 -331133 -176823 316238
36269C16238K33000j97140j47706K71179L74494m77k74884j31897L080j67803
$$ 316238 549238 352098 204392 475571 850065 849588 574704 442807 445887 278084
36259B78084j82643L54417Q86890O17237k22920o28249k40749K57504K37753r6946
$$ 278084 95441 449858 1336748 1953985 1731065 1102816 862067 1119571 1357324 1260378
36249A260378k52044j76506j15697j32027j24405p8383j8587R6118K10228J10202
$$ 1260378 1008334 831828 716131 584104 459699 381316 362729 458847 669075 779277
36239G79277k28929m20521j02184M84534O73576J86717m91318o89625l21163J35028
$$ 779277 550348 129827 27643 512177 1185753 1372470 881152 191527 -129636 5392
36229E392L23209L77511N23878O29880M31947K2317k63456l71698n27331p00031
$$ 5392 328601 706112 1229990 1859870 2291817 2314134 2050678 1678980 1151649 451618
36219D51618n60744j04745J96668J24946O8758K66458K50180l49408r13566n76111
$$ 451618 -109126 -213871 -17203 107743 176501 442959 693139 343731 -569835 -1145946
36209a145946L85016Q00765K53775m05078l53433K04271O41682P68730O55486
$$ -1145946 -760930 39835 293610 -111468 -464901 -260630 381052 1149782 1805268
36200A805268K42628l46279o08753l22611K424j41795m48393k92270K48704M94702
$$ 1805268 2047896 1701617 1092864 770253 772677 630882 182489 -109781 138923 633625
36190F33625J53907l49748n10290k57043J47189L70773K15003j62249l22475r6838
$$ 633625 787532 437784 -72506 -329549 -182360 188413 403416 241167 -81308 -178146
36180a78146J35519J4764k23962j51177J36885K10686M2608q640J37169J90524
$$ -178146 -42627 -27863 -251825 -403002 -266117 -55431 -12823 -21463 115706 306230
36170C06230N7687k8135J7383P277r6236q6701P6827J67769P8412n0869j26149
$$ 306230 363917 335782 353165 360442 264206 177505 254332 422101 500513 449644 323495
36159C23495j69344r4874K00108N23237N45609K55621j02497m27746o66398n12463
$$ 323495 154151 59277 259385 782622 1328231 1583852 1481355 1053609 387211 -125252
36149a25252J81150Q24120O62936p9027m25458p9206K33595M1422j84321j4340
$$ -125252 55898 880018 1542954 1463927 1038469 959263 1192858 1234280 1049959 1035619
36139A035619J59796q1361l73151k39045L7488n5339l38473k95906J8672J49129
$$ 1035619 1195415 1114054 740903 501858 539346 484007 145534 -150372 -131700 17429
36129A7429M3799K2014J29195J36118K8389l9471j06481k20959j19782L53766
$$ 17429 61228 83242 212437 348555 376944 337473 230992 10033 -109749 244017
36119B44017P28035M29983k84970n70294j42875L96314M64759J79617k6701l5960
$$ 244017 972052 1402035 1117065 546771 403896 800210 1264969 1444586 1417885 1381925
36109A381925m1385j53655k28634n6300L29922N85837M31162N0857j39605j07376
$$ 1381925 1340540 1186885 958251 901951 1231873 1817710 2248872 2299729 2160124 2052748
36099B052748j79846l73478k92141J18483L19725K6526k77078j22273J88726J57220
$$ 2052748 1872902 1499424 1207283 1325766 1645491 1672017 1394939 1272666 1461392 1618612
36089A618612o1101J229K97380L95091J66517j61162l76124k94519K16718Q20817
$$ 1618612 1557511 1558740 1856120 2251211 2417728 2256566 1880442 1585923 1802641 2623458
36079B623458Q00632M0562o17894n19481q3821L5462k4336J09970J89929n5003
$$ 2623458 3424090 3464652 2846758 2327277 2243456 2278918 2254582 2364552 2554481 2499478
36069B499478j19392M72363J135121J030491L77721n8507k08686l59391k27504
$$ 2499478 2380086 2852449 3987570 5018061 5395782 5337275 5128589 4769198 4541694
36060D541694M35007R68587P97426N73959J005976J448773J233790J319587K651890
$$ 4541694 4976701 5945288 6742714 7316673 8322649 9771422 11005212 12324799 14976689
36051A4976689M032297M078905M159292O295866R222441J0497293J1803008J6718432
$$ 14976689 19008986 23087891 27247183 33543049 42765490 53262783 65065791 81784223
36043H1784223K2338809J9353695M126803j4046575k2614384j9674781j3416322
$$ 81784223 104123032 123476727 127603530 113556955 90942571 71267790 57851468
36036E7851468j0221780r175228p552420n622236m456472l417475k010965j333441
$$ 57851468 47629688 38454460 30902040 25279804 20823332 17405857 15394892 14061451
36028A4061451j902298k336436j642002p83594p23171q14562l67013P469j73215
$$ 14061451 12159153 9822717 8180715 7397121 6673950 5859388 5492375 5499844 5326629
36019E326629j92784K86576K56211p28194j295749l97282P77314O36112l35687
$$ 5326629 5133845 5420421 5676632 4948438 3652689 3255407 4032721 4668833 4333146
36010D333146o62875l75432n42772j060228q30502J72495P76760M92638J3851
$$ 4333146 3670271 3294839 2752067 1691839 861337 1033832 1810592 2303230 2317081
36001B317081j93860m24143p07985n40014O9667L57671J925l47180j25097L25623
$$ 2317081 2123221 1699078 991093 451079 520746 878417 880342 533162 408065 733688
35991G33688M12844J47951q1134j10215M199K12324L77061K61992j15628l80094
$$ 733688 1146532 1294483 1213349 1103134 1107333 1319657 1696718 1958710 1843082 1462988
35981A462988k70805J5138J50836J16690R1599R9174N089k34088n18233p39410
$$ 1462988 1192183 1207321 1358157 1474847 1566446 1665620 1670709 1436621 918388 178978
35971A78978q12786o31421j70512L59283O27890N26059K83074J67049J69315J04528
$$ 178978 -633808 -1265229 -1435741 -1076458 -448568 77491 360565 527614 696929 801457
35961H01457o6807k00892k23190k09086j93575j12949J7184Q0129O5274O7515
$$ 801457 734650 533758 310568 101482 -92093 -205042 -187858 -107729 -42455 25060
35951B5060N0296r5513k27077q1547J92372J42468j81490j50860L85886O59589
$$ 25060 75356 -20157 -247234 -328781 -136409 6059 -175431 -326291 59595 719184
35941G19184J39758n25617m81331q09P9201j87011o4573M32236N14618N0168j47341
$$ 719184 858942 333325 -148006 -148815 -69614 -256625 -321198 111038 625656 675824 528483
35930E28483K89077O53824L44724k39355m58838l31783j79589l1094J22065K7577
$$ 528483 817560 1471384 1816108 1576753 1117915 786132 606543 575449 697514 725091
35920G25091l88653p12778n52797o558N83741R23308P26241l2500p25149o15735
$$ 725091 336438 -376340 -929137 -935695 -351954 571354 1297595 1265095 539946 -75789
35910g5789O5453L49439k6108l05102q6288M6971k68947m21455M1002M96775L07385
$$ -75789 -10336 339103 312995 7893 -78395 -31424 -300371 -721826 -680824 -184049 123336
35899A23336p9537O523K67584Q7828l04561l49020k21685l30252k99767L71293
$$ 123336 43799 50322 317906 405734 101173 -247847 -469532 -799784 -1099551 -728258
35889g28258J087173Q41866j29810o32540l23694k0300j71068k30060K02835O51166
$$ -728258 358915 1200781 1070971 438431 114737 94437 -76631 -306691 -103856 547310
35879E47310N41728l4259o05972p84443l79970L35471N72984m9606p02376l49192
$$ 547310 1089038 1054779 448807 -335636 -715606 -380135 192849 143243 -559133 -908325
35869i08325O15853Q41813Q6605m70884j79600J83849l8612k51248J82490O93310
$$ -908325 -292472 549341 635946 165062 -14538 169311 130699 -120549 61941 755251
35859G55251M58536k31164n69602n44504o22928o49889j52063N66224P01097K19666
$$ 755251 1213787 982623 413021 -131483 -754411 -1404300 -1556363 -990139 -289042 -69376
35849f9376j13769J4692J09855j14546k26968R8882M64935L84176K0842j54334
$$ -69376 -183145 -168453 -58598 -173144 -400112 -301230 163705 547881 568723 414389
35839D14389q1926l5751p0522o501J30116P6899k10291m13749l00037n5146J8078
$$ 414389 332463 296712 226190 219689 349805 426704 216413 -197336 -497373 -552519 -534441
35828e34441n0959j0686J60670K28186J26656P5386J55952J15362j76107l66763
$$ -534441 -585400 -596086 -435416 -207230 -80574 -5188 150764 266126 90019 -276744
35818b76744p1993M98290P38216M00468j80172n70891o23611l96390k9239K49109
$$ -276744 -348737 149553 887769 1288237 1108065 537174 -86437 -482827 -512066 -262957
35808b62957K58002P6235n6383l5656O8374J78386K24300J29360n656Q2605L51762
$$ -262957 -4955 71280 14897 -20759 47615 226001 450301 579661 574005 656610 1008372
35797A008372L11893k29536o29588k43224M71128M81940k74955p82422m70828
$$ 1008372 1320265 1090729 461141 217917 689045 1170985 896030 113608 -357220
35788c57220N5563J24409l9018N6233K93098K98783J26170J7183o4428j61198
$$ -357220 -301657 -177248 -216266 -160033 133065 431848 558018 575201 510773 349575
35778C49575m5322K77491K79116k90520p83415n07736J98449M80830K28988L1591
$$ 349575 304253 581744 860860 570340 -213075 -720811 -522362 -41532 187456 219047
35768B19047J10846J56235J19819K97821N57389L29016m02571q44259m79184J92052
$$ 219047 329893 486128 605947 903768 1461157 1790173 1387602 543343 64159 256211
35758B56211L96124J07159j16809n135J61941N2896k73254m56269k58571J25831
$$ 256211 652335 759494 642685 637550 799491 852387 579133 122864 -135707 -9876
35748i876K58401J8900k07798j07972N2998j15407l86782j98475L87247O50413
$$ -9876 248525 267425 59627 -48345 4653 -110754 -497536 -696011 -308764 341649
35738C41649K72325j89465j66246J16930R9126k56751n17738m54154k36750p2669
$$ 341649 613974 424509 258263 375193 474319 217568 -300170 -754324 -991074 -1063743
35728a063743K0303J05385K00923K49702J55922m6355r8669J52767L72681J04565
$$ -1063743 -1043440 -938055 -737132 -487430 -331508 -377863 -476532 -323765 48916 153481
35718A53481m22886m22346K70773P58437L18248m48810m28969L67999Q26165L29207
$$ 153481 -269405 -691751 -420978 337459 655707 206897 -222072 145927 972092 1301299
35708A301299m76513p20840m00714n5932R9962K23047L33051K77190R6557J9033
$$ 1301299 824786 103946 -296768 -352700 -252738 -29691 303360 580550 677107 696140
35698F96140P9636N4090j70482l92166l71472j64951l7408q8185j20965M0577
$$ 696140 775776 829866 659384 267218 -104254 -269205 -306613 -394798 -515763 -475186
35688d75186K28005J22280k24817l29674R1500O45348O99879J86856l48569m55699
$$ -475186 -247181 -124901 -349718 -679392 -587892 57456 757335 944191 595622 139923
35678A39923k05447R7444K70839K36206q166k40797j59972J46443J96558j87175
$$ 139923 -65524 31920 302759 538965 530799 290002 130030 276473 473031 285856
35668B85856n11748k82935K48865M42911J66536j51867k63129l42681m54291l16633
$$ 285856 -225892 -508827 -259962 182949 349485 197618 -65511 -408192 -862483 -1179116
35658a179116J79832O55216P22605M66076J66897j31856m50201n40095j78900
$$ -1179116 -999284 -344068 378537 844613 1011510 879654 429453 -110642 -289542
35649b89542L35863M42257O5306k89229k51108j2094R2080O1714P1818J23316
$$ -289542 46321 488578 553884 264655 13547 1453 93533 155247 227065 350381
35639C50381J30195J36078J57177O199l85513o34779l35417K38284L65518r2254
$$ 350381 480576 616654 773831 780030 394517 -240262 -575679 -337395 28123 -64131
35629f4131m25201r9743M49747N04804J46183K8156K62916K56114k67455p55431
$$ -64131 -489332 -589075 -139328 365476 511659 539815 802731 1058845 791390 35959
35619C5959o44985j54925J47592J70051K06858L01861K23686l2857k03649k04757
$$ 35959 -609026 -763951 -616359 -446308 -239450 62411 286097 253240 49591 -155166
35609a55166k07275k34649q8645K29591L98448K41219L812l9456q695j89666n26730
$$ -155166 -362441 -597090 -685735 -456144 -57696 183523 187335 147879 139184 -50482 -577212
35598e77212o17498k24582L73096O29040L19556j73526k75277P9633L58531J71808
$$ -577212 -1194710 -1419292 -1046196 -417156 -97600 -271126 -546403 -466770 -108239 63569
35588F3569j58510q2437L30582M96382K10079j02542j29352j20252l23935m69309
$$ 63569 -94941 -177378 153204 649586 859665 757123 627771 507519 183584 -285725
35578b85725k30569J49326J99956k1291l2064K84863M90055K64153j31252k55374
$$ -285725 -516294 -366968 -167012 -188303 -220367 64496 554551 818704 687452 432078
35568D32078p8457O2828k3395j49078o9340J05391K0862l54098n25812j10738
$$ 432078 353621 416449 393054 243976 174636 280027 300889 -53209 -579021 -689759
35558f89759N07935O02246J34533j84831J3061K49583R7028r1571Q1274J98396
$$ -689759 -181824 420422 554955 370124 383185 632768 729796 638225 719499 917895
35548I17895k70932q27369n10537N16258J004282L90194m58488o12190k78117
$$ 917895 646963 -180406 -690943 -174685 829597 1219791 761303 149113 -129004
35539a29004r2552k2175K71938N37404K54041m08254p20170m01585J12508L72413
$$ -129004 -221556 -243731 28207 565611 819652 411398 -308772 -710357 -597849 -225436
35529b25436L40833J38293j28702k43535k4725L34930M32216J93633o8360j25353
$$ -225436 115397 253690 124988 -118547 -143272 191658 623874 817507 749147 623794
35519F23794k3996J45569K87269J55972l62921q30679o33876J19219O15198M26634
$$ 623794 599798 745367 1032636 1188608 825687 -4992 -638868 -519649 95549 522183
35509E22183L8820L27R9933j42481n96442p25713m43977j76598j32660n0348K60990
$$ 522183 561003 561330 661263 518782 -77660 -803373 -1247350 -1423948 -1556608 -1606956 -1345966
35498a345966N55002M85325M5222m46592o24265l09032L33672Q33515P98572L14744
$$ -1345966 -790964 -305639 -260417 -707009 -1331274 -1640306 -1306634 -473119 325453 640197
35488F40197j57781k75329p0482K13270L53386K46504k6307k29535k16583j07475
$$ 640197 482416 207087 136605 349875 703261 949765 923458 693923 477340 369865
35478C69865q9834j43054j38406q1477k5157J09235L36159L92177Q5593k78120
$$ 369865 280031 136977 -1429 -82906 -108063 1172 337331 729508 815101 536981
35468E36981k60333J7901N0137k33549l85017k09442j1736L9296J59572L66704
$$ 536981 276648 294549 344686 111137 -273880 -483322 -495058 -455762 -296190 70514
35458G0514K94122j23765l97416k41902J8728J35290L25387N75499L52456l98942
$$ 70514 364636 240871 -156545 -398447 -379719 -244429 80958 656457 1008913 609971
35448F09971p88436k80939L27936J70501k47251l0966L91666K5044p18030n14241
$$ 609971 -178465 -459404 -131468 39033 -208218 -239184 152482 177526 -540504 -1054745
35438a054745N32568Q66242J4221o48347k16227L79999J68678k67101p8386L15975
$$ -1054745 -522177 344065 358286 -290061 -506288 -126289 42389 -224712 -303098 12877
35428A2877K17670R504K18539K76363l49540p56002J6304R97069N61478q00522
$$ 12877 230547 240051 458590 734953 385413 -370589 -354285 642784 1204262 403740
35418D03740j043288J95209J019862L12380o66454n20094J83430K26800j95349
$$ 403740 -639548 -444339 575523 887903 221449 -298645 -115215 111585 -83764
35409h3764j18954L74336L96890j37308m05315m9933L57613K87392q5212l18272
$$ -83764 -202718 171618 568508 431200 25885 -24048 333565 620957 535745 217473
35399B17473k62336m3322J59836K26917J73592J08401M5379p1800j20939Q8456
$$ 217473 -44863 -88185 71651 298568 472160 580561 625940 554140 433201 521657
35389E21657L53983J82453m18108p41268l42153K64206L31383q4851l61328k65934
$$ 521657 875640 1058093 639985 -101283 -443436 -179230 152153 67302 -294026 -559960
35379e59960q7776k474R7022K01233J36697p2220j91370j15335Q3454L30868M77397
$$ -559960 -647736 -650210 -553188 -351955 -215258 -287478 -478848 -594183 -510729 -179861 297536
35368B97536K66892k38537m72344j01607L24635J07140m52370m44773J81172M92200
$$ 297536 564428 325891 -146453 -248060 76575 183715 -268655 -713428 -532256 -40056
35358d0056P1986l21258k8846M54843L59008j29248k95100o3329J04850J48237
$$ -40056 31930 -289328 -318174 136669 495677 366429 71329 8000 112850 261087
35348B61087L58620N63468K53762m44930p69878m55758j04400j59532k43711P7197
$$ 261087 619707 1183175 1436937 992007 222129 -233629 -338029 -497561 -741272 -664075
35338f64075M99726M79555P1130k48688k66025q5494J86392L77577J94869l08487
$$ -664075 -164349 315206 386336 137648 -128377 -213871 -27479 350098 544967 236480
35328B36480n44954j80564K42329P6169l78321l39968J73502L99073Q2041k20521
$$ 236480 -308474 -489038 -246709 -170540 -548861 -888829 -715327 -316254 -234213 -454734
35318d54734j54521m236M8921K21414M34271K26269k93846l44602K04091L91154
$$ -454734 -609255 -613491 -564570 -343156 91115 317384 23538 -321064 -116973 274181
35308B74181k67147p61342j26598Q51431P43379k55441o12754J33768P29289K44855
$$ 274181 7034 -754308 -880906 -29475 713904 458463 -154291 -20523 708766 953621
35298I53621n38131m51027L03058N88583M0251n38161m09820J22979K38203k34487
$$ 953621 415490 -35537 267521 856104 896355 358194 -51626 71353 309556 75069
35288G5069n76776k07211M30267M66270p4071k75089K15901N96372K40738k28945
$$ 75069 -501707 -708918 -278651 187619 113548 -161541 54360 650732 891470 662525
35278F62525q022M71883K58243m64703o48146j01305K96234J23125m7557J46776
$$ 662525 654503 1126386 1384629 919926 271780 170475 466709 589834 542277 689053
35268F89053K41916q3593l90740k81681j6358P6103P7744M6892j59375l44646
$$ 689053 930969 847376 456636 174955 158597 234700 312444 359336 199961 -144685
35258a44685n6680M96055M96106j54518n17430j12551K75524m7061m91413k23933
$$ -144685 -201365 294690 790796 636278 118848 6297 281821 234760 -256653 -480586
35248d80586M09982M96867J0399l26489k30465j1293J54363K91805K30719j34882
$$ -480586 -70604 426263 436662 110173 -120292 -131585 22778 314583 545302 410420
35238D10420m39789l47178j50234k43778l71412j05543K95961K99266M3499M8402
$$ 410420 -29369 -376547 -526781 -770559 -1141971 -1247514 -951553 -652287 -608788 -560386
35228e60386K26599O7084l45167l88366L4301L27815J77524o0588o6969K2363
$$ -560386 -333787 -266703 -611870 -1000236 -965935 -638120 -460596 -521184 -588153 -565790
35218e65790P4312K30225M87395M96311M5519n57194p92264m64254J27547M65049
$$ -565790 -491478 -261253 226142 722453 767972 210778 -581486 -1045740 -918193 -453144
35208d53144L27203O7390J54736M38092L17846k55483n95153l64487j11288k50799
$$ -453144 -125941 -58551 96185 534277 852123 596640 1487 -363000 -474288 -725087
35198g25087l03940J56028N48209J87162m60678m41627K10577O88673P20530O15786
$$ -725087 -1029027 -872999 -324790 -137628 -598306 -1039933 -829356 -140683 579847 1195633
35188A195633L56958k23665o34809k90788L05683J85642m26568m32085K01520
$$ 1195633 1552591 1328926 694117 403329 709012 894654 468086 36001 237521
35179B37521L25884l55516p03176r7921N03400K50514j78999J38605P15694M53449
$$ 237521 563405 207889 -495287 -593208 -89808 160706 -18293 120312 836006 1289455
35169A289455n62293j187159q11004O8736O82984P20979L47672k6178r6964k7307
$$ 1289455 727162 -459997 -1271001 -1202265 -519281 201698 549370 523192 426228 398921
35159C98921j97754n04304m06026J59262N40500L44078j5626r9175j01701k81339
$$ 398921 201167 -303137 -709163 -549901 -9401 334677 319051 219876 118175 -163164
35149a63164l87636j91567J0066l1645j0528L06109N17686K75017l2218N5222
$$ -163164 -550800 -742367 -732301 -763946 -774474 -468365 49321 324338 292120 347342
35139C47342K38058L8819k73328j59388J80573J57540j24274n6727L33853L65328
$$ 347342 585400 624219 350891 191503 372076 529616 405342 348615 682468 1047796
35129A047796j39479n28743l54377O957O4510n9336N35J94735K15513P2995Q2327
$$ 1047796 908317 379574 25197 32154 96664 37328 37863 232598 448111 521106 603433
35118F03433L01305L39318q7506o00772n03741K47087P80678L51323o17036j011834
$$ 603433 904738 1244056 1156550 555778 52037 299124 1079802 1431125 814089 -197745
35108a97745m43030L77622O67141L92568m4947l53113l63981m3129K72825J30973
$$ -197745 -640775 -263153 403988 796556 751609 398496 34515 -8614 264211 395184
35098C95184l43745n18567j86724J67906K34563K92101M59285L14311k61327o11577
$$ 395184 51439 -467128 -653852 -485946 -251383 40718 500003 814314 552987 -58590
35088e8590k85247J84972J54650j05049r438K58554J18410l48168n43659l03178
$$ -58590 -343837 -158865 -4215 -109264 -118702 139852 258262 -89906 -633565 -936743
35078i36743L8557K91403M47699L33312j12982m57659l04856N6647J45807P9293
$$ -936743 -898186 -606783 -159084 174228 61246 -396413 -701269 -644622 -498815 -419522
35068d19522J96993K91138O990l24124j32077L54557M16161J7175k24237j21547
$$ -419522 -222529 68609 75599 -248525 -380602 -26045 390116 407291 183054 61507
35058F1507o7855j60720q6605J18692P4510j49786j10970J05168k5879l80907
$$ 61507 -6348 -167068 -253673 -134981 -60471 -210257 -321227 -216059 -241938 -622845
35048f22845j72426P20583J326189Q98465q1159o57231n62670k29837j05988k82657
$$ -622845 -795271 -74688 1251501 2149966 2068807 1411576 848906 619069 513081 230424
35038B30424m81647k87607K88441N97642K01555l08961r8435N21345M92277k41368
$$ 230424 -251223 -538830 -250389 347253 548808 239847 141412 662757 1155034 913666
35028I13666n72903m9203L86894l832n52317l56791K56826L73039o5398l77970
$$ 913666 340763 291560 678454 674622 122305 -234486 22340 395379 329981 -47989
35018d7989l00892j67898j60812r4799J29934L63591M36524K74980m5839k16225
$$ -47989 -348881 -516779 -677591 -772390 -642456 -278865 157659 432639 386800 170575
35008A70575J6889L65370K80001j69297l26843n0683J9379l48628m26439K08493
$$ 170575 187464 552834 832835 663538 336695 286012 305391 -43237 -469676 -261183
34998b61183P19389K23366p04790p97037L7269O77128M68160p1026k67928j49295
$$ -261183 458206 681572 -23218 -820255 -782986 -105858 362302 291276 23348 -125947
34988a25947o1404q3460q5102J7772K15031L74709K92592j5664k34595j96267
$$ -125947 -187351 -270811 -355913 -338141 -123110 251599 544191 528527 293932 97665
34978I7665j32311j96155j27841J95981L29050n8318m78838l08100J88377K97029
$$ 97665 -34646 -230801 -358642 -162661 166389 108071 -370767 -678867 -490490 -193461
34968a93461L9718J5461K29854R1132l93145m45197J97139P53626N75262M7946
$$ -193461 -153743 -138282 91572 182704 -210441 -655638 -458499 295127 870389 918335
34958I18335j77653j65775l00927m60791k75269J13933K20841N633q4977J31832
$$ 918335 740682 574907 273980 -186811 -462080 -348147 -127306 -121673 -206650 -74818
34948g4818K74648j0078m86741n92692j46720M07586N21693J80091j61220k39477
$$ -74818 199830 189752 -296989 -889681 -1036401 -628815 -107122 72969 -88251 -327728
34938c27728k76821m67510n42418k14637K22490K65088K3589P6474M95390O62988
$$ -327728 -604549 -1072059 -1614477 -1829114 -1606624 -1341536 -1317947 -1241473 -746083 -83095
34928h3095K57472j82807n1971M17741N07612J3917n39250n87864j01324M87536
$$ -83095 174377 -8430 -60401 357340 864952 878869 339619 -248245 -349569 137967
34918A37967O94420L62762k01767n08364l83970j24040q5765k61872l42568r1711
$$ 137967 832387 1195149 993382 485018 101048 -22992 -108757 -370629 -713197 -804908
34908h04908L91968O93260M05091l67265q92742n37285L82937Q68692M70771j77574
$$ -804908 -412940 280320 685411 318146 -574596 -1111881 -728944 139748 610519 432945
34898D32945k86041Q4284L27539K39041J16768R9453k1830l07098m69451l20317
$$ 432945 146904 231188 558727 797768 914536 1013989 992159 685061 215610 -104707
34888a04707n5716P3871J00407J59576K04711J23321q676k1437O7219P6539m2942
$$ -104707 -160423 -86552 13855 173431 378142 501463 492787 471350 538569 615108 572166
34877E72166j38335j19716j05900j86886k00409M4468L91192M41238P7437l57510
$$ 572166 433831 314115 208215 21329 -179080 -134612 256580 697818 775255 417745
34867D17745n07626l91002j82402J22106N25654P22714L94177k33451n42325l05140
$$ 417745 -89881 -480883 -663285 -541179 -15525 707189 1101366 867915 325590 20450
34857B0450N8990J25402q860m0765K2828l8697k47258l94540l24863n8386K61351
$$ 20450 79440 204842 195982 155217 178045 139348 -107910 -502450 -827313 -885699 -624348
34846f24348M08347K35197n4109j8232M14202O92511L17203m24762p83486m94942
$$ -624348 -216001 19196 -34913 -53145 361057 1053568 1370771 946009 162523 -332419
34836c32419N944K74389L03036K19289j764l16679m73665l55633j84946j32126
$$ -332419 -326475 -52086 250950 470239 468475 151796 -321869 -677502 -862448 -994574
34826i94574P30L86553P18258N77082J13275j27124l0889m0526l23426l84932
$$ -994574 -993844 -607291 110967 688049 801324 674200 643311 602785 279359 -105573
34816a05573J20901O54809M47741l31070p15414k65079L84070M99758K03550L7133
$$ -105573 15328 670137 1117878 786808 71394 -193685 190385 690143 893693 930826
34806I30826M0251j45030m76392m81731p0692K09036l2800m09961k88127L18031
$$ 930826 971077 826047 349655 -132076 -202768 6268 -26532 -436493 -724620 -406589
34796d06589P52606N53797k5574l81599k42955J15519K57860O4760k19258l54899
$$ -406589 346017 899814 874240 492641 249686 365205 623065 687825 468567 113668
34786A13668l73642l96870l46754o4206L25713M36351J06670l25721l89269k2882
$$ 113668 -259974 -656844 -1003598 -1067804 -742091 -305740 -199070 -524791 -914060 -936942
34776i36942L68003L66976j2434l44386k57045J23846L12317J08843r6949J01568
$$ -936942 -568939 -201963 -214397 -558783 -815828 -691982 -379665 -270822 -367771 -266203
34766b66203M49627L36310k67862o66470l76634K22658M55677K27147p526O5582
$$ -266203 183424 519734 251872 -414598 -791232 -568574 -112897 114250 106724 172306
34756A72306L01208L78291J50989k25455l86008j13635K94706K76716k24137n85694
$$ 172306 473514 851805 1002794 777339 391331 277696 572402 849118 624981 39287
34746C9287l85039n2589j78802n12272l31539L28044O15268J61850l23703j40647
$$ 39287 -345752 -398341 -577143 -1089415 -1420954 -1092910 -477642 -315792 -639495 -780142
34736g80142L64810M23804N3299r4879J07200P4636m02538o54938j53441N49425
$$ -780142 -415332 8472 61771 -33108 74092 148728 -253810 -908748 -1062189 -512764
34726e12764N57919j7437k43536J59550L99697n9858n90261m12670J38883K04772
$$ -512764 45155 27718 -215818 -56268 343429 283571 -306690 -719360 -580477 -375705
34716c75705j85899k71375P3437K02460k1628N8436N87424P15902J4405o32606
$$ -375705 -561604 -832979 -759542 -557082 -578710 -520274 67150 783052 797457 164851
34706A64851l65679K50192J57913m82331o22582m075N91388O26450L55638J12032
$$ 164851 -200828 49364 207277 -275054 -897636 -901711 -310323 316127 671765 783797
34696G83797p7120j36066L3580J73825J304k00389m4191J41204j43537m54433
$$ 783797 706677 570611 604191 778016 779320 578931 534740 675944 532407 77974
34686G7974K2839Q89352Q46373k49235j007170n89162J44560J88813j39686j05113
$$ 77974 100813 990165 1836538 1587303 580133 -9029 135531 324344 184658 79545
34676G9545J40487R1304j11272j22225j27635l03842k44191K47581N04947K0253
$$ 79545 220032 311336 200064 77839 -49796 -353638 -597829 -350248 154699 174952
34666A74952n63946m12145J93060M46553L11481K32721J62008j06254k12731J00990
$$ 174952 -388994 -801139 -608079 -161526 149955 382676 544684 438430 225699 326689
34656C26689K29181k70638n95100L6134P54542L07597o46537m34916P48087J003502
$$ 326689 555870 285232 -309868 -273734 480808 788405 141868 -293048 455039 1458541
34646A458541j30001r26906m14522J12656m68975j111663m76868P00383P98773
$$ 1458541 1328540 401634 -12888 99768 -369207 -1480870 -1957738 -1257355 -458582
34637d58582j38429o91698l31011J14828K6932k28667j24464L20535P29394P33913
$$ -458582 -597011 -1288709 -1619720 -1504892 -1477960 -1706627 -1831091 -1510556 -781162 -47249
34627d7249K52388k58781j65632M16005N88228l6128o73826n47504j6285J66046
$$ -47249 205139 -53642 -219274 196731 784959 748831 75005 -472499 -488784 -322738
34617c22738N3680J40883L53886K97353O7952k8501j57360n08882o13251l6891
$$ -322738 -269058 -128175 225711 523064 591016 562515 405155 -103727 -716978 -753869
34607g53869O25574M78085k37779m88686n9033K74798J34503Q305K03732L46079
$$ -753869 -128295 349790 112011 -376675 -435708 -160910 -26407 -18102 185630 531709
34597E31709J81313R353K1551l0279k10150j57220K02654L55688n605m28765l55333
$$ 531709 713022 722375 743926 713647 503497 346277 548931 904619 899014 470249 114916
34586A14916P0628K43370q5938n25460m99041R6184O54075M57191l44075p23117
$$ 114916 185544 428914 342976 -182484 -681525 -585341 68734 525925 181850 -541267
34576e41267j14440O91652O15520j54285n29317j97468J04734q041n429M21044
$$ -541267 -655707 35945 651465 497180 -32137 -229605 -124871 -132912 -138341 282703
34566B82703O63990J95208n11195o76016k92702P6739J71386J43594Q7680m3259
$$ 282703 946693 1141901 630706 -45310 -338012 -261273 -89887 53707 141387 98128
34556I8128j96105k53198k15830j44603m2211Q6719K14733L59219M65908K99190
$$ 98128 -97977 -351175 -567005 -711608 -753819 -667100 -452367 -93148 372760 671950
34546F71950k14378o26462m22782J93061N09722L16684R6574J32558J12492j52970
$$ 671950 457572 -168890 -591672 -398611 111111 427795 524369 656927 769419 616449
34536F16449k96575m3890K71392K43749k1989k32174l61529m33112k84918P0279
$$ 616449 319874 275984 547376 791125 769136 536962 175433 -257679 -542597 -472318
34526d72318K66969J31423r317Q4624J26422j33248l59951j62172K13878K63745
$$ -472318 -205349 -73926 -83243 1381 127803 -5445 -365396 -527568 -313690 -49945
34516d9945J3906j09483R164J18005J14594J32959J72786O0055k08011l74995
$$ -49945 -36039 -145522 -136358 -18353 96241 229200 401986 462041 254030 -120965
34506a20965k19648J93061N10681L34670l32882q90759p27166l3711M11274L31384
$$ -120965 -340613 -147552 363129 697799 364917 -525842 -1253008 -1286719 -875445 -544061
34496e44061K40251M64437N70436J65997l61891m54869k17785p1681k0138J33987
$$ -544061 -303810 160627 731063 897060 535169 80300 -137485 -209166 -229304 -95317
34486i5317K28000K2880k64355k96159j74879j14016P2128N17314P42309L06175
$$ -95317 132683 155563 -108792 -404951 -579830 -693846 -621718 -104404 637905 944080
34476I44080l13613l39986N6791O5161l57102m15551J04437L96988n4948o22639
$$ 944080 630467 290481 347272 412433 55331 -360220 -255783 141205 86257 -536382
34466e36382m92816J73699N95541M41008M4747j66204n8550K26828L99991K41924
$$ -536382 -1029198 -855499 -259958 181050 225797 59593 1043 227871 627862 869786
34456H69786j48332m39924m40977k26375N3902K53394J97385j10969l24464j45361
$$ 869786 721454 281530 -159447 -385822 -331920 -78526 118859 7890 -316574 -461935
34446d61935J94455K43438K1035q2484j6628r7682l17730k72646Q3541K52775
$$ -461935 -267480 -24042 -3007 -85491 -102119 -199801 -517531 -790177 -706636 -453861
34436d53861J1109j83494N0630L72517K61267j84520m37138k82221P650Q7076
$$ -453861 -442752 -626246 -575616 -203099 58168 -126352 -563490 -845711 -838061 -750985
34426g50985j34369m34857m07857J35055P88632Q84681L17406l11092m96681l59529
$$ -750985 -885354 -1320211 -1728068 -1593013 -804381 80300 397706 86614 -410067 -769596
34416g69596j83293O5551M19253N66506K82366j22226k19751p4445k2672j00972
$$ -769596 -952889 -887338 -468085 98421 380787 258561 38810 -35635 -58307 -159279
34406a59279j20080q0284p3411K0988K83056L92710L6920m59073m64044L5975
$$ -159279 -279359 -359643 -433054 -412066 -129010 263700 300620 -158453 -622497 -586522
34396e86522L99375K59258m1050p4101J03874K30252K64086K59468J37412j10011
$$ -586522 -187147 72111 31061 -43040 60834 291086 555172 814640 952052 842041
34386H42041k26956k5011K40097J40584l15326o22048l83434J98188N48617L65147
$$ 842041 615085 590074 830171 970755 655429 33381 -350053 -151865 396752 761899
34376G61899p8215k89616j30376R5248R8816m2571r6719l7194K4043J20033L38824
$$ 761899 683684 394068 263692 358940 457756 415185 318466 281272 305315 425348 764172
34365G64172N00329K76882k84879o82284n59982j40988J29999J36784N2998k9515
$$ 764172 1264501 1541383 1256504 574220 14238 -126750 3249 140033 193031 163516
34355A63516j23875j40208m74J00432r5511m41444n06850k33603n4692j75254
$$ 163516 39641 -100567 -101041 -609 -96120 -537564 -1044414 -1278017 -1332709 -1507963
34345a507963j69520L38003R31529Q71758J63897l99984l04643J01325K46347
$$ -1507963 -1677483 -1339480 -407951 463807 627704 227720 -76923 24402 270749
34336B70749Q5125r2152k09285l47741l81635j22042K60443L68875J46213m2794
$$ 270749 355874 263722 54437 -293304 -674939 -796981 -536538 -167663 -21450 -64244
34326f4244M6409K32100K55406J57570J25693J49453M6118k33978m85286m52701
$$ -64244 -17835 214265 469671 627241 752934 902387 948505 714527 229241 -223460
34316b23460j15856K47722L28478J49453O2520K65434M55502K07987l66938o76837
$$ -223460 -339316 -91594 236884 386337 448857 714291 1169793 1377780 1010842 334005
34306C34005m16398M8375K27175J24463M1780J3402j74405m94991o07505l31298
$$ 334005 -82393 -34018 193157 317620 359400 372802 198397 -296594 -904099 -1235397
34296a235397J00985L60884L64189K04308k6916k27293k87628k34338j89143r3681
$$ -1235397 -1134412 -773528 -409339 -205031 -231947 -459240 -746868 -981206 -1170349 -1264030
34286a264030K54049P19449P42784R7033n65803m67311J62957L74022p6977l65155
$$ -1264030 -1009981 -290532 452252 549285 -16518 -483829 -320872 53150 -23827 -388982
34276c88982M9504N03750J85707n03025n09043K48097P53692M07422k20150l76548
$$ -388982 -339478 164272 349979 -153046 -662089 -413992 339700 747122 526972 150424
34266A50424j24748M5738K1632j0939n0711j91438k76464p9056K79884M24808
$$ 150424 25676 71414 93046 82107 31396 -160042 -436506 -515562 -235678 189130
34256A89130J91253j97330l56101o3395M88974P44684L46553l17874n00529r1332
$$ 189130 380383 183053 -173048 -236443 252531 997215 1343768 1025894 525365 434033
34246D34033K38523M5524k99597l40772k56721l60485m10720o9050L51396L11958
$$ 434033 672556 718080 418483 77711 -179010 -539495 -950215 -1019265 -667869 -355911
34236c55911m6318j62196l4549j51736n02029m86963M8416M69750L21587j913
$$ -355911 -402229 -564425 -598974 -750710 -1252739 -1739702 -1691286 -1221536 -899949 -901862
34226i01862P1620M49549O16614L82472N612k24694k35688j26302o4093j36456
$$ -901862 -830242 -380693 235921 618393 624005 399311 163623 37321 -26772 -163228
34216a63228k38299k30099j73904j98775j98023L0048L77233N20538M14192K98445
$$ -163228 -401527 -631626 -805530 -1004305 -1202328 -1172280 -795047 -274509 139683 438128
34206D38128K15561l1005l76743m50288j72480P7155Q3060J02396L05733L98128
$$ 438128 653689 622684 245941 -204347 -376827 -299672 -216612 -114216 191517 589645
34196E89645J45001j54556j34165M7375J7843j80496k25511p6317L8875N4737
$$ 589645 734646 580090 445925 493300 511143 330647 105136 28819 67694 122431
34186A22431P7155O8113p5877k02065n6410K58243L54820J25237j06199o4812
$$ 122431 199586 267699 191822 -10243 -66653 191590 546410 671647 565448 500636
34176E00636J25902J75564j3886l01706m45618k54672K00369N18033L52542q9015
$$ 500636 626538 802102 788216 486510 40892 -213780 -13411 504622 857164 768149
34166G68149k27646J00841L75743J47971k61976k50165R2092Q1833m29268o80718
$$ 768149 540503 641344 1017087 1165058 903082 652917 745009 826842 397574 -283144
34156b83144j06992P12923P91969J08220m46002l78309j20378j40939k68917k10714
$$ -283144 -390136 322787 1114756 1222976 776974 398665 278287 137348 -131569 -342283
34146c42283j10649j61541j73066o014K6966k72478m52885o7766M93188N30171
$$ -342283 -452932 -614473 -787539 -793553 -766587 -1039065 -1491950 -1559716 -1066528 -536357
34136e36357J25590m8796J45023J88081j17224l37565j85651R9087K91840M49917
$$ -536357 -410767 -459563 -314540 -126459 -243683 -581248 -766899 -667812 -375972 73945
34126G3945M94862J94970k48738k74462J41716L34667n220l27784j63378J06277
$$ 73945 568807 763777 515039 240577 382293 716960 711740 383956 220578 326855
34116C26855m2790l65419k87931J33042L38430J29556j54231j93340J3805K97836
$$ 326855 284065 -81354 -369285 -236243 102187 231743 77512 -115828 -102023 195813
34106A95813M20679J77824l01710n40808k84930J26727K46835J21867O9630J04364
$$ 195813 616492 794316 492606 -48202 -333132 -206405 40430 162297 231927 336291
34096C36291j779k35496l28220j74252N2002J66240J27859k3686j92892k46053
$$ 336291 334512 99016 -229204 -403456 -351454 -185214 -57355 -81041 -273933 -519986
34086e19986j44025J4163J43422K28930K03234r637k76835l34390j35712J29273
$$ -519986 -664011 -649848 -506426 -277496 -74262 -83899 -360734 -695124 -830836 -701563
34076g01563L50975N10201M34770J2603l79913k44445K03499K35293k40776n00281
$$ -701563 -350588 159613 594383 606986 227073 -17372 186127 421420 180644 -319637
34066c19637k01999Q8431l4787j23259J66136K90582k01582o68890l11551M65315
$$ -319637 -521636 -433205 -467992 -591251 -425115 -134533 -336115 -1005005 -1316556 -851241
34056h51241O50951J90738r3327J00648K59279P0681j86388k80394k75198j47743
$$ -851241 -200290 -9552 -102879 -2231 257048 327729 141341 -139053 -414251 -561994
34046e61994J54274L49954J84767j0055J75106M00850R2696m52195m49200K8968
$$ -561994 -407720 -57766 127001 116946 292052 692902 785598 333403 -115797 -86829
34036h6829J67219j62077k32435J57187L18808k3364k26148M1925J61319k79092
$$ -86829 80390 -81687 -314122 -156935 161873 138509 -87639 -45714 115605 -163487
34026a63487o87448m90204m5100J55883L29859O88075P14988O1466n56480l38755
$$ -163487 -850935 -1341139 -1386239 -1230356 -900497 -212422 502566 564032 7552 -331203
34016c31203K86065L41841j57122l99110j76389j9080j10876j22504o2233k71985
$$ -331203 -45138 296703 139581 -259529 -435918 -454998 -565874 -688378 -750611 -1022596
34006a022596n49383k85596L90550O07828J37856k00662R6016M15646J57153k21572
$$ -1022596 -1571979 -1857575 -1467025 -859197 -721341 -922003 -825987 -410341 -253188 -474760
33996d74760m8375L68510K89419j81665l16187m675J51898o4561j90330J6458
$$ -474760 -523135 -154625 134794 -46871 -363058 -367733 -215835 -280396 -470726 -454268
33986d54268J76652L4777r6746M3606K13202J88222J75654L01323K42596j36344
$$ -454268 -277616 -242839 -339585 -295979 -82777 105445 281099 582422 825018 688674
33976F88674l22868M8087M18633R9979n26428n10797J45519M69029M9685m07946
$$ 688674 365806 413893 832526 932505 406077 -104720 40799 509828 559513 151567
33966A51567l19726n4230q8906j82651J8258K43077J17724j36737j64417j18861
$$ 151567 -168159 -222389 -311295 -493946 -475688 -232611 -114887 -251624 -416041 -534902
33956e34902k02058r1356M26008P45880K59127n17297n96978m4123K21577N194
$$ -534902 -736960 -828316 -402308 343572 602699 85402 -511576 -555699 -334122 -328928
33946c28928M7138N43334O59186m8998p74194o60754m9547J96790j7618j66610
$$ -328928 -281790 261544 920730 871732 97538 -563216 -612763 -415973 -433591 -600201
33936f00201p4700K6718J24388L62409N07239J72976m37362o47305k53347J96775
$$ -600201 -674901 -648183 -523795 -161386 345853 518829 81467 -565838 -819185 -622410
33926f22410K43183J27265K61852M89192L31857j82147m50581j45658K84752K44082
$$ -622410 -379227 -251962 9890 499082 830939 648792 198211 52553 337305 581387
33916E81387j66296l35510n2504K62071K79792K02059K51195K15366j10931m29530
$$ 581387 415091 79581 27077 289148 568940 770999 1022194 1237560 1126629 697099
33906F97099l66665j00035k8676o0913J58335M64516L12109k87405o36746l24780
$$ 697099 330434 230399 201723 140810 299145 763661 1075770 788365 151619 -173161
33896a73161K37342M60995K75209m2007k86488l44074j67296L8852m5096l38082
$$ -173161 64181 525176 800385 758378 471890 127816 -39480 -628 -45724 -383806
33886c83806l51660Q4603M67330K82154k71187n31621j81736M43835P56592M90181
$$ -383806 -735466 -650863 -183533 98621 -172566 -704187 -885923 -442088 314504 804685
33876H04685m2003k65146l4806J40790j64867n68989l78136L30056P64396N61706
$$ 804685 762682 497536 462730 603520 438653 -130336 -508472 -178416 585980 1147686
33866A147686J78449J7803j07537l70896m89687k88699j06783k03206k87656q2096
$$ 1147686 1326135 1343938 1236401 865505 375818 87119 -19664 -222870 -510526 -592622
33856e92622J58437J43202O4192J39454J43069q9913k04507M3020K10416r8862
$$ -592622 -434185 -290983 -226791 -87337 55732 -34181 -238688 -195668 14748 -84114
33846h4114m22063j40616M27004N14467J54592j7490M0619j61892n04641l23992
$$ -84114 -506177 -646793 -219789 294678 449270 431780 472399 310507 -194134 -518126
33836e18126K78709L78305k12295m93521N7219M97798n4135q57469o40460L57043
$$ -518126 -239417 138888 -73407 -566928 -509709 -11911 -66046 -923515 -1563975 -1206932
33826a206932P10089l5505p75333n58003J91670N55752L73726P1908j20113j79691
$$ -1206932 -496843 -532348 -1307681 -1865684 -1674014 -1118262 -744536 -672628 -792741 -972432
33816i72432L2582M86353O70328J87734n14669o31478j34568K17558M8174j46005
$$ -972432 -939850 -453497 216831 404565 -110104 -741582 -876150 -658592 -610418 -756423
33806g56423Q0075L50821J21441l57471l71479J49793N08299K77509r5867J1653
$$ -756423 -676348 -325527 -204086 -561557 -933036 -783243 -274944 2565 -93302 -81649
33796h1649M87029O43908J61974m93268o63542k79680J42798K02527M0764j3707
$$ -81649 405380 1049288 1211262 717994 54452 -225228 -82430 120097 160861 147154
33786A47154M8905M5221M0104K41978N00149L83483j40225n70649n99867m91679
$$ 147154 196059 241280 281384 523362 1023511 1406994 1266769 696120 96253 -395426
33776c95426m76524k90250K52902O88179M82011j05982l34836P611M40150N20786
$$ -395426 -871950 -1162200 -909298 -221119 260892 154910 -179926 -172315 267835 788621
33766G88621K62355r0327k77810j41054J17790J3705m99776p40814k44108M14898
$$ 788621 1050976 960649 682839 541785 659575 673280 173504 -567310 -811418 -396520
33756c96520M25679j6977j29749J13870O5788l23545m07055l7949K19164J94761
$$ -396520 29159 12182 -117567 -3697 62091 -261454 -668509 -706458 -487294 -292533
33746b92533L34345O14853M09047k23502l24400L44807O73832m9818q85704o99382
$$ -292533 41812 656665 1065712 842210 517810 862617 1536449 1486631 600927 -98455
33736i8455Q6303L33025K5659J4894M06005M82251M7013l14197l11709k91558
$$ -98455 -12152 320873 346532 361426 767431 1249682 1296695 982498 670789 379231
33726C79231m01869l04306Q3332K97923N6639k91924l14835p7022O8646j9232
$$ 379231 -22638 -326944 -243612 54311 110950 -180974 -495809 -572831 -504185 -523417
33716e23417j94745k83569k53576j48657P1588M82553Q70993P11676j37306r17991
$$ -523417 -718162 -1001731 -1255307 -1403964 -1332376 -849823 21170 732846 595540 -322451
33706c22451p74478J0186L62550L7645q5962M18303P64154L38809k23353j89487
$$ -322451 -1096929 -1086743 -724193 -686548 -772510 -354207 409947 748756 525403 335916
33696C35916P997l05450o69908k52733N92147Q01637K80376j35226j55443k60294
$$ 335916 343913 38463 -631445 -884178 -292031 509606 789982 654756 499313 239019
33686B39019n52923n73280k75406j13152j11419J21269M32363K44507k92189l59602
$$ 239019 -313904 -887184 -1162590 -1275742 -1387161 -1265892 -833529 -589022 -881211 -1240813
33676a240813J65426M99788L18927K08626M27494L61518k75590p51480m80742
$$ -1240813 -1075387 -575599 -256672 -48046 379448 740966 465376 -286104 -766846
33667g66846J3848K1200k31675j25126K79921M57186K73445m147k08402k64818
$$ -766846 -752998 -731798 -963473 -1088599 -808678 -351492 -78047 -82194 -290596 -555414
33657e55414m5522L15064L46452q0198m07009j58802L57793N68320M16311J72618
$$ -555414 -600936 -285872 60580 -19618 -426627 -585429 -227636 340684 756995 929613
33647I29613r0238l09972j67954L78534O88100K40894m56743n11992K2663K58946
$$ 929613 839375 529403 361449 739983 1428083 1668977 1212234 700242 722905 981851
33637I81851j48081n61440m46271j20594p5115j67245l57L00167K71920q5820
$$ 981851 833770 272330 -173941 -294535 -369650 -536895 -537252 -237085 34835 -50985
33627e0985k55135P159K90978J71698j29312j02809K10682K28473k64021o80282
$$ -50985 -306120 -298961 -7983 163715 34403 -68406 142276 370749 106728 -573554
33617e73554m10016K91181O11447K44620k91247m05446j05271K16948L44208L38637
$$ -573554 -983570 -692389 -80942 163678 -127569 -533015 -638286 -421338 -77130 261507
33607B61507K56725M2217k70323m36504k51232J15190K37341j524j88568K7613
$$ 261507 518232 560449 290126 -146378 -397610 -282420 -45079 -46603 -235171 -207558
33597b07558L50764K72660o5931p2171K48474K12476l46989o44169j92421L04169
$$ -207558 143206 415866 349935 277764 526238 738714 391725 -252444 -444865 -140696
33587a40696N4335m89490l55401L40091N81897Q0488l55798j45382L09774M22500
$$ -140696 -86361 -575851 -931252 -591161 -9264 71224 -284574 -429956 -120182 302318
33577C02318K02724n3213k40597l14863j56739J70054L67338K67612j160k22200
$$ 302318 505042 451829 211232 -103631 -260370 -90316 277022 544634 543474 321274
33567C21274k19914P2345L86767K46815l01557n04345N619M41169o490p49365
$$ 321274 101360 173705 560472 807287 505730 1385 7004 448173 441683 -307682
$$ [...]
##END NTUPLES=NMR SPECTRUM
##END=
