##TITLE=31Pdec_3C2610
 CDCl3, 24 sc
 27.10.2021
##JCAMPDX= 6.0         $$ Bruker NMR JCAMP-DX V2.0
##DATA TYPE= NMR SPECTRUM
##DATA CLASS= NTUPLES
##ORIGIN= UXNMR, Bruker Analytische Messtechnik GmbH
##OWNER= root
$$ XWIN-NMR		Version 3.5
$$ Wed Oct 27 11:17:52 2021 Russian Standard Time (UT+4h)  she@DPX200
##.OBSERVE FREQUENCY= 81.013821
##.OBSERVE NUCLEUS= ^31P
##.ACQUISITION MODE= SIMULTANEOUS
##.ACQUISITION SCHEME= undefined
##.AVERAGES= 24
##.DIGITISER RES= 16
##SPECTROMETER/DATA SYSTEM= spect
##.PULSE SEQUENCE= zgpg30
##.SOLVENT NAME= CDCl3
##.SHIFT REFERENCE= (INTERNAL, CDCl3, 0, 248.564)
##AUDIT TRAIL= $$ (NUMBER, WHEN, WHO, WHERE, WHAT)
$$ ##TITLE= Audit trail, XWIN-NMR		Version 3.5
$$ ##JCAMPDX= 5.01
$$ ##ORIGIN= Bruker BioSpin GmbH
$$ ##OWNER= she
$$ F:/spectra/data/she/nmr/P31/1/pdata/1/auditp.txt
$$ ##AUDIT TRAIL=  $$ (NUMBER, WHEN, WHO, WHERE, WHAT)
(   1,<2021-10-27 11:15:30.32 +0400>,<she>,<DPX200>,
      <created by zg, POWCHK disabled, PULCHK disabled
       configuration hash MD5:
       00 E9 B6 7A A2 85 ED C7 34 08 36 98 17 FE 4E 26
       data hash MD5: 32K
       1D 28 9D 25 2D 76 1E 81 32 4C E0 D4 57 B1 7B 21>)
(   2,<2021-10-27 11:15:45.17 +0400>,<she>,<DPX200>,
      <Start of raw data processing
       efp BC_mod = 2 LB = 1 FT_mod = 6 PKNL = 1 PHC0 = -9043.527 PHC1 = 536.4695 SI = 64K 
       data hash MD5: 64K
       58 F8 CE 8C 44 A7 FA BD C2 8E 14 AD EB 7C E8 44>)
(   3,<2021-10-27 11:15:58.60 +0400>,<she>,<DPX200>,
      <pk PHC0 = 28.84835 PHC1 = 0 
       data hash MD5: 64K
       22 F0 68 94 E9 93 14 98 C1 97 21 A6 0F F6 43 49>)
$$ ##END=
$$ 
$$ hash MD5
$$ 8D B0 B9 90 3F C1 32 C5 67 08 F4 4A 6C 95 E0 77
##$RELAX= 
##$RELAX= 
##$RELAX= 
##$RELAX= 
##$RELAX= 
##$RELAX= 
##$RELAX= 
##$RELAX= 
$$ Bruker specific parameters
$$ --------------------------
##$DU= <F:/spectra>
##$EXPNO= 1
##$NAME= <P31>
##$PROCNO= 1
##$TYPE= <nmr>
##$USER= <she>
##$AMP= (0..31)
100 100 100 100 100 100 100 100 100 100 100 100 100 100 100 100 100 100 
100 100 100 100 100 100 100 100 100 100 100 100 100 100 
##$AQSEQ= 0
##$AQ_mod= 1
##$AUNM= <au_zg>
##$AUTOPOS= <>
##$BF1= 81.014009
##$BF2= 200.13
##$BF3= 200.13
##$BF4= 200.13
##$BF5= 200.13
##$BF6= 200.13
##$BF7= 200.13
##$BF8= 200.13
##$BYTORDA= 1
##$CFDGTYP= 0
##$CFRGTYP= 5
##$CHEMSTR= <none>
##$CNST= (0..31)
1 1 145 1 1 1 1 1 1 1 1 1 1 1 1 1 1 1 1 1 1 1 1 1 1 1 1 1 1 1 1 1 
##$CPDPRG= <waltz16>
##$CPDPRG1= <>
##$CPDPRG2= <waltz16>
##$CPDPRG3= <>
##$CPDPRG4= <mlev>
##$CPDPRG5= <mlev>
##$CPDPRG6= <mlev>
##$CPDPRG7= <mlev>
##$CPDPRG8= <mlev>
##$CPDPRGB= <>
##$CPDPRGT= <>
##$D= (0..31)
0 1 0 0 0 0 0 0 0 0 0 0.03 2e-05 3e-06 0 0 0 0 0 0 0 0 0 0 0 0 0 0 0 0 
0 0 
##$DATE= 1635318929
##$DBL= (0..7)
120 120 120 11 120 120 24 19 
##$DBP= (0..7)
150 150 150 150 150 150 150 150 
##$DBP07= 0
##$DBPNAM0= <>
##$DBPNAM1= <>
##$DBPNAM2= <>
##$DBPNAM3= <>
##$DBPNAM4= <>
##$DBPNAM5= <>
##$DBPNAM6= <>
##$DBPNAM7= <>
##$DBPOAL= (0..7)
0.5 0.5 0.5 0.5 0.5 0.5 0.5 0.5 
##$DBPOFFS= (0..7)
0 0 0 0 0 0 0 0 
$$ [...]
##$SUBNAM2= <"">
##$SUBNAM3= <"">
##$SUBNAM4= <"">
##$SUBNAM5= <"">
##$SUBNAM6= <"">
##$SUBNAM7= <"">
##$SUBNAM8= <"">
##$SUBNAM9= <"">
##$SW= 501.771253377433
##$SWIBOX= (0..15)
0 1 3 0 0 0 0 0 0 0 0 0 0 0 0 0 
##$SW_h= 40650.406504065
##$TD= 32768
##$TD0= 1
##$TE= 0
##$TE2= 300
##$TE3= 300
##$TEG= 300
##$TL= (0..7)
0 120 53 12 22 120 120 120 
##$TP= (0..7)
150 150 150 150 150 150 150 150 
##$TP07= 0
##$TPNAME0= <>
##$TPNAME1= <>
##$TPNAME2= <>
##$TPNAME3= <>
##$TPNAME4= <>
##$TPNAME5= <>
##$TPNAME6= <>
##$TPNAME7= <>
##$TPOAL= (0..7)
0.5 0.5 0.5 0.5 0.5 0.5 0.5 0.5 
##$TPOFFS= (0..7)
0 0 0 0 0 0 0 0 
##$TUNHIN= 0
##$TUNHOUT= 0
##$TUNXOUT= 0
##$USERA1= <user>
##$USERA2= <user>
##$USERA3= <user>
##$USERA4= <user>
##$USERA5= <user>
##$V9= 5
##$VALIST= <valist>
##$VCLIST= <CCCCCCCCCCCCCCC>
##$VD= 0
##$VDLIST= <DDDDDDDDDDDDDDD>
##$VPLIST= <PPPPPPPPPPPPPPP>
##$VTLIST= <TTTTTTTTTTTTTTT>
##$WBST= 1024
##$WBSW= 4
##$XGAIN= (0..3)
0 0 0 0 
##$XL= 0
##$YL= 0
##$YMAX_a= 5717
##$YMIN_a= -5838
##$ZGOPTNS= <>
##$ZL1= 120
##$ZL2= 120
##$ZL3= 120
##$ZL4= 120
##$ABSF1= 0
##$ABSF2= 0
##$ABSG= 0
##$ABSL= 0
##$ALPHA= 0
##$AQORDER= 0
##$ASSFAC= 0
##$ASSFACI= 0
##$ASSFACX= 0
##$ASSWID= 0
##$AUNMP= <proc_1d>
##$AZFE= 0.1
##$AZFW= 0.5
##$BCFW= 0
##$BC_mod= 2
##$BYTORDP= 0
##$COROFFS= 0
##$CY= -3
##$DATMOD= 1
##$DC= 0
##$DFILT= <>
##$DTYPP= 0
##$F1P= 0
##$F2P= 0
##$FCOR= 1
##$FTSIZE= 65536
##$FT_mod= 6
##$GAMMA= 0
##$GB= 0
##$INTBC= 1
##$INTSCL= 5.30512e-09
##$ISEN= 30
##$LB= 1
##$LEV0= 0
##$LPBIN= 0
##$MAXI= 10000
##$MC2= 0
##$MEAN= 0
##$ME_mod= 0
##$MI= 50
##$NCOEF= 0
##$NC_proc= -5
##$NLEV= 6
##$NOISF1= 182.463
##$NOISF2= 159.3651
##$NSP= 0
##$NTH_PI= 0
##$NZP= 0
##$OFFSET= 248.5645
##$PC= 4
##$PHC0= -9014.679
##$PHC1= 536.4695
##$PH_mod= 1
##$PKNL= yes
##$PPARMOD= 0
##$PSCAL= 0
##$PSIGN= 0
##$REVERSE= no
##$SF= 81.014009
##$SI= 65536
##$SIGF1= 159.3651
##$SIGF2= -187.1042
##$SINO= 113.3802
##$SIOLD= 16384
##$SREGLST= <1H.CDCl3>
##$SSB= 0
##$STSI= 65536
##$STSR= 0
##$SW_p= 40650.406504065
##$SYMM= 0
##$S_DEV= 0
##$TDeff= 32768
##$TDoff= 0
##$TI= <>
##$TILT= no
##$TM1= 0
##$TM2= 0
##$TOPLEV= 0
##$USERP1= <user>
##$USERP2= <user>
##$USERP3= <user>
##$USERP4= <user>
##$USERP5= <user>
##$WDW= 1
##$XDIM= 65536
##$YMAX_p= 480284826
##$YMIN_p= -42869223
$$ End of Bruker specific parameters
$$ ---------------------------------
##NTUPLES= NMR SPECTRUM
##VAR_NAME=  FREQUENCY,     SPECTRUM/REAL,   SPECTRUM/IMAG
##SYMBOL=    X,             R,               I
##VAR_TYPE=  INDEPENDENT,   DEPENDENT,       DEPENDENT
##VAR_FORM=  AFFN,          ASDF,            ASDF
##VAR_DIM=   65536,         65536,           65536
##UNITS=     HZ,            ARBITRARY UNITS, ARBITRARY UNITS
##FACTOR=    0.620285442955139, 1,           1
##FIRST=     20137.2065510759, 0,            0
##LAST=      -20513.1999529892, 0,           0
##MIN=       -20513.1999529892, -42869223,   0
##MAX=       20137.2065510759, 480284826,    0
$$ Real data points
##PAGE= N=1
##DATA TABLE= (X++(R..R)), XYDATA
$$ [...]
39747D5566O4489J58869M5594o7087K493K84144M77893J19941o97733j113461
$$ 45566 110055 268924 314518 247431 249924 534068 1011961 1131902 434169 -679292
39737f79292n39668M25136P85908N03921K55656J62259k14268p28599o40541R8208
$$ -679292 -1218960 -793824 -7916 496005 751661 913920 699652 -28947 -669488 -571280
39727e71280N90892L40460p8307o2981J60274J69258N8347J9412j16477m11643
$$ -571280 19612 360072 281765 218784 379058 548316 606663 626075 509598 97955
39717I7955m90634j70948J20299M3903o5262J73545M63030L16529j02910k29703
$$ 97955 -392679 -563627 -443328 -399425 -464687 -291142 171888 488417 385507 155804
39707A55804M5591K98152K37534K7343l3948J28543L17009K45484j57968o00615
$$ 155804 201395 499547 737081 764424 730476 859019 1176028 1421512 1263544 662929
39697F62929p01402l88221J24073N96682P73520L98125l60865p76703m03320K11544
$$ 662929 -38473 -426694 -302621 294061 1067581 1465706 1104841 328138 -75182 136362
39687A36362K90505J184L5937K87430K5523o64555q23926j86435L77240L21435
$$ 136362 426867 428051 463988 751418 776941 112386 -711540 -897975 -520735 -199300
39677a99300J67018L09160K53993k85110o09882j85555L51254K21667k39634k62837
$$ -199300 -32282 276878 530871 245761 -364121 -549676 -198422 23245 -216389 -479226
39667d79226R5337K76247K37822K69118K69457L4576j70951p1365L7517j46096
$$ -479226 -383889 -107642 130180 399298 668755 703331 532380 461015 498532 352436
39657C52436k92578q0723P6152k78304p45601o62468j11262L98855P23005Q24435
$$ 352436 59858 -20865 55287 -223017 -968618 -1631086 -1742348 -1343493 -620488 203947
39647B03947L89326m59260p70807o3516O92180M55930k49990l18338O7584p656
$$ 203947 593273 134013 -636794 -700310 -8130 447800 197810 -120528 -52944 -60600
39637f0600l79935k05672K63108Q6672m25241q0414R11824J006788o7095p55717
$$ -60600 -440535 -646207 -383099 -296427 -721668 -802082 109742 1116530 1049435 293718
39627B93718k60381K87552K3682j91345L69658P41254J1883q27646m41899N48854
$$ 293718 33337 320889 344571 153226 522884 1264138 1276021 448375 6476 555330
39617E55330N84658k78990o19521m1069M10491J57210j53819q662J84807L8960
$$ 555330 1139988 860998 241477 200408 610899 768109 614290 605628 790435 829395
39607H29395j50442j13972j23244l54774m38997r8527L08389L26234Q2389J7214
$$ 829395 678953 564981 441737 86963 -352034 -450561 -142172 184062 266451 283665
39597B83665K07903L33635J80377j02969k29645j12624L8494m5314l40500n08438
$$ 283665 491568 825203 1005580 902611 672966 560342 598836 553522 213022 -295416
39587b95416l17404L5108J84975Q4257R363J25234K60027J79843l9017m4187L28363
$$ -295416 -612820 -577712 -392737 -308480 -299117 -173883 86144 265987 226970 182783 511146
39576E11146O90294M33785m34884j070239p54638J04284M55244P175m75626l66965
$$ 511146 1201440 1635225 1200341 130102 -624536 -520252 -65008 -57833 -533459 -900424
39566i00424K9535J81782J62240K76966L69926J07221l47586n13576k78981M9475
$$ -900424 -870889 -689107 -526867 -249901 120025 227246 -120340 -633916 -912897 -863422
39556h63422K27820K18671M1875j52611p8977K64975M44965K29143K6510K16572
$$ -863422 -635602 -416931 -375056 -527667 -606644 -341669 103296 332439 358949 575521
39546E75521M37383J73391k92762k96419O2947P1110l60831n26392j23271K68189
$$ 575521 1012904 1186295 893533 597114 660061 731171 370340 -156052 -279323 -11134
39536a1134J97689J8173J24235K40054L804l20983l07613r2773n3434j09069O5679
$$ -11134 186555 204728 328963 569017 572821 251838 -55775 -148548 -201982 -311051 -245372
39525b45372L90612N12490M07493L20534K45972p549l28116l90836j99215o0286
$$ -245372 145240 657730 1065223 1385757 1631729 1624180 1296064 905228 706013 645727
39515F45727m9642J0702N1554k14125o56927o76228l4774O84928P74571K50697
$$ 645727 596085 606787 658341 444216 -212711 -888939 -923713 -238785 535786 786483
39505G86483k75642l48110k4639L32300M02221J70042l5241P2197K85137J56481
$$ 786483 510841 162731 138092 470392 872613 1042655 1007414 1079611 1364748 1521229
39495A521229k52347l66371m1116Q2964l86262p84511l24110N88220Q59012L26627
$$ 1521229 1268882 902511 861395 944359 558097 -226414 -550524 37696 896708 1223335
39485A223335j20832n4625n2931m45260n90501m1860M81842J69190n08889n05519
$$ 1223335 1102503 1047878 994947 549687 -40814 -82674 399168 568358 59469 -446050
39475d46050J54366N12226K56359M6582K16577K46210j68540m87831k59113J16784
$$ -446050 -291684 220542 476901 523483 740060 986270 817730 329899 70786 187570
39465A87570J23501l0174N4213J49622j47337n68123n51648k02997p8186j62715
$$ 187570 311071 280897 335110 484732 337395 -230728 -782376 -985373 -1063559 -1226274
39455a226274Q7604O57300P86219J51375n02067l66809L26114P24839M95329J1166
$$ -1226274 -1138670 -481370 304849 456224 -45843 -412652 -86538 638301 1133630 1144796
39445A144796l39094m77150l78902l9133K69626J74564k32280m03948r0205K89941
$$ 1144796 805702 328552 -50350 -89483 180143 354707 122427 -281521 -371726 -81785
39435h1785K84886Q3481J60084M62209M50118n7171n51965n27598j25686J70908
$$ -81785 203101 286582 446666 908875 1358993 1301822 749857 222259 96573 267481
39425B67481K08529J84939J79582O0283j69657k96645k39079j64596j65608j00742
$$ 267481 476010 660949 840531 900814 731157 434512 195433 30837 -134771 -235513
39415b35513R3927K07584Q6817o4201K246J36496K2464k22420j04506M70143Q59734
$$ -235513 -141586 65998 152815 88614 90860 227356 249820 27400 -77106 393037 1252771
39404A252771M43795m75688r16249l85649N09697P99187K74602l85252n25335
$$ 1252771 1696566 1220878 304629 -81020 428677 1227864 1502466 1117214 591879
39395E91879k15995M2992J2029j55324k93768l97533m21563k36074J05849K98634
$$ 591879 375884 418876 430905 275581 -18187 -415720 -837283 -1073357 -967508 -668874
39385f68874J46868j63992l09424k00695K3688K33587L57896L27379J68961O1688
$$ -668874 -522006 -685998 -995422 -1196117 -1172429 -938842 -580946 -253567 -84606 -22918
39375b2918J01207J15307n5779k17101p6202K27490K48210p8447l05020j72313
$$ -22918 78289 193596 137817 -79284 -155486 72004 320214 241767 -63253 -235566
39365b35566N754o8433j33030J44858M69777K94832k50282m46048l7211M09173
$$ -235566 -229812 -298245 -431275 -286417 183360 478192 227910 -218138 -255349 153824
39355A53824L78167P4476q0895j07726k01444k33798k8247J74371O8583j34595
$$ 153824 531991 606467 525572 417846 216402 -17396 -45643 128728 197311 62716
39345F2716n9469J03972q9538m10959j69523N47915P54328N6542n84056k37311
$$ 62716 3247 107219 17681 -393278 -562801 -14886 739442 795984 211928 -25383
39335b5383N52272N99469r3429l96729J55845O97026M11389k97794n45783k46310
$$ -25383 526889 1126358 1032929 636200 792045 1489071 1900460 1602666 1056883 810573
39325H10573j9605j64716l52913k58678Q401J70833J51638O2833O238k0457p7162
$$ 810573 790968 626252 273339 14661 23062 193895 345533 408366 414604 394147 316985
39314C16985j60290j44334N4185K54655J51620k46125n43433m73893k46676j54172
$$ 316985 156695 12361 66546 321201 472821 226696 -316737 -790630 -1037306 -1191478
39304a191478q3571K20765N77007N21134M4043l03665j90701N2004L6972l7759
$$ -1191478 -1275049 -1054284 -477277 43857 87900 -215765 -406466 -354462 -317490 -355249
39294c55249K01068N23274L33280l27710o43215j41774N52568N38879j25179n73318
$$ -355249 -154181 369093 702373 374663 -268552 -410326 142242 681121 555942 -17376
39284a7376l75342N432Q5845N5393K47603M26720J55099l87921n53473j56603
$$ -17376 -392718 -387286 -301441 -246048 1555 428275 583374 195453 -358020 -514623
39274e14623K65331K32832p0176j58455J10065M60843N53541K49327k83712o33123
$$ -514623 -249292 -16460 -86636 -245091 -135026 325817 879358 1128685 844973 211850
39264B11850n23857j96428j15305k47308o7871N23308Q21379K93920m95599n76929
$$ 211850 -312007 -508435 -623740 -871048 -938919 -415611 405768 699688 204089 -372840
39254c72840N8704M98935K68356j05583n3656K08573J97541l2507r8439L7463
$$ -372840 -314136 184799 453155 347572 293916 502489 700030 667523 569084 606547
39244F06547J06332N7955Q1940J73615P3747l32246q11978r97356o64477Q5589
$$ 606547 712879 770834 852774 1026389 1100136 767890 -44088 -1041444 -1705921 -1620332
39234a620332P79230R02059M85380J20179J36233J15080l55487q16142n15528
$$ -1620332 -841102 60957 546337 666516 802749 917829 562342 -253800 -769328
39225g69328L35679P21563K82715k24677j75657O2009k2994j56503R8179L88940
$$ -769328 -433649 287914 570629 345952 170295 232304 209310 52807 150986 539926
39215E39926J14079m38047m11310K53976O61415K85076l13268l80384K1342K89515
$$ 539926 654005 215958 -195352 58624 720039 1005115 691847 311463 332805 622320
39205F22320J53729j30893k49898j62919k6934L8593Q2643J90748K24957o7265
$$ 622320 776049 645156 395258 232339 205405 243998 326641 517389 742346 675081
39195F75081n28973n40511J13162O68750L01155o06810q89257k45094M06805L71772
$$ 675081 146108 -394403 -281241 387509 688664 81854 -807403 -1052497 -645692 -273920
39185b73920P4034J22716L25792K35429L466r344K7515k05330m37398j94528L24014
$$ -273920 -199886 -77170 248622 484051 487517 478173 505688 300358 -137040 -331568 -7554
39174g554M77365J55544j41943j24934L716N7761R6836J27624O1903j4483M8882
$$ -7554 469811 625355 483412 358478 362194 419955 516791 644415 706318 691835 740717
39163G40717J33024L6164j09306n6741N6202n3110k15160n0771K90399K99555
$$ 740717 873741 909905 800599 743858 800060 746950 531790 481019 771418 1070973
39153A070973k8179k14516j77524k88006m66437j42626O04487Q14278O7207p13633
$$ 1070973 1042794 828278 650754 362748 -103689 -246315 358172 1172450 1239657 526024
39143E26024n71878J04474L45712J37515J89763N26173M09389l35011r13348p18205
$$ 526024 -45854 58620 404332 541847 731610 1257783 1667172 1332161 418813 -299392
39133b99392j06502K91048L92225M14991L35721N9874k05640j98072l5178m7672
$$ -299392 -405894 -114846 277379 692370 1028091 1087965 882325 684253 649075 601403
39123F01403k84391m68868l81893p6110K28046L09699J07328j58117j54653J29368
$$ 601403 317012 -151856 -533749 -609859 -381813 -72114 35214 -122903 -277556 -148188
39113a48188L04666J11702j84596j99181j2989K7948n1679Q4280M07743M60367
$$ -148188 156478 268180 83584 -115597 -128586 -100638 -152317 -68037 339706 800073
39103H00073J03765j99126j19203L1600q7269k10320K0390L15081J88998j31197
$$ 800073 903838 704712 585509 617109 529840 319520 339910 654991 843989 712792
39093G12792n0913K83884J35651m97094o81014k0977N99046L44279k99299l76610
$$ 712792 661879 945763 1081414 584320 -96694 -117671 481375 825654 526355 149745
39083A49745L5361J40419j43537j28872L36108N37701R3461l91288k79708J38681
$$ 149745 185106 325525 181988 53116 389224 926925 1020386 629098 349390 488071
39073D88071J66848k43888m98009k37879K27475L79738R6295k82833l73563j39473
$$ 488071 654919 411031 -86978 -324857 -97382 282356 378651 95818 -277745 -417218
39063d17218J57115L23231L89322L81043K02635j00740k37068o8991J30509J07160
$$ -417218 -260103 63128 452450 833493 1036128 935388 698320 629329 759838 866998
39053H66998K4854P1963n662m43510p85929l71222N66768R99518M44930m10937
$$ 866998 891852 963815 958153 514643 -271286 -642508 -75740 923778 1368708 957771
39043I57771o65118k52244K37332L80719K41538J08985J55253K48456Q9357l23853
$$ 957771 292653 40409 277741 658460 899998 1008983 1164236 1412692 1502049 1178196
39033A178196n44020l02287l0986k36659n83873l36058L93721P05391L00604j23591
$$ 1178196 634176 331889 300903 64244 -519629 -855687 -461966 243425 544029 420438
39023D20438j15474j30051m93005o48736j33802M89189M87186J15464N3147K08830
$$ 420438 304964 174913 -318092 -966828 -1100630 -611441 -124255 -8791 44356 253186
39013B53186M8115k70802j28325L68008M58464L553k95562j05482M0207k22052
$$ 253186 301301 30499 -97826 270182 728646 732199 436637 331155 371362 149310
39003A49310l91155L3444O37050O75918J72756k13759k00047j34088k66204l41200
$$ 149310 -241845 -208401 428649 1104567 1277323 1063564 863517 729429 463225 122025
38993A22025j07497J99201K14921M0078O6711K87861K34016k61882o55763l93208
$$ 122025 14528 213729 428650 468728 535439 823300 1057316 795434 139671 -253537
38983b53537K61634N47476K22064k23620l41384k14108p6665O7621K40001K79112
$$ -253537 8097 555573 777637 554017 212633 -1475 -78140 -10519 229482 508594
38973E08594Q8054j73436l06605k46714K7558M21718N49682R9820n48989o31125
$$ 508594 596648 423212 116607 -130107 -102549 319169 868851 968671 419682 -211443
38963b11443o6945L85470K85442J08805K92521M22753J2840n33705n31037j34047
$$ -211443 -278388 107082 392524 501329 793850 1216603 1229443 695738 164701 30654
38953C0654n705j61226l4009M22451N67073Q4820n48376p65674n08935j2660M87711
$$ 30654 24949 -136277 -170286 252165 819238 904058 355682 -409992 -918927 -931587 -443876
38942d43876P03404M31781q0269k95820n8167K16024J24963k22510m16767k50427
$$ -443876 259528 691309 611040 315220 257053 473077 598040 375530 -41237 -291664
38932b91664Q2273K10082K1991j45932L1046K76959N4756m46629l74718M22383
$$ -291664 -209391 691 22682 -123250 -92204 184755 239511 -207118 -581836 -159453
38922a59453R19585M18499k97946k21988K24867J6771n63199l47455N90430Q75252
$$ -159453 760132 1178631 880685 658697 883564 900335 337136 -10319 580111 1455363
38912A455363P7700n79133k67263J90624q9464n39235k76557K98903K57178k68232
$$ 1455363 1533063 953930 686667 877291 787827 248592 -27965 270938 528116 259884
38902B59884m57189k43131j76220k10380J59282P09993O36901n3074l91276O2151
$$ 259884 -197305 -440436 -616656 -827036 -667754 42239 679140 626066 234790 296941
38892B96941N48601L36826j99934k92819K3796P5253l65196p38208m68418K70640
$$ 296941 845542 1182368 982434 689615 713411 788664 423468 -314740 -783158 -512518
38882e12518P07645L39297m34308o92023r2729O44314O31768l1390m40506j19312
$$ -512518 195127 534424 100116 -591907 -684636 -40322 591446 560056 119550 238
38872B38M67539O95622N15471J88012j93426n43491n57597j20452L11849K20725
$$ 238 467777 1163399 1678870 1866882 1673456 1129965 572368 451916 763765 984490
38862I84490k33387m48645k62357p8043j13774q6997J83742L88184K55201N1500
$$ 984490 751103 302458 40101 -37942 -151716 -238713 -54971 333213 588414 639914
38852F39914J36115L33564K35300p7250j50722O0719Q2768l15487p24563o65152
$$ 639914 776029 1109593 1344893 1267643 1116921 1177640 1260408 944921 220358 -444794
38842d44794j87639L21430O17438O30004K93577l17726q10289p39761j03277N72213
$$ -444794 -632433 -311003 306435 936439 1230016 912290 102001 -637760 -741037 -168824
38832a68824O86677J35716n36539o37567q6997M67453M70057J47391L4949J02697
$$ -168824 517853 653569 117030 -520537 -607534 -140081 329976 477367 512316 615013
38822F15013n3507l25201j83960L10060M53599P2362j36543J84152L99918J3019
$$ 615013 561506 236305 52345 362405 816004 888366 751823 935975 1335893 1348912
38812A348912m31952l29434r6017l34926o11135j77779N74252O13979n5430m39513
$$ 1348912 916960 587526 491509 156583 -454552 -632331 -58079 555900 500470 60957
38802F0957j69476J14682L7977j2063J50255J21387k16709l79072j49011Q4818
$$ 60957 -108519 6163 44140 32077 182332 303719 87010 -292062 -441073 -356255
38792c56255J29720K71966M99818L43774j86597m09605r3988J15099j85990n05205
$$ -356255 -226535 45431 545249 889023 702426 292821 198833 313932 127942 -377263
38782c77263l94307j58061r3935Q9235M86736N12081j00460o26874m39510J6837
$$ -377263 -771570 -929631 -1023566 -934331 -447595 64486 -35974 -662848 -1102358 -1085521
38772a085521J14981J08855M14988O10219J91321l22937j75509K78050J75526
$$ -1085521 -970540 -861685 -446697 163522 354843 31906 -143603 134447 309973
38763C09973l19906l19080K37326N42596L04628Q058j17837k69899k82640J68192
$$ 309973 -9933 -329013 -91687 450909 755537 763595 645758 375859 93219 261411
38753B61411N99421J91626p00737q14294K9672N55820P8027m59106j58014L97981
$$ 261411 860832 1052458 351721 -462573 -432901 122919 200946 -258160 -416174 -18193
38743a8193L20454o3830K0063L47422K08098k26190k50488N5703M4339k14448
$$ -18193 302261 238431 258494 605916 814014 587824 337336 393039 437378 222930
38733B22930n9667M20816L90146k53091n64618j05150K80654j53033q05761o77404
$$ 222930 163263 584079 974225 721134 156516 51366 332020 178987 -626774 -1304178
38723a304178J07958O35469O16110N05879M40579P3460m84326n46630L3891M89814
$$ -1304178 -1196220 -560751 55359 561238 1001817 1075277 590951 44321 78212 568026
38713E68026L04160k8695L0812R3317l68364q70872n93905J57711L12263k48134
$$ 568026 872186 843491 874303 967620 599256 -271616 -865521 -707810 -395547 -643681
38703f43681n18211o2083L42544J58025l635L86151O94915K21618m84526m72229
$$ -643681 -1161892 -1223975 -881431 -723406 -727041 -340890 354025 575643 91117 -381112
38693c81112Q7807L54656K75849L68130M21235j96315j051222r10231L03064J163918
$$ -381112 -293305 61351 337200 705330 1126565 930250 -120972 -1031203 -728139 435779
38683D35779P88629m429j72405M0672j13828n04522m79917k4583L39592M21029
$$ 435779 1224408 1219979 1047574 1088246 974418 469896 -10021 -34604 304988 726017
38673G26017L67877J43048l01606n98330l77879Q4292K09814q1434m06369n19746
$$ 726017 1093894 1236942 935336 337006 -40873 43419 253233 171799 -234570 -754316
38663g54316m03337l5647M30768N66399K51610J8898K57329M98691J81425l13628
$$ -754316 -1157653 -1193300 -762532 -196133 55477 74375 331704 830395 1011820 698192
38653F98192k56591J62679J79486j58571j04659L21050K32620n17232q75852k45272
$$ 698192 441601 604280 783766 625195 520536 841586 1074206 556974 -318878 -564150
38643e64150N13509M35900j33547l18918j22002j09534k65072j37483K12969L29851
$$ -564150 -50641 385259 251712 -67206 -189208 -298742 -563814 -701297 -488328 -158477
38633a58477K06905K02135K77843J08889j81167j65562Q3310R8004j16394r3329
$$ -158477 48428 250563 528406 637295 456128 290566 373876 471880 355486 262157
38623B62157J91456K17053j54728m02969k07063J07412K17263K36712K49812P2802
$$ 262157 453613 670666 515938 112969 -94094 13318 230581 467293 717105 789907
38613G89907k12713j59249K43282L37144j68546n98385l34096J78580J79946j47618
$$ 789907 577194 417945 661227 998371 829825 231440 -102656 75924 255870 108252
38603A08252m2883N10315P36846K90564l06106n30515m47697k69119J6175L08055
$$ 108252 65369 575684 1312530 1603094 1296988 766473 318776 49657 65832 373887
38593C73887K63605j45308l78106k7778N23289N62603K854n17301m72234m8496
$$ 373887 637492 492184 114078 86300 609589 1172192 1175046 657745 185511 137015
38583A37015K25375K06871K09478L78485L63757j20889o70603o07321J0381L53668
$$ 137015 362390 569261 778739 1157224 1520981 1400092 729489 122168 132549 486217
38573D86217k5657n52922m81855Q6341M96244M71614K36517J327j30256J2228
$$ 486217 460560 -92362 -574217 -487876 8368 479982 716499 717826 587570 599798
38563E99798L75003M43598j04957p23709o36341M971L36017O6842k39721j89250
$$ 599798 974801 1418399 1313442 589733 -46608 -41637 294380 361222 121501 -67749
38553f7749l7832k3936n523L6273j18742l24112j10169M18413N40250Q4023k31807
$$ -67749 -105581 -129517 -135040 -98767 -217509 -541621 -651790 -233377 306873 390896 159089
38542A59089l3235Q1624k68000m12170J73812P37400L92137l24531k95360K74260
$$ 159089 125854 207478 -60522 -472692 -298880 438520 830657 506126 210766 485026
38532D85026K15681n32290p05812K22598J130632R22054J0938n46818n26999l72096
$$ 485026 700707 168417 -537395 -314797 815835 1737889 1748827 1202009 675010 302914
38522C02914k18549P0189K97254J47740j80248k17790Q673L9883k24017l45216
$$ 302914 84365 154554 451808 599548 419300 201510 210183 250066 26049 -319167
38512c19167m5047L74377M73702K21117r4334k77873l55606l81029k96295l9438
$$ -319167 -364214 10163 483865 704982 610648 332775 -22831 -403860 -700155 -739593
38502g39593K64813L39377Q9810j71704o8858K63281K73437j86162n17018k05168
$$ -739593 -474780 -135403 -45593 -217297 -286155 -22874 250563 64401 -452617 -657785
38492f57785L35653L14894k04051l39402K43856P53308M44005k67497m79400j31606
$$ -657785 -322132 -7238 -211289 -550691 -306835 446473 890478 622981 143581 11975
38482A1975J08269K4226M8334K90526K56212k19978n41273k72853J44273J24160
$$ 11975 120244 144470 192804 483330 739542 519564 -21709 -294562 -150289 -26129
38472b6129j38755o7506L53346O35245N31798J81996k64797o38909n95451l6520
$$ -26129 -164884 -232390 120956 756201 1287999 1469995 1205198 566289 -29162 -65682
38462f5682M98056M38358J6459j06420J21784J61714j49465l85593l27319k61997
$$ -65682 432374 870732 887191 780771 902555 1064269 914804 529211 201892 -60105
38452f0105l52005l37795n3121K99980N29858O17222M51219m1042m74773l47677
$$ -60105 -412110 -749905 -803026 -503046 26812 644034 1095253 1054211 579438 231761
38442B31761J44213L02030L925j50581J09305L38787K45189J19919J28654r288
$$ 231761 375974 678004 681929 531348 640653 979440 1224629 1344548 1473202 1463914
38432A463914l16603l65646j28689j39240m31908l05714L67039O66715J33482
$$ 1463914 1147311 781665 652976 513736 81828 -223886 143153 809868 943350
38423I43350l39151M626M44098L5867p00083o30882J28177N33797L19102P8301
$$ 943350 604199 608825 1052923 1088790 388707 -242175 -113998 419799 738901 817202
38413H17202K846j92491l40618n9441K87067P7520l29988j27464L68525J04602
$$ 817202 820048 627557 286939 227498 514565 592085 262097 134633 503158 607760
38403F07760p77174r32921K4489Q62200O81773J39583P7500K06638k8637l40428
$$ 607760 -169414 -1102335 -1077846 -215646 466127 605710 683210 889848 861211 520783
38393E20783k61044q8172k71084m97455k40680K74256M23217J34289j59956k09345
$$ 520783 259739 171567 -99517 -596972 -837652 -563396 -140179 -5890 -165846 -375191
38383c75191n4304K38309M89763L84823o0920l42248j27172K75916M14701K47917
$$ -375191 -429495 -191186 298577 683400 622480 280232 153060 428976 843677 1091594
38373A091594o7162m50865o68182l77541K28701M17545l9993m34610k06357J98279
$$ 1091594 1024432 573567 -94615 -472156 -243455 174090 134097 -300513 -506870 -308591
38363c08591J68795k8992J51019M39266J88281m17858n54439n5229L52887J64483
$$ -308591 -139796 -168788 -17769 421497 609778 191920 -362519 -417748 -64861 99622
38353I9622k93038m88854l28714j8169K42013L03224J70425Q5444K02320K83573
$$ 99622 -193416 -682270 -1010984 -1029153 -787140 -483916 -313491 -228047 -25727 257846
38343B57846R1156j03574Q7939M18378K77996l04376o16670l37930J5732k3530
$$ 257846 349002 245428 333367 751745 1029741 725365 108695 -229235 -213503 -237033
38333b37033j72712P861L25587K91326o8640k75004j25478J13321J94964J54498
$$ -237033 -409745 -401884 -76297 215029 146389 -128615 -254093 -140772 54192 208690
38323B08690O8154o5849j40577Q483K48104J93669j95600m09656q3264L91327
$$ 208690 276844 210995 70418 78901 327005 520674 325074 -84582 -167846 223481
38313B23481L76950o5096k68050L3842L53480K40016j12554l09337l31792l11710
$$ 223481 600431 535335 267285 301127 654607 894623 782069 472732 140940 -170770
38303a70770j36378K82415O51601O48604L81544J06569k04493n65613o11471j31276
$$ -170770 -307148 -24733 626868 1275472 1657016 1763585 1559092 993479 382008 250732
38293B50732L38794J66060l52687l98228P1318K99751J4958j97353R910J79529
$$ 250732 589526 755586 402899 4671 75989 375740 390698 193345 203255 382784
38283C82784n2109k86930q3441K87685L12738k1153l78948n49507m25083L8969
$$ 382784 330675 43745 -39696 247989 560727 539574 160626 -388881 -813964 -774995
38273g74995N35605N58409J28746j55353n3327j3187k47164k60349J84699M34781
$$ -774995 -239390 319019 447765 292412 239085 225898 -21266 -281615 -96916 337865
38263C37865m340n06067k85387K82949L14331q2358q5796L07634K56107l81591
$$ 337865 333525 -172542 -457929 -174980 139351 56993 -28803 278831 534938 153347
38253A53347o50327k788P73478O89594p2933n44376l04775J54315K45685j4254
$$ 153347 -496980 -499768 273710 963304 890371 345995 41220 195535 441220 426966
38243D26966j81971j2315K48437K12707r2881k21587P4465M53632M00443j38967
$$ 426966 244995 232680 481117 693824 600943 379356 453821 907453 1307896 1168929
38233A168929p12606q03947k35209O05734Q85656J21966r86949j122702o8827
$$ 1168929 456323 -347624 -582833 22901 908557 1030523 43574 -1079128 -1147955
38224a147955Q09577L69571p09596r54162j61328O02961P21045N67322M24456
$$ -1147955 -338378 31193 -678403 -1632565 -1793893 -1190932 -469887 97435 521891
38215E21891N2941m70777n62553j18250K25151J62629J61149M37768M33396j36303
$$ 521891 574832 104055 -458498 -576748 -351597 -188968 -27819 409949 843345 707042
38205G07042n74364k54238L47246M32893Q5078j14959j22078k21736k52851L4929
$$ 707042 132678 -121560 225686 658579 743657 628698 506620 284884 32033 66962
38195F6962K14362k24133p64040m46207N24144R16158L44232j85429L9167L70953
$$ 66962 281324 57191 -706849 -1153056 -628912 287246 631478 446049 485216 856169
38185H56169O9400m17715l48914l4508j88574n16404j88116N63479O26716j67767
$$ 856169 925569 507854 158940 124432 -64142 -580546 -768662 -205183 421533 253766
38175B53766o77157k27335L96677L16033r6651k5575M25963N85112L52288Q3268
$$ 253766 -423391 -650726 -254049 61984 -34667 -60242 365721 950833 1303121 1386389
38165A386389k20968o63638p71532j19243O11731L63081n67478p71098J16166
$$ 1386389 1165421 501783 -269749 -388992 222739 585820 18342 -752756 -636590
38156f36590P94674L18367m94834m53426K28998N31889K44653p5635k32560m15429
$$ -636590 158084 476451 -18383 -471809 -242811 289078 533731 458096 225536 -189893
38146a89893m57526j05816K17397m9072m86741k06586N86591P29232l8779n63418
$$ -189893 -647419 -753235 -535838 -584910 -1071651 -1278237 -691646 37586 -1193 -564611
38136e64611p1232O53885N90705K3403j43180J09286J35709r2972l8747K54516
$$ -564611 -635843 18042 608747 632150 488970 598256 733965 640993 602246 856762
38126H56762J59573l16090l68105K32622N90549Q7265n19518k55365M28176K77466
$$ 856762 1016335 700245 332140 564762 1155311 1242576 723058 467693 895869 1173335
38116A173335p36252j235603m88565N03963N64858L3778m195M80086N62166j0092
$$ 1173335 437083 -798520 -1287085 -783122 -218264 -184486 -188681 291405 853571 843479
38106H43479m66561l61625j84562l05860k92498J85990N75576K55868m31873o73773
$$ 843479 376918 15293 -169269 -475129 -767627 -581637 -6061 249807 -182066 -855839
38096h55839k92341K58343O23498O54013J83045n90910q52440j21643P93855P05231
$$ -855839 -1148180 -889837 -266339 387674 570719 -20191 -872631 -994274 -200419 504812
38086E04812k29484o83003j16610N12206L32922j72836j33457K90055K96396k18802
$$ 504812 275328 -407675 -524285 -12079 320843 148007 14550 304605 601001 382199
38076C82199n96345m90314k17378l5020K18895N89835O86637K29606m28461o69896
$$ 382199 -214146 -704460 -921838 -956858 -737963 -148128 538509 768115 339654 -330242
38066c30242l33143J98890N25045N85091N15317L89188K08557K3608q3580j24285
$$ -330242 -663385 -464495 60550 645641 1160958 1550146 1758703 1782311 1698731 1574446
38056A574446k13878m16065o15653n94988k54630K42746N64047M75584M8252m03077
$$ 1574446 1360568 944503 328850 -266138 -520768 -278022 286025 761609 809861 406784
38046D06784n78583l96451r799K98546L02778O3142o8908J31685L82559K38271
$$ 406784 -171799 -568250 -578049 -279503 23275 86417 17509 149194 531753 770024
38036G70024j71835k07181K91680O01811J46387n37373n08618J90670O20100L12827
$$ 770024 598189 391008 682688 1284499 1430886 893513 384895 575565 1195665 1508492
38026A508492k13545l79892k41678q1718L4924O5265q3771k37129j09614J05818
$$ 1508492 1294947 915055 673377 591659 626583 691848 608077 370948 261334 367152
38016C67152m3773l74755k11948L77679M72232j90723o32735j97481L45314J39091
$$ 367152 323379 -51376 -263324 114355 586587 395864 -236871 -434352 -89038 50053
38006E0053k78868K0394O40517M90131l33940o86111k13511K63359K17932K7615
$$ 50053 -228815 -208421 432096 922227 588287 -97824 -311335 -47976 169956 197571
37996A97571l0176k29582n56607m64228J39949N53829L41743m3444r0572N4477
$$ 197571 167395 -62187 -618794 -1083022 -943073 -389244 -47501 -90945 -181517 -127040
37986a27040J15049K23985M65212M88761R4356k95922k40760M7718R1393j27789
$$ -127040 -11991 211994 677206 1165967 1260323 964401 723641 771359 862752 734963
37976G34963k63359j83615p2990q9106j77779j57604R2291M19123M51083R5677
$$ 734963 471604 287989 214999 125893 -51886 -209490 -117199 301924 753007 848684
37966H48684j96435n7407J30939k04648p60937o46629K10435P97166M27506l47726
$$ 848684 652249 594842 725781 521133 -239804 -886433 -675998 121168 548674 200948
37956B00948o30572l02006J84077N23900N78891J99561m09746n75954J7758P06848
$$ 200948 -429624 -731630 -547553 -23653 555238 754799 345053 -230901 -213143 493705
37946D93705O10301j81906p16039l91832L69015P09933L15462k95029l91447Q3597
$$ 493705 1104006 922100 206061 -185771 183244 893177 1208639 913610 522163 605760
37936F05760M08673K2019o75883q46842l39807K56031N46200O34787N28505M0738
$$ 605760 1014433 1036452 360569 -486273 -826080 -570049 -23849 610938 1139443 1180181
37926A180181n68481o62459j96741J46956O7663M4246K71812J63937m80605p62116
$$ 1180181 611700 -50759 -247500 -100544 -32881 11365 283177 447114 -33491 -795607
37916g95607r968R32970Q04722k02581p52606k79069M57810O63055M09226J46623
$$ -795607 -805575 127395 932117 729536 -23070 -302139 155671 818726 1227952 1374575
37906A374575P8899J94142L48659K22705l26221q60323q03996k69426P5444m1880
$$ 1374575 1453474 1647616 1996275 2218980 1892759 1032436 228440 -40986 34458 -7422
37896g422k16824r0237J68546K39599R5892q0560j24844M1495L10104L69144O3615
$$ -7422 -224246 -314483 -145937 93662 189554 108994 -15850 25645 335749 704893 768508
37885G68508k97432l17559j01977p2219k54147k22703J82596N37887M22148O661
$$ 768508 471076 153517 51540 -20679 -274826 -497529 -314933 222954 645102 651763
37875F51763j82045N7950L58821K42844k29901m28033M5575O63571N54177k12292
$$ 651763 469718 527668 886489 1129333 899432 471399 516974 1180545 1734722 1522430
37865A522430n80869m9553M87858P2316p78230p97159J09287P47622M22575k17411
$$ 1522430 941561 892008 1379866 1452182 673952 -123207 -13920 733702 1156277 938866
37855I38866l73180j88210j63321k29525n6079J89340O5321l59752n21050j45843
$$ 938866 565686 377476 214155 -15370 -71449 117891 183212 -176540 -697590 -843433
37845h43433L70700M63341N3196l89831l81887L4796L65018L04651J18601J78990
$$ -843433 -472733 -9392 43804 -346027 -727914 -693118 -328100 -23449 95152 274142
37835B74142L39026J54889l60460o75228m86480q6728J51538K39381L18455L29038
$$ 274142 613168 768057 407597 -267631 -754111 -840839 -689301 -449920 -131465 197573
37825A97573K00038O2944M785j15752l31955l42424K7820L94360K81786j32578
$$ 197573 397611 460555 465340 349588 17633 -324791 -296971 97389 379175 246597
37815B46597k42543N4362J95236j27743m14832j09255M74481N29485n4455m79885
$$ 246597 4054 58416 253652 125909 -288923 -398178 76303 605788 551333 71448
37805G1448j64447M51395N71118J27146k92528l70813l25995k96630r1650K84380
$$ 71448 -92999 358396 929514 1056660 764132 393319 67324 -229306 -320956 -36576
37795c6576M33086J98571L304J42422K04007k45906p62255n42553K81714O80645
$$ -36576 396510 595081 598385 740807 944814 698908 -63347 -605900 -324186 356459
37785C56459J93247l97607k46048L32895M44504J8834j65643J93246M02611r0057
$$ 356459 549706 152099 -93949 238946 683450 702284 536641 729887 1132498 1042441
37775A042441p16261n82305J41204M42109J3285l14280L7449M33113R3930n53418
$$ 1042441 326180 -256125 -114921 327188 340473 26193 63642 496755 590685 37267
37765C7267n17075J62098N05800J87189p1370J47672K84836q7287m54899k96583
$$ 37267 -479808 -317710 188090 375279 303909 451581 736417 649130 194231 -102352
37755a02352j8430k01160n54975m44476L2695L23513L96238N95239P93957N49627
$$ -102352 -120782 -321942 -876917 -1321393 -1288698 -965185 -568947 26292 820249 1369876
37745A369876k9505l58391k63224j11386j18223j61668j97794k41438p1610L97760
$$ 1369876 1340371 981980 718756 607370 489147 327479 129685 -111753 -183363 214397
37735B14397O50055K11394m36289m44916N6329J90316j67175k39275J88811L58159
$$ 214397 864452 1075846 639557 194641 250970 441286 274111 34836 223647 581806
37725E81806o1907l28326N0706M09160Q3003m37617l75068O2325J92917N6824
$$ 581806 519899 191573 242279 651439 734442 296825 -78243 -15918 176999 233823
37715B33823J38123L21498J04977l80496m79513o2169L24030L42267K11057J25118
$$ 233823 371946 693444 798421 417925 -61588 -123757 200273 542540 753597 878715
37705H78715l8747l18438m67788l14097P455K47787K54075L2759k04166j82917
$$ 878715 839968 521530 53742 -260355 -252900 -5113 248962 281721 77555 -105362
37695a05362P3539K45533K13950J96338K10768o3226n64566o31713l4847M25613
$$ -105362 -31823 213710 427660 623998 834766 771540 206974 -424739 -459586 -33973
37685c3973Q3193m48165k28707M25020M61884j15621k74427K79778O58340L24675
$$ -33973 49220 -398945 -627652 -202632 259252 143631 -130796 148982 807322 1131997
37675A131997j44034k11913j86952l67376l94742m5708K23075J16559M1420K16924
$$ 1131997 987963 776050 589098 221722 -173020 -218728 4347 120906 162326 379250
37665C79250J48910l20560l96834L35198Q71956K20126q77093r60701r0852L78218
$$ 379250 528160 207600 -189234 145964 1017920 1238046 360953 -599748 -690600 -312382
37655c12382J3371k20747K03175N22659J18339m23144l40897J25695K93888Q2466
$$ -312382 -299011 -519758 -316583 206076 324415 -98729 -439626 -313931 -20043 62423
37645F2423j58680l23179m35416k98650J59191N24492M13259P1852j7220J28615
$$ 62423 -96257 -419436 -854852 -1153502 -994311 -469819 -56560 15292 -1928 126687
37635A26687J39937k3820n2217J41160K78982J73510k9920j18503p1230P544M5046
$$ 126687 266624 242804 190587 331747 610729 784239 754319 635816 564586 572130 617176
37624F17176L2970j3034r1082k03327k81480j95485M2072J72108O337k15754p7978
$$ 617176 650146 637112 546030 342703 61223 -134262 -92190 79918 86255 -129499 -207477
37613b07477L98629O99031M49247j39878n40562m32196M8883M04431K00285l93135
$$ -207477 191152 890183 1339430 1199552 658990 226794 275677 680108 880393 487258
37603D87258o71039k96214J70242J06785j66319M1777N07688L77555l24160o00560
$$ 487258 -183781 -479995 -309753 -202968 -369287 -327510 180178 557733 233573 -366987
37593c66987r9325L24240Q1628k34648l0043K56059Q5834j50545N2371L13282
$$ -366987 -466312 -142072 -60444 -295092 -325135 -69076 16758 -133787 -81416 231866
37583B31866J38796p9382J24352K42188k71086p16400j55699Q46051R56501J93571
$$ 231866 370662 291280 415632 657820 386734 -329666 -485365 360686 1317187 1510758
37573A510758k30193J8015R4377k33968j91809L17127K77110n91040j046712k37980
$$ 1510758 1280565 1298580 1392957 1158989 967180 1284307 1561417 970377 -76335 -314315
37563c14315Q53049Q55880n2786o56487m49402M5329K42978K9875l49979m50058
$$ -314315 538734 1394614 1341828 685341 235939 281268 524246 554121 204142 -245916
37553b45916k0634M81212L36131k90286m43168J00053M02178m9151m19510M5282
$$ -245916 -266550 214662 550793 260507 -182661 -82608 319570 270419 -149091 -103809
37543a03809P07579O48348J79723P9323Q1164n09313j221267r32986K04371Q08987
$$ -103809 603770 1252118 1431841 1511164 1592328 1083015 -138252 -1071238 -866867 -57880
37533e7880L37623k10490K5005N60799N68690J24978j85869k32087k45638k29533
$$ -57880 279743 69253 94258 655057 1223747 1348725 1162856 930769 685131 455598
37523D55598n3029J30943N7503k03739l32563j87107J09040L95128N50840M36551
$$ 455598 402569 533512 591015 387276 54713 -132394 -23354 371774 922614 1359165
37513A359165P067n04113p03400m35242J1944K01611M9850q8426R2952M16146
$$ 1359165 1366232 862119 158719 -276523 -264579 -62968 -13118 -101544 -8592 407554
37503D07554M58425J34683k24122l56593l35627k93097j80546O2400L27225M48687
$$ 407554 865979 1000662 776540 419947 84320 -208777 -389323 -326923 302 448989
37493D48989L39716q906m58606o79120m50564J3159L32593M61298N40810M25965
$$ 448989 788705 779799 321193 -357927 -808491 -795332 -462739 -1441 539369 965334
37483I65334o5089n31137l71863J69992K16188k99539l71503M31607J059179N09578
$$ 965334 900245 369108 -2755 167237 383425 83886 -287617 143990 1203169 1712747
37473A712747n53189p51047l1300L90904o5533o19370m42224K11228N53486L36069
$$ 1712747 1159558 408511 377211 768115 702582 83212 -359012 -147784 405702 741771
37463G41771m3443j79706n7001R1514J18767R9280J23906P0026k02160m77799
$$ 741771 698328 518622 461621 553135 671902 771182 895088 965114 762954 285155
37453B85155l86781l1146M0597l41050o40950l89584J73213N48702O37070N76658
$$ 285155 -101626 -132772 -92175 -433225 -1074175 -1463759 -1290546 -741844 -104774 471884
37443D71884L48240l1860k77324k09980o4969o2640l3675J65520K73023Q8437
$$ 471884 820124 788264 510940 300960 235991 173351 139676 305196 578219 666656
37433F66656p7553R2962L24628J73915k24924l62419j24256R3254n1319m54217
$$ 666656 589103 682065 1006693 1180608 955684 593265 469009 562263 510944 56727
37423E6727o54454k34664O30158J090892N66457l26431n03116p329J26589l04360
$$ 56727 -597727 -832391 -202233 888659 1455116 1128685 625569 618240 744829 440469
37413D40469k87783N19750R33206J30786q76190q14123j02230P2846k73974l16633
$$ 440469 152686 672436 1605642 1736428 860238 46115 -56115 16731 -257243 -573876
37403e73876n6854p2269j61506K47465P26474L99181l96133m97123J73849N69504
$$ -573876 -630730 -702999 -864505 -617040 109434 508615 112482 -384641 -210792 358712
37393C58712L32062J65168L19758J77760m02367o72323k84411J75058K81293L22874
$$ 358712 690774 855942 1175700 1353460 951093 278770 -5641 169417 450710 773584
37383G73584M45745K77537k52931o33579n84575l44707l6853L78660N16274m9698
$$ 773584 1219329 1496866 1243935 610356 25781 -318926 -355779 22881 539155 489457
37373D89457p86676o94568J34272N99674L28895Q0411K46182K84447l1827j23980
$$ 489457 -297219 -991787 -857515 -257841 71054 151465 397647 682094 650267 526287
37363E26287J92117K69422j23780l43070j45234j63913n54616m89628K88696P33237
$$ 526287 718404 987826 864046 520976 375742 211829 -342787 -832415 -543719 189518
37353A89518J93801l89252l5256O43585N40580j23532l31834L5868K55725O5551
$$ 189518 383319 -5933 -41189 602396 1142976 1019444 687610 723478 979203 1044754
37343A044754j62675k51531l03579k14538J26660M10580L33474J43711J84849
$$ 1044754 882079 630548 326969 112431 239091 649671 983145 1126856 1311705
37334A311705K75488J16623j06658j15785r3512k58774l42141j00120J05617j01340
$$ 1311705 1587193 1703816 1597158 1481373 1387861 1129087 786946 686826 792443 691103
37324F91103l75191j96266K19905K81001p787j43123n755L1104j93627l73029
$$ 691103 315912 119646 339551 620552 612765 469642 463887 494991 301364 -71665
37314g1665k06575K20748N35541L99056j38160n61203m42563m7460L8484j70849
$$ -71665 -278240 -57492 478049 877105 738945 177742 -264821 -312281 -273797 -444646
37304d44646j35745K18292L69578J78543J18160K96485K05792j93536j63554M96866
$$ -444646 -580391 -362099 7479 186022 304182 600667 806459 612923 449369 946235
37294I46235Q45307K27404o10098o82541k25023n3510j67958j1033L78937M61488
$$ 946235 1791542 2018946 1408848 726307 501284 447774 279816 268783 647720 1109208
37284A109208J31622k46174m63005m73161j43801L94964N86786K28598r6933L5426
$$ 1109208 1240830 994656 531651 58490 -85311 309653 896439 1125037 1028104 1063530
37274A063530J48331k30651o02020l22976K03603J69962k83682l90241o5645J32706
$$ 1063530 1211861 981210 379190 56214 259817 429779 146097 -244144 -309789 -177083
37264a77083R1498J78720L67242K70285m7297j51646m9255j32264m11374n21552
$$ -177083 -85585 93135 460377 730662 683365 531719 482464 350200 -61174 -582726
37254e82726l64289q9221L35156Q50006R20462K16989n98875o18299J9644M27138
$$ -582726 -947015 -1036236 -701080 148926 1069388 1286377 687502 69203 88847 515985
37244E15985L14068J16784j246k66257n07950k72233K60556M14357J17454m9838
$$ 515985 830053 946837 945591 679334 171384 -100849 159707 574064 691518 641680
37234F41680N4888l7193l73995l69790J13269L89712L0508m62430m66502q0077
$$ 641680 696568 659375 285380 -84410 28859 418571 449079 -13351 -479853 -559930
37224e59930K15481J95703r0058m38778m39189J55732Q45397P92536Q875n50249
$$ -559930 -344449 -148746 -238804 -677582 -1116771 -961039 -115642 676894 685769 135520
37214A35520l48484M701j69505n04938k22924N63623R36936M57882k61811l92809
$$ 135520 -212964 -208263 -377768 -882706 -1105630 -542007 394929 852811 591000 198191
37204A98191J05964N51517M56078J14195J34067N34327O83516K49919k28001q6152
$$ 198191 304155 855672 1311750 1425945 1560012 2094339 2777855 3027774 2799773 2713621
37194B713621N28021J018042J352772J944563K547615K164287M21977j618135
$$ 2713621 3241642 4259684 5612456 7557019 10104634 12268921 12690898 11072763
37186A1072763k570634k242676j519025j052190p20908l11817l7929j10654k86807
$$ 11072763 8502129 6259453 4740428 3688238 2967330 2655513 2617584 2506930 2220123
37177B220123k57319j85978l83084o29957m26535R8355K15274k49331n03444K12
$$ 2220123 1962804 1776826 1393742 763785 337250 435605 650879 401548 -101896 -101684
37167a01684O23335N12107o8071k68563q1283j38938l71980j34474L68843J84701
$$ -101684 521651 1033758 965687 697124 615841 476903 104923 -29551 339292 523993
37157E23993n93515n85961O82934J699139J035600n64008j325314q64264k32907
$$ 523993 -69522 -655483 27451 1726590 2762190 2198182 872868 8604 -224303
37148b24303p4259j7053K44788L96419J71536j83775k95983p9396K55792L49323
$$ -224303 -298562 -315615 -70827 325592 497128 313353 17370 -62026 193766 543089
37138E43089J6545l78882k52046K89879M29428j28117n95994l09560K18714J68290
$$ 543089 559634 180752 -71294 218585 648013 519896 -76098 -385658 -166944 1346
37128A346k79639l48018P5033M39730M80345L65040J56783j54206l10923j24300
$$ 1346 -278293 -626311 -551278 -111548 368797 733837 890620 736414 425491 301191
37118C01191J04472N9928l4117J02296K09853N887j89394m3195Q2750k03873m80426
$$ 301191 405663 465591 431474 533770 743623 749510 560116 516921 599671 395798 -84628
37107h4628k21960J43113p7975n06290k07590O67747R60175K47963n62113n84913
$$ -84628 -306588 -163475 -241450 -747740 -955330 -287583 672592 920555 358442 -226471
37097b26471p894M54790M52996J09976k34878k46294P0769K84718J14161j24757
$$ -226471 -234365 220425 673421 783397 548519 302225 372994 657712 771873 647116
37087F47116l7143K12180K53103J25843J9814j59094l78794j77466N11750Q12950
$$ 647116 609973 822153 1075256 1201099 1220913 1061819 683025 505559 1017309 1830259
37077A830259Q5498q72628q47313j9334M03670Q9716j32089J69125M22291K03244
$$ 1830259 1915757 1043129 195816 176482 580152 669868 537779 706904 1129195 1332439
37067A332439q6024k7869J53511R4169j62987l80206m25434k52583L6599J57026
$$ 1332439 1246415 1218546 1372057 1466226 1303239 923033 497599 245016 281615 438641
37057D38641K4756l0214J75127K71697n103k29333j1884J99805j20917n01963
$$ 438641 463397 433183 608310 880007 874904 645571 633687 833492 712575 210612
37047B10612j55634N99972P04807O223n27461k81730K64238M16767J14181k71805
$$ 210612 54978 654950 1359757 1365980 838519 556789 821027 1237794 1351975 1080170
37037A080170m07579j85331J59036K06337n6662j28062J91840L94821J22672k13171
$$ 1080170 672591 487260 646296 852633 795971 667909 859749 1254570 1377242 1164071
37027A164071k22016k00995l58679k29843L30492N13966r4100n34501l4687M80781
$$ 1164071 942055 741060 382381 152538 483030 996996 902896 368395 333708 814489
37017H14489r0271r56631o47056M40851O64788j24259m89580P9639N32703K62711
$$ 814489 724218 -232413 -879469 -438618 226170 101911 -387669 -308030 224673 487384
37007D87384o2453K9592J16508l186Q4132L67560K62389k45287m84669k74800
$$ 487384 424931 454523 571031 567845 651977 1019537 1281926 1036639 551970 277170
36997B77170q1863j258K45222M03224L9201l75950j03717L80194P8549n93358
$$ 277170 195307 194049 439271 842495 881696 505746 402029 782223 860772 267414
36987B67414l36622O58328Q03285k55253j034097o30122J11882L62604M63430
$$ 267414 -69208 589120 1392405 1137152 103055 -527067 -415185 -52581 410849
36978D10849O79977M70908k42290n53729o8346L98809K56752j0110O937o4081
$$ 410849 1090826 1561734 1319444 765715 697369 1096178 1352930 1342820 1349757 1285676
36968A285676l63242l53316O1515K03205j08189k02183Q9192N7067m44521n67073
$$ 1285676 922434 569118 630633 833838 725649 523466 612658 669725 225204 -341869
36958c41869q995L83181J35743p8405J96189L84765J01765q2424K01267L64442
$$ -341869 -350864 32317 168060 89655 285844 670609 772374 689950 891217 1255659
36948A255659m2206n27632n68623l50809j28527J90224M69804L54496P6144J94804
$$ 1255659 1213453 685821 117198 -233611 -362138 -171914 297890 652386 728530 923334
36938I23334M47141P8127o42502o44259J16552N61230L41040J87579K72573n0497
$$ 923334 1370475 1448602 806100 161841 278393 839623 1180663 1368242 1640815 1590318
36928A590318o32968m76843L52892N83268r1600n26525k40639j07623m42114l68896
$$ 1590318 957350 480507 833399 1416667 1325067 798542 557903 450280 8166 -360730
36918c60730L03682N51013J09324O49M43125L21941n41045p81286l345L52110
$$ -360730 -57048 493965 603289 603938 1047063 1369004 827959 46673 43328 395438
36908C95438l48559p14253O2431O69652J43397l43465K53685Q70386L55402m03992
$$ 395438 46879 -667374 -604943 64709 208106 -135359 118326 988712 1344114 940122
36898I40122j86281M15558L51879Q6496M09255O73049K4478p88573n59356L99447
$$ 940122 753841 1169399 1521278 1607774 2017029 2690078 2714556 1925983 1366627 1766074
36888A766074R11463O84744J70604l91631p43221m32543K48592K85372l89770
$$ 1766074 2677537 3362281 3532885 3141254 2398033 1965490 2214082 2499454 2109684
36879B109684n93964Q3638N30857R2047m15964m17520m75935p03396k46657Q00311
$$ 2109684 1515720 1599358 2130215 2222262 1806298 1388778 912843 209447 -37210 763101
36869G63101J047303K36371j86612K21273R9545q31848q61660M43983R79303k42947
$$ 763101 1810404 2046775 1860163 2081436 2180981 1349133 487473 931456 1910759 1667812
36859A667812j111692r0352J018393L28680q14956m26791O17356M67303l58629
$$ 1667812 556120 465768 1484161 1812841 997885 571094 1188450 1655753 1297124
36850A297124l00285L19837L20265L1346K32822K80734m53982q91829j40672O17497
$$ 1297124 996839 1316676 1636941 1668287 1901109 2181843 1727861 836032 695360 1312857
36840A312857K22325l13840J50947O44990O7080n68808j05928N23489K43249n8379
$$ 1312857 1535182 1221342 1372289 2017279 2084359 1515551 1409623 1933112 2176361 2117982
36830B117982M39493N65155m62357j051910l8712R19364K37481p34354l25914
$$ 2117982 2557475 3122630 2660273 1608363 1569651 2489015 2726496 1992142 1666228
36821A666228M44659J31140l60442P7146L70365l20579n08414O54237J246375
$$ 1666228 2110887 2242027 1881585 1958731 2329096 2008517 1500103 2154340 3400715
36812C400715J17521o69420K31253O60213p65854j485690K97267J781953M99821
$$ 3400715 3518236 2848816 3080069 3740282 2974428 1488738 1786005 3567958 4067779
36803D067779j006117R5112J594110N24546j184551n39182Q50018K85946o08925
$$ 4067779 3061662 3156774 4750884 5275430 4090879 3551697 4401715 4687661 4078736
36794D078736N18028J615088K87060j043005K37095J515666J23755r77556R38593
$$ 4078736 4596764 6211852 6498912 5455907 5693002 7208668 7332423 6354867 7293460
36785G293460K287600Q09j632197J167240L636173J269507o77935L159720P043891
$$ 7293460 9581060 9581869 7949672 9116912 12753085 14022592 13344657 16504377 23548268
36776B3548268M624890K130219O923934J2110807R527841Q126310J8391663K9208844
$$ 23548268 28173158 30303377 37227311 49338118 58865959 66992269 85383932 114592776
36768A14592776K8118217L4817118P4989825J20326528J02274610N165752r5663637
$$ 114592776 142710993 177528111 252517936 372844464 475119074 480284826 384621189
36761C84621189j20183919p7089037l5346193k8286444l0993306k0356673q182890
$$ 384621189 264437270 187348233 152002040 123715596 92722290 72365617 64182727
36754F4182727q494239j1717104o760471j189479l850743p808245m739273j81226
$$ 64182727 55688488 43971384 37210913 36021434 32170691 24362446 19623173 19441947
36746A9441947j605268m593836k618130O43196m59656k636161r34870J439945
$$ 19441947 17836679 13242843 10624713 11267909 10808253 8172092 7237222 8677167
36738H677167j66407k681952j438616J028101L24227j522447o69850R65841q9712
$$ 8677167 8510760 5828808 4390192 5418293 5742520 4220073 3550223 4516064 4426352
36729D426352j872756r53464R11992M47652q36090j9244J333519M56689r94299
$$ 4426352 2553596 1600132 2512124 2959776 2123686 2104442 3437961 3894650 2900351
36720B900351k31794J101571J74481j371025m91779J377112R96898o07008j84939
$$ 2900351 2668557 3770128 3944609 2573584 2081805 3458917 4455815 3848807 3663868
36711C663868J671688J785650J37015o20204j48431l07183j041015o86504M11737
$$ 3663868 5335556 7121206 7258221 6638017 6489586 6182403 5141388 4454884 4866621
36702D866621N24440K4567N96123J736825J598833O19645Q50385K214484K793244
$$ 4866621 5391061 5415628 6011751 7748576 9347409 9967054 10817439 13031923 15825167
36693A5825167K475907L070438M802379N617828M205713J373344j657606m243828
$$ 15825167 18301074 21371512 26173891 31791719 35997432 37370776 35713170 31469342
36685C1469342n640078n267003l786630k516978j925718j733166j833313j988127
$$ 31469342 25829264 20562261 16775631 14258653 12332935 10599769 8766456 6778329
36677F778329j509993m40750n509p00180j189811m32273N19906L61725k80543
$$ 6778329 5268336 4827586 4822077 4121897 2932086 2499813 3019719 3381444 3100901
36668C100901k25799J12186j73458n35851j04209M16597j0414o91056m23320K24478
$$ 3100901 2875102 2987288 2813830 2277979 2173770 2590367 2579953 1888897 1465577 1690055
36658A690055k2852o95762m02591N65447O73001k10026o88365j97638L84278M26814
$$ 1690055 1667203 971441 568850 1134297 1807298 1597272 908907 711269 1095547 1522361
36648A522361K33891P3535j07979r3239L21060O69099M59100N3263n2259j79124
$$ 1522361 1756252 1829787 1721808 1628569 1949629 2618728 3077828 3131091 3078832 2899708
36638B899708o47071p98729q5755O51384L61144m65042o39722k25734j37708l60047
$$ 2899708 2252637 1453908 1368153 2019537 2380681 1915639 1275917 1050183 912475 552428
36628E52428j32957M55819N80591J61522j17883r1804j78662l68698k90691o3193
$$ 552428 419471 875290 1455881 1617403 1499520 1407716 1229054 860356 569665 506472
36618E06472k5090N8946M73415O60001J1521q46450q14931m8668L43564Q6375
$$ 506472 481382 540328 1013743 1673744 1685265 838815 23884 -24784 318780 405155
36608D05155p2825J62379K80101J20251J68629N15925O27229M08157M78111J006368
$$ 405155 332330 494709 774810 895061 1063690 1579615 2206844 2615001 3093112 4099480
36598D099480J240721Q43307R59731K912517N837635O627419L127793k814333
$$ 4099480 5340201 6183508 7143239 10055756 15893391 22520810 25648603 22834270
36590B2834270o626404n852917k729127j010812j353003j551328n99281K1166
$$ 22834270 16207866 10354949 7625822 6615010 5262007 3710679 3111398 3132564
36582C132564o57906j330793p58667J76323J90018k69062j61019K14869N8548
$$ 3132564 2474658 1143865 385198 561521 751539 482477 321458 536327 594875
36573E94875k47170P0090N53369K87464l82784m20778J42252M12040J52408j53925
$$ 594875 347705 417795 971164 1258628 875844 455066 597318 1009358 1161766 1007841
36563A007841l23778m15153j65804M25978N92347j4112l85475L06166J058144
$$ 1007841 684063 268910 103106 529084 1121431 1107319 721844 1028010 2086154
36554B086154M73382q36390j057187J2535P88209M42133j60906k37527j40990
$$ 2086154 2559536 1723146 665959 678494 1466703 1908836 1747930 1510403 1369413
36545A369413k36308j52793K76990M88696J92435j8108L47480P93882N21468m48324
$$ 1369413 1133105 980312 1257302 1745998 1938433 1920325 2267805 3061687 3583155 3134831
36535C134831j266549j174441k62082N63101M50699m05727r46640o06563J2746
$$ 3134831 1868282 693841 431759 994860 1445559 1039832 93192 -513371 -500625
36526e00625J81572Q9477K38615M35019K18869j89458k69087j48815k80623m80650
$$ -500625 -319053 -229576 9039 444058 662927 473469 204382 55567 -225056 -705706
36516g05706k24059L25466M95693J80409j13104j73863k22626k34545M8577M51122
$$ -705706 -929765 -604299 -108606 71803 -41301 -215164 -437790 -672335 -623758 -172636
36506a72636M80844J47432k1323J73133L53743K26432n2116k29146k52594j88932
$$ -172636 308208 455640 434317 607450 961193 1187625 1135509 906363 653769 464837
36496D64837j52820k41203l14280q4038L44240M13260o7040m97910l31278J20863
$$ 464837 312017 70814 -243466 -327504 16736 429996 362956 -134954 -466232 -345369
36486c45369K27646l0850k24256j90145m8093J70517M03259L89230O5564k04912
$$ -345369 -117723 -148573 -372829 -562974 -611067 -440550 -37291 351939 417503 212591
36476B12591j61569J3509J68182M17189O00342K43666n19571q18094l58569L2759
$$ 212591 51022 64531 232713 649902 1250244 1493910 974339 156245 -202324 -169565
36466a69565j80519l13517K07756O40272J96860m12013r3428O91018O36249k15871
$$ -169565 -350084 -663601 -455845 184427 381287 -30726 -124154 566864 1203113 987242
36456I87242n94122j34883J72490j95474m76293l1100N92096N75087K368m23973
$$ 987242 393120 258237 430727 235253 -241040 -272140 319956 895043 897411 473438
36446D73438l37114K9494K41404J11860j16685p2636J84994K07212r2950k33901
$$ 473438 136324 165818 407222 519082 402397 329761 514755 721967 629017 395116
36436C95116r381Q3071k73188n51752k24539L38668M96099K87648O3109k32385
$$ 395116 385735 468806 195618 -356134 -580673 -242005 254094 541742 604851 372466
36426C72466o28373o15316O0287O75240N35069J19354K14943M91193J18469o41935
$$ 372466 -255907 -871223 -810936 -135696 399373 518727 733670 1224863 1343332 701397
36416G01397p51595p6601M67220L79170Q1184l3663o9211j12744j00096j69919
$$ 701397 -50198 -126799 340421 719591 800775 767112 697901 585157 485061 315142
36406C15142m18289m67399k5919M05165K24044k12167j73855J30127o6606o17670
$$ 315142 -103147 -570546 -596465 -191300 32744 -179423 -353278 -223151 -289757 -907427
36396i07427n80815K05327Q15908O67533K36216J11918K02382J64149l8968k41212
$$ -907427 -1488242 -1282915 -467007 200526 436742 548660 751042 915191 876223 635011
36386F35011k75972l2097L03993K44967l08252o94193l62296K60541M11630R9799
$$ 635011 359039 326942 630935 875902 567650 -126543 -488839 -228298 183332 283131
36376B83131j23195q4551M5006K75863N43008M02545k43014o55733l14742J61010
$$ 283131 159936 75385 120391 396254 939262 1341807 1098793 443060 128318 289328
36366B89328L6011l01406j53710J74569O8597j24324J63575M17028o5019o54580
$$ 289328 325339 23933 -129777 44792 113389 -10935 152640 569668 504649 -149931
36356a49931l94214J35429k26572r31405m53460R59538J456482N40282l12905
$$ -149931 -544145 -408716 -635288 -1566693 -2020153 -1060615 395867 936149 623244
36347F23244k60199j68227n59395n60604K71207Q98259N40688p5944j38547j2494
$$ 623244 363045 194818 -364577 -925181 -653974 244285 784973 709029 570482 557988
36337E57988j85887k57898Q4236K43618k20490p22957o51232k82129k2322K80853
$$ 557988 372101 114203 198439 442057 221567 -501390 -1152622 -1434751 -1457073 -1176220
36327a176220O31215N08264j43855n40548k85429J7692o0008o1413K99081M92171
$$ -1176220 -545005 -36741 -180596 -721144 -1006573 -988881 -1048889 -1110302 -811221 -319050
36317c19050K47233J43162M29017M05397k47266o83219l03789J65571l2259l73699
$$ -319050 -71817 71345 500362 905759 658493 -24726 -328515 -162944 -195203 -568902
36307e68902p7409N01883N77331K22621n1232k54719m95979l64630K90929P19132
$$ -568902 -646311 -144428 432903 655524 604292 349573 -146406 -511036 -220107 499025
36297D99025L73716p8899J37162N49653K81321m20687o55013l29536l8599N5126
$$ 499025 872741 793842 931004 1480657 1761978 1341291 686278 356742 318143 373269
36287C73269J45369M2202m17954o49713j08069N82167M31200k89043m23825K27486
$$ 373269 518638 560840 142886 -506827 -614896 -32729 398471 109428 -314397 -86911
36277h6911O71065L38272j98614l33508k56183l31970m21662k22693K00070N22730
$$ -86911 584154 922426 723812 390304 134121 -197849 -619511 -842204 -642134 -119404
36267a19404N09422J47205l21600n30560l76407j39128k0815J35411M00423M54651
$$ -119404 390018 537223 215623 -314937 -691344 -830472 -851287 -715876 -315453 139198
36257A39198J34336j54418p0173N8920j34983k78661J22559O38171M06971m56382
$$ 139198 273534 119116 48943 107863 -27120 -305781 -183222 454949 861920 405538
36247D05538q91294m10341K83188M47019K79904L02642L81259J7886o61697q76575
$$ 405538 -485756 -896097 -612909 -165890 114014 416656 797915 815801 154104 -722471
36237g22471k36954O37670Q36583K73824k73930k08310K21048M40732L33627J42701
$$ -722471 -959425 -321755 514828 788652 514722 306412 527460 968192 1301819 1444520
36227A444520p0499l75121n80145m28310p8069J04512J16777J70908J55551j28982
$$ 1444520 1374021 998900 418755 -9555 -87624 16888 133665 304573 460124 331142
36217C31142l76704j67057J89304O9298k81606l1749O98374P64781j79150r56009
$$ 331142 -45562 -212619 -23315 45983 -235623 -267372 431002 1195783 1016633 60624
36207F0624n72450L61139O79446K80890j45075l26585m55219m93636k60571Q6521
$$ 60624 -511826 -150687 528759 809649 664574 337989 -117230 -610866 -871437 -784916
36197g84916K88222M10075N28866L76241j84360p05254o95339k77865J19366L43539
$$ -784916 -496694 -86619 442247 818488 634128 -71126 -766465 -1044330 -924964 -581425
36187e81425L95730J90605j44689k06306M7799J19760j69994k76639J25318M72584
$$ -581425 -185695 4910 -139779 -346085 -298286 -178526 -348520 -625159 -499841 -27257
36177b7257K20056k15428j51105K61152M03518K16066P8870L5490j21925k94873
$$ -27257 192799 -22629 -173734 87418 490936 707002 785872 821362 699437 404564
36167D04564k86622k68064m00503l42688J86114O94656N20529j09365l71138m6147
$$ 404564 117942 -150122 -550625 -893313 -707199 -12543 507986 398621 27483 -18664
36157a8664K77190J56443j60365j97942J39982M73135L12079l30541p21222k52226
$$ -18664 258526 414969 254604 56662 196644 669779 981858 651317 -69905 -322131
36147c22131N21444M67729l77562o99837N0138P05568K61661m93375l87470J35568
$$ -322131 199313 667042 289480 -410357 -360219 345349 607010 113635 -273835 -138267
36137a38267q1890p48297n71774M50217R10010K29206n32030m31811J17203L40414
$$ -138267 -220157 -968454 -1540228 -1090011 -180001 49205 -482825 -914636 -797433 -457019
36127d57019K22417R1973l1158j50416n7367J83603J40664k35766l87557l3161
$$ -457019 -234602 -142629 -173787 -324203 -381570 -197967 -57303 -293069 -680626 -713787
36117g13787L26492K00407j28003j01419K47306M18233K02590j00869j49840M8167
$$ -713787 -387295 -186888 -314891 -416310 -169004 249229 451819 350950 201110 249277
36107B49277K20262J66684m5696k34684l58944m45327l30991J49128O75561O53757
$$ 249277 469539 636223 590527 355843 -3101 -448428 -779419 -630291 45270 699027
36097F99027J01819k50742p0276M4559l55918o74433k38229M48926M45130n6631
$$ 699027 800846 550104 479828 524387 168469 -505964 -744193 -295267 149863 93232
36087I3232n9958N03529O22544p6712o54619l31638L62843N32478K27390P7678
$$ 93232 33274 536803 1159347 1082635 428016 96378 459221 991699 1219089 1296767
36077A296767J40784o9098n94299q20159l70446K91285M46122N5210k44456o1479
$$ 1296767 1437551 1368453 774154 -46005 -416451 -125166 320956 376166 131710 70231
36067G0231K13655M0040m03529m52066M5449N12600M92728J61426j39313l06982
$$ 70231 283886 323926 -79603 -531669 -486220 26380 519108 680534 541221 234239
36057B34239k38296J80061N77033K91889n57281r33395l22818M18006L19968k87874
$$ 234239 -4057 176004 753037 1044926 487645 -445750 -768568 -350562 -30594 -318468
36047c18468m37420j2807L31881L36893L02119L40144K82333J50830N2735j51001
$$ -318468 -755888 -768695 -436814 -99921 202198 542342 824675 975505 1028240 877239
36037H77239m77671n09429p9848K23198k8643k69582R2548M92515J08628n76349
$$ 877239 399568 -109861 -189709 33489 4846 -264736 -172188 320327 428955 -147394
36027a47394m30822M20427P40139J48291m10735k78168R5875J70509N4001l9669
$$ -147394 -578216 -157789 582350 730641 319906 41738 137613 308122 362123 322454
36017C22454j36300j26422J02856J54866l30525p37019k06065P84545Q98466L6525
$$ 322454 186154 59732 162588 317454 -13071 -750090 -956155 -171610 726856 763381
36007G63381m90630r5420L02720M3223k56767q1428M4415k14890k09795L51907
$$ 763381 272751 177331 480051 523274 266507 185079 229494 14604 -195191 156716
35997A56716N79713l5086m75448J57448R76222O84500k94866n94381j27067O4539
$$ 156716 736429 701343 225895 383343 1359565 2044065 1749199 1154818 1027751 1092290
35987A092290k20198j41051M87813Q00090L64219j94634l59881m28634o76186
$$ 1092290 872092 731041 1218854 2018944 2383163 2188529 1828648 1400014 723828
35978G23828p44269l28204K31278M81910M49762L45983J57080j43585l59852l40660
$$ 723828 -20441 -348645 -117367 364543 814305 1160288 1317368 1173783 813931 473271
35968D73271j99921q2427J5526P4224J148j42345j64455o7510k9670j9142J76770
$$ 473271 273350 190923 206449 280673 281821 139476 -24979 -92489 -122159 -141301 35469
35957C5469M51463L71305j35252n35782m28313q5240J02815K77877O66868Q62930
$$ 35469 486932 858237 722985 187203 -241110 -326350 -223535 54342 721210 1584140
35947A584140L23804n48610p01439L7981N65167L9280r19575j169307n66743J78384
$$ 1584140 1907944 1359334 657895 695876 1261043 1300323 380748 -788559 -1355302 -1176918
35937a176918O48997Q40466N46230l12305r52702n05830M83667N85361l13903
$$ -1176918 -527921 312545 858775 546470 -406232 -912062 -428395 156966 -156937
35928a56937p20219Q6871Q45777L68456n31213m25745M39177P18127J57161k87842
$$ -156937 -877156 -790285 55492 423948 -107265 -533010 -93833 624294 781455 493613
35918D93613j52614J23751K88389M74200M42486j26532o90123m32967K89479L92963
$$ 493613 340999 464750 753139 1227339 1669825 1543293 853170 420203 709682 1102645
35908A102645j15355j88810L22634L56147m14065q84409l92876J69714n4099m73943
$$ 1102645 987290 798480 1121114 1477261 1063196 178787 -214089 -44375 -98474 -572417
35898e72417k16405L58389L95013p075j58084o266m928j73014j70263n089O4846
$$ -572417 -788822 -430433 -35420 -42495 -200579 -206845 -211773 -384787 -555050 -560139 -495293
35887d95293O8461J57993K07284Q9286J5090J31265J74746j9707j20782J09988
$$ -495293 -426832 -268839 -61555 27731 42821 174086 348832 329125 208343 318331
35877C18331L08142J12973j80490j37211Q4849R7878j9542J4896P8881j04011
$$ 318331 626473 739446 558956 421745 506594 604472 584930 599826 678707 574696
35867E74696l89871m43697k97852j85591o0745K39836N57963N62735J95069l05123
$$ 574696 184825 -258872 -556724 -742315 -803060 -563224 -5261 557474 752543 447420
35857D47420o20694m82131P5800N00854K71445k69344l00625J60854K38814k54329
$$ 447420 -173274 -655405 -579605 -78751 192694 -76650 -377275 -216421 22393 -231936
35847b31936l53233M11636J029855N51738l80098o06901k19472n0070j05190J52564
$$ -231936 -585169 -173533 856322 1408060 1027962 421061 201589 151519 46329 198893
35837A98893M60798J24903n31277m97910J97738M67802l1367l94514o1903L17444
$$ 198893 659691 784594 253317 -244593 -46855 420947 389580 -4934 -66837 250607
35827B50607J17172k25304n3403M11257N02207J19324k85393l99906k79989j09845
$$ 250607 367779 142475 89072 500329 1002536 1121860 836467 436561 156572 46727
35817D6727l5455p2194n2476J39385K96905J62757r3981r0061J23409J21326j61999
$$ 46727 11272 -60922 -113398 25987 322892 485649 391668 301607 425016 546342 384343
35806C84343k94668o4735J68092M5774k71062l90033j95688J15108K97219K51802
$$ 384343 89675 24940 193032 238806 -32256 -422289 -617977 -502869 -205650 46152
35796D6152J08979J02136K17340J38178k21008m07785p9761L08899P0029o07212
$$ 46152 155131 257267 474607 612785 391777 -16008 -95769 213130 283159 -324053
35786c24053p95793j25495P09027R03355M55832r3946l71968l52854j73155K116
$$ -324053 -1119846 -1245341 -536314 367041 822873 728927 356959 4105 -169050 -166934
35776a66934J10623K54542M55543M61428J09667k74482k76614m2027l236j00995
$$ -166934 -56311 198231 653774 1115202 1224869 950387 673773 631746 628510 527515
35766E27515O8840L96340L17080j83304m31728j66851L4959j86468k94578J82464
$$ 527515 596355 992695 1309775 1126471 694743 527892 562851 376383 81805 264269
35756B64269O88268M09241m22887q13960m03831J61307K32930r6206l48956k64253
$$ 264269 952537 1361778 938891 124931 -278900 -117593 115337 19131 -329825 -594078
35746e94078J10860N56670P55568N15165N3815j61952J7338K23181O2930l61019
$$ -594078 -483218 73452 829020 1344185 1398000 1236048 1253386 1476567 1539497 1178478
35736A178478n99473m24652o3014J33184Q4859k2697m8130n1198j33549k44874
$$ 1178478 579005 154353 91339 224523 309382 286685 238555 187357 53808 -191066
35726a91066k30859l0336K35258L54195K02435j12341k90666j31263K05082L56154
$$ -191066 -421925 -452261 -217003 137192 339627 227286 -63380 -194643 10439 366593
35716C66593K11822L1149L5499R1137n0194l57632n52379m38286o9178L16990
$$ 366593 578415 609564 645063 736200 686006 328374 -224005 -662291 -731469 -414479
35706d14479M44377K24488q5008j33458M5993Q5131j01537j36194J64966L89718
$$ -414479 29898 254386 169378 35920 81913 167044 65507 -70687 94279 483997
35696D83997J72743j49937n8688K63444J91660l22370o42921l91931Q2413K99303
$$ 483997 656740 506803 448115 711559 903219 580849 -62072 -454003 -371590 -72287
35686g2287K10985J8312j49108j93113m5118J47424J46777J7369L7032J65695
$$ -72287 138698 157010 7902 -185211 -230329 -82905 63872 81241 118273 283968
35676B83968N8429k73018l42970M769K08473j68803o51999m85364K20399O20825
$$ 283968 342397 69379 -273591 -268822 -60349 -229152 -881151 -1366515 -1146116 -525291
35666e25291L51217l6310J1681K69916K11456j35962k78586l5348K30619J75549
$$ -525291 -174074 -210384 -198703 71213 282669 146707 -131879 -167227 63392 238941
35656B38941j05533l26427l62157k01883J56001N40696O02370K52621j07510j17175
$$ 238941 133408 -193019 -555176 -757059 -601058 -60362 542008 794629 687119 569944
35646E69944J0009j19915l71042l00581L1127J17365j10105j45243J77166L31883
$$ 569944 579953 460038 88996 -211585 -180458 -63093 -173198 -318441 -141275 190608
35636A90608q288l83619k94004K5351R3200k7025J0008J63456J77495J15627J74671
$$ 190608 182320 -201299 -495303 -469952 -376752 -403777 -393769 -230313 -52818 62809 237480
35625B37480K29726P9136j20428j52659j69472l13154k73452J80359N83674L85373
$$ 237480 467206 546342 425914 273255 103783 -209371 -482823 -302464 281210 666583
35615F66583j27668k51627M7847K46287K20973K53830K56539q9293n11774m20379
$$ 666583 538915 287288 335135 581422 802395 1056225 1312764 1223471 711697 291318
35605B91318K2373Q3428k48180k07303L50757O07628J68242k86083k03812k256
$$ 291318 313691 397119 148939 -58364 292393 900021 1068263 782180 578368 576112
35595E76112j12202j55810J88779L73160j07922o96834n84937M959K64110Q5916
$$ 576112 463910 308100 496879 870039 762117 65283 -519654 -514695 -250585 -164669
35585a64669k0281K2281j54304m81082m44262M8220N21762O62703N61787K73975
$$ -164669 -184950 -162669 -316973 -798055 -1242317 -1194097 -672335 -9632 552155 826130
35575H26130k21448o30818n50697j07609J79225J98342L15104N88442N60420J8940
$$ 826130 604682 -26136 -576833 -684442 -505217 -306875 8229 596671 1157091 1176031
35565A176031n81673p15334l74825J28065N40375O56549L47854j56940l72657
$$ 1176031 594358 -120976 -495801 -367736 172639 829188 1177042 1020102 647445
35556F47445j58066J12228J45205R5805J12148k0149m02394o06695k51323K87752
$$ 647445 489379 601607 746812 842617 954765 934616 532222 -74473 -325796 -38044
35546c8044L22403j26509l60928p0791K40848R1219k53969k45112J15026L22515
$$ -38044 284359 157850 -203078 -273869 -33021 58198 -195771 -440883 -325857 -3342
35536c342R6586l13054m94535k86155J48039M59334L84552L3924j89261r8983
$$ -3342 93244 -219810 -714345 -1000500 -852461 -393127 -8575 25349 -163912 -262895
35526b62895L5239l1430p8019J65131M10662J80867l35857m46394k0497K81465
$$ -262895 -227656 -259086 -337105 -171974 238688 419555 83698 -362696 -383193 -101728
35516a01728N7523k21745k1238M09005M80404J33269k40015m08452l75672j32143
$$ -101728 -44205 -265950 -287188 121817 602221 735490 495475 87023 -288649 -420792
35506d20792K23495L74241J84540o4319j52345k30630l15844m4953N60383P29847
$$ -420792 -197297 176944 361484 297165 144820 -85810 -401654 -446607 113776 843623
35496H43623O5621n93153l39296L30236L22481k23849k48958L23657M77220m4893
$$ 843623 909244 316091 -23205 307031 629512 405663 156705 480362 957582 912689
35486I12689k99799R3089K40390l47881p50538j93628N61538M57072j67651k81724
$$ 912689 612890 705979 946369 598488 -152050 -345678 215860 672932 505281 223557
35476B23557J26061K40281r8366k45267Q1330M41363M44057J51045k34129n05328
$$ 223557 349618 589899 491533 246266 327596 768959 1213016 1364061 1129932 624604
35466F24604m21921l8048J66316m4134k06758Q5297M02853J34489m60400o26832
$$ 624604 202683 164635 330951 286817 80059 165356 568209 702698 242298 -384534
35456c84534k62326R2480J88469K13206J93209M0628K7926M05667P09371L26820
$$ -384534 -646860 -554380 -365911 -152705 40504 81132 109058 514725 1224096 1550916
35446A550916l66455m17438J74786M02418j19053n59037l03865N4751j92229o33069
$$ 1550916 1184461 767023 941809 1344227 1225174 666137 362272 417023 224794 -408275
35436d08275m18089L39670P04684K71110l37585l64212J66714N84047L96784j69271
$$ -408275 -826364 -486694 217990 489100 151515 -212697 -45983 538064 934848 765577
35426G65577m77507k68789N7365P4686n3420O3587L30898L41401J04985K624P5790
$$ 765577 288070 19281 76646 151332 97912 161499 492397 833798 938783 941407 1017197
35415A017197R181j72879r3956K04772K28084o1521q4313L04526M19034j31580
$$ 1017197 1026378 853499 759543 964315 1192399 1130878 1046565 1351091 1770125 1638545
35405A638545o86921n28360K6822K39633J05335R4548J71234m9119m15069l93669
$$ 1638545 951624 423264 450086 689719 795054 889602 1060836 1011717 596648 202979
35395B02979j1140J79184M8155J1274J47256K4721l87031m42486J45090O73978
$$ 202979 191839 371023 419178 430452 577708 602429 215398 -227088 -81998 591980
35385E91980M09115l19393n86706j55931L24387L10664r704j69377o3427P5002
$$ 591980 1001095 681702 94996 -60935 263452 574116 564412 395035 331608 406610
35375D06610R5254Q5123J65660K81197K32789r5873n57607q30278p30026l98002
$$ 406610 501864 586987 752647 1033844 1266633 1170760 613153 -217125 -947151 -1345153
35365a345153j12140M1552J96391M11456N13342L39903L6062p2970J02319L04085
$$ -1345153 -1457293 -1415741 -1219350 -807894 -294552 45351 81413 8443 110762 414847
35355D14847K90090J32581K6678l1002j43831k01276J4256L75767M07777p7622
$$ 414847 704937 837518 864196 833194 689363 488087 502343 878110 1285887 1208265
35345A208265o06291n95249j25324J84767L9419j77924l1474L24518M17662J71213
$$ 1208265 601974 6725 -118599 66168 105587 -72337 -103811 220707 638369 809582
35335H09582k8523M9434J74940R9000l2354K6604J56495P3626j30490q8397J90799
$$ 809582 781059 830493 1005433 1104433 1072079 1098683 1255178 1328804 1198314 1109917 1300716
35324A300716K30412j83380o00296n29029j27016R4383k933j56136k09716k06896
$$ 1300716 1531128 1347748 747452 218423 91407 185790 182857 26721 -182995 -389891
35314c89891q6873K45759N78622N56054J97723j48457l51561n38415o03699k54216
$$ -389891 -476764 -231005 347617 903671 1101394 952937 601376 62961 -540738 -794954
35304g94954L40324N40150J31039l21839l25609j17598p7530m2133K39516M44870
$$ -794954 -454630 85520 216559 -105280 -430889 -548487 -626017 -668150 -428634 16236
35294A6236J62532k87860k66432J39337K47070q6147k43165J10337M79051L23205
$$ 16236 178768 -109092 -375524 -236187 10883 -75264 -318429 -208092 270959 594164
35284E94164j68759m34127k59930J42747M65040M66819J16348k56741k61008j9178
$$ 594164 425405 -8722 -268652 -125905 339135 805954 922302 665561 404553 385375
35274C85375m0728l79122m52158P13L60583M7402m80328l46825L81912P39144
$$ 385375 344647 -34475 -486633 -485920 -125337 -77935 -558263 -905088 -523176 215968
35264B15968K57169l89530l59108K83057P85485O49500K3354o17727q76377o20567
$$ 215968 473137 83607 -275501 7556 793041 1442541 1465895 848168 -28209 -648776
35254f48776l6875M70670N75203K96406k8859p0070J61426L07311P3311l69539
$$ -648776 -685651 -214981 360222 656628 627769 557699 719125 1026436 1099747 730208
35244G30208n64484l78463j70437k16288k80196n3587K55453K15503r1784j40139
$$ 730208 165724 -212739 -383176 -599464 -879660 -933247 -677794 -462291 -554075 -694214
35234f94214K24176N23172L44116j12305l81809l13238p9828J32255K29717J84252
$$ -694214 -470038 53134 397250 284945 -96864 -410102 -489930 -357675 -127958 56294
35224E6294P2505K1749L7910L4241L0648R0971Q2757j60637m18229k54339K69697
$$ 56294 128799 150548 188458 222699 253347 344318 427075 266438 -151791 -406130 -136433
35213a36433N34268K44582j04290P79K93930J86254l03422o15355m68977j07176
$$ -136433 397835 642417 538127 538906 832836 1019090 715668 100313 -368664 -475840
35203d75840J84563L34732L04243Q3173j20010n8661J58170J73232j00218l55586
$$ -475840 -291277 43455 347698 430871 310861 252200 410370 583602 483384 127798
35193A27798l07037Q836L32442L97291J32199j87410j77081Q2418L5724m72183
$$ 127798 -179239 -170403 162039 559330 691529 504119 327038 409456 445180 -27003
35183b7003p44441k01139N91583O25377n1803m37174j29722J83815j3096k71571
$$ -27003 -771444 -972583 -381000 244377 192574 -244600 -374322 -190507 -203603 -475174
35173d75174o0195L57381M65867K91394J17400n0164k18281j26878K35419L47880
$$ -475174 -535369 -177988 287879 579273 696673 646509 428228 301350 536769 884649
35163H84649l9151l39868l7202L54353M9415o68022p98192j35911N03886N40856
$$ 884649 845498 505630 468428 822781 872196 204174 -594018 -729929 -226043 314813
35153C14813K14922j53298n81514q72258n11822M36524J041583O52663j73006
$$ 314813 529735 376437 -205077 -1077335 -1589157 -1152633 -111050 541613 368607
35144C68607m41955l0288L59044K85499J4776o7484L6611J25535J38685J28180
$$ 368607 -73348 -103636 255408 540907 555683 488199 524810 650345 789030 917210
35134I17210P4578r1745l20190m13685k51347n008J3520k10816k93536L7771N03148
$$ 917210 991788 900043 579853 166168 -85179 -90187 -76667 -287483 -581019 -543248 -40100
35123d0100O19865L58529R0943l4113k13094m62965m75905j71805O5976j3855
$$ -40100 579765 938294 1029237 995124 782030 319065 -156840 -328645 -262669 -276524
35113b76524r5586J85797O05004O41644K26435k09732l38039k31352j05259o3908
$$ -276524 -372110 -186313 418691 1060335 1286770 1077038 738999 507647 402388 338480
35103C38480j04830j52027r4543N2307J07129J701m8465J29686L33494K58790
$$ 338480 233650 81623 -12920 39387 146516 148217 99752 229438 562932 821722
35093H21722l5270k58084l52638m41765m11618l7954M52588M80822m3354m58887
$$ 821722 786452 528368 175730 -266035 -677653 -715607 -263019 217803 174449 -284438
35083b84438k33757K91763M27931R3475k13787k23263j54821j86092j44701J02530
$$ -284438 -518195 -226432 201499 294974 81187 -142076 -296897 -482989 -627690 -525160
35073e25160L15481J97086j50957l37536j72041J44761L05430K36071J20810J45089
$$ -525160 -209679 -12593 -163550 -501086 -673127 -528366 -222936 13135 133945 279034
35063B79034K51943J89696j53991n21070n28649j59890J69437J32725r2021j09159
$$ 279034 530977 720673 566682 45612 -483037 -642927 -473490 -340765 -432786 -541945
35053e41945J25716K87046J87381J177q5739j46455k54099k24090Q5805L96489
$$ -541945 -416229 -129183 58198 59375 -26364 -172819 -426918 -651008 -565203 -168714
35043a68714L12989m0461j10399K71395N79434L43719j43722k58891L0038J47086
$$ -168714 144275 103814 -6585 264810 844244 1187963 1044241 785350 815388 962474
35033I62474j94183n41664l51983K20267M82624P6618n43840n96453J12014Q70050
$$ 962474 768291 226627 -125356 94911 577535 654153 110313 -486140 -374126 495924
35023D95924Q21292K5972n42832k43043L64389L24843l23736o62957l13997R4438
$$ 495924 1317216 1343188 800356 557313 921702 1246545 922809 259852 -54145 40293
35013D0293Q3815O9425M24515N96088k1247q80338r26588j66825L93074K80114
$$ 40293 124108 193533 618048 1214136 1192889 312551 -614037 -780862 -387788 -107674
35003a07674L6585J11080K46153J96753J44584Q2384l21674q55123o93470K44848
$$ -107674 -71089 39991 286144 482897 627481 709865 388191 -466932 -1160402 -915554
34993i15554Q09085K40699n71595m17665L87841O35021J58189j49041K3185R6972
$$ -915554 -106469 134230 -437365 -855030 -467189 167832 326021 176980 200165 297137
34983B97137q0000L3061M13794K60647n28464q85530k32465M87395K79183l48584
$$ 297137 217137 250198 663992 924639 396175 -489355 -721820 -234425 44758 -303826
34973c03826l23564K32495L62286o1811k62892J591J16440j58493k16246K82003
$$ -303826 -627390 -394895 -32609 -94420 -357312 -355721 -239281 -397774 -614020 -332017
34963c32017P27575N23180K3073r7243R5918L8181l26213m81014k14316P2381
$$ -332017 395558 918738 941811 844568 940486 978667 652454 171440 -42876 29505
34953B9505M9617o2981M4059K24517J45325j33211k48428j27229q2833k57462
$$ 29505 79122 16141 60200 284717 430042 296831 48403 -78826 -161659 -419121
34943d19121l42475n8094L66323M76714K02198j05020j54183K2823K45816L63848
$$ -419121 -761596 -819690 -453367 23347 225545 120525 -33658 -10835 234981 598829
34933E98829K73819P517j90109r4889J69215K49791K3202k80653m12723l36954
$$ 598829 872648 880165 690056 595167 764382 1014173 1037375 756722 343999 7045
34923G045j27235J12947J98412r691l54454m80462k42959J54373M28059M31964
$$ 7045 -120190 -7243 191169 181478 -172976 -653438 -896397 -742024 -313965 117999
34913A17999J71044j50953j87742J33673L69014J24758k67375j87215K46921K95969
$$ 117999 289043 138090 -49652 84021 453035 577793 310418 123203 370124 666093
34903F66093j75012l93841P9687N85205L68696k77135n48505l41462j93023k89263
$$ 666093 491081 97240 176927 762132 1130828 853693 305188 -36274 -229297 -518560
34893e18560k61884R8273N18352O55461M21317o5963n17563n71651j88707J87835
$$ -518560 -780444 -682171 -163819 491642 912959 846996 329433 -242218 -430925 -243090
34883b43090J81701L656P8380L71001M81959K31933k20758o49940q03012m48641
$$ -243090 -61389 -57733 20647 391648 873607 1105540 884782 234842 -568170 -1016811
34873a016811K19696N46129K37185j31386L0265L70904J98981l25102m58944j11545
$$ -1016811 -797115 -250986 -13801 -145187 -114922 255982 454963 129861 -329083 -440628
34863d40628J29191R4203J68129L19620N8118m60413l74281M41338R02457K84910
$$ -440628 -311437 -217234 -49105 270515 328633 -131780 -506061 -64723 837734 1122644
34853A122644o28092p10788q8323K69748K8008l09744l64999k40996m9078K25832
$$ 1122644 494552 -216236 -304559 -34811 -6803 -316547 -681546 -922542 -971620 -745788
34843g45788M18410L01288M914j26885n6588j5696j9456J35803M00921M37922
$$ -745788 -327378 -26090 -21176 -148061 -204649 -220345 -239801 -103998 296923 734845
34833G34845J46415j22668l0956K90737M04669R6443l63421n19289k82778o3888
$$ 734845 881260 758592 727636 1018373 1423042 1519485 1156064 636775 353997 290109
34823B90109k14345m96318m19462q541K22959Q7756k1006J52610L11039J88222
$$ 290109 75764 -420554 -840016 -848557 -625598 -537842 -558848 -406238 -95199 93023
34813I3023J8339M4346O5669o7455k553M98295R12864O00074k08520p29447p04282
$$ 93023 111362 155708 221377 153922 151369 649664 1562528 2162602 1954082 1224635 520353
34802E20353m77904k24302J35791L73038J37208k84891k17785L00971M89176O9443
$$ 520353 42449 -181853 -46062 326976 464184 179293 -38492 262479 751655 821098
34792H21098k99351j50730Q0192n1976k09195j3403J25877k51738o32762k06514
$$ 821098 521747 371017 451209 399233 190038 176635 302512 50774 -581988 -788502
34782g88502P19322R84300K39357n87081o72953l18277k05260l33250k42749J22740
$$ -788502 -69180 915120 1154477 567396 -105557 -423834 -629094 -962344 -1205093 -1082353
34772a082353L54944K14654j11827l26625k78823L1850M44588O69262N49649K65289
$$ -1082353 -727409 -512755 -624582 -951207 -1230030 -1198180 -753592 -84330 465319 730608
34762G30608R5640M8691p7227l20208m74631l84234j13062J89955M02036L80923
$$ 730608 826248 874939 797712 477504 2873 -381361 -494423 -304468 97568 478491
34752D78491L8547m33225o04014k56628K92228N08451K67733j0969O0454K87463
$$ 478491 517038 83813 -520201 -776829 -484601 23850 291583 280614 341068 628531
34742F28531J48690m00517p10021k81398M21724N08020m9555l12905J91850O53230
$$ 628531 777221 376704 -333317 -614715 -192991 315029 265474 -47431 144419 797649
34732G97649J86918p03281p99207k6136M56809R0037l05394m160M34113K18265
$$ 797649 984567 281286 -517921 -544057 -87248 2789 -302605 -306765 127348 345613
34722C45613k80229j85964L78850N33289R5192k64941k34226j88836k65202j19526
$$ 345613 65384 -120580 258270 791559 886751 621810 387584 198748 -66454 -185980
34712a85980J84097M6391n37048o66950R2132Q75451P43089M6256k31105M2827
$$ -185980 -1883 44508 -492540 -1159490 -1067358 -191907 551182 597438 366333 409160
34702D09160K10412L2072q8769K0305L5248j99996m20629m42882l51288j37987
$$ 409160 619572 651644 562875 583180 618428 418432 -2197 -445079 -796367 -934354
34692i34354K71545N84118L60415j97392l34980J29316M24886j7612o25108m87503
$$ -934354 -662809 -78691 281724 84332 -250648 -121332 303554 285942 -339166 -826669
34682h26669L03827Q13763N78919P5984j50004j85228l34126m99466l80809m5197
$$ -826669 -522842 290921 869840 945824 795820 610592 276466 -223000 -603809 -649006
34672f49006J20769j1137j33002L328J92971J07970j41854j13656K79282N43106
$$ -649006 -528237 -539374 -672376 -669048 -476077 -368107 -509961 -623617 -344335 198771
34662A98771K95233j14648q8727K61762K05086m64193r55881n48975L27159O62611
$$ 198771 494004 379356 290629 552391 757477 293284 -662597 -1211572 -884413 -221802
34652b21802K73528n7747J52970M21834J87326k46730k07876K54315M11255o4335
$$ -221802 51726 -6021 146949 568783 756109 509379 301503 555818 967073 902738
34642I02738o16826n70053J283M21484K70959j50257k47431R8170L51463L5970
$$ 902738 285912 -284141 -282858 138626 409585 259328 11897 110067 461530 497500
34632D97500n23310n31603J55109P19685M96213o3649q2380M04080N33718k5032
$$ 497500 -25810 -557413 -402304 317381 813594 749945 667565 1071645 1605363 1580331
34622A580331n85032m95403o121K58371J51930n2520j53445q3468J57329L14350
$$ 1580331 995299 499896 493775 752146 904076 851556 698111 614643 771972 1086322
34612A086322K0667n51387o55604k1967N56201K83425m15564m89817J82197O75426
$$ 1086322 1106989 555602 -100002 -121969 434232 717657 302093 -187724 -5527 669899
34602F69899M21220r3778k11366O517R2923j08223l87390n28463m62181k59578
$$ 669899 1091119 997341 785975 792492 885415 777192 389802 -138661 -600842 -860420
34592h60420j13182j42517j77958L0615L90011N40359L72140J51065Q3078P0503
$$ -860420 -973602 -1116119 -1294077 -1263462 -873451 -333092 39048 190113 273191 343694
34582C43694k6521j71914k71728k71911j18040J41002K47816L4136k24882j14382
$$ 343694 317173 145259 -126469 -398380 -516420 -375418 -127602 -93466 -318348 -432730
34572d32730K79833M36133J44319k15316k49614n3606K4844j28822k84259j27904
$$ -432730 -152897 283236 427555 212239 -37375 -90981 -66137 -194959 -479218 -607122
34562f07122L51670O79605L39126m31104p08842j37839M15813J10824m88063k66133
$$ -607122 -255452 424153 763279 332175 -376667 -514506 -98693 12131 -475932 -742065
34552g42065N48976O32795k78538q55113k26971O92392O84461J942k75923O2267
$$ -742065 -193089 439706 161168 -693945 -920916 -228524 455937 457879 181956 244223
34542B44223L08971O7748l48342n42934l92042N2560N05490N20089N3520l25735
$$ 244223 553194 620942 272600 -270334 -662376 -609816 -104326 415763 469283 143548
34532A43548j94665J14330Q0291k17797l45390j90802N0006K35600K50468N45
$$ 143548 -51117 63213 143504 -74293 -419683 -610485 -560479 -324879 -74411 -73866
34522g3866k45936k4433M93244M96609k06446p12970l93313J09239K6583k40070
$$ -73866 -319802 -344235 149009 645618 439172 -273798 -667111 -557872 -531289 -771359
34512g71359K6586M81717L74313m1007k7298K04699m3381m69053k21276M16392
$$ -771359 -744773 -263056 111257 70250 42952 247651 204270 -264783 -486059 -69667
34502f9667L77576k33108k09819N85002Q38482K530p61363n25505L7331Q0022
$$ -69667 307909 74801 -135018 449984 1288466 1290996 529633 4128 41459 121481
34492A21481k2281K74618M66839J4816m39096j10736M73591L27160l31497n35463
$$ 121481 99200 373818 840657 855473 416377 305641 779232 1106392 774895 239432
34482B39432k11428p7884k10797o685N07026N54784m9000m93968j91828M22783
$$ 239432 28004 -49880 -260677 -267362 239664 794448 745448 251480 59652 482435
34472D82435O18094K57418k94165o40687n34946k3535M52547M74159J89257N2261
$$ 482435 1100529 1357947 1063782 423095 -111851 -135386 317161 791320 980577 1032838
34462A032838Q4805q3182m45314m98229m0251M43450M40305N6095k33833j73670
$$ 1032838 1117643 1034461 589147 90918 50667 494117 934422 990517 756684 583014
34452E83014J25778L85618L65033O4708k21845k52389j78932k70462l97441k11567
$$ 583014 708792 1094410 1459443 1524151 1302306 1049917 870985 600523 203082 -8485
34442h485J98212L35498O0176j92528j24430J1241k2515K6058L72880O00224J50540
$$ -8485 189727 525225 585401 392873 268443 279684 257169 283227 656107 1256331 1406871
34431A406871p46099j183880o70855K80430P77655N18135j3750k01214L992J08948
$$ 1406871 660772 -523108 -1193963 -913533 -135878 382257 368507 167293 171285 280233
34421B80233j97810n39901l30993L31532P00998M30698P6021J95547M41169J60908
$$ 280233 82423 -457478 -788471 -456939 244059 674757 750778 946325 1387494 1548402
34411A548402m21824m64112J01096L35002k46031q17245m58612M04955N93394
$$ 1548402 1126578 662466 763562 1098564 852533 35288 -423324 -18369 575025
34402E75025j21455p70312o13269m546L53278L32703K15088J15482j0720j08681
$$ 575025 453570 -316742 -930011 -934557 -581279 -248576 -33488 81994 71274 -37407
34392c7407j29685j68884k34863j33788J65082L33942J54483r5320o2692J33143
$$ -37407 -167092 -335976 -570839 -704627 -539545 -205603 -51120 -146440 -209132 -75989
34382g5989J69830J06232K26963M41671L47253j15511n18770n33990k96968r7620
$$ -75989 93841 200073 427036 868707 1215960 1100449 581679 47689 -249279 -346899
34372c46899j2269M4285J21713J82534J36037n0242j93386l2956L16972L50219
$$ -346899 -359168 -314883 -193170 -10636 125401 75159 -118227 -151183 165789 516008
34362E16008r9179m50127j65304L69838L88270o5024k42878Q1788L40485K00288
$$ 516008 416829 -33298 -198602 171236 559506 494482 251604 333392 673877 874165
34352H74165K0437M3012m3781l58821m17624L7131M66821L41588p9250l08769
$$ 874165 894602 937614 893833 535012 117388 154519 621340 962928 883678 574909
34342E74909l71824l99689j27097M90284P74301K94346k27953J3402M48469j6312
$$ 574909 203085 -196604 -323701 166583 940884 1235230 1007277 1020679 1469148 1452836
34332A452836j002646j004352J93499R75463K95556p65188p16732J72618N58188
$$ 1452836 450190 -554162 -360663 614800 910356 145168 -571564 -398946 159242
34323A59242J22153k53003o8732K20928K11602J10979J09735m116l08099m42482
$$ 159242 281395 28392 -40340 180588 392190 503169 612904 608788 300689 -141793
34313a41793j79164J64351K02031K6684j9463J34520K74912K43330O2609j72447
$$ -141793 -320957 -156606 45425 72109 52646 187166 462078 705408 768017 595570
34303E95570l63494m27065l36096j13771J86653M14226L52026J6250k07000k8455
$$ 595570 232076 -194989 -531085 -644856 -458203 -43977 308049 324299 117299 88844
34293H8844K51601J26667l01779m16736l9258L11941K96368K32050L50098K46447
$$ 88844 340445 467112 165333 -251403 -290661 21280 317648 549698 899796 1146243
34283A146243l43553q08066m63890L10135N89486K74558L0107K5916k20023o99897
$$ 1146243 802690 -5376 -469266 -159131 430355 704913 735020 760936 540913 -158984
34273a58984p13440r8395L65661K38551J21061M61258O21910O820o97044m90742
$$ -158984 -872424 -970819 -605158 -366607 -245546 215712 837622 844442 147398 -343344
34263c43344K86142M67489q4417l68106N6023M52884K19702k50891m00918l15098
$$ -343344 -57202 410287 325870 -42236 13787 466671 686373 435482 34564 -280534
34253b80534k42761p1260K23750K66729m5967j63873K41674N72157J70015n48356
$$ -280534 -523295 -594555 -370805 -104076 -150043 -313916 -72242 499915 669930 121574
34243A21574o39143o1925L02786N0903j86795J53305O24719M51140k66004o33806
$$ 121574 -517569 -579494 -276708 -225805 -412600 -259295 365424 816564 550560 -83246
34233h3246j88465M88915N57131o166m25875j46263M93419P28089L02618l04968
$$ -83246 -271711 217204 774335 768169 342294 196031 689450 1417539 1720157 1415189
34223A415189n38022l72512j77337j61797j86633j03717m6970j96722l55773r2119
$$ 1415189 877167 504655 327318 165521 -21112 -124829 -171799 -368521 -724294 -816413
34213h16413N57323Q68710L16976n26949n70759L15368J048011P90963M636l93602
$$ -816413 -259090 609620 926596 399647 -171112 144256 1192267 1983230 1987866 1594264
34203A594264l00008k24473l09390l17216k86865m09663m49977q4141L37216K16668
$$ 1594264 1294256 1069783 760393 443177 156312 -253351 -703328 -787469 -450253 -233585
34193b33585j97461r1118N21792P10633J34914l88630k07529K36505K98881P3060
$$ -233585 -431046 -522164 -372 710261 845175 456545 249016 485521 784402 857462
34183H57462j24786l70459o00970l10613M75545P50025m4855q84670n45169M99005
$$ 857462 732676 362217 -238753 -549366 -73821 676204 631349 -253321 -798490 -299485
34173b99485P98870J37300l53323j29789J13910r9442k52768M6286K96193N9474
$$ -299485 499385 636685 283362 153573 267483 168041 -84727 -38441 257752 317226
34163C17226k22645n3877K18645O3419k53069j23736L33355M31905k4523m93018
$$ 317226 94581 40704 259349 322768 69699 -54037 279318 711223 686700 193682
34153A93682m71175l3486M12338N30539K38801k08390l68437j07171J60943J1159
$$ 193682 -277493 -310979 101359 631898 870699 662309 293872 186701 347644 358803
34143C58803l65044m34852j02024K27547L10863L10943L18219J42844k17745l81358
$$ 358803 -6241 -441093 -543117 -315570 -4707 306236 624455 767299 549554 168196
34133A68196j67884K5144j66022m44725l44554m6656n5126k30595M6670O96258
$$ 168196 312 25456 -140566 -585291 -929845 -976501 -1031627 -1262222 -1215552 -519294
34123e19294Q10057N6501o25906l58246L57912M77871L5923r7195K11251J92784
$$ -519294 290763 347264 -278642 -636888 -278976 198895 234818 137623 348874 541658
34113E41658l64658o52864j97488L40281K82745m67J36766M71281L73641n8502
$$ 541658 177000 -475864 -673352 -333071 -50326 -50793 85973 557254 930895 872393
34103H72393k11159k9886k7471l13360m19337j45903J31977J56310J50591K58835
$$ 872393 661234 631348 603877 290517 -128820 -274723 -142746 13564 164155 422990
34093D22990J89423k16220m93983j20995O23557Q42855J29940q44481j065832
$$ 422990 612413 396193 -97790 -218785 404772 1247627 1377567 533086 -532746
34084e32746l47198N03525O91339K95596o0314r4629k9051m3135p4939j37674
$$ -532746 -879944 -376419 314920 610516 550202 455573 426522 383387 308448 170774
34074A70774l05400l35968J08358P29619P36673P99n88001l39477K85745M73382
$$ 170774 -134626 -470594 -362236 367383 1104056 1104855 516854 177377 463122 936504
34064I36504K12905K309q3987k58672l50791j00060J62687l1713l83611k52255
$$ 936504 1149409 1151718 1067731 809059 458268 358208 520895 489182 105571 -146684
34054a46684J84537J79306k36310k36723L20871N34319k2349m83601p4586N84225
$$ -146684 37853 217159 -19151 -255874 64997 599316 576967 93366 18780 603005
34044F03005M50758k84779n48721r2486J98441k22425o99400l92346M59107Q70860
$$ 603005 1053763 768984 220263 127777 326218 103793 -595607 -987953 -528846 342014
34034C42014M54873j55872k62984Q340O9778j99222l57619j73624K8486m5801
$$ 342014 796887 641015 378031 386371 456149 256927 -100692 -274316 -245830 -291631
34024b91631j79362n0703K27630L38916K58823J59247O7660q392J07103M03126
$$ -291631 -470993 -521696 -294066 44850 303673 462920 530580 522188 629291 1032417
34014A032417M38556l7177n21195m38171j15024k98672q48180q18121O5577R09346
$$ 1032417 1470973 1433796 912601 474430 359406 60734 -787446 -1605567 -1539990 -630644
34004f30644R22972M04769N8554J1713Q809K4838J24260R4994k45622o26283o33255
$$ -630644 292328 697097 755651 767364 776173 801011 925271 1020265 774643 148360 -484895
33993d84895k58835J77775M38539M30406J42572j81877j03562M35706Q44734N65684
$$ -484895 -743730 -565955 -127416 302990 445562 263685 160123 595829 1440563 2006247
33983B006247j68362o28296m98727j29965L9005l6714j22315n4537R5910J25479
$$ 2006247 1837885 1209589 710862 580897 619902 583188 460873 406336 502246 627725
33973F27725n2855k77243l44247k90861k71499k17813N2908L84310L51707q1322
$$ 627725 574870 297627 -46620 -337481 -608980 -826793 -773885 -389575 -37868 -119190
33963a19190l94074k29870R9298J44041J0909J08434M25440N31925K47659j02589
$$ -119190 -513264 -743134 -643836 -499795 -488886 -380452 44988 576913 824572 721983
33953G21983j80322p8110j12565l32488m29743j57575K98232N13214L58231J23025
$$ 721983 541661 463551 350986 18498 -411245 -568820 -270588 242626 600857 723882
33943G23882M4589j563j48418j95311L0669K39509O8626k78708l07871j9412J48602
$$ 723882 768471 766908 618490 423179 453848 693357 761983 483275 175404 155992 304594
33932C04594Q3210O9406J23971l8821l05275j83862K80927L89605j04221n24432
$$ 304594 387804 457210 581181 542360 237085 53223 334150 723755 619534 95102
33922I5102l37088M2856N0782r9363M3182K70607J41086j23230O586L64305K79150
$$ 95102 -241986 -199130 -148348 -247711 -204529 66078 207164 83934 90520 454825 733975
33911G33975l00563o42489k90560L20907M98918J11820l91665n03245r7613M58154
$$ 733975 433412 -209077 -499637 -178730 320188 432008 40343 -462902 -560515 -102361
33901a02361O33002L09805o5964o2459K07479L40059J93951q3494l53998m92007
$$ -102361 530641 840446 774482 712023 919502 1259561 1453512 1370018 1016020 524013
33891E24013l07621J65213M77305K54877k34418l89303p0400K87621L24192J40841
$$ 524013 216392 381605 858910 1113787 879369 490066 419666 707287 1031479 1172320
33881A172320q826j01114k63560m69908m76643j11104M11907O17664L35566n5242
$$ 1172320 1163494 1062380 798820 328912 -147731 -258835 153072 770736 1106302 1051060
33871A051060j74790j69084k76212j93552L98743Q89840L30343r29727j333725
$$ 1051060 876270 707186 430974 237422 636165 1526005 1856348 926621 -407104
33862d07104k90073Q52262P24473j66449m44937M1268L28241L3774k79785k39607
$$ -407104 -697177 155085 879558 713109 268172 309440 637681 671455 391670 152063
33852A52063o6475J01299L43205M33734M5346n17036n69446n0534M30308M93473
$$ 152063 85588 186887 530092 963826 1009172 492136 -77310 -127844 302464 795937
33842G95937K53168j79802o90522p98576j65324O11049N97264r8728m60532r1624
$$ 795937 1049105 869303 178781 -619795 -785119 -174070 423194 324466 -136066 -227690
33832b27690L34713K51093j21437m29220o11593m94676J14580P32230N64407j84265
$$ -227690 107023 358116 236679 -192541 -804134 -1298810 -1184230 -452000 112407 -71858
33822g1858l92972K56661P31261K97406l69958m01771n0614L1340m3952J05819
$$ -71858 -464830 -208169 523092 820498 450540 48769 -1845 29495 -14457 91362
33812I1362J83486k41103p41698n79835Q8100M50526K72821O7785J56489K94474
$$ 91362 274848 33745 -707953 -1287788 -1199688 -749162 -476341 -408556 -252067 42407
33802D2407K13313m2928l12642m29639k36098J73743M03824K57203J8307n7203
$$ 42407 255720 212792 -99850 -529489 -765587 -591844 -188020 69183 87490 30287
33792C0287j43503l70101m10991l9625L44636L08017R7846J63870L52582K48304
$$ 30287 -113216 -483317 -894308 -933933 -589297 -281280 -183434 -19564 333018 581322
33782E81322k4586o4920J8028j62734m63855m15135r0710R656j24063j3849L76827
$$ 581322 556736 491816 509844 347110 -116745 -531880 -622590 -612934 -736997 -750846 -374019
33771c74019N05155J60514k06755k45802j44729j09877j7944J67894J91004r573
$$ -374019 131136 291650 84895 -160907 -305636 -415513 -433457 -265563 -74559 -84132
$$ [...]
##END NTUPLES=NMR SPECTRUM
##END=
