##TITLE=31Pdec_3C1011
 CDCl3, 24 sc
 11.11.2021
##JCAMPDX= 6.0         $$ Bruker NMR JCAMP-DX V2.0
##DATA TYPE= NMR SPECTRUM
##DATA CLASS= NTUPLES
##ORIGIN= UXNMR, Bruker Analytische Messtechnik GmbH
##OWNER= root
$$ XWIN-NMR		Version 3.5
$$ Thu Nov 11 10:43:33 2021 Russian Standard Time (UT+4h)  she@DPX200
##.OBSERVE FREQUENCY= 81.013821
##.OBSERVE NUCLEUS= ^31P
##.ACQUISITION MODE= SIMULTANEOUS
##.ACQUISITION SCHEME= undefined
##.AVERAGES= 24
##.DIGITISER RES= 16
##SPECTROMETER/DATA SYSTEM= spect
##.PULSE SEQUENCE= zgpg30
##.SOLVENT NAME= Acetone
##.SHIFT REFERENCE= (INTERNAL, Acetone, 0, 248.564)
##AUDIT TRAIL= $$ (NUMBER, WHEN, WHO, WHERE, WHAT)
$$ ##TITLE= Audit trail, XWIN-NMR		Version 3.5
$$ ##JCAMPDX= 5.01
$$ ##ORIGIN= Bruker BioSpin GmbH
$$ ##OWNER= she
$$ F:/spectra/data/she/nmr/P31/1/pdata/1/auditp.txt
$$ ##AUDIT TRAIL=  $$ (NUMBER, WHEN, WHO, WHERE, WHAT)
(   1,<2021-11-11 10:42:33.75 +0400>,<she>,<DPX200>,
      <created by zg, POWCHK disabled, PULCHK disabled
       configuration hash MD5:
       00 E9 B6 7A A2 85 ED C7 34 08 36 98 17 FE 4E 26
       data hash MD5: 32K
       1F FB 97 94 30 1A 82 DE 64 D7 AD 13 BA FF A2 A2>)
(   2,<2021-11-11 10:42:37.07 +0400>,<she>,<DPX200>,
      <Start of raw data processing
       efp BC_mod = 2 LB = 1 FT_mod = 6 PKNL = 1 PHC0 = -8836.172 PHC1 = 134.2694 SI = 64K 
       data hash MD5: 64K
       13 1A A9 1C 77 DC 5C F2 52 F1 97 49 93 E3 B7 32>)
(   3,<2021-11-11 10:42:55.56 +0400>,<she>,<DPX200>,
      <pk PHC0 = 9.201017 PHC1 = 0 
       data hash MD5: 64K
       E3 E4 B8 24 62 F8 D7 A8 EE FC 78 92 85 66 6D 64>)
(   4,<2021-11-11 10:42:58.92 +0400>,<she>,<DPX200>,
      <abs ABSG = 5 
       data hash MD5: 64K
       6E 4B A8 60 B9 4B 6F D0 77 05 6B 37 30 0F 8C E5>)
$$ ##END=
$$ 
$$ hash MD5
$$ 29 2E 54 FE D5 8B 36 FA 7D CB 4E 3B FA 18 E2 59
##$RELAX= 
##$RELAX= 
##$RELAX= 
##$RELAX= 
##$RELAX= 
##$RELAX= 
##$RELAX= 
##$RELAX= 
$$ Bruker specific parameters
$$ --------------------------
##$DU= <F:/spectra>
##$EXPNO= 1
##$NAME= <P31>
##$PROCNO= 1
##$TYPE= <nmr>
##$USER= <she>
##$AMP= (0..31)
100 100 100 100 100 100 100 100 100 100 100 100 100 100 100 100 100 100 
100 100 100 100 100 100 100 100 100 100 100 100 100 100 
##$AQSEQ= 0
##$AQ_mod= 1
##$AUNM= <au_zg>
##$AUTOPOS= <>
##$BF1= 81.014009
##$BF2= 200.13
##$BF3= 200.13
##$BF4= 200.13
##$BF5= 200.13
##$BF6= 200.13
##$BF7= 200.13
##$BF8= 200.13
##$BYTORDA= 1
##$CFDGTYP= 0
##$CFRGTYP= 5
##$CHEMSTR= <none>
##$CNST= (0..31)
1 1 145 1 1 1 1 1 1 1 1 1 1 1 1 1 1 1 1 1 1 1 1 1 1 1 1 1 1 1 1 1 
##$CPDPRG= <waltz16>
##$CPDPRG1= <>
##$CPDPRG2= <waltz16>
##$CPDPRG3= <>
##$CPDPRG4= <mlev>
##$CPDPRG5= <mlev>
##$CPDPRG6= <mlev>
##$CPDPRG7= <mlev>
##$CPDPRG8= <mlev>
##$CPDPRGB= <>
##$CPDPRGT= <>
##$D= (0..31)
0 1 0 0 0 0 0 0 0 0 0 0.03 2e-05 3e-06 0 0 0 0 0 0 0 0 0 0 0 0 0 0 0 0 
0 0 
##$DATE= 1636612952
##$DBL= (0..7)
120 120 120 11 120 120 24 19 
##$DBP= (0..7)
150 150 150 150 150 150 150 150 
##$DBP07= 0
##$DBPNAM0= <>
##$DBPNAM1= <>
##$DBPNAM2= <>
$$ [...]
##$SUBNAM3= <"">
##$SUBNAM4= <"">
##$SUBNAM5= <"">
##$SUBNAM6= <"">
##$SUBNAM7= <"">
##$SUBNAM8= <"">
##$SUBNAM9= <"">
##$SW= 501.771253377433
##$SWIBOX= (0..15)
0 1 3 0 0 0 0 0 0 0 0 0 0 0 0 0 
##$SW_h= 40650.406504065
##$TD= 32768
##$TD0= 1
##$TE= 0
##$TE2= 300
##$TE3= 300
##$TEG= 300
##$TL= (0..7)
0 120 53 12 22 120 120 120 
##$TP= (0..7)
150 150 150 150 150 150 150 150 
##$TP07= 0
##$TPNAME0= <>
##$TPNAME1= <>
##$TPNAME2= <>
##$TPNAME3= <>
##$TPNAME4= <>
##$TPNAME5= <>
##$TPNAME6= <>
##$TPNAME7= <>
##$TPOAL= (0..7)
0.5 0.5 0.5 0.5 0.5 0.5 0.5 0.5 
##$TPOFFS= (0..7)
0 0 0 0 0 0 0 0 
##$TUNHIN= 0
##$TUNHOUT= 0
##$TUNXOUT= 0
##$USERA1= <user>
##$USERA2= <user>
##$USERA3= <user>
##$USERA4= <user>
##$USERA5= <user>
##$V9= 5
##$VALIST= <valist>
##$VCLIST= <CCCCCCCCCCCCCCC>
##$VD= 0
##$VDLIST= <DDDDDDDDDDDDDDD>
##$VPLIST= <PPPPPPPPPPPPPPP>
##$VTLIST= <TTTTTTTTTTTTTTT>
##$WBST= 1024
##$WBSW= 4
##$XGAIN= (0..3)
0 0 0 0 
##$XL= 0
##$YL= 0
##$YMAX_a= 8591
##$YMIN_a= -9562
##$ZGOPTNS= <>
##$ZL1= 120
##$ZL2= 120
##$ZL3= 120
##$ZL4= 120
##$ABSF1= 248.5645
##$ABSF2= -253.2056
##$ABSG= 5
##$ABSL= 3
##$ALPHA= 0
##$AQORDER= 0
##$ASSFAC= 0
##$ASSFACI= 0
##$ASSFACX= 0
##$ASSWID= 0
##$AUNMP= <proc_1d>
##$AZFE= 0.1
##$AZFW= 0.5
##$BCFW= 0
##$BC_mod= 2
##$BYTORDP= 0
##$COROFFS= 0
##$CY= -3
##$DATMOD= 1
##$DC= 0
##$DFILT= <>
##$DTYPP= 0
##$F1P= 0
##$F2P= 0
##$FCOR= 1
##$FTSIZE= 65536
##$FT_mod= 6
##$GAMMA= 0
##$GB= 0
##$INTBC= 1
##$INTSCL= 5.30512e-09
##$ISEN= 30
##$LB= 1
##$LEV0= 0
##$LPBIN= 0
##$MAXI= 10000
##$MC2= 0
##$MEAN= 0
##$ME_mod= 0
##$MI= 50
##$NCOEF= 0
##$NC_proc= -6
##$NLEV= 6
##$NOISF1= 182.463
##$NOISF2= 159.3651
##$NSP= 0
##$NTH_PI= 0
##$NZP= 0
##$OFFSET= 248.5645
##$PC= 4
##$PHC0= -8826.971
##$PHC1= 134.2694
##$PH_mod= 1
##$PKNL= yes
##$PPARMOD= 0
##$PSCAL= 0
##$PSIGN= 0
##$REVERSE= no
##$SF= 81.014009
##$SI= 65536
##$SIGF1= 159.3651
##$SIGF2= -187.1042
##$SINO= 113.3802
##$SIOLD= 16384
##$SREGLST= <1H.CDCl3>
##$SSB= 0
##$STSI= 65536
##$STSR= 0
##$SW_p= 40650.406504065
##$SYMM= 0
##$S_DEV= 0
##$TDeff= 32768
##$TDoff= 0
##$TI= <>
##$TILT= no
##$TM1= 0
##$TM2= 0
##$TOPLEV= 0
##$USERP1= <user>
##$USERP2= <user>
##$USERP3= <user>
##$USERP4= <user>
##$USERP5= <user>
##$WDW= 1
##$XDIM= 65536
##$YMAX_p= 359350326
##$YMIN_p= -83714611
$$ End of Bruker specific parameters
$$ ---------------------------------
##NTUPLES= NMR SPECTRUM
##VAR_NAME=  FREQUENCY,     SPECTRUM/REAL,   SPECTRUM/IMAG
##SYMBOL=    X,             R,               I
##VAR_TYPE=  INDEPENDENT,   DEPENDENT,       DEPENDENT
##VAR_FORM=  AFFN,          ASDF,            ASDF
##VAR_DIM=   65536,         65536,           65536
##UNITS=     HZ,            ARBITRARY UNITS, ARBITRARY UNITS
##FACTOR=    0.620285442955139, 1,           1
##FIRST=     20137.2065510759, 0,            0
##LAST=      -20513.1999529892, 0,           0
##MIN=       -20513.1999529892, -83714611,   0
##MAX=       20137.2065510759, 359350326,    0
$$ Real data points
##PAGE= N=1
##DATA TABLE= (X++(R..R)), XYDATA
$$ [...]
41786 -1210013 -1283572 -946856 162379 1280672 1158363 -75113 -866549 -364664 511518
41777 511518 622517 195214 101956 366602 363982 61207 56820 470044 655954 191679
41767 191679 -508168 -847529 -852345 -965696 -1332770 -1658510 -1646203 -1272470 -709085 -264247
41757 -264247 -322517 -960160 -1604582 -1526248 -813730 -363782 -606729 -792546 -102124 994414
41747 994414 1291099 524785 -385337 -726967 -675439 -461133 105555 844306 885055 -169209
41737 -169209 -1443579 -1859005 -1440854 -888118 -434860 5565 38799 -831326 -2172203
41728 -2172203 -2903485 -2627129 -1901547 -1191895 -381553 526530 1052699 964799 731855 800907
41718 800907 887382 492210 -189307 -467019 -209820 -121420 -697151 -1311389 -903234 467584
41708 467584 1395488 815423 -607036 -1383978 -1120997 -672173 -538202 -161139 936667
41699 936667 2240173 2928833 2780482 2013987 943385 147764 182170 687415 631426 -125353
41689 -125353 -529248 -168254 -161109 -1260077 -2298146 -1863300 -510479 219724 156065 201633
41679 201633 375168 4794 -585427 -562649 -501715 -1683203 -3446533 -3512195 -1424344 492962
41669 492962 434688 -614535 -949276 -616637 -451906 -215043 674951 1607229 1529708 553564
41659 553564 -413604 -982023 -1185353 -838126 -66941 258978 -307805 -953432 -950924 -912789
41649 -912789 -1469697 -1725013 -666574 673746 415444 -1166478 -1819340 -575330 1007326
41640 1007326 1273216 522280 -20297 22769 225359 249976 -2406 -490444 -819110 -505484
41630 -505484 269546 791348 835404 823760 851020 460089 -375495 -1003909 -1197577 -1548739
41620 -1548739 -2267630 -2522391 -1664512 -340758 369335 309631 16258 -282410 -598010
41611 -598010 -544617 305885 1539817 2117654 1541955 358669 -508859 -624266 -324465
41602 -324465 -356162 -1064620 -1861856 -1878382 -1216533 -892060 -1249509 -1295530 -277109 882025
41592 882025 765912 -414834 -1095945 -594502 123176 32544 -683099 -1297252 -1545557 -1502197
41582 -1502197 -1186809 -783898 -688516 -938952 -1139492 -1234451 -1661640 -2344092 -2349344 -1222776
41572 -1222776 48632 235991 -524334 -1197755 -1383904 -1317668 -789291 569241 2003838
41563 2003838 2105252 880283 17203 515886 1327633 1206762 724262 1170104 2284988
41554 2284988 2606190 1730328 730090 291013 -135285 -952274 -1495028 -1211425 -771337
41545 -771337 -1046806 -1607005 -1264192 101211 1216283 1055177 101838 -367060 142045
41536 142045 885918 894786 82538 -797080 -1103109 -881714 -448280 177845 1046501 1765774
41526 1765774 1795106 1221772 685124 449887 147596 -369926 -590924 -204089 173385 -212794
41516 -212794 -1085588 -1496134 -1202511 -905633 -1010989 -923307 -8301 1261169 1740468 1034538
41506 1034538 -89415 -778346 -1039600 -1259137 -1192889 -169002 1619619 2744560 2023514
41497 2023514 26441 -1532176 -1772436 -1352922 -1180010 -1196869 -838198 -79702 581000
41488 581000 905510 1091965 1248818 1189531 832720 454401 382774 628213 955759 1220173
41478 1220173 1448959 1547398 1120452 -90377 -1579092 -2335305 -2012701 -1401747 -1272610
41469 -1272610 -1212355 -377072 955486 1663676 1565475 1705146 2557772 3173597 2745672 1914745
41459 1914745 1617969 1591554 1132722 618473 969132 1970940 2374157 1574096 202798
41450 202798 -854773 -1152187 -588018 442543 1011667 747633 667912 1755190 2992054
41441 2992054 2356998 -137870 -2045854 -1614842 175707 1423383 1743397 1886165 2068780
41432 2068780 1919738 1382213 626197 -367368 -1278134 -1217002 -5631 1015724 604123
41423 604123 -526198 -692096 339605 1241195 1181070 626992 150802 -205274 -247223 334572
41413 334572 949972 461551 -951145 -1576271 -559094 691403 491703 -737949 -1362581
41404 -1362581 -1078508 -1041915 -1672952 -1888491 -886041 543753 1175305 987924 867792
41395 867792 1181902 1450863 1233844 625134 -125291 -887964 -1436358 -1463425 -1043694 -692925
41385 -692925 -701408 -712326 -237356 687647 1649616 2334071 2463236 1652048 16870 -1281340
41375 -1281340 -1014346 447486 1333825 726785 -232619 -15746 1204930 2071563 2064955
41366 2064955 1815623 1625926 1029602 60708 -305484 346824 882342 28374 -1788592
41357 -1788592 -2938609 -2624641 -1544479 -618644 41237 661969 1051993 877889 395326
41348 395326 341760 1012354 1772575 1753993 948000 287169 504615 1217886 1486725 1061589
41338 1061589 567191 515623 746588 939019 1026730 879955 276719 -417970 -284817 820137
41328 820137 1650196 1109087 -151926 -658921 -188942 243560 185370 162219 307379 63108
41318 63108 -423975 -142502 860842 905346 -847962 -2643788 -2383886 -703779 3135
41309 3135 -822336 -1235683 159549 2280857 3287607 2818650 1756103 912982 784275
41300 784275 1594899 2647719 2471711 673706 -1045277 -880160 607463 1318983 595347
41291 595347 -165168 37245 355361 -194620 -956131 -780869 -61383 -118392 -885024 -799855
41281 -799855 690597 1983632 1558413 278790 146596 1323606 1975338 1143929 148360
41272 148360 364909 981236 320309 -1410639 -2341031 -1702773 -729324 -520567 -596049 -311948
41262 -311948 -280998 -1130454 -1866915 -1052571 843910 1843469 1166706 82620 -190724
41253 -190724 6913 -24980 33036 664012 1226714 808145 -128161 -244909 657688 1381243
41243 1381243 1217092 874921 1055168 1210388 585478 -322191 -450260 105161 238628
41234 238628 -362656 -756704 -369968 23281 -418626 -1212845 -1298626 -594264 126920 550864
41224 550864 1014457 1519650 1565785 1080790 634407 505722 346376 37688 58077 589155
41214 589155 1019313 861839 512558 533828 778457 809855 627164 368183 -108007 -647947
41204 -647947 -459258 764361 1931549 1831937 914569 601312 1092073 1214407 480352
41195 480352 -132465 168606 855539 1221313 1533946 2214908 2748737 2385085 1369247
41186 1369247 570641 266293 114317 27390 211164 455773 211659 -536191 -1121335 -1099739
41176 -1099739 -772559 -548384 -223529 635662 1724297 1964373 786201 -842427 -1317488
41167 -1317488 -450499 111240 -963236 -2783964 -3379244 -2277873 -793774 64342 584731
41158 584731 1093628 1169870 697435 389055 460985 -4228 -1395297 -2445970 -2039675 -1142166
41148 -1142166 -1391745 -2453022 -2483695 -941676 746997 1335611 1036144 466782 -218223
41139 -218223 -734722 -492305 395594 902797 418140 -519506 -1182369 -1518900 -1708016 -1684446
41129 -1684446 -1473019 -1217974 -632650 664008 2001335 1961530 342537 -1247826 -1420554
41120 -1420554 -657387 -223442 -400392 -678135 -868077 -1073065 -1208654 -1399287 -2153349
41111 -2153349 -3302216 -3583072 -2322242 -771055 -558855 -1464635 -2034771 -1824866 -1506401
41102 -1506401 -1148885 -137361 1206839 1636021 936351 349702 557627 707223 147197
41093 147197 -243106 505851 1728330 2035016 1323604 738770 926007 1323876 1173674
41084 1173674 503537 -10076 221871 1111049 1854632 1684490 808570 233242 404473
41075 404473 519626 -342726 -1821602 -2630535 -2122446 -889714 141152 601331 534696
41066 534696 -43475 -946268 -1418705 -635223 1072144 1962541 634812 -1985350 -3308662
41057 -3308662 -2148521 -222846 224433 -566026 -626371 451019 847616 -528457 -2179568
41048 -2179568 -2115881 -580913 545828 303287 -601091 -1156379 -1044011 -417715 410098
41039 410098 1022941 1176583 966430 494985 -181067 -509378 327792 2017592 2863513
41030 2863513 1937942 688210 1063184 2617211 3111910 1832667 534176 707140 1514761
41021 1514761 1308087 27421 -963710 -786474 141492 874370 818853 20280 -950701
41012 -950701 -1499126 -1618592 -1794510 -2208905 -2456957 -2231049 -1808571 -1556736 -1368797 -964785
41002 -964785 -450433 -198029 -324973 -563163 -565760 -202041 374313 891743 1231200 1441962
40992 1441962 1464692 1156636 739906 713819 955488 539528 -902639 -2303955 -2574328
40983 -2574328 -2273924 -2633899 -3405200 -3272304 -2198114 -1510018 -1482338 -830160 776561
40974 776561 1710520 970223 -102983 -120408 65366 -805355 -1769656 -1143734 324116
40965 324116 364567 -1086066 -1623332 -101180 1702135 1860162 760486 -206677 -772233
40956 -772233 -1355484 -1709754 -1322805 -489077 64612 150161 -36240 -489756 -1105782 -1365144
40946 -1365144 -1028014 -639971 -681056 -778861 -511172 -366115 -912897 -1487673 -909316 627071
40936 627071 1584708 1186161 347735 79306 16029 -625740 -1406806 -1159928 87023 880464
40926 880464 349079 -553273 -527640 50948 -332816 -1975381 -3293141 -2875756 -1271497
40917 -1271497 -74502 85499 -189583 -359969 -512537 -703917 -662311 -358767 -176356
40908 -176356 -224330 -42888 680705 1523973 1775388 1185664 87113 -917593 -1231384
40899 -1231384 -629068 368385 776471 94041 -1196575 -2219207 -2545735 -2306894 -1806932
40890 -1806932 -1348369 -1234033 -1558894 -1972596 -1887126 -1056426 92089 817816 828129 546815
40880 546815 403127 43517 -1155354 -2728918 -3155023 -1820804 -189235 -35331 -1025282
40871 -1025282 -1248094 49795 1592930 2085553 1783547 1576819 1630389 1634317 1541057 1350952
40861 1350952 872187 324920 475232 1503594 2414884 2250426 1225155 28030 -1154990
40852 -1154990 -2071136 -1813113 -97927 1522291 1223990 -598513 -1856703 -1657601 -1140745
40843 -1140745 -1293201 -1533925 -1066105 -272311 115113 224088 508573 784885 716175 634922
40833 634922 938787 1133578 455581 -831482 -1716378 -1881604 -1908448 -2017332 -1615577 -468719
40823 -468719 530796 439681 -374196 -686738 -95356 430976 -161334 -1636175 -2692238
40814 -2692238 -2351223 -836965 831367 1804362 1878354 1272180 252011 -915142 -1786023
40805 -1786023 -1820826 -886942 356557 890902 350353 -573702 -942520 -591686 -76504
40796 -76504 162723 121631 -133911 -539595 -698976 -143594 834986 1217873 470285 -797201
40786 -797201 -1689249 -1924193 -1482142 -177799 1638871 2660745 1989157 537562 -44402
40777 -44402 378400 433884 -580410 -1820568 -2362226 -2243680 -1670791 -491256 904456
40768 904456 1396141 716670 132247 557392 1067535 537188 -247057 220976 1495365
40759 1495365 1641189 302323 -604388 305193 2047899 2962406 2792260 2151980 1173054
40750 1173054 -101931 -872157 -472192 345289 225074 -904402 -1785823 -1567886 -699838
40741 -699838 -158817 -546900 -1816870 -3106364 -3030655 -1090527 1246654 1845941 385496
40732 385496 -1368008 -1829642 -1085158 68263 1283777 2238221 2187904 942526 -433130
40723 -433130 -824001 -452451 -269369 -544193 -953774 -1501069 -2253984 -2559342 -1699205 -161711
40713 -161711 875058 1226226 1675538 2279450 2074315 832890 -192251 37134 931693
40704 931693 1308687 995461 626703 577000 898810 1668420 2549021 2607785 1495631 304605
40694 304605 257569 969044 1102962 435268 -1994 249828 456565 145409 -118752 41990
40684 41990 -24707 -788411 -1390887 -771751 599250 1222827 638955 -807 440565 1665609
40674 1665609 2452372 2077192 906392 -138251 -434622 -102507 260867 274729 85447
40665 85447 -105343 -501053 -1288902 -1982225 -1817304 -841817 34503 271380 316098 603602
40655 603602 626297 -246345 -1431195 -1564684 -292063 1184643 1580760 919345 154653
40646 154653 -32928 341334 923082 1319569 1256533 792044 239907 -281716 -918656 -1516114
40636 -1516114 -1466324 -534671 569885 978608 709514 376092 156087 -234385 -687721
40627 -687721 -648740 -66410 274647 -268219 -1248817 -1480494 -279937 1631235 2462010
40618 2462010 982686 -1878152 -3569974 -2641289 -449422 636298 217531 -148742 345540
40609 345540 677786 -48575 -1076858 -1237894 -579334 162817 795165 1367235 1375082 352666
40599 352666 -1165223 -2189438 -2456859 -2329150 -1967571 -1423862 -1133363 -1453717 -2020274
40590 -2020274 -2294936 -2332964 -2263738 -1645887 -370016 429169 -261829 -1445997 -1177675
40581 -1177675 525015 1473631 349116 -1595816 -2498556 -2146999 -1370388 -365811 1116954
40572 1116954 2586475 3041516 2233777 864157 -368257 -1252046 -1703433 -1556525 -829564
40563 -829564 118980 768845 715511 -38802 -980526 -1544463 -1759485 -2064872 -2402618 -2056429
40553 -2056429 -708915 865150 1661706 1668741 1702737 2193534 2619807 2186075 773777
40544 773777 -876402 -1888627 -2155320 -2369740 -2978207 -3389385 -2741407 -1270957 -159259
40535 -159259 24551 -140198 -191037 -597264 -1663960 -2450960 -1776392 73437 1548808
40526 1548808 1631890 705165 -265315 -682456 -446480 145296 410043 -258592 -1609860
40517 -1609860 -2530821 -2137318 -770945 292427 153307 -775081 -1261841 -725455 55117
40508 55117 -12588 -874971 -1557358 -1710301 -1974799 -2557840 -2523748 -1258288 219363 454547
40498 454547 -477422 -1324467 -1604440 -1915474 -2383680 -2199057 -1088106 -70930 -96471
40489 -96471 -798500 -1295263 -1477931 -1716679 -1890353 -1633221 -1203981 -1184752 -1452373 -1346986
40479 -1346986 -891479 -915052 -1657619 -2109196 -1381903 -154050 114882 -798688 -1552617
40470 -1552617 -1075017 101795 811605 862368 873748 918883 402233 -620580 -1048850 -201554
40460 -201554 1080423 1513916 1045705 669254 925746 1447151 1816233 1961607 1666842
40451 1666842 617212 -799360 -1566135 -1328407 -918713 -1129431 -1619996 -1633422 -1215835
40442 -1215835 -988916 -1124495 -1320903 -1498835 -1695249 -1463618 -315612 1211530 1853555
40433 1853555 1226577 326815 100654 309092 283255 27899 -138619 -408758 -1017094 -1304348
40423 -1304348 -304618 1687684 3050411 2651104 1118622 -8172 79767 946171 1578436
40414 1578436 1250572 93336 -872123 -593534 798580 1939866 1732352 597128 -159495
40405 -159495 69073 766483 1272008 1518922 1675536 1607952 1067227 166403 -645883 -1010867
40395 -1010867 -866382 -322618 416770 993419 1042278 635069 416890 926657 1762998 1886063
40385 1886063 987887 86798 267965 1219645 1735162 1448783 1175764 1492342 1950665
40376 1950665 2030816 1970316 2113845 2210818 1992863 1765377 1719517 1302060 108391 -1134266
40366 -1134266 -1412953 -888172 -592427 -961489 -1558401 -1982202 -2107919 -1648691 -466855
40357 -466855 824211 1513733 1846042 2413096 2804053 2160446 912847 435725 866919
40348 866919 899590 106853 -268017 404821 772255 -367855 -1944433 -2124898 -990824
40339 -990824 -140420 -216585 -382468 -34635 370912 322111 21494 -86281 110682 402373
40329 402373 407197 -191947 -1196497 -1933484 -2075433 -1988363 -1930435 -1578956 -879776 -580174
40319 -580174 -1141834 -1844322 -1846971 -1428213 -1195942 -855854 779 606306 21870 -1059627
40309 -1059627 -1158781 -392385 -285316 -1247289 -2045259 -2034717 -2099692 -2792812 -3219998 -2626045
40299 -2626045 -1666223 -1173276 -932613 -666274 -1006434 -2291269 -3395417 -3075883 -1776656
40290 -1776656 -854102 -598092 -284346 257635 449773 137290 -251809 -638897 -1246083
40281 -1246083 -1616521 -876134 755837 1776784 1210242 -191218 -1066134 -1092462 -899800
40272 -899800 -843804 -646091 -138834 298536 239044 -218474 -609035 -665047 -517893 -420621
40262 -420621 -481416 -665776 -836303 -731240 -161499 638733 1153377 1277396 1478824 1917234
40252 1917234 1910670 983996 26332 315967 1453850 1544388 -160612 -2017433 -2189206
40243 -2189206 -1074503 -434307 -822793 -1232915 -985399 -558720 -406843 -214844 208238
40234 208238 324177 -167276 -511133 136372 1364821 1965795 1566664 1017183 1054796 1294523
40224 1294523 924670 -74650 -962393 -1293290 -1343921 -1396440 -1160619 -297186 812506 1313461
40214 1313461 826807 -200746 -1030919 -1197765 -667739 138968 555627 339161 59978
40205 59978 340043 863629 869660 549419 943940 2187670 2925628 2114556 502801 -502649
40195 -502649 -680897 -749680 -919934 -847391 -637148 -708901 -841660 -496085 19667 -73647
40185 -73647 -459315 115979 1774193 2902092 2278437 733057 -125006 33174 358617
40176 358617 297712 -5271 -346213 -599491 -478256 67781 419016 -49354 -1035780 -1662420
40166 -1662420 -1561836 -1041511 -465477 -156617 -589013 -1795333 -2760036 -2388397 -1101137
40157 -1101137 -475327 -1123625 -1936197 -1805979 -1121619 -889235 -1164537 -1225315 -836423 -449075
40147 -449075 -275645 93291 1044521 2339768 3241058 3066161 1763959 143927 -680800
40138 -680800 -315181 656129 1528483 2127336 2361037 1822450 495156 -673092 -778535
40129 -778535 -261275 -298539 -1059620 -1540386 -1132546 -311724 440044 1318184 2333812 2779095
40119 2779095 2314070 1818354 2244974 3114552 3093340 1836554 382510 -239029 -22791
40110 -22791 450282 774262 815109 548903 113999 -179007 -30330 711903 1924996 2978207
40100 2978207 2890058 1251489 -1020028 -2353689 -2113041 -1182464 -852246 -1434641 -2165433
40091 -2165433 -2244167 -1715977 -1312806 -1522671 -1968952 -1892942 -1173517 -488649 -380025 -630459
40081 -630459 -812167 -914406 -992088 -741588 -86442 274086 -261925 -1099304 -1181648 -639449
40071 -639449 -576031 -1149975 -1118120 239800 1834373 2176895 1308777 483104 428505 755777
40061 755777 819044 444714 -113154 -461527 -410953 -309697 -734037 -1548321 -1767242 -885734
40051 -885734 115670 -148082 -1601281 -2702817 -2311795 -891383 273997 499527 81548
40042 81548 -378190 -696799 -1151949 -1868738 -2341876 -1928292 -847849 -143175 -342755 -731753
40032 -731753 -460705 169514 270320 -203467 -506201 -400590 -420618 -769778 -883405 -369157
40022 -369157 367950 780864 860983 865478 912122 1109959 1546977 1894532 1602273 762741
40012 762741 157562 104380 -69258 -938202 -2022900 -2500357 -2269267 -1648923 -629828
40003 -629828 712475 1544639 1071427 -191234 -939973 -802832 -537160 -535179 -301811 316355
39993 316355 587516 191702 -7706 614641 1124277 304627 -1273109 -1813718 -861714
39984 -861714 17215 -527420 -1831988 -2337455 -1701643 -923558 -792525 -1098212 -1275284
39975 -1275284 -1060381 -409345 592892 1486236 1593423 789186 -171401 -437163 -35469
39966 -35469 199414 -409571 -1683743 -2784385 -2977628 -2323108 -1712061 -2007278 -2955463
39957 -2955463 -3239009 -1981277 24829 1117116 699086 -261126 -728382 -813593 -1082246
39948 -1082246 -1376781 -1111273 -364223 174362 235868 150713 -8654 -587123 -1395578 -1425406
39938 -1425406 -51686 2002147 3389925 3414438 2194716 148162 -2055670 -3463240
39930 -3463240 -3543244 -2796528 -2113930 -1752501 -1488199 -1400676 -1702165 -2041418 -1913662 -1661709
39920 -1661709 -2055157 -2829267 -2764816 -1532209 -361251 -314176 -858992 -906135 -458476 -316408
39910 -316408 -665584 -877644 -481982 370047 1244198 1720495 1595523 1182735 1036850 1048474
39900 1048474 438697 -876542 -1753200 -1443495 -917434 -1442022 -2519499 -2606384 -1451717
39891 -1451717 -230737 422164 903441 1166822 517499 -727750 -1080885 -127047 604150
39882 604150 -13541 -884827 -483984 691515 976428 93921 -710442 -698020 -302408 106926
39872 106926 694630 1231567 963801 -177252 -1191885 -1281888 -764797 -353527 -220870
39863 -220870 -190665 -233375 -284205 -44470 562910 1105250 1212879 1085181 1038551 979938
39853 979938 876232 1335429 2864833 4616632 4825048 2902090 408244 -672743 -162085
39844 -162085 526010 490098 257663 539945 1109204 1427278 1559516 1691667 1356604 120645
39834 120645 -1305673 -1729616 -1198973 -986814 -1675850 -2322226 -1973463 -1052938 -537782
39825 -537782 -522519 -453177 -250629 -235047 -190126 502604 1709603 2355524 1721024 388051
39815 388051 -492519 -535665 -323000 -435890 -728032 -671170 -105785 662878 1385099 2057168
39805 2057168 2525281 2395041 1654664 963521 852198 980766 730437 178037 -189026
39796 -189026 -362646 -542590 -302118 804117 1909058 1531371 -112482 -951855 126571
39787 126571 1668669 1804753 789630 144420 242440 259593 -48832 -89983 226821 310204
39777 310204 113663 301185 968303 1276330 703111 -214387 -735686 -778516 -596444 -279574
39767 -279574 13554 -131234 -878055 -1772283 -2247524 -2288391 -2265541 -2199113 -1504237 309819
39757 309819 2705839 4223191 3884125 2314226 954460 327109 -159961 -781813 -989041
39748 -989041 -600567 -298194 -359921 -111729 568951 501009 -903486 -2226794 -2023177 -1141647
39738 -1141647 -1285350 -2105695 -1840182 -388258 512128 168456 -218390 80711 220359
39729 220359 -327395 -717061 -420267 -250593 -736387 -1044087 -600777 -350556 -1162195 -2184274
39719 -2184274 -2073988 -947923 46041 306735 -62597 -818687 -1311631 -551784 1372178
39710 1372178 2768292 2342175 933233 132154 31936 -279692 -722588 -358273 754146
39701 754146 1357654 734031 -505847 -1449966 -1778698 -1622873 -1335436 -1363092 -1689484 -1624889
39691 -1624889 -787006 123708 289766 4860 19961 228813 147022 179948 998904 1941812
39681 1941812 1602962 55768 -1046571 -879189 -507275 -1028779 -1971458 -2292598 -1939417
39672 -1939417 -1566761 -1418934 -1264653 -977757 -614611 -279225 -233144 -671937 -1175074 -999406
39662 -999406 -175998 399917 313713 287674 992842 1935050 2167833 1526016 484761 -675198
39652 -675198 -1798419 -2348468 -1820915 -562333 486089 852304 852599 902511 968835 726064
39642 726064 -45479 -1169132 -1986933 -1813022 -786725 11962 -258412 -1127457 -1420537
39633 -1420537 -775558 25035 195664 -180837 -536723 -549349 -288049 -58883 -299776 -1203661
39623 -1203661 -2200219 -2268579 -1161655 68804 298913 -192418 -146340 858553 1788851
39614 1788851 1586806 508107 -458395 -933283 -1180384 -1146369 -424225 713961 1124954
39605 1124954 145709 -1382296 -2019399 -1385141 -343626 337577 850302 1632856 2304602
39596 2304602 1929531 388603 -1039314 -968068 339944 1103018 138823 -1680360 -2588924
39587 -2588924 -2128915 -1438867 -1488803 -1884526 -1642001 -481769 972229 1813005 1456771
39578 1456771 132205 -1039818 -1017106 -117772 277611 -438322 -1300499 -1237912 -563088
39569 -563088 -314725 -730778 -1185781 -1262822 -1130266 -1078543 -1253555 -1584003 -1560049 -598831
39559 -598831 864068 1370760 318347 -888923 -629908 614224 1039381 178636 -755164
39550 -755164 -1065863 -1439360 -2275660 -2710649 -2060905 -1086939 -951274 -1706571 -2546631 -2898026
39540 -2898026 -2624598 -1776743 -782679 -340879 -499446 -350643 703332 1820106 1609812
39531 1609812 -8547 -1488559 -1276284 566498 2425753 2749714 1622178 605018
39523 605018 884180 1938074 2466836 2153876 1676637 1338770 849175 364630 437707 749921
39513 749921 267557 -935720 -1422712 -592680 291054 160598 -200094 219643 692453
39504 692453 8165 -1286112 -1678276 -1114483 -849047 -1221302 -1355975 -970086 -740646
39495 -740646 -777249 -418862 177509 -80462 -1254214 -1884536 -1175388 -182375 78452 284663
39485 284663 1318854 2266195 1486972 -824715 -2618846 -2474811 -1011686 258221 609816
39476 609816 443891 537993 1169020 1743601 1391270 124792 -947840 -954041 -379420 -292261
39466 -292261 -826765 -1198986 -1040044 -871350 -1173476 -1684132 -1833344 -1387335 -519862 341273
39456 341273 694890 441697 171858 460726 933367 732639 -61469 -412265 -11651 85816
39446 85816 -766593 -1398334 -398353 1489544 2046842 619736 -1002589 -1172640 -492717
39437 -492717 -468168 -1107598 -1107822 75563 1578088 2438280 2496728 1918590 826977 -271977
39427 -271977 -540892 190321 988317 823677 -310630 -1545446 -2036371 -1532530 -498204
39418 -498204 110484 -325904 -1240160 -1391890 -504038 268601 -66517 -991708 -1383007 -1108555
39408 -1108555 -839534 -746935 -441860 -11295 -47107 -597384 -1035159 -1114830 -1275311 -1678100
39398 -1678100 -1826486 -1497473 -1226439 -1362379 -1362935 -681089 178928 237132 -578856 -1296005
39388 -1296005 -1133010 -398083 -20046 -412797 -987442 -880569 -104404 416061 199480
39379 199480 33921 715514 1438090 686880 -1285888 -2349660 -1373697 193013 552492
39370 552492 72770 178690 729572 358311 -932182 -1462105 -487516 534125 54071
39361 54071 -1395916 -2064408 -1230907 276979 1302875 1305554 407317 -768547 -1391787
39352 -1391787 -1078224 -281962 197299 4993 -596476 -1102509 -1126867 -627305 39125 469402
39342 469402 680194 946126 1213709 1179955 1014018 1329323 2148681 2565045 1909416 685654
39332 685654 -206777 -626007 -875510 -749357 173547 1480199 2098281 1590718 559469
39323 559469 -285713 -739228 -704677 -14468 1022500 1578569 1279965 732513 629289 770324
39313 770324 502348 -176340 -566803 -261515 341200 630664 531932 460685 711938 1110978
39303 1110978 1284654 1144970 947741 851083 634920 90542 -431749 -220059 966507
39294 966507 2502434 3428027 3211576 2007164 471160 -618671 -945624 -1044122 -1739520
39285 -1739520 -2929999 -3337843 -1980685 347866 1709094 1176243 -209993 -852874 -437447
39276 -437447 85766 -3496 -375839 -353270 162940 783042 1268206 1629885 1748571 1372912
39266 1372912 560785 -240619 -674931 -762724 -643062 -377913 -129939 -106347 -82975 543681
39256 543681 1791831 2597053 1924889 178476 -1191241 -1428622 -1106754 -918827 -633456
39247 -633456 270277 1457889 1901982 1130139 -128736 -697999 -235548 379403 92691
39238 92691 -915667 -1283467 -234545 1179036 1307581 113683 -789759 -352201 687579
39229 687579 1138913 930478 681449 516539 189215 -149625 -227310 -369468 -1051579 -1910358
39219 -1910358 -2072412 -1424745 -732612 -436193 -149942 427759 893767 888383 890723 1624140
39209 1624140 2855541 3380383 2399498 620181 -373209 111474 1091370 1197276 401418
39200 401418 -181429 -41411 144446 -117858 -275843 121264 395347 -167233 -970264 -1019540
39190 -1019540 -585215 -612838 -866203 -198748 1342870 2218689 1518104 77401 -894646
39181 -894646 -1068282 -492771 781703 1950287 1665299 -92730 -1500445 -1237185 -281784
39172 -281784 -247365 -939785 -989157 -189776 356251 108531 -354296 -568962 -688222 -704441
39162 -704441 -330087 243049 513323 677894 1399162 2424239 2576094 1477259 261888
39153 261888 91360 804683 1493279 1610020 1043592 -88464 -1143353 -1200571 -265854
39144 -265854 427510 14756 -736248 -584716 303079 661596 54287 -581096 -388206 344218
39134 344218 874086 1023888 1069173 1116779 1078614 990842 939493 793521 336570 -375137
39124 -375137 -999549 -1218224 -933254 -284226 336394 431236 -103200 -635381 -328232 845915
39114 845915 1932282 2039011 1248024 231357 -607242 -1077300 -705066 743290 2238592
39105 2238592 2092191 90593 -1869176 -2021216 -877297 -222889 -610299 -1074673 -1009796
39096 -1009796 -886317 -971385 -729808 -37070 198250 -571917 -1435515 -1255348 -342853 105740
39086 105740 -203567 -520790 -523480 -817345 -1731976 -2499468 -2176942 -957625 -32517 -198866
39076 -198866 -942241 -1095499 -348450 246524 -380823 -1732700 -2232807 -1370814 -437898
39067 -437898 -625297 -1299440 -1131913 -302360 -251917 -1365235 -2255968 -1762549 -578195
39058 -578195 -195259 -931111 -1796273 -1981543 -1724849 -1685102 -1965190 -1996695 -1274138 -25892
39048 -25892 992281 1361191 1367878 1369276 1218023 728343 261612 161947 -31176 -870582
39038 -870582 -1694184 -1215438 430759 1492879 958248 -77624 -161320 504527 852937
39029 852937 809780 1003296 1260471 932125 429360 822827 1845398 1907983 536038 -727739
39019 -727739 -607936 97706 82322 -285757 168249 1130947 1139916 64019 -523099 120887
39009 120887 579133 -534432 -2216149 -2287829 -467171 1174113 870369 -881373 -2359884
39000 -2359884 -2634789 -1956546 -902743 20546 296708 -238152 -975753 -1087847 -522499
38991 -522499 35782 175287 187456 419082 711197 673815 167226 -610010 -1226360 -1228138
38981 -1228138 -605487 32077 172597 95467 229111 119407 -898474 -2064955 -1665735
38972 -1665735 387349 1889463 1222801 -353228 -621555 404861 916315 330989 -54481
38963 -54481 545126 1196618 962945 358228 317506 795497 1193898 1374702 1472914 1295208
38953 1295208 631476 -193092 -619229 -481758 -71071 137820 -257627 -1123447 -1558067
38944 -1558067 -794770 570999 1048973 155217 -1000995 -1333006 -1069671 -972391 -1149220
38935 -1149220 -1277905 -1287079 -1208014 -982833 -884133 -1343256 -1898266 -1342621 358631 1416893
38925 1416893 537995 -1116896 -1596044 -908987 -518223 -698324 -309532 853814 1382220
38916 1382220 434044 -900939 -1184282 -479345 168077 273247 134696 62876 130807 421572
38906 421572 962836 1503882 1656615 1207539 262196 -718327 -1096989 -642685 86603 326884
38896 326884 37880 -184915 -87595 -107080 -628617 -1354576 -1625331 -1130590 -226414 319588
38886 319588 42510 -574210 -495808 492389 1279718 885893 -26852 47012 1382318 2696364
38876 2696364 2886214 2194963 1500117 1233431 1259464 1228595 858867 311979 245492 952298
38866 952298 1634839 1298188 230560 -324862 31555 383941 -12792 -756828 -1127138
38857 -1127138 -1039551 -829660 -783608 -1098961 -1605265 -1482009 -194390 1222662 1021571
38848 1021571 -788579 -2110741 -1508133 -55028 420986 -164045 -555574 -272139 -34632
38839 -34632 -407630 -1074755 -1430450 -1207693 -564991 42300 252693 269939 539450 835587
38829 835587 418372 -591412 -929698 75591 1319665 1305179 84379 -1008569 -1041437
38820 -1041437 -111522 1205119 2204270 2259806 1473388 811208 952062 1382751 1224454
38811 1224454 450564 -359494 -897201 -1023957 -421124 778717 1565838 1208413 352428
38802 352428 13852 -347 -529228 -1333496 -1263157 -86637 1071727 1316802 1034745 1081802
38792 1081802 1638294 2152822 2017745 1204956 420654 389361 823611 697929 -141866 -520154
38782 -520154 314849 1466201 1799916 1562861 1454124 1129306 113977 -710551 -297627
38773 -297627 599820 573392 68045 555983 1597315 1279465 -309683 -757639 826688
38764 826688 2239574 1679737 489194 714814 1830993 1910535 753467 -232992 -529464
38755 -529464 -932972 -1740146 -2127458 -1493543 -352599 309211 33110 -690090 -742623 487608
38745 487608 2153522 2814657 2339416 1854628 1591811 347230 -2168373 -4089686 -3805068
38736 -3805068 -2260886 -1375137 -1327440 -1094586 -647822 -691976 -931520 -581916 -139083 -650351
38726 -650351 -1550666 -1319645 -180074 65334 -923133 -1394995 -465586 505338 400377
38717 400377 140633 712143 1211082 476509 -742456 -1037488 -742458 -1228506 -2400461
38708 -2400461 -2722565 -1594429 -153076 376855 -91320 -980869 -1639880 -1410867 -200777
38699 -200777 909002 667432 -573092 -1131047 -284964 778598 727215 -210542 -916713
38690 -916713 -939283 -653627 -464888 -548454 -970339 -1493538 -1644637 -1438542 -1564265 -2351654
38680 -2351654 -3087532 -2943437 -2024945 -845683 554461 2026482 2512138 1170425 -976192
38671 -976192 -1940797 -1309580 -450251 -66401 738503 2301301 3029516 1554235 -913173
38662 -913173 -1983852 -1241637 -437126 -786570 -1594009 -1731189 -1195933 -698484 -573182
38653 -573182 -664940 -823092 -1098532 -1641224 -2485954 -3277280 -3403961 -2707978 -1738961 -919341
38643 -919341 23011 1183434 1741025 1152277 508231 1219172 2569364 2341631 167639
38634 167639 -1549262 -895794 946996 1609975 811385 185808 630516 1501299 2169166
38625 2169166 2770468 3247574 3014111 2040828 1225809 1101506 987308 106627 -1060339
38616 -1060339 -1354978 -593041 184819 186108 -108687 237084 1241911 2026012 2053529 1719398
38606 1719398 1548031 1394419 864817 121815 -300874 -300444 -267846 -414122 -548748 -529478
38596 -529478 -439854 -252072 237299 990784 1552505 1394015 321212 -1296476 -2517245
38587 -2517245 -2426745 -1145770 158917 719854 1031209 1598173 1650349 343915 -1374964
38578 -1374964 -1776918 -1012397 -931842 -2079798 -2810473 -1994134 -701214 -197523 -13142
38569 -13142 652955 1099099 301722 -1142232 -1822797 -1465118 -710212 163629 886342 543132
38559 543132 -1042537 -2132412 -1174065 600577 750501 -694046 -1461159 -808533 -494037
38550 -494037 -1492372 -2235877 -1277580 317107 731125 68606 -289204 36512 316088
38541 316088 256178 255452 366875 97564 -776852 -1868043 -2558502 -2357062 -1201247 235736
38531 235736 965377 771895 429182 560013 895412 987093 889959 671332 84104 -622381
38521 -622381 -441215 921457 2057716 1490285 -191091 -1085598 -664121 -367555 -1350400
38512 -1350400 -2845426 -3342368 -2537588 -1398330 -784974 -716922 -817311 -870175 -849226 -780558
38502 -780558 -767187 -965342 -1354630 -1627146 -1517050 -1225858 -1253388 -1701387 -2038419 -1798238
38492 -1798238 -1240583 -963336 -1093706 -1319153 -1516881 -1763555 -1833018 -1393311 -750233 -646213
38482 -646213 -1113756 -1264927 -577425 275811 345407 -396947 -1265857 -1782533 -1871816 -1544930
38472 -1544930 -915667 -266203 270667 768360 1001972 463287 -717995 -1542046 -1435093
38463 -1435093 -1116578 -1392702 -1741103 -1168525 -27512 307554 -512628 -1355703 -1382572
38454 -1382572 -1090042 -1142992 -1220254 -732656 42393 323609 -75865 -653795 -990738 -1119665
38444 -1119665 -1261169 -1528352 -1787783 -1670083 -969119 -131916 53678 -543800 -1153708
38435 -1153708 -1110232 -622393 -195680 172267 661378 930201 475873 -478068 -1126121 -1097354
38425 -1097354 -787055 -694324 -949516 -1473268 -2011480 -1946076 -732953 1175203 2375490
38416 2375490 1918745 369704 -887430 -1143828 -800272 -520260 -422173 -165380 471396
38407 471396 1269114 1770042 1739334 1372174 978085 566956 -30271 -712166 -1161782 -1388283
38397 -1388283 -1723186 -2068751 -1716297 -404739 897356 988381 160 -817586 -858261
38388 -858261 -839218 -1451472 -2152343 -1928345 -746321 486732 1176637 1526955 1762996
38379 1762996 1546628 478923 -1173972 -2584107 -3076248 -2596863 -1629311 -815274 -551046
38370 -551046 -751670 -978978 -866578 -412318 148737 622130 872943 694413 -39905 -1016507
38360 -1016507 -1574203 -1416694 -1032084 -1027349 -1159292 -574625 858335 2057710 2010305 1113177
38350 1113177 616737 963347 1406086 1284703 912917 865403 968673 560024 -464657
38341 -464657 -1337656 -1203523 -36351 1229295 1461113 374142 -1109101 -1685444 -920208
38332 -920208 451879 1426336 1647615 1390791 995816 602813 315063 343417 838913 1549612
38322 1549612 1796077 1132974 100003 -170288 619624 1456130 1472719 1222908 1602996
38313 1602996 2096012 1455785 -50946 -690832 138050 929128 414263 -536452 -438980
38304 -438980 528761 1076474 829864 466124 313047 77352 -283550 -480803 -479915 -303867
38294 -303867 376088 1539371 2176908 1440025 41413 -619600 -336429 130839 700083
38285 700083 1786694 2645504 1715645 -988470 -3374990 -3746801 -2525179 -1035197 84536
38276 84536 606194 174355 -986443 -1781179 -1575228 -1070837 -1120184 -1471226 -1477734 -1260773
38266 -1260773 -1261874 -1285572 -900109 -306975 -2601 -10701 -154797 -583236 -1279597 -1579897
38256 -1579897 -1016234 -199134 -4407 -274916 -237083 108370 11738 -703672 -1275125 -1077003
38246 -1077003 -372761 151318 106845 -415814 -1008068 -1277842 -1268762 -1392569 -1766651 -2018202
38236 -2018202 -2035700 -2324343 -3055780 -3342244 -2274085 -331929 1058953 1173269 457090
38227 457090 -382271 -954639 -1071667 -909206 -1143246 -2075792 -2794781 -2188098 -701514
38218 -701514 65189 -354876 -646691 196340 1287080 1151650 -200083 -1424729 -1584008
38209 -1584008 -901663 -67458 468496 615874 633549 922598 1393411 1234526 -121305
38200 -121305 -1888237 -2434530 -1096052 957369 1925142 1171468 -390794 -1442923 -1457846
38191 -1457846 -863348 -386295 -386679 -666441 -756721 -425811 22414 40738 -480716 -976258
38181 -976258 -846919 -199997 365988 615947 856410 1211078 1281347 845867 440903 753822
38171 753822 1677191 2423838 2450104 1879756 1149873 642331 578779 886792 1192054 1224237
38161 1224237 1119028 1058522 885435 500525 341671 832252 1528935 1562454 894715 348675
38151 348675 321879 363439 270589 590916 1434272 1717939 575987 -1066384 -1451977 -298532
38141 -298532 940681 1131337 698827 539254 694439 714036 620542 781153 1217296 1671457
38131 1671457 2066118 2335921 2127142 1329583 657831 918184 1781592 2113452 1579385
38122 1579385 1026117 1013681 946462 288259 -193489 608298 2318785 3243605 2368696 412513
38112 412513 -1243472 -1990535 -2092831 -1902605 -1447872 -684478 118901 404187 -84736
38103 -84736 -714555 -384095 1130258 2612451 2680318 1338362 -281083 -1391827 -2009945
38094 -2009945 -2183649 -1787227 -1193781 -1171034 -1727898 -1870126 -979579 245313 772170
38085 772170 598317 526753 972025 1595700 1934801 1899747 1705404 1601220 1634297 1598483
38075 1598483 1347181 1070996 954591 726832 90241 -553552 -569965 -235467 -457314 -1214859
38065 -1214859 -1386295 -521483 371547 465665 384962 882678 1307832 688006 -412445 -604948
38055 -604948 122442 410068 -290106 -921960 -497749 583963 1338788 1426838 1093546 570099
38045 570099 58604 -138023 55789 271113 129758 -241302 -338055 126569 842406 1151638
38035 1151638 741979 -13286 -640052 -1279437 -2244592 -2996252 -2532539 -1037013 -24509
38026 -24509 -243605 -571119 50876 684603 -187314 -2108401 -3196586 -2871197 -2282711
38017 -2282711 -2053601 -1415122 -71245 712063 -144941 -1742882 -2194370 -937919 664589
38008 664589 858877 -696378 -2497270 -2595157 -736737 1152341 1156895 -336565 -1346640
37999 -1346640 -892384 249976 1139130 1625711 1642193 981543 183535 344965 1498602
37990 1498602 2315466 1965766 1166061 794845 613854 110414 -435315 -568361 -464962
37981 -464962 -339185 102884 846825 1082669 378669 -466129 -586132 -262258 -111416 79002
37971 79002 702656 1303004 1279430 949432 823259 506734 -470291 -1360818 -1104055 -111947
37961 -111947 214585 -487789 -1300286 -1610326 -1614099 -1312482 -372498 871838 1514855 1405519
37951 1405519 1301984 1530336 1574866 1187102 759743 318455 -683930 -2138771 -2980436
37942 -2980436 -2678305 -1991401 -1618871 -1173830 -332686 34212 -902196 -2204659 -2032360
37933 -2032360 -102051 1844987 2170887 1050466 -173450 -572018 -156906 618693 1313764
37924 1313764 1620916 1481896 1165997 1045423 1213849 1397544 1283587 892302 576814
37915 576814 652918 1049120 1330737 1095232 401515 -203425 -211458 261413 615607 566524
37905 566524 434374 369389 -182135 -1523256 -2594297 -1932023 196257 1819224 1834034
37896 1834034 1328880 1592212 2057931 1497020 276314 -217518 126472 208914 -77461
37887 -77461 383746 1634293 1968355 409707 -1653957 -2416558 -2015319 -1682164 -1517763
37878 -1517763 -640081 941509 2113692 2276969 1939319 1589182 1082871 425632 175008
37869 175008 576435 1021660 923144 619043 816545 1423700 1537866 606275 -820683 -1655481
37859 -1655481 -1391850 -485285 299600 683007 892526 1096042 1155748 975457 754426 717372
37849 717372 826679 930816 962707 817983 329982 -367056 -738029 -482958 -61192 -152178
37839 -152178 -722178 -1095561 -928097 -614795 -588049 -628308 -191285 743491 1460785 1255381
37829 1255381 307446 -400951 -233429 221313 -107438 -1154774 -1577732 -625590 593921
37820 593921 537369 -604045 -1251552 -744092 -22738 158927 356071 1086560 1504043 503606
37810 503606 -1503771 -3012206 -3250871 -2618197 -1629919 -561146 -9962 -581211 -1773386
37801 -1773386 -2268475 -1726921 -1283068 -1715018 -2153203 -1494629 -267625 112823 -479763
37792 -479763 -752817 -31659 806727 799940 246941 -63725 -159611 -524811 -914045 -568886
37782 -568886 416259 913052 291179 -594444 -513486 511235 1379532 1508065 1458391 1838924
37772 1838924 2316763 2203835 1545013 978954 723779 378065 -241825 -707349 -654751 -340214
37762 -340214 -173306 -94498 173291 552668 748454 754799 745762 585799 -18322 -876440
37752 -876440 -1360133 -1213024 -824152 -506283 -38893 704749 1194287 935024 402293 465633
37742 465633 909915 471551 -1247143 -2750072 -2379257 -576675 674251 563996 353910
37733 353910 1125493 1882059 1051351 -824344 -1428652 230274 2426518 3009628 2048118
37724 2048118 1261321 1476028 1825400 1396394 565267 223743 382492 291267 -254624 -486683
37714 -486683 183560 1109629 1114909 107837 -708139 -428204 439248 928553 1050285 1454492
37704 1454492 2061938 2065283 1248414 309088 -257239 -617526 -737960 -164190 855241 1111308
37694 1111308 73840 -1105218 -1125729 -330181 20237 -376713 -801953 -853092 -688744
37685 -688744 -240681 642259 1395684 1217706 327430 -331856 -655098 -1466831 -2847132
37676 -2847132 -3559507 -2678530 -871180 533072 1027636 909503 421507 -358388 -1088127
37667 -1088127 -1275261 -833683 -208520 118148 172064 473576 1321829 2130449 1945815 801825
37657 801825 -108126 -50377 244700 -64572 -445186 -32144 570835 106293 -1086434 -1373153
37647 -1373153 -368969 559976 565988 327447 327700 -71593 -1042260 -1449470 -648884 326857
37637 326857 492817 442515 912728 1173645 395147 -476027 62945 1678988 2690440
37628 2690440 2481236 1888815 1522840 1187674 810569 590904 298360 -413716 -1141194
37619 -1141194 -1269833 -1120846 -1394972 -1791931 -1499489 -789345 -644532 -922928 -519407
37610 -519407 530700 833285 -18199 -539449 348630 1506786 1197720 -427311 -1650351
37601 -1650351 -1476038 -541300 81630 154433 224769 723478 1296508 1112673 -58228 -1350740
37591 -1350740 -1807414 -1587841 -1508359 -1623660 -1214032 -174200 634013 655118 280684 -118373
37581 -118373 -781389 -1662253 -1947642 -1247315 -464144 -580320 -1174188 -1102646 -265908 303748
37571 303748 -1420 -603559 -655016 -87258 438182 252394 -729806 -1892786 -2448020 -2306005
37561 -2306005 -2231834 -2803815 -3454759 -3063166 -1420046 434189 1400440 1343279 769748
37552 769748 35989 -684972 -984272 -403992 869834 1932580 2001301 1106383 -156699
37543 -156699 -1214196 -1638841 -1159522 -91094 548360 71371 -826693 -839281 96513
37534 96513 642555 17287 -894024 -954052 -360588 3127 11101 87669 192658 136356 415470
37523 415470 1480834 2484754 2126122 673568 -240179 15340 282771 -442614 -1597691
37514 -1597691 -2153273 -1975849 -1398141 -461782 614507 1099855 752037 426245 829213
37505 829213 1326918 911893 -190601 -860172 -649297 -75205 396342 748539 923226
37496 923226 766425 456391 341079 421428 543607 838579 1269407 1086583 -240197 -1666501
37486 -1666501 -1377459 752788 2646604 2580014 1283148 625552 996235 1199606 627406
37477 627406 181833 729622 1677893 1759754 686999 -594808 -986627 -90261 1694228
37468 1694228 3370683 3875776 3011775 1767260 1203853 1201538 921456 249494 -187667
37459 -187667 -404039 -1209388 -2569997 -3072436 -1923669 -475691 -521089 -1697877 -1964884
37450 -1964884 -443281 1518293 2207923 1393380 98192 -555320 -63744 1099546 1668906
37441 1668906 875705 -370985 -454396 714125 1488040 820544 -339594 -650818 -373205
37432 -373205 -749059 -1965010 -2814357 -2319412 -899663 238163 420740 -4874 -357636
37423 -357636 -557250 -1081168 -1930791 -2214339 -1334030 -118229 144160 -469925 -778230
37414 -778230 -488626 -553728 -1257410 -1437948 -376758 833359 852866 1598 -547402 -605219
37404 -605219 -693277 -610782 226704 1306228 1343336 169775 -926651 -975907 -425983 -194040
37394 -194040 -489677 -926497 -1142750 -1030127 -841042 -1124604 -1968110 -2367228 -1210015
37385 -1210015 976828 2197505 1290533 -744638 -2182518 -2511249 -2275121 -1754819 -836423
37376 -836423 157111 576741 421658 318649 369088 -128334 -1430154 -2610226 -2715001
37367 -2715001 -2084677 -1710314 -1651280 -1112897 -46771 484720 -33769 -573591 -27544
37358 -27544 1075352 1355851 641273 60312 192038 346547 -46290 -461980 -279853 150880
37348 150880 228580 219561 731964 1441477 1351599 336410 -477907 -219686 476185 281494
37338 281494 -1036595 -2241449 -2135115 -987927 -131164 -381680 -1348572 -2239647 -2742817
37329 -2742817 -2874373 -2547525 -1826713 -1248076 -1278736 -1623834 -1612369 -1154485 -784332 -804520
37319 -804520 -877546 -485118 534725 1816257 2587190 2260124 1208869 495090 431292
37310 431292 103890 -1036575 -1977782 -1616114 -660837 -633907 -1482288 -1825948 -1311667 -933906
37300 -933906 -1045370 -946164 -658896 -1098761 -1973794 -1613044 217050 1358559 393363
37291 393363 -1117535 -1106937 -122419 -111549 -1273966 -2102054 -1847107 -1123036 -462679 155830
37281 155830 611884 763367 964604 1418419 1547949 1051190 807436 1486357 2093442 1405290
37271 1405290 118248 -112166 797514 1542445 1683702 1850173 1975540 1313644 221148
37262 221148 9173 785662 1206040 680076 142061 262575 575918 867515 1748715 3154239
37252 3154239 3812993 3085030 2024194 1733046 1807907 1313257 304251 -521722 -889773
37243 -889773 -875340 -461845 164353 515377 526576 722481 1250720 1532624 1307645 1161003
37233 1161003 1475663 1701020 1283887 572983 159985 -10534 -256209 -478738 -444348 -223258
37223 -223258 115335 716035 1450847 1791326 1553467 1240934 1361916 1942347 2820029 3691506
37213 3691506 3829711 2750299 1303424 937141 1607442 1759756 834077 242519 1040919
37204 1040919 2212786 2510696 2570151 3562221 4865580 4989966 4125623 3763001 4065454
37195 4065454 3699638 2497545 2285558 4208178 6720640 7424431 6034256 4375607 3866775
37186 3866775 4097560 3951488 3263943 2858866 3281150 4093359 4561686 4570975 4436566 4135492
37176 4135492 3420250 2642504 2645681 3564474 4421290 4294880 3299308 2073200 1019406
37167 1019406 517418 1059536 2388820 3172850 2506914 1310513 1232574 2434878 3464400
37158 3464400 3203371 1955524 607396 -258952 -237592 872635 2397458 2929673 1824230
37149 1824230 115108 -670347 -349350 -155737 -1056155 -2528961 -3183262 -2282650 -440789
37140 -440789 1040255 1316369 584454 -200418 -145527 785222 1681900 1631949 848991 467885
37130 467885 984212 1459015 862740 -283528 -544883 346576 1138669 944000 422722
37121 422722 628783 1548702 2385449 2622756 2215950 1315504 403513 172659 650474 927897
37111 927897 386950 -282188 -5223 1134311 2065442 2196984 1931890 1800063 1786151 1607691
37101 1607691 1184312 752328 764394 1539348 2744484 3478211 3211607 2391162 1777193
37092 1777193 1534839 1392250 1296468 1348960 1406990 1356857 1517828 2111731 2537878 1954771
37082 1954771 602478 -187769 440405 1792582 2442867 1870184 956065 855677 1606666
37073 1606666 2155998 1817501 1214184 1301805 1934955 2307180 2512830 3338225 4394993
37064 4394993 4079310 2101520 484556 798763 1744770 1169181 -505978 -914467 636317
37055 636317 2332981 2772814 2669081 2999336 3217045 2413765 1070857 463096 958373
37046 958373 1829529 2321627 2204888 1631331 1006025 709868 602072 210969 -306981 -25636
37036 -25636 1446275 3092435 3572346 2813775 1912605 1721882 2150523 2673861 2886763
37027 2886763 2546087 1652596 692238 395485 963351 1725082 1851435 1350830 1045748
37018 1045748 1454081 2040680 1955790 1262711 774721 688452 259796 -774978 -1356430 -508596
37008 -508596 1045678 1721168 1186748 561589 638997 1048050 1268786 1371471 1442950 1257427
36998 1257427 923468 1007028 1597764 2050564 2043793 2033770 2201862 1915639 930752 217210
36988 217210 660356 1660750 2068473 1943342 2202786 2858270 2918935 2112438 1490243 1901080
36978 1901080 2758450 2876522 1944707 667082 -134458 -69154 850380 2233290 3361249
36969 3361249 3647211 3180294 2605501 2342189 2095441 1381776 461613 285205 1201542
36960 1201542 2139432 1788375 497314 74272 1366035 2946101 2953647 1553344 553958
36951 553958 953014 1992162 2598588 2625537 2413830 2154924 2153195 2837306 3920724 4306583
36941 4306583 3501958 2462814 2277207 2630469 2506360 1899540 1671269 1928050 1812281
36932 1812281 1054621 567192 1066728 2064799 2748657 3029434 3117033 2833855 2112499 1558847
36922 1558847 1666525 1901051 1434550 510763 198278 876502 1751421 1915844 1296290
36913 1296290 555053 527079 1582522 3036476 3524035 2646981 1814848 2453976 3762085
36904 3762085 3654933 1943855 921993 2186852 4366650 5081815 4069821 3046706
36896 3046706 3126141 3769480 4128828 4206516 4427409 4834492 5045661 4679391 3724317 2669493
36886 2669493 2170666 2426571 3067217 3711490 4249542 4534188 4421128 4278614 4674083
36877 4674083 5266975 4981693 3806449 3321958 4551220 6303892 6827381 6216456 5786227
36868 5786227 5811630 5591559 5303018 5873005 7006851 7223227 6214527 5455893 5890205
36859 5890205 6605909 6592296 6328277 6620884 7124770 7157222 6969256 7051899 7056384 6602470
36849 6602470 6393922 7230697 8496609 8980953 8792356 9047945 9880621 10254309 9865428
36840 9865428 9759974 10562372 11303041 10776551 9265712 8153079 8310847 9483757 10870335
36831 10870335 11757476 11873634 11610118 11698870 12333579 12908345 12976238 13040513 13818181 15049624
36821 15049624 15803989 15864870 15979806 16582345 17092988 16937925 16600861 17010782 18296041
36812 18296041 19828965 21228074 22562521 23705053 24355638 24835999 26006991 28003019
36804 28003019 29757976 30355334 30329635 30989978 32814321 35183739 37453273 39513301 41308716
36795 41308716 42589796 43477135 44781181 47302696 50951827 54873595 58458271 62008588
36787 62008588 66236642 71189532 76063147 80367264 84926595 91076663 98934480 107259468
36779 107259468 115246148 123653945 133716578 145674667 158971748 173167546 187892185
36772 187892185 202607799 217439263 233702050 252393751 272410303 291416374 308296785
36765 308296785 323504844 337108493 347998152 355299882 359117319 359350326 355204168 346717858
36757 346717858 335540152 323115500 309110295 292841205 275393539 258818878 243643690
36750 243643690 228665608 213165726 197923201 183790164 170553965 157841701 146204015
36743 146204015 136453228 128392228 120941494 113362739 105821818 98812502 92485915 86648061
36735 86648061 81150456 76127497 71884965 68557120 65855920 63255308 60517020 57934568
36727 57934568 55886191 54203696 52266510 49846112 47576407 46219208 45544065 44418303
36719 44418303 42209645 39694403 38178285 37984646 38345741 38681093 39271521 40367804 41222910
36710 41222910 40718772 38890231 37187228 36918829 37831688 38704711 39140209 40041064 42087554
36701 42087554 44466553 45831915 46155586 46719539 48310245 50390718 52331606 54484332
36693 54484332 57366195 60487209 62824199 64082548 64743749 65126312 65089213 64464058 63131375
36684 63131375 60835178 57538699 53817222 50336743 47147962 44051672 41307779 39200608
36676 39200608 37189007 34464349 31302488 28895589 27722369 26964518 25720056 23945872
36668 23945872 21956194 19862346 17940875 16806870 16637245 16693918 16133319 14999744 14047271
36659 14047271 13803093 14078596 14258269 13938782 13374315 13202483 13564059 13774936 13219742
36650 13219742 12203241 11370438 10684920 9779258 9017513 9183474 10119043 10659852 10110737
36641 10110737 8965494 8004729 7485696 7397977 7702257 8052391 7988297 7638325 7608016 8050950
36631 8050950 8491509 8614084 8547474 8389110 8176990 8228900 8698640 8992722 8563537 7978485
36621 7978485 8054819 8318472 7804756 7051565 7413490 8490368 8467094 7322978 7253862 9051772
36611 9051772 10512899 9835376 8379238 8278856 9246473 9787045 9950263 10622828 11386242
36602 11386242 11446767 11721944 13587326 16221885 17621791 17852592 18860069 21137804 22992775
36593 22992775 23438232 23624321 24741450 26285522 27130509 26890241 25591255 23271939 20516902
36584 20516902 18329063 16987226 15924238 14933556 14435647 14364038 13965990 13026810 12186373
36575 12186373 11715855 11072491 10026607 9156849 8803739 8520325 7981297 7501636 7244711
36566 7244711 6827224 6145697 5756493 6004514 6504044 6802427 6843647 6584256 5971498 5476989
36556 5476989 5748307 6534084 6902694 6703057 6729561 7199368 7298509 6675622 6111911 6056424
36546 6056424 5748591 4702056 3952210 4686132 6417393 7670479 7922273 7755802 7484277
36537 7484277 6772128 5565009 4460764 3988882 4069650 4255466 4148078 3647623 3095296
36528 3095296 3016781 3441612 3705623 3261364 2469048 2199425 2741017 3415337 3321463 2367163
36518 2367163 1509430 1792854 3024273 3771750 3102068 1904573 1715715 2497304 2670230
36509 2670230 1466708 100568 70196 1213105 2178170 2210613 1713911 1402659 1563455
36500 1563455 2001217 2258097 1969711 1247339 580338 302864 427602 964116 1917451
36491 1917451 2934057 3506253 3625085 3675493 3658769 3233224 2595554 2424103 2689419 2497509
36481 2497509 1607871 1152514 2080172 3633375 4281139 3700795 2957065 2965367 3564545 4050489
36471 4050489 4013290 3571598 3112663 2848294 2577376 2055745 1518220 1388240 1513034 1340119
36461 1340119 921495 948757 1578444 2099435 2129040 2212796 2712797 3043562 2715703 2239727
36451 2239727 2143122 1948200 1156498 481859 867897 1828105 2096381 1598160 1397175 1804732
36441 1804732 1968818 1513225 1219794 1601077 1944574 1464879 558036 174516 529146
36432 529146 1109096 1531075 1742879 1647273 1123090 333703 -382921 -828037 -856449 -219503
36422 -219503 1044555 2185572 2272863 1295957 286958 71409 261785 -78100 -1008051
36413 -1008051 -1572354 -1144846 -284530 89878 -132345 -424618 -567003 -733162 -814482 -408564
36403 -408564 451171 1188132 1442496 1393781 1225322 882930 556400 757944 1574984 2363185
36393 2363185 2536720 2214450 1778441 1300953 789460 495244 500103 422768 53121 -92054
36383 -92054 570181 1724944 2461676 2439719 2187602 2186382 2137873 1421774 110735 -774412
36373 -774412 -256047 1331855 2396893 1742101 -47106 -1298837 -1134024 -81448 982845
36364 982845 1661345 1746410 1069268 66626 -254883 505334 1490358 1610509 864732 247412
36354 247412 612737 1862128 2974075 2793301 1225998 -375952 -603763 311781 936910
36345 936910 622195 -5339 -493755 -1111067 -1641448 -1183202 145364 770817 -75929
36336 -75929 -1016940 -637836 319943 326507 -446105 -675662 -184014 57133 -213088 -322452
36326 -322452 -83442 69117 233591 947479 2017099 2715872 3024763 3412726 3562181
36317 3562181 2691621 1081026 -85446 -391882 -414193 -374796 8788 403857 143871
36308 143871 -334490 28316 880308 711280 -519452 -937783 363318 1843288 1897228
36299 1897228 1030480 473841 191816 -289128 -382605 576126 1768982 1933572 1330760
36290 1330760 1162877 1501637 1287862 161971 -1056117 -1633351 -1516448 -763389 472944
36281 472944 1400096 1146853 59418 -477549 258803 1553100 2345127 2381437 2029200
36272 2029200 1561191 1021018 526364 419872 1024488 2062734 2405403 1064117 -1265440
36263 -1265440 -2450386 -1383393 530730 1255908 777880 612559 1186177 1371319 659793
36254 659793 92937 465083 1045371 957616 692367 1210501 2366675 3275740 3643031 3713255
36244 3713255 3408477 2618801 2003678 2316354 3035329 2863242 1719704 1051322 1731928
36235 1731928 2743972 2711858 1929506 1847495 2926786 4038576 4045337 3150761 2369813 2208634
36225 2208634 2304434 2134894 1677732 1314893 1274052 1332502 1138066 719299 450842 490845
36215 490845 565291 478203 483017 790828 1012806 651177 44143 188105 1454888 2979202
36205 2979202 3582829 2963436 1743436 673588 72146 -178465 -352443 -509881 -353471
36196 -353471 315874 1023916 980099 176410 -399789 -7540 863798 1227711 911210 535375
36186 535375 470762 481906 277286 -245719 -1228371 -2594962 -3526475 -3005053 -1188289 478218
36176 478218 972255 869732 1205891 1789143 1603944 584296 -174974 -122306 -37585 -590609
36166 -590609 -1136591 -874871 -410098 -843349 -1696184 -1329150 375114 1335180 49204
36157 49204 -2236132 -3216184 -2391323 -989811 148509 1075440 1581664 1225473 533871
36148 533871 678234 1727742 2538992 2586063 2515427 2586355 2093302 924193 172432 329144
36138 329144 268744 -884630 -2154910 -2256483 -1627403 -1457050 -1592218 -1077471 -193614
36129 -193614 -166598 -978240 -1142861 59852 1470556 1637799 576741 -506107 -621639
36120 -621639 164004 877465 532021 -800633 -1934483 -1906995 -1060335 -401238 -351525 -647955
36110 -647955 -933461 -806871 133061 1550077 2267099 1692214 706423 307977 212942 -134687
36100 -134687 -141199 836078 1764625 1163670 -362068 -738279 532484 1802415 1827968 1052519
36090 1052519 127895 -975397 -1918113 -1837412 -934817 -660050 -1568175 -2404982 -2072669
36081 -2072669 -1165315 -747945 -832206 -887859 -802301 -596846 -153252 227075 4106 -486693
36071 -486693 -321644 287116 83964 -915379 -974211 615737 2079291 1666212 82396
36062 82396 -925159 -1030531 -944218 -801761 -430022 -187525 -170347 376305 1572405 2072870
36052 2072870 1152774 228745 559484 864669 -566983 -2619091 -2800025 -1169082 -39265
36043 -39265 -147322 -39431 657518 413166 -1002942 -1356789 598587 2823242 2866875
36034 2866875 1258845 179435 120330 -116825 -915407 -1363591 -1087973 -851636 -1081907
36025 -1081907 -1112463 -387723 466264 398848 -661644 -1705006 -1857396 -1310554 -877719
36016 -877719 -876990 -891827 -689112 -783808 -1598577 -2481349 -2327780 -1099741 25731 151947
36006 151947 -337955 -514095 -82817 507817 762081 551830 4483 -710877 -1430672 -1917582
35996 -1917582 -1891832 -1364477 -878901 -980048 -1336515 -978049 271997 1272984 1082888
35987 1082888 402839 654494 1999377 3240574 3556994 3391523 3525026 4042250 4417996
35978 4417996 4128288 3115500 2004254 1644193 2000398 1932893 757324 -508324 -475338
35969 -475338 452860 558857 -664473 -1876320 -1950927 -1284495 -619869 81523 884667
35960 884667 1161688 537279 -292920 -534497 -363244 -254803 -30915 502113 690976 -22093
35950 -22093 -745034 -13606 2013197 3394410 2745701 899920 -175035 438409 1891791
35941 1891791 2674965 2064093 608902 -565116 -864372 -576156 -136105 577317 1829474
35932 1829474 3151348 3533585 2669181 1483379 1046729 1277548 1184191 258644 -878134
35923 -878134 -1293823 -755365 292219 1350437 2088937 2236738 1778069 1190909 1032136
35914 1032136 1292255 1575568 1846803 2426993 3207199 3526513 3063455 2265877 1620494
35905 1620494 1064554 426434 -147582 -565549 -977190 -1221748 -816920 19484 193629
35896 193629 -672039 -1296729 -393576 1408280 2443249 2271832 1767521 1336416 570285
35887 570285 -351617 -462739 396359 1058922 655485 -265097 -779602 -837080 -861579 -894376
35877 -894376 -792148 -715168 -852196 -1084948 -1301053 -1557071 -1636592 -1066115 32373 737448
35867 737448 498278 -29990 97125 795375 1178669 811663 97855 -465574 -826458 -1083057
35857 -1083057 -1096661 -674776 5891 429596 286892 -176156 -536186 -720754 -781725 -384162
35847 -384162 705746 1648875 1164918 -456477 -1208554 -80245 1294137 963619 -466463
35838 -466463 -1002611 -475534 -484011 -1479374 -2153745 -1867427 -1502073 -1450478 -893883 184605
35828 184605 355895 -822618 -1643849 -818829 508532 761247 353872 467312 808712
35819 808712 458399 -157303 -75487 275718 -106492 -737749 -373177 709848 1167664 985109
35809 985109 1307925 2002476 1632934 176287 -457896 604146 1670004 1050119 -436721
35800 -436721 -910017 -236337 119574 -539413 -1323090 -1236357 -488400 -94952 -616745 -1457536
35790 -1457536 -1424901 -160952 1155103 1061962 -338192 -1575443 -1852596 -1806662 -1918721
35781 -1918721 -1470727 -18265 1182015 650861 -936221 -1412024 -151691 1062811 679598
35772 679598 -447715 -460715 834274 1915226 1796473 1115805 881485 1184687 1574436
35763 1574436 1894460 2118549 1905392 1045554 73339 -256951 -5377 47824 -490626 -1178385
35753 -1178385 -1451010 -1269313 -931216 -664732 -539653 -454121 -176870 255014 270703 -573178
35743 -573178 -1676887 -1798148 -572891 917597 1366373 580935 -608943 -1309747 -1166776
35734 -1166776 -440932 199553 238117 -161230 -415620 -271463 110431 681993 1461788 1991473
35724 1991473 1653392 688033 70411 106802 -9191 -863535 -1863638 -2110994 -1529862
35715 -1529862 -636245 164917 595102 474949 125492 151235 480441 391658 -209455 -551077
35705 -551077 -440521 -710629 -1544897 -1716211 -540167 718694 751858 319516 754377
35696 754377 1333436 273207 -2038574 -3022402 -1431584 905302 1507691 97550 -1621996
35687 -1621996 -2072946 -1091386 245042 683130 73643 -441591 26681 798969 710497
35678 710497 50372 106875 906757 936884 -477425 -1843815 -1337041 854688 2760125
35669 2760125 2782051 1157623 -464959 -685460 230876 689299 -231952 -1545455 -1705540
35660 -1705540 -700526 125413 17362 -484335 -653640 -343943 346586 1204541 1691102
35651 1691102 1496713 1224817 1619905 2319863 2404057 1899063 1509268 1130712 117322
35642 117322 -1107022 -1364979 -718852 -397117 -516446 191073 1842904 2606790 1423022
35633 1423022 -240337 -563359 213006 834793 1091328 1351199 1200235 131206 -1195170
35624 -1195170 -1794130 -1798942 -1812276 -1569631 -608279 398946 442498 -162298 -354036 -219844
35614 -219844 -824460 -2242254 -3174602 -2722154 -1419152 -272038 297570 304748 -186454
35605 -186454 -920314 -1393654 -1251346 -616192 -37526 -109161 -804049 -1192261 -465644 664783
35595 664783 556249 -1021466 -2277636 -1842371 -625198 -171456 -285963 242473 1358180
35586 1358180 1860268 1418030 857763 575651 178456 -249060 47410 1140389 2044919
35577 2044919 1995793 1178939 68285 -1015285 -1587894 -1232705 -328622 299140 537219
35568 537219 948373 1595493 1864335 1514017 960619 475966 58141 66113 875461 1844824
35558 1844824 1796300 690441 -316551 -620898 -729167 -899107 -658105 -78499 -64154
35549 -64154 -747839 -1017487 -373289 195338 107335 437266 1946922 3227838 2521540 479668
35539 479668 -710619 -434329 -75900 -520816 -986737 -594448 334869 999880 1078246 598220
35529 598220 -264087 -976918 -1047151 -823055 -1093876 -1739366 -1704074 -594923 630991 1007388
35519 1007388 749213 591852 700715 847159 1051008 1404107 1701717 1787524 1853007 1966058
35509 1966058 1830235 1473851 1516446 2108384 2320041 1509598 681246 1245102 2721985
35500 2721985 3071982 1434697 -739678 -1683537 -1288755 -511811 158972 791022 1272108
35491 1272108 1372730 1160041 730595 -15348 -781830 -703118 462536 1565031 1446377
35482 1446377 616460 476099 1247607 1914037 2011100 2080347 2263260 1916035 1050943 774071
35472 774071 1555890 2255948 1792025 788858 498974 869565 881737 298732 -169404 -230809
35462 -230809 -373281 -818702 -1102886 -891668 -440559 -30090 396049 783520 719420 -37882
35452 -37882 -1102542 -1755309 -1510835 -383782 1114757 2215449 2445857 2082466 1885643
35443 1885643 2311830 3060195 3389711 2877318 1943444 1510417 1873028 2112550 1233535
35434 1233535 -205686 -523916 768702 2137745 2147040 1405938 1379798 2062978 2165513
35425 2165513 1202131 15040 -694116 -1057658 -1167179 -747671 -37675 82080 -670205
35416 -670205 -1428216 -1327459 -542086 191848 473135 341578 66677 82313 573299 996119
35406 996119 689005 48025 201779 1271903 1986694 1549772 893114 1243221 2218012
35397 2218012 2375756 1248261 -155243 -764348 -571909 -270084 -319812 -557689 -509599
35388 -509599 -49793 276416 -145419 -1060923 -1482406 -929319 -20592 433981 401531 329794
35378 329794 395860 497504 589818 622986 505951 435241 797173 1442665 1632362 1064273
35368 1064273 308070 -180510 -661366 -1169611 -968823 114641 731722 -325687 -2162710
35359 -2162710 -2926335 -2427745 -1977578 -1867061 -964347 896409 2076548 1523632 366594
35350 366594 11372 40410 -606664 -1468834 -1240254 7812 931577 1008371 1001213 1331368
35340 1331368 1457232 1166554 1168016 1853711 2531437 2516631 2131034 1960471 1836129 1253758
35330 1253758 282423 -566369 -962378 -791490 -82978 645977 603893 -161449 -553252 -1149
35320 -1149 546144 138049 -462402 106465 1502895 2021518 1053166 -323738 -1215378 -1779384
35310 -1779384 -2013992 -1393416 -268340 18098 -778922 -1172119 -382418 221919 -512033
35301 -512033 -1295108 -405645 1281680 1512207 221790 -472895 280976 956740 355771
35292 355771 -661378 -933752 -757640 -874038 -1036896 -680813 -84469 85507 -283622
35283 -283622 -955819 -1797588 -2432764 -2214441 -1197179 -429339 -618798 -1175011 -1229597 -923496
35273 -923496 -912965 -1162695 -1067962 -453051 245149 587155 460691 66427 -98934 366570
35263 366570 1112789 1274655 652899 34664 -10567 81722 -217014 -580508 -446210 67606
35253 67606 554101 1019845 1460984 1334343 320781 -819052 -1037041 -382023 177403
35244 177403 86338 -361816 -757289 -1078890 -1507306 -2132921 -2707385 -2525544 -1070224 936042
35234 936042 1842701 967261 -496167 -1034641 -521403 297730 1098508 1774716 1782029 940478
35224 940478 315743 1000908 2406436 3007766 2448081 1624589 1021630 386674 -120568
35215 -120568 4921 341099 -153589 -1302881 -1631495 -562346 649021 780318 236339
35206 236339 25377 170125 60798 -288068 -255374 377180 1065330 1124735 508689 5109
35196 5109 461757 1566023 1906285 879021 -117650 484287 1933343 2075849 598707
35187 598707 -471902 167656 1361674 1551873 901501 332652 -102539 -648642 -851582
35178 -851582 -470774 -390942 -1256561 -2062737 -1553303 -291370 216741 -103501 -77568 489114
35168 489114 577632 14025 -29302 902425 1529593 719562 -796619 -1551848 -1311899 -875459
35158 -875459 -506283 271963 1463865 2228171 1955255 1018097 136051 -467121 -874776
35149 -874776 -914723 -399054 284878 515542 386234 592914 1182339 1234436 290957 -717189
35139 -717189 -805049 -498987 -918089 -1778112 -1773135 -841957 -425419 -1102836 -1559731 -692323
35129 -692323 659464 1172356 1069818 1332399 1701620 1036326 -624663 -1787149 -1433982
35120 -1433982 -204909 589781 414808 -235671 -542632 -180818 349457 313059 -259605
35111 -259605 -615567 -473105 -420444 -750794 -841288 -354955 -39258 -363066 -403906 587128
35101 587128 1482014 859610 -425150 -327702 1041396 1466220 239463 -644403 261849
35092 261849 1587511 1471029 385118 -42566 284156 286988 -66038 205244 1137103 1582220
35082 1582220 978562 20435 -554840 -703075 -490537 98759 571223 239155 -528391
35073 -528391 -432818 837279 1805554 1151690 -286937 -541938 750034 1768799 905545
35064 905545 -1133974 -2229460 -1418149 153345 844106 419212 -74833 58227 353504
35055 353504 109172 -485835 -645317 -159974 302634 165145 -259927 -267264 195100 432530
35045 432530 -8760 -686281 -881650 -593236 -437372 -638273 -715483 -384334 -164455 -575601
35035 -575601 -1181560 -1182266 -729892 -748578 -1389814 -1676307 -1124250 -760402 -1631213 -2937631
35025 -2937631 -2860414 -1126779 461120 414146 -558318 -760383 141255 955382 793672
35016 793672 -3456 -772378 -1303148 -1374516 -512450 1067963 2044625 1485254 280538
35007 280538 -25091 442906 81028 -1554607 -2770848 -2094846 -379712 519528 283849
34998 283849 48144 305425 326427 -346493 -1058638 -976800 105 1450121 2756291 3103591
34988 3103591 2032452 273560 -756261 -599492 -187074 -388972 -968242 -1319511 -1338975
34979 -1338975 -1011143 -720 1572067 2644960 2404476 1513012 1262048 1782209 1956301
34970 1956301 1017554 -521618 -1583269 -1597012 -782221 241399 1046212 1747013 2621766
34961 2621766 3365014 3243701 2228955 1261517 877575 352066 -938384 -2022144 -1476068
34952 -1476068 259999 1129446 155148 -1396509 -1973358 -1733136 -1870633 -2746492 -3520705
34943 -3520705 -3293598 -1999701 -355292 697959 668574 -132987 -1075150 -2000979 -3103029
34934 -3103029 -4037833 -3914810 -2481157 -677417 413609 653788 519181 299581 140460
34925 140460 288378 622653 412318 -717420 -1931698 -2079687 -1196386 -329158 -65704
34916 -65704 -109268 -243361 -730854 -1530251 -1978754 -1655243 -900771 -111665 825236 1921334
34906 1921334 2548191 2190833 1327091 834407 750547 349544 -619258 -1499145 -1688984 -1445796
34896 -1445796 -1430208 -1845889 -2323254 -2382954 -1767502 -560610 758219 1568742 1676955
34887 1676955 1489594 1439429 1477464 1415547 1470163 1931062 2405232 2067802 869637 -97968
34877 -97968 107214 1001797 1233320 251399 -1121521 -1809971 -1676457 -1382699 -1399769 -1481140
34867 -1481140 -1069794 -64723 872847 856729 -271338 -1617626 -2088769 -1551226 -900775
34858 -900775 -963391 -1605409 -2026852 -1681339 -762216 21899 27445 -755838 -1565232 -1496243
34848 -1496243 -445176 758525 1302491 1210546 976304 694600 54919 -872714 -1412247
34839 -1412247 -1102627 -393205 -125921 -447608 -677656 -368546 -48402 -452174 -1250333
34830 -1250333 -1273983 -182727 858193 748608 64297 157681 1025156 1308904 469621
34821 469621 -391512 -372068 -130215 -490522 -801458 -6294 1359317 1741382 856791 -35854
34811 -35854 -121284 132362 305503 788390 1710930 2323763 2092104 1405760 624191 -494402
34801 -494402 -1688607 -1708829 -69950 1635442 1518807 -99206 -1299306 -1227777 -685939
34792 -685939 -281267 358701 1254305 1493013 711852 13190 480837 1548547 1800597
34783 1800597 950453 93886 115121 635889 726842 147767 -478780 -588518 -403521 -474039
34773 -474039 -652374 -140751 1128857 1848626 916049 -736121 -1075123 223647 1198942
34764 1198942 351483 -1246086 -1584837 -579899 38774 -665289 -1715100 -1854348 -1116996
34755 -1116996 -262434 450224 1155843 1578900 1232766 376296 27594 741780 1849635
34746 1849635 2323765 2110198 2043498 2493563 2766896 2159728 1040935 324754 248995 377404
34736 377404 572279 1093380 1730995 1783989 1175801 717610 819182 781184 14429 -807560
34726 -807560 -713143 -25610 26184 -929231 -1991413 -2323614 -2052093 -1704199 -1476069 -1306667
34716 -1306667 -1161871 -1011551 -842737 -753175 -744673 -534674 48489 679134 1033372 1413043
34706 1413043 2178944 2763129 2156915 441657 -1065477 -1425780 -1034726 -705858 -646923
34697 -646923 -749285 -1067163 -1424926 -1232686 -345487 454892 506039 304008 769687 1840067
34687 1840067 2534865 2220198 1161356 3090 -680164 -487307 484751 1444178 1589365
34678 1589365 994336 371361 66182 -173381 -496369 -629405 -367195 107188 549942
34669 549942 936112 1265494 1357749 965824 -8674 -1328564 -2322480 -2238506 -1002927 597242
34659 597242 1782695 2494573 2865479 2516563 1170170 -353000 -738656 170860 1170902
34650 1170902 1268060 676496 73467 -323706 -598729 -736228 -761169 -764991 -568874 73189
34640 73189 801861 912336 466302 273389 481840 228025 -779818 -1424986 -762734 540956
34630 540956 1361353 1795872 2458097 2897101 2278038 1171238 958863 1568244 1541153 592909
34620 592909 324163 1643620 3002836 2366843 -11850 -1955165 -1965392 -505884 981422
34611 981422 1497698 1050155 385881 167306 249723 41749 -436733 -531813 -140148 -24333
34601 -24333 -532161 -941596 -713160 -436061 -651462 -657565 332554 1568321 1699126 903212
34591 903212 591130 1128176 1364572 597623 -421760 -852766 -875640 -877644 -640321 -51999
34581 -51999 260941 -220137 -1078418 -1609948 -1687131 -1422384 -682436 366288 897264 468773
34571 468773 -56977 456546 1786091 2635556 2374841 1601696 998575 530680 21039
34562 21039 -216259 206517 1055172 1592121 1302155 354423 -551887 -741475 -115115 742658
34552 742658 1073519 649271 -12298 -156455 423299 1116355 1168658 646392 379046 745885
34542 745885 1035252 547405 -185397 -215931 82878 -645238 -2543305 -3975925 -3643548
34533 -3643548 -2093793 -498255 868297 2026432 2358794 1570683 707231 798175 1162082
34524 1162082 577313 -417799 -200304 1135609 1581796 182930 -1517646 -1708258 -593053
34515 -593053 393655 511528 -72037 -1069758 -2061307 -2287828 -1396492 -104060 515335
34506 515335 156238 -669667 -1279280 -1166504 -250374 796351 983839 188463 -619317
34497 -619317 -692117 -399706 -347938 -342996 71022 637824 748883 390177 14357 -228801
34487 -228801 -500515 -773248 -848712 -604263 125376 1387670 2430253 1976576 -61342
34478 -61342 -1895000 -1892839 -708272 -234752 -929768 -1544014 -1285475 -752074 -548673 -380209
34468 -380209 8138 161963 -185639 -474532 -226315 152717 110224 -145250 -122150 73900
34458 73900 -19910 -444611 -828067 -933498 -785979 -474372 -140612 59806 188175 427235
34448 427235 660475 583759 314315 276334 347162 -60312 -742702 -534903 914807 2157154
34438 2157154 1776349 458704 -70474 340355 284685 -685841 -1265657 -551288 552524
34429 552524 927357 949246 1441584 1915487 1330678 118058 -113163 1078463 2269810
34420 2269810 2156227 1078045 50219 -680612 -1301005 -1455957 -669951 597850 1284260
34411 1284260 1028270 359792 -338065 -1174869 -1964471 -2061823 -1462057 -1278518 -2385601
34402 -2385601 -4044618 -4676967 -3812331 -2502589 -1802106 -1599381 -1214134 -509016 96276
34393 96276 355087 386736 265876 -75584 -494760 -622516 -372700 -119780 -117859 -36995
34383 -36995 548512 1393573 1783455 1502128 1118887 1165342 1487771 1681467 1711894 1667755
34373 1667755 1277210 291870 -808671 -1140759 -480847 507753 1123434 1161430 599736
34364 599736 -541483 -1791265 -2326329 -1862538 -974827 -255397 262239 531399 152937
34355 152937 -724730 -902835 455194 2317926 2801095 1568931 153209 -162673 328789
34346 328789 798697 1108177 1384931 1310291 684633 104353 222191 735950 919755 811817
34336 811817 968858 1250950 888609 -153924 -880140 -664663 -88961 116118 162351 521291
34326 521291 805973 319854 -587624 -775266 39060 857768 912401 702214 1010792 1636932
34316 1636932 1844365 1559936 1257849 915374 27174 -1281400 -2016659 -1534540 -398153
34307 -398153 367219 432965 204571 90487 184946 412089 502261 -26679 -1347756 -2762071
34297 -2762071 -3142118 -2162039 -772322 -155810 -397050 -551513 53 719165 699894
34288 699894 -14997 -392966 309376 1631685 2396477 1805202 -22528 -2198131 -3571274
34279 -3571274 -3508548 -2471282 -1528696 -1133545 -833453 -361830 -258143 -883907 -1570984
34270 -1570984 -1552537 -1121130 -905643 -568188 569074 1980480 2414325 1803808 1272560
34261 1272560 1167492 614654 -628233 -1423526 -1008712 -124929 383005 798670 1469239
34252 1469239 1786698 1381252 1228421 2223478 3482132 3460116 2201427 1135449 1018132
34243 1018132 1313159 1347844 931660 11426 -1234502 -2080988 -1945820 -1247487 -798509
34234 -798509 -642482 -315501 98144 84970 -411167 -1050260 -1689290 -2135671 -1839797 -736168
34224 -736168 206265 266758 102431 466027 680638 -79131 -814903 19786 1749829 2148086
34214 2148086 778104 -510722 -599208 -389026 -595422 -466499 391502 871615 196820
34205 196820 -718464 -871170 -695196 -884925 -1084609 -914653 -983916 -1630383 -1885421 -1025544
34195 -1025544 -14382 31231 -239848 386929 1451855 1539979 696874 338258 912201
34186 912201 1303921 727615 -182258 -520174 -253964 207379 750897 1360168 1682872 1278050
34176 1278050 209336 -777575 -779715 341238 1587231 1775831 899717 8223 -305004
34167 -305004 -525613 -1102341 -1597492 -1469131 -948609 -529055 -198448 224948 543192 528256
34157 528256 354560 253785 229310 391404 913546 1401137 1148719 362450 172465 988031
34147 988031 1836591 1833279 1258050 658510 65062 -290341 222181 1343673 1788409 1240272
34137 1240272 1023512 1804653 2294347 1542814 772383 1200127 1704950 785743 -604072
34128 -604072 -617931 240026 104768 -830518 -738939 410298 787000 87015 70749 1252270
34118 1252270 1808917 673750 -722395 -914878 -514054 -635173 -1029942 -1067120 -1075941 -1465119
34108 -1465119 -1726703 -1403706 -958465 -764624 -360174 393110 538151 -578918 -2077436
34099 -2077436 -2665083 -2216965 -1444154 -762398 -242954 3824 58239 224228 439312 349463
34089 349463 188209 625200 1478445 1701558 1042324 542652 910246 1584114 1954614 2269474
34079 2269474 2676007 2603789 1892331 1416223 1783409 2422652 2674250 2738243 2855935 2664827
34069 2664827 2093900 1792705 1982791 2047603 1870626 2168944 2771404 2226996 199735
34060 199735 -1417499 -1147353 -102775 59769 -199606 348271 1010564 169520 -1748139
34051 -1748139 -2577812 -1458792 349403 1552126 1993053 1836574 1200334 638940 645330
34042 645330 759541 393101 188690 1121144 2560071 2835075 1637299 328800 -118189
34033 -118189 -21846 155242 379559 407523 -48783 -492383 -313567 -151499 -1032879 -2266663
34023 -2266663 -2035071 -261174 1023276 644599 -235260 -304103 44666 29584 21460 507555
34013 507555 818396 252894 -477828 -246137 722936 1242212 823503 -33362 -762758 -1087270
34003 -1087270 -896309 -548783 -823492 -1821970 -2457557 -1860355 -749829 -441572 -930430
33994 -930430 -1093321 -598732 -382570 -1015337 -1674729 -1319359 -190211 564521 450954
33985 450954 123206 286743 707797 688004 165406 -264344 -375643 -638560 -1221521 -1386302
33975 -1386302 -545690 581781 760313 -36230 -598066 -180449 631619 905702 422645
33966 422645 -488802 -1480711 -2224255 -2450513 -2228740 -1825304 -1252298 -454937 145412 38663
33956 38663 -444861 -456291 32461 195607 -129411 -41792 788575 1230563 301014 -1239246
33946 -1239246 -1924565 -1555431 -1030553 -675365 27526 1112215 1675976 1071336 -202148
33937 -202148 -1182037 -1551402 -1706480 -1979709 -2157430 -1831087 -1080728 -554385 -692731 -1116634
33927 -1116634 -1199979 -1067935 -1366219 -2052173 -2268075 -1690468 -1115048 -1140175 -1088328 -66940
33917 -66940 1515694 2484228 2565878 2462276 2391175 1679950 49836 -1628943 -2341597 -2070982
33907 -2070982 -1488855 -1021641 -748515 -842391 -1432360 -2080983 -2005667 -1029263 102717 641905
33897 641905 722624 880131 971926 356859 -767645 -1123359 -35697 1349094 1423204 264533
33887 264533 -597793 -348445 329340 662312 748652 766301 395032 -353901 -731088 -399755
33877 -399755 -100772 -371923 -498404 253238 1156458 1033905 186818 -90792 337535 286258
33867 286258 -646574 -1257423 -569268 656496 1029636 394429 -256327 -311932 -180370 -448090
33857 -448090 -1000626 -1211630 -813815 -349472 -603576 -1619275 -2560487 -2679732 -2058805
33848 -2058805 -1148762 -111496 827291 921544 -225162 -1573072 -1591849 -416876 133881
33839 133881 -829394 -1801866 -949190 1223350 2523776 2042242 1143113 1307811 2130826
33830 2130826 2126853 859737 -561652 -948645 -324777 373899 444729 -7573 -427139 -430590
33820 -430590 -61712 390331 711719 911521 1097062 1290503 1469558 1714157 2047320 2086731
33810 2086731 1270215 -251519 -1338583 -1079018 -73717 270257 -274857 -439229 513385
33801 513385 1421898 740503 -1240889 -2750065 -2830877 -2223856 -1936861 -1960625 -1757513 -1264603
33791 -1264603 -902011 -975554 -1395300 -1701376 -1257212 145509 1718472 2202150 1212186
33782 1212186 -364208 -1537333 -2264149 -2963456 -3482817 -3166703 -1817450 -120892 928127
33773 928127 859194 89646 -449077 -255812 121646 -223192 -1175442 -1517700 -590419 599491
33763 599491 634918 -350246 -859192 -100472 1062411 1509750 1403854 1662368 2301120 2159364
33753 2159364 500566 -1671054 -2502396 -1484132 -159896 -242543 -1448295 -1950893 -860963
33744 -860963 748343 1606156 1945133 2531339 2832218 1611660 -787417 -2244947 -1438161
33735 -1438161 505214 1635389 1571417 1348599 1515727 1551948 1064996 510054 420185 642450
33725 642450 742560 694101 749326 938989 1125380 1375015 1847418 2349446 2411706 1905131
33715 1905131 1219912 657059 39211 -717241 -1050347 -461141 406938 336834 -617103 -884771
33705 -884771 392947 1859643 1721049 296220 -603674 -443724 -440847 -1210976 -1724445
33696 -1724445 -1211552 -480318 -359269 -254180 500035 1106010 662903 66734 755662
33687 755662 2166908 2358638 962541 -361940 -532682 -300806 -492388 -659907 -209822
33678 -209822 457369 738620 753267 812620 831924 764918 766320 604824 -73415 -668424 -112662
33667 -112662 1218083 1618959 676027 60874 766089 1355154 410640 -923409 -741748
33658 -741748 531242 957685 156695 -580138 -727681 -952046 -1312482 -1083924 -412647
33649 -412647 -277181 -668931 -597751 -88385 -347198 -1573774 -2370094 -1886665 -972411 -595199
33639 -595199 -604998 -669182 -974582 -1346841 -1103622 -466010 -654161 -1816061 -2389321 -1485885
33629 -1485885 -395958 -496020 -1038830 -512026 865319 1588926 1124639 262759 -336037
33620 -336037 -687239 -887473 -999382 -1227244 -1435379 -1009861 68417 764947 487400
33611 487400 182438 859174 1900149 2156858 1905154 2131626 2498902 1811656 209536
33602 209536 -931028 -1253470 -1757302 -2659682 -2766734 -1596426 -468180 -534882 -1086189
33593 -1086189 -945447 -483188 -882768 -2015842 -2463556 -1586678 -385607 27243 -67704
33584 -67704 342705 1295787 1651741 747722 -463935 -569106 382686 997502 572283 -30959
33574 -30959 48493 272535 -261354 -1161043 -1264792 -467748 131470 -110536 -587314 -513303
33564 -513303 -1133 277961 51089 -225812 144615 1261842 2216287 1873015 285046
33555 285046 -1169218 -1405783 -801942 -290973 -26298 334865 699837 788749 782817 862328
33545 862328 646628 -54194 -618367 -700189 -1064488 -2094395 -2458426 -993973 899708
33536 899708 910204 -579024 -936643 635418 1980897 1468636 156330 -472834 -666756
33527 -666756 -960296 -581797 988302 2379169 2036298 522188 -471029 -524668 -428282
33518 -428282 -502122 -466431 -403350 -515965 -419528 177688 661696 483031 247115 640855
33508 640855 1022383 484759 -324442 -43216 1129990 1613128 768652 -419933 -989125
33499 -989125 -945409 -521967 207765 811428 736150 208010 -103882 -253964 -699510 -933701
33489 -933701 103906 2058657 3083602 2244807 739204 112253 404626 749416 765200
33480 765200 567076 254131 148698 764039 1791530 1927318 588117 -933558 -1078425
33471 -1078425 -229126 -99363 -1162142 -1973638 -1271242 329270 1259704 899193 -81527
33462 -81527 -838995 -1122215 -1023993 -612715 -39623 377427 503260 617204 978256 1310176
33452 1310176 1121863 491419 70801 243176 746004 1255189 1795651 2316951 2446468
33443 2446468 2092111 1778571 1890412 2066605 1892375 1670789 1825496 2029767 1735106
33434 1735106 1129391 681068 185828 -640588 -1022958 12583 1723713 2133140 725339
33425 725339 -775826 -850866 -29485 468341 631649 1093790 1645264 1575164 965738 572540
33415 572540 761159 1382907 2252626 2949916 2718644 1526357 679818 1257089 2362607
33406 2362607 2239422 875680 46715 651154 1456607 1028032 -266923 -944375 -326072
33397 -326072 946185 1831511 1765698 967352 262549 319385 882939 1150085 913377 702566
33387 702566 746511 659398 393447 518573 1075186 1142725 261437 -641976 -635034 -224986
33377 -224986 -358438 -773016 -664781 -363233 -756431 -1391199 -934312 400422 716065
33368 716065 -763312 -2434307 -2697638 -2097067 -1952116 -2136799 -1655041 -575501 104843
33359 104843 80937 -95535 -174271 -325199 -347435 37611 270698 -426643 -1552588 -1699065
33349 -1699065 -545854 743977 1345409 1704146 2194894 2145365 1070817 -78978 16307
33340 16307 1218192 2102927 1769112 737055 79470 208217 658878 832486 758759 939052
33330 939052 1388697 1346972 466272 -235420 383504 1662865 1780325 431962 -586065
33321 -586065 -9894 1115407 1232623 578670 391000 739256 673780 57778 -257072 2570
33311 2570 104816 -384101 -916502 -850094 -249183 413531 768122 662136 270557 87098
33301 87098 349012 608415 367201 -117404 -277672 -201962 -389173 -734992 -634872 -77326
33291 -77326 221193 -59133 -272815 366071 1786353 3027039 3042393 1729099 299687
33282 299687 126772 958851 1124018 30447 -708827 260830 1642185 1292185 -406642
33273 -406642 -1121935 -186003 678998 406181 17601 385805 763003 551645 580869 1382486
33263 1382486 1929702 1445995 868174 1039870 1006899 -167750 -1305322 -824682 566862
33254 566862 1029535 568731 588629 1079143 699560 -521762 -1044687 -575816 -573947 -1476383
33244 -1476383 -1777171 -799578 -148335 -989685 -1804914 -682813 1556630 2569536 1970935
33235 1970935 1544634 2272813 3096286 2862245 1909599 1151791 746056 356638 -27432
33226 -27432 -183951 -121004 9219 149306 214403 69008 -150583 -58522 398796 753832
33216 753832 668045 377468 167042 -171337 -860787 -1464704 -1354123 -711916 -364907 -583941
33206 -583941 -780783 -577796 -376466 -438057 -228986 540578 925336 -59976 -1610553 -1870752
33196 -1870752 -585232 421452 -68520 -911022 -566838 350960 58225 -1461610 -2267483
33187 -2267483 -1306776 134206 420805 -221355 -382275 444013 1419886 1637816 1012222
33178 1012222 51803 -607468 -501842 285591 1025742 1020280 397576 -85478 -23100 176825
33168 176825 -144379 -1104547 -2110634 -2374743 -1655457 -575542 -51883 -300393 -665534
33159 -665534 -616543 -499761 -847304 -1294389 -926011 334266 1423870 1439430 640334 -116589
33149 -116589 -405195 -355961 -248404 -375408 -873760 -1283112 -766293 697587 1835108
33140 1835108 1516166 295826 -316502 134784 742481 841483 827561 1153897 1511052 1431494
33130 1431494 918570 101876 -932766 -1616866 -1168937 48205 431670 -798811 -2330867
33121 -2330867 -2484833 -1376384 -277020 370989 939365 1233634 721501 -113530 -210156
33112 -210156 318147 361397 -230688 -450479 -75477 -131965 -959877 -1471407 -1043504 -563969
33102 -563969 -684213 -564484 468330 1401155 1083090 156785 -65764 293897 304579 154628
33092 154628 689902 1540418 1541218 805908 576407 982666 745273 -560696 -1621679 -1383844
33082 -1383844 -517459 -121517 -144441 55308 512044 875087 1109965 1204087 792346 -177218
33072 -177218 -938082 -808307 -164557 207279 338646 820818 1512460 1407764 14065
33063 14065 -1753799 -2457192 -1659984 -234864 772796 1207431 1522244 1756255 1397732
33054 1397732 364423 -544660 -645178 -312140 -303849 -550694 -414194 108340 376967 264490
33044 264490 342680 742779 786773 161994 -358064 41310 1000258 1393316 639849 -790507
33034 -790507 -1897395 -1894228 -761011 668194 1417046 1290764 802543 273714 -357614
33025 -357614 -792072 -322614 1034734 2119491 1975301 1097325 699540 1155881 1812100
33016 1812100 2001114 1554783 543478 -747936 -1628663 -1494327 -673019 -228365 -657450
33007 -657450 -1224230 -985250 -187040 -34401 -985590 -1929438 -1618161 -484069 -78732
32998 -78732 -755564 -1137199 -374817 359504 -258963 -1398624 -1209704 324704 1433759
32989 1433759 1240823 598246 210536 -163289 -309880 613867 2134963 2309153 564811
32980 564811 -1141748 -1276028 -961994 -1629639 -2253489 -1177542 676476 1033108 -43498
32971 -43498 -305417 1047939 2373451 2377846 1640221 940995 147889 -628495 -621463 138086
32961 138086 554577 264880 124540 344767 -98546 -1407904 -2095373 -1252021 -72780
32952 -72780 118589 -136435 181111 574143 88823 -711835 -595763 263809 735750 660701
32942 660701 697817 736266 150823 -656170 -636091 119888 564145 555329 873612 1374683
32932 1374683 956599 -312886 -865140 -67758 720356 425835 -21528 530457 1348277
32923 1348277 1028492 -150855 -740267 -389234 25484 237298 895307 1956256 2314599
32914 2314599 1473821 347585 -138437 -164482 -136395 252074 1193566 1824369 1187037 -304507
32904 -304507 -1361826 -1506651 -1285261 -1000427 -368285 441054 570594 -203198 -824041
32895 -824041 -356342 595000 680842 -331493 -1298497 -1186948 -128499 1031831 1659728
32886 1659728 1679414 1418367 1250146 1179727 841054 140656 -332506 -568 764526 990100
32876 990100 395017 -241358 -109264 741865 1679701 2181711 2094111 1629393 1269414 1321817
32866 1321817 1520141 1438230 1210739 1277405 1502962 1310183 690581 181157 -254344 -1200689
32856 -1200689 -2329662 -2268778 -674534 793792 659195 -263388 -274108 562671 796421
32847 796421 109506 -295759 242550 1026849 1416918 1580425 1524142 798275 -361517 -889675
32837 -889675 -432692 151328 348683 761524 1657269 2094016 1463713 714626 880130 1406869
32827 1406869 1226095 621789 597023 1006784 842837 58813 -331449 124486 871789 1465158
32817 1465158 1918808 1965501 1198046 63831 -416805 -80015 271720 254651 273323 426628
32807 426628 299526 45935 342914 930814 634192 -615378 -1277192 -561002 171249
32798 171249 -476473 -1716149 -1919890 -1124970 -522540 -199226 725510 2002374 2207413
32789 2207413 1020078 -98510 -25930 566546 546448 4996 -209578 124925 525314
32780 525314 686761 769529 997101 1404818 1868239 2164568 2161878 2007779 1882938 1602356
32770 1602356 851326 -181505 -846436 -766275 -172704 424297 508921 -264042 -1537397
32761 -1537397 -2119383 -1225486 261630 757239 162064 -141617 323807 230099 -1330632
32752 -1330632 -3066329 -3140882 -1703039 -449894 -240108 -457326 -447206 -309706 -282941
32743 -282941 -421387 -966563 -2102882 -3227633 -3305858 -2130603 -567051 518232 926191
32734 926191 783012 317559 9085 170458 348005 -44005 -504944 95603 1676285
32725 1676285 2725439 2373577 1535137 1268199 1094627 42567 -1437180 -1936441 -1163629
32716 -1163629 -293055 -187882 -333808 159205 1288753 2303851 2608327 2152192 1245164
32707 1245164 311507 -270819 -262296 404697 1461854 2129221 1603311 128130 -907156
32698 -907156 -619687 27830 -494731 -1899984 -2284382 -950522 388183 42658 -1225677
32689 -1225677 -1508920 -655678 -218298 -759175 -993831 -30227 1109280 1116805 383114 187507
32679 187507 679190 959486 769146 743555 1008747 819462 -45937 -627299 -174780 575755
32669 575755 332758 -921316 -1790257 -1136289 605094 1928186 1888594 1075465 809406
32660 809406 1375092 1553294 407102 -988910 -696494 1277562 2662903 1909093 218464
32651 218464 -342219 304890 623986 22714 -553498 -475982 -371164 -818632 -1273482 -927112
32641 -927112 63429 784560 626656 -198977 -922394 -865076 -102871 587627 793008 1168255
32631 1168255 2393363 3689099 3412442 1269294 -1040967 -1773816 -990693 -99250 -190449
32622 -190449 -1179224 -2059525 -1774578 -321529 997531 1063265 491668 689466 1533376
32613 1533376 1500868 331388 -237844 818014 2109393 2079951 1367844 1293163 1385850 516312
32603 516312 -476879 268334 2371592 3311855 2065780 475774 366768 1228718 1670623
32594 1670623 1506085 1243071 827914 159298 -126464 384494 868322 377961 -583367
32585 -583367 -759638 -66930 300138 -380680 -1433809 -1742234 -991851 199562 1013021
32576 1013021 1172541 1085586 1186671 1233168 680318 -274248 -755985 -545661 -495966 -1139233
32566 -1139233 -1753974 -1561774 -1039002 -1022549 -1152108 -455358 839404 1400840 721407
32557 721407 -259114 -655159 -634530 -554319 -172226 654043 1319205 1272839 900611 885637
32547 885637 1118305 978956 439028 131260 370466 748397 802338 578127 354468 212394
32537 212394 127440 203222 500202 763806 648772 239936 55687 354051 651674 260831
32527 260831 -751496 -1535543 -1511321 -1068742 -942433 -1214992 -1360775 -1076638 -571326 -83615
32517 -83615 395230 865598 1237122 1601694 2139422 2590032 2291868 1065612 -307179
32508 -307179 -884620 -625823 -278577 -342388 -527942 -278937 424300 914067 502110 -666985
32498 -666985 -1552210 -1282066 -239234 342049 -79336 -776612 -968558 -919452 -1236472 -1659597
32488 -1659597 -1463487 -775424 -457578 -667809 -590073 123898 671191 433241 118484 732397
32478 732397 1998917 2745369 2541579 2040952 1819045 1744290 1530922 1127524 447729 -543513
32468 -543513 -1312220 -1068061 130735 1256379 1583120 1383991 1036029 293995 -897598
32459 -897598 -1643377 -1103237 178474 911774 778415 550589 611118 381495 -610448 -1956162
32449 -1956162 -2921492 -3091544 -2317527 -808649 511282 617994 -258473 -738834 -205345
32440 -205345 340687 5134 -441629 146042 1215195 1174626 -192098 -1464222 -1774466
32431 -1774466 -1792174 -2129645 -2166253 -1274109 -131335 238334 31727 186320 769774 972214
32421 972214 580745 384534 906188 1599862 1722523 1387849 1240992 1433871 1459522 958152
32411 958152 278192 36591 270914 336861 -183558 -737139 -459179 440453 669829 -360650
32401 -360650 -1422443 -956109 697922 1584939 674062 -901776 -1489078 -906156 -171272
32392 -171272 101857 204720 479143 711748 473543 -336750 -1372205 -2101082 -2270035
32383 -2270035 -2186921 -2295407 -2380927 -1658752 55539 1756156 2323592 1813942 1125154
32374 1125154 738398 483374 304392 436162 818428 1059918 1067985 1082081 1035998 586154
32364 586154 -106882 -375124 -81459 54920 -435731 -964131 -670386 428094 1526187
32355 1526187 1916221 1451316 541219 23395 559853 1733459 2201392 1246665 -230243
32346 -230243 -797721 -178914 751083 1295177 1497191 1507751 1168208 409088 -433425 -932136
32336 -932136 -983521 -829981 -788680 -933961 -1035177 -986881 -1205607 -2094811 -3068655 -2860022
32326 -2860022 -1183590 605460 1056016 203202 -954073 -1820571 -2265514 -2029421 -1102838
32317 -1102838 -212055 69325 204386 671418 731866 -394861 -1704632 -1516791 -150990
32308 -150990 458166 -126013 -269838 700762 1174189 78781 -1040610 -456619 835602
32299 835602 654545 -975489 -2055044 -1693241 -952275 -708700 -492516 236106 1080017
32290 1080017 1427964 1172985 400793 -762264 -1749006 -1808863 -930567 112695 740280
32281 740280 972146 887455 430353 -161004 -433712 -348119 -245956 -204236 -53057 41404
32271 41404 -243505 -670252 -706749 -481895 -585333 -894728 -638057 179424 515026 -105474
32261 -105474 -764998 -584183 -38985 376 -216828 150676 910923 919340 -148118 -1085734
32251 -1085734 -658593 792351 1826227 1737678 1284471 1441587 2008617 2049101 1445093
32242 1445093 1118838 1505686 1742384 1017597 -51105 -336698 66136 188308 -60314
32233 -60314 171519 960781 1218443 439567 -350469 -84763 801448 1059026 252728 -916869
32223 -916869 -1457505 -829089 637276 1711945 1257298 -397337 -1708646 -1860060 -1645572
32214 -1645572 -1994354 -2576204 -2604953 -2154528 -1716912 -1130468 -35532 1041159 1174227
32205 1174227 442670 -140592 -81867 62786 -298667 -947008 -1219935 -824222 -168492 -30127
32195 -30127 -717134 -1469976 -1178766 67788 824996 149343 -1123424 -1648382 -1390101
32186 -1390101 -1234928 -1396118 -1359554 -1074262 -1004075 -1096877 -797672 -96989 436032 702275
32176 702275 1161962 1770126 1813501 1072123 294061 187369 604337 982776 1031215 802306
32166 802306 564607 631072 879755 663629 -214602 -828759 -305434 701510 840506 97947
32156 97947 -331853 -101816 -102687 -642571 -861110 -417198 -166894 -468234 -359630 651349
32146 651349 1452830 1137148 614642 1058911 1877016 1761192 872540 355873 327211 -6359
32136 -6359 -650500 -882764 -755335 -928253 -1117372 -364907 1034895 1537595 655468 -280977
32126 -280977 -252896 7892 -444444 -1079265 -893949 -203056 -114664 -663133 -723806 222383
32116 222383 1276720 1377369 663594 126052 246734 484722 127002 -714688 -1227455
32107 -1227455 -891447 -7014 806360 1245093 1274687 883988 282946 30071 476866 1247332
32097 1247332 1674722 1579129 1241855 890828 696053 983301 1827075 2607230 2604570 1937267
32087 1937267 1338048 1161043 1209443 1325155 1432239 1197815 448855 -262725 -379919 -370960
32077 -370960 -942355 -1440251 -509141 1491206 2338177 874699 -1304784 -1983656 -952602
32068 -952602 470815 1419799 1735259 1146909 -344508 -1711401 -1827680 -954824 -292975
32059 -292975 -351453 -749452 -1232955 -1717049 -1602351 -353077 1279910 1849973 1126945
32050 1126945 278639 44076 -44584 -369969 -466708 -96501 96040 -222358 -202958 921209
32040 921209 2410558 2857538 2022473 892777 148594 -510403 -1469055 -2386650 -2578887
32031 -2578887 -1853321 -755051 -103780 -302338 -993413 -1431364 -1242546 -729461 -452718
32022 -452718 -719694 -1436588 -2130967 -2140155 -1236831 -139674 129663 -440477 -788268 -310284
32012 -310284 250893 5447 -651769 -673348 -44480 192301 -398043 -933988 -536592 384699
32002 384699 744865 258715 -331884 -389398 -146907 -143659 -285375 84738 1170948 2183008
31992 2183008 2136643 1053476 -27074 -266108 134183 461595 455589 370542 332751 115043
31982 115043 -427302 -1020770 -1180801 -645980 340177 1058724 803734 -362402 -1431696
31973 -1431696 -1404927 -483333 51611 -645864 -1858812 -2031374 -539805 1613948 2960052
31964 2960052 3032986 2363897 1348397 -120893 -1766191 -2535308 -1822374 -574712 -245252
31955 -245252 -836221 -1021227 -257618 419533 170558 -241287 279549 1338818 1644374
31946 1644374 922284 58161 -429649 -844014 -1227031 -1029245 -176786 551941 677389
31937 677389 685634 1025208 1249464 853855 311119 421232 1021004 1209841 709185 178896
31927 178896 121241 199000 -79399 -541271 -660117 -428280 -437199 -1002036 -1526944 -1077957
31917 -1077957 413500 1873230 2258447 1722640 1169896 879750 323764 -577507 -945457
31908 -945457 -270103 490493 68374 -1219027 -1768542 -859938 508457 1224152 1511225
31899 1511225 2142384 2945391 2999065 2021815 752830 3615 -38526 388244 876544 891664
31889 891664 209088 -586018 -678737 -239053 -317849 -1255647 -2022975 -1676377 -690915 -100289
31879 -100289 -13408 62748 33613 -426713 -701052 174211 1775714 2592013 2238916 1873884
31869 1873884 1978423 1385662 -554353 -2350190 -2268967 -741465 584691 1235521 1690235
31860 1690235 1545448 -52170 -2296827 -3039942 -1599616 317573 959482 421304 -260006
31851 -260006 -553794 -370725 241633 671181 89016 -1144394 -1515885 -475939 641801
31842 641801 651003 269491 714258 1578224 1532016 489577 -398969 -625894 -836236 -1469244
31832 -1469244 -2043075 -1978725 -1289646 -293216 695616 1288509 1226975 769943 474030 584857
31822 584857 921988 1184466 1100188 603140 160266 440818 1272550 1527184 577663 -772780
31812 -772780 -1458737 -1544576 -1638033 -1631199 -1071326 -237131 252027 456553 686842 566979
31802 566979 -300307 -1274838 -1618622 -1930909 -3039580 -3947770 -2889500 -349340 1121441
31793 1121441 459876 -616826 -521024 50892 -103500 -615935 -589920 -225907 -8394 474226
31783 474226 1515032 2239752 1987650 1667140 2229504 2804660 2060588 598492 117198
31774 117198 692883 787326 -238805 -1435664 -2072582 -2369244 -2226975 -980914 1030163
31765 1030163 2146662 1441421 19332 -466224 226128 1055870 1096413 279785 -690237
31756 -690237 -814972 256250 1555889 1728908 794929 190574 822663 1954262 2394818
31747 2394818 1916690 983502 -85774 -1010499 -1294351 -821718 -238821 -111848 -142573
31738 -142573 201396 762443 1077756 1276542 1820012 2569779 2862347 2469312 1877838 1589429
31728 1589429 1601784 1591660 1231860 377036 -687253 -1251740 -867501 -30171 232982 -433847
31718 -433847 -1255809 -1248073 -386533 364401 178666 -631812 -918381 -56596 1213839 1610727
$$ [...]
##END NTUPLES=NMR SPECTRUM
##END=
