##TITLE=31Pdec_2xp
 CDCl3
  24 sc
 3.11.2023
##JCAMPDX= 6.0         $$ Bruker NMR JCAMP-DX V2.0
##DATA TYPE= NMR SPECTRUM
##DATA CLASS= NTUPLES
##ORIGIN= UXNMR, Bruker Analytische Messtechnik GmbH
##OWNER= root
$$ XWIN-NMR		Version 3.5
$$ Fri Nov  3 15:33:32 2023 Russian Standard Time (UT+4h)  she@DPX200
##.OBSERVE FREQUENCY= 81.013821
##.OBSERVE NUCLEUS= ^31P
##.ACQUISITION MODE= SIMULTANEOUS
##.ACQUISITION SCHEME= undefined
##.AVERAGES= 24
##.DIGITISER RES= 16
##SPECTROMETER/DATA SYSTEM= spect
##.PULSE SEQUENCE= zgpg30
##.SOLVENT NAME= CDCl3
##.SHIFT REFERENCE= (INTERNAL, CDCl3, 0, 248.564)
##AUDIT TRAIL= $$ (NUMBER, WHEN, WHO, WHERE, WHAT)
$$ ##TITLE= Audit trail, XWIN-NMR		Version 3.5
$$ ##JCAMPDX= 5.01
$$ ##ORIGIN= Bruker BioSpin GmbH
$$ ##OWNER= she
$$ F:/spectra/data/she/nmr/P31/1/pdata/1/auditp.txt
$$ ##AUDIT TRAIL=  $$ (NUMBER, WHEN, WHO, WHERE, WHAT)
(   1,<2023-11-03 15:32:53.10 +0400>,<she>,<DPX200>,
      <created by zg, POWCHK disabled, PULCHK disabled
       configuration hash MD5:
       00 E9 B6 7A A2 85 ED C7 34 08 36 98 17 FE 4E 26
       data hash MD5: 32K
       8E 18 4D 14 E5 09 D9 B1 70 96 A0 6A 4D 68 B5 C5>)
(   2,<2023-11-03 15:32:55.20 +0400>,<she>,<DPX200>,
      <Start of raw data processing
       efp BC_mod = 2 LB = 5 FT_mod = 6 PKNL = 1 PHC0 = -10351.4 PHC1 = -400.9095 SI = 64K 
       data hash MD5: 64K
       A3 90 8A 88 16 20 82 45 C8 66 44 21 53 5E BB A5>)
(   3,<2023-11-03 15:33:08.81 +0400>,<she>,<DPX200>,
      <pk PHC0 = -1.181207 PHC1 = 0 
       data hash MD5: 64K
       E8 B9 50 90 4A 2A EF A6 61 A2 5E 7E 5E C8 84 CA>)
(   4,<2023-11-03 15:33:14.70 +0400>,<she>,<DPX200>,
      <abs ABSG = 5 
       data hash MD5: 64K
       C4 07 5A 43 82 E7 70 8E E6 46 CE 3A 48 8C D0 82>)
$$ ##END=
$$ 
$$ hash MD5
$$ 92 51 64 51 5D ED 06 A4 D2 70 71 A9 B7 81 57 9B
##$RELAX= 
##$RELAX= 
##$RELAX= 
##$RELAX= 
##$RELAX= 
##$RELAX= 
##$RELAX= 
##$RELAX= 
##$RELAX= 
$$ Bruker specific parameters
$$ --------------------------
##$DU= <F:/spectra>
##$EXPNO= 1
##$NAME= <P31>
##$PROCNO= 1
##$TYPE= <nmr>
##$USER= <she>
##$AMP= (0..31)
100 100 100 100 100 100 100 100 100 100 100 100 100 100 100 100 100 100 
100 100 100 100 100 100 100 100 100 100 100 100 100 100 
##$AQSEQ= 0
##$AQ_mod= 1
##$AUNM= <au_zg>
##$AUTOPOS= <>
##$BF1= 81.014009
##$BF2= 200.13
##$BF3= 200.13
##$BF4= 200.13
##$BF5= 200.13
##$BF6= 200.13
##$BF7= 200.13
##$BF8= 200.13
##$BYTORDA= 1
##$CFDGTYP= 0
##$CFRGTYP= 5
##$CHEMSTR= <none>
##$CNST= (0..31)
1 1 145 1 1 1 1 1 1 1 1 1 1 1 1 1 1 1 1 1 1 1 1 1 1 1 1 1 1 1 1 1 
##$CPDPRG= <waltz16>
##$CPDPRG1= <>
##$CPDPRG2= <waltz16>
##$CPDPRG3= <>
##$CPDPRG4= <mlev>
##$CPDPRG5= <mlev>
##$CPDPRG6= <mlev>
##$CPDPRG7= <mlev>
##$CPDPRG8= <mlev>
##$CPDPRGB= <>
##$CPDPRGT= <>
##$D= (0..31)
0 1 0 0 0 0 0 0 0 0 0 0.03 2e-05 3e-06 0 0 0 0 0 0 0 0 0 0 0 0 0 0 0 0 
0 0 
##$DATE= 1699011172
##$DBL= (0..7)
120 120 120 11 120 120 24 19 
##$DBP= (0..7)
150 150 150 150 150 150 150 150 
##$DBP07= 0
##$DBPNAM0= <>
##$DBPNAM1= <>
##$DBPNAM2= <>
$$ [...]
##$SUBNAM3= <"">
##$SUBNAM4= <"">
##$SUBNAM5= <"">
##$SUBNAM6= <"">
##$SUBNAM7= <"">
##$SUBNAM8= <"">
##$SUBNAM9= <"">
##$SW= 501.771253377433
##$SWIBOX= (0..15)
0 1 3 0 0 0 0 0 0 0 0 0 0 0 0 0 
##$SW_h= 40650.406504065
##$TD= 32768
##$TD0= 1
##$TE= 0
##$TE2= 300
##$TE3= 300
##$TEG= 300
##$TL= (0..7)
0 120 53 12 22 120 120 120 
##$TP= (0..7)
150 150 150 150 150 150 150 150 
##$TP07= 0
##$TPNAME0= <>
##$TPNAME1= <>
##$TPNAME2= <>
##$TPNAME3= <>
##$TPNAME4= <>
##$TPNAME5= <>
##$TPNAME6= <>
##$TPNAME7= <>
##$TPOAL= (0..7)
0.5 0.5 0.5 0.5 0.5 0.5 0.5 0.5 
##$TPOFFS= (0..7)
0 0 0 0 0 0 0 0 
##$TUNHIN= 0
##$TUNHOUT= 0
##$TUNXOUT= 0
##$USERA1= <user>
##$USERA2= <user>
##$USERA3= <user>
##$USERA4= <user>
##$USERA5= <user>
##$V9= 5
##$VALIST= <valist>
##$VCLIST= <CCCCCCCCCCCCCCC>
##$VD= 0
##$VDLIST= <DDDDDDDDDDDDDDD>
##$VPLIST= <PPPPPPPPPPPPPPP>
##$VTLIST= <TTTTTTTTTTTTTTT>
##$WBST= 1024
##$WBSW= 4
##$XGAIN= (0..3)
0 0 0 0 
##$XL= 0
##$YL= 0
##$YMAX_a= 170
##$YMIN_a= -336
##$ZGOPTNS= <>
##$ZL1= 120
##$ZL2= 120
##$ZL3= 120
##$ZL4= 120
##$ABSF1= 248.5645
##$ABSF2= -253.2056
##$ABSG= 5
##$ABSL= 3
##$ALPHA= 0
##$AQORDER= 0
##$ASSFAC= 0
##$ASSFACI= 0
##$ASSFACX= 0
##$ASSWID= 0
##$AUNMP= <proc_1d>
##$AZFE= 0.1
##$AZFW= 0.5
##$BCFW= 0
##$BC_mod= 2
##$BYTORDP= 0
##$COROFFS= 0
##$CY= -3
##$DATMOD= 1
##$DC= 0
##$DFILT= <>
##$DTYPP= 0
##$F1P= 0
##$F2P= 0
##$FCOR= 1
##$FTSIZE= 65536
##$FT_mod= 6
##$GAMMA= 0
##$GB= 0
##$INTBC= 1
##$INTSCL= 6.047779e-11
##$ISEN= 30
##$LB= 5
##$LEV0= 0
##$LPBIN= 0
##$MAXI= 10000
##$MC2= 0
##$MEAN= 0
##$ME_mod= 0
##$MI= 50
##$NCOEF= 0
##$NC_proc= -11
##$NLEV= 6
##$NOISF1= 182.463
##$NOISF2= 159.3651
##$NSP= 0
##$NTH_PI= 0
##$NZP= 0
##$OFFSET= 248.5645
##$PC= 4
##$PHC0= -10352.58
##$PHC1= -400.9095
##$PH_mod= 1
##$PKNL= yes
##$PPARMOD= 0
##$PSCAL= 0
##$PSIGN= 0
##$REVERSE= no
##$SF= 81.0140089999694
##$SI= 65536
##$SIGF1= 159.3651
##$SIGF2= -187.1042
##$SINO= 113.3802
##$SIOLD= 16384
##$SREGLST= <1H.CDCl3>
##$SSB= 0
##$STSI= 65536
##$STSR= 0
##$SW_p= 40650.406504065
##$SYMM= 0
##$S_DEV= 0
##$TDeff= 32768
##$TDoff= 0
##$TI= <>
##$TILT= no
##$TM1= 0
##$TM2= 0
##$TOPLEV= 0
##$USERP1= <user>
##$USERP2= <user>
##$USERP3= <user>
##$USERP4= <user>
##$USERP5= <user>
##$WDW= 1
##$XDIM= 65536
##$YMAX_p= 310920617
##$YMIN_p= -33500335
$$ End of Bruker specific parameters
$$ ---------------------------------
##NTUPLES= NMR SPECTRUM
##VAR_NAME=  FREQUENCY,     SPECTRUM/REAL,   SPECTRUM/IMAG
##SYMBOL=    X,             R,               I
##VAR_TYPE=  INDEPENDENT,   DEPENDENT,       DEPENDENT
##VAR_FORM=  AFFN,          ASDF,            ASDF
##VAR_DIM=   65536,         65536,           65536
##UNITS=     HZ,            ARBITRARY UNITS, ARBITRARY UNITS
##FACTOR=    0.620285442955139, 1,           1
##FIRST=     20137.2065510682, 0,            0
##LAST=      -20513.1999529968, 0,           0
##MIN=       -20513.1999529968, -33500335,   0
##MAX=       20137.2065510682, 310920617,    0
$$ Real data points
##PAGE= N=1
##DATA TABLE= (X++(R..R)), XYDATA
$$ [...]
38721g51349q2512n227O1358J02380J18466J18688J11352J11910J46348K26697
38711A58111L25751L95211M15874M17978M39703M67425M28803K56621l6078l46872
38701B922527n53085n92670m88928l19077j67904q5530n5858j0117R7457K25137
38691I71952K85079K52469J94087J73414J73061J46792J08623J12808J61019J88912
38681B768216J48606N2714p3744k29670l95314m98114m72625l43990k13331j56118
38671E86630j55157j34651m5015Q6631J79753J74408Q8082m367m7367m8762m6327
38660F33858n5217o7096q2120j11939j53709j84982j88451j67860j40866j31204
38650f49586j63310k40752l24045l51282k95714j92881j00609m2790m645K7878
$$ y = [-751349, -833861, -839088, -777730, -675350, -556884, -438196, -326844, -214934, -68586, 158111, 483862, 879073, 1294947, 1712925, 2152628, 2620053, 3048856, 3305477, 3269399, 2922527, 2369442, 1776772, 1287844, 968767, 800863, 715333, 659475, 649358, 746815, 971952, 1257031, 1509500, 1703587, 1877001, 2050062, 2196854, 2305477, 2418285, 2579304, 2768216, 2916822, 2969536, 2895792, 2666122, 2270808, 1772694, 1300069, 956079, 742748, 586630, 431473, 296822, 251807, 338438, 518191, 692599, 780681, 776314, 728947, 680185, 633858, 578641, 511545, 429425, 317486, 163777, -21205, -209656, -377516, -518382, -649586, -812896, -1053648, -1377693, -1728975, -2024689, -2217570, -2318179, -2360969, -2365614, -2337736]
38640b337736M7220M7202M9112Q9393J84741L19007M59573N71191O15589N65794
38630F11086M42296L17110K47942K08256J14494o8083k76265m21292m82354n04385
38620A88805n28239n56747n73306n53916m65677k93686p6103J18934K57419L51612
38610b130904M09408M16802L85056L65635L81898L82587L09010J84995Q9797N1915
38600H46199J9709o0476j80507k90630l43498l12540k12060j14892j04292j79885
38590i32872k46867k25577j33505k6932Q8446K25405L27103L00526J51727J5262
38580d57284R772J07277J82790J62486Q5637M0250P2498J48516J76396P4723j49407
38569D53654l84407m91146m04919j73443Q0502K31089K25665J23756M1934L3573
$$ y = [-2337736, -2290516, -2243314, -2194202, -2104809, -1920068, -1601061, -1141488, -570297, 45292, 611086, 1053382, 1370492, 1618434, 1826690, 1941184, 1873101, 1596836, 1175544, 693190, 188805, -339434, -896181, -1469487, -2023403, -2489080, -2782766, -2858869, -2739935, -2482516, -2130904, -1721496, -1304694, -919638, -554003, -172105, 210482, 519492, 704487, 794284, 846199, 865908, 805432, 624925, 334295, -9203, -321743, -533803, -648695, -752987, -932872, -1179739, -1405316, -1538821, -1565753, -1477307, -1251902, -924799, -624273, -472546, -457284, -447512, -340235, -157445, 5041, 90678, 130928, 203426, 351942, 528338, 603061, 453654, 69247, -421899, -826818, -1000261, -919759, -688670, -463005, -339249, -297315, -263742]
38559b63742M4904J6453j1049M8358J84164K78515K50346J42914L6575o3922j98955
38548D64561l47888m20001l49754j57544Q3156K97880M26562M32444L24709J56244
38538I10369j8863j76691l06390l83672l85662l27881k64806k44038k65948k91894
38528a755476k85091k37341j61169o7468M3245J68979K86088L41237K77043Q9523
38518a300430j33926k59886k20394p6793M4588P4776M2533N901j5536k7105j4624
38507a880896M8625J56047K58364L11388L21509L31253L59337L66777K97848J54691
38497G24943Q923p4523j01851j12469j00648k4767J07179K15855K35195J77985
38487A055822R4130M681q8598j62639j86812j61027j05572l0013N4714J13651
$$ y = [-263742, -218838, -202385, -213434, -165076, 19088, 297603, 547949, 690863, 727438, 663516, 464561, 116673, -303328, -653082, -810626, -727470, -429590, -3028, 429416, 754125, 910369, 891506, 714815, 408425, 24753, -360909, -688790, -953596, -1197634, -1463582, -1755476, -2040567, -2277908, -2439077, -2506545, -2463300, -2294321, -2008233, -1666996, -1389953, -1300430, -1434356, -1694242, -1914636, -1991429, -1946841, -1872065, -1829532, -1823631, -1839167, -1866272, -1880896, -1832271, -1676224, -1417860, -1106472, -784963, -453710, -94373, 272404, 570252, 724943, 733866, 659343, 557492, 445023, 344375, 319608, 426787, 642642, 877837, 1055822, 1149952, 1154633, 1066035, 903396, 716584, 555557, 449985, 419972, 474686, 588337]
38477E88337J17742Q2775L9431k0463j23291k52720l62229m43041n20586n77596
38467a471641n44947l96306k02020n4970K1284O3406J05868J59997K19772K50287
38457a849270K00026O7350o6534j13773p4311j5237K6118O8219J21954J59037
38447a476421J60047J50855J66028K01898K26066K13811J59413P1223k6120r8991
38437b52191j32807j46256j67044k00960k29713k24779j56515j1159J82010L54169
38427i85245M48831M63489M25577L45484K24249R6630J8701l795l6154j31516
38417H66251k50669l04145k65481k01397j84185k13092k40212k39121k14277j62266
38407a408594o3755Q5101K60515M31145N65370O20025N59330M04431K38709J36870
$$ y = [588337, 706079, 788854, 828285, 807822, 684531, 431811, 69582, -373459, -894045, -1471641, -2016588, -2412894, -2614914, -2669884, -2648600, -2585194, -2479326, -2319329, -2099557, -1849270, -1649244, -1581894, -1648428, -1762201, -1836512, -1851749, -1825631, -1757412, -1635458, -1476421, -1316374, -1165519, -999491, -797593, -571527, -357716, -198303, -127080, -153200, -252191, -384998, -531254, -698298, -899258, -1128971, -1353750, -1510265, -1521424, -1339414, -985245, -536414, -72925, 352652, 698136, 922385, 1019015, 1037716, 1033921, 997767, 866251, 615582, 311437, 45956, -155441, -339626, -552718, -792930, -1032051, -1246328, -1408594, -1472349, -1387248, -1126733, -695588, -130218, 489807, 1049137, 1453568, 1692277, 1829147]
38397A829147R9181P4248L1060k1251p8011j62369k83261l93268m21796l55874
38387C17806k69965k61349l56585m86599n51651n04434l71119k05913m2173J10665
38377b621317K40195L21484L38325L03015K45605J87333J34912R9963J07063J68742
38367d74680K60481L37584L75874L80601L57507K98601K02889Q7654l2469j52834
38357A641208k49782k77433k28596j74291j93487k70618l12541k70909j97511
38348e33960j63823j76102j97586k07443j93649j21001L6249K34304L75858L95720
38338e51433L13025K06569J58927K06867L09301L68516L19413K00880J08786P9626
38328A720477N9689j707p2154p8862m217R8078J74819K27561K83204L27409K89441
$$ y = [1829147, 1928328, 2002576, 2033636, 2012385, 1934374, 1772005, 1488744, 1095476, 673680, 317806, 47841, -213508, -570093, -1056692, -1608343, -2112777, -2483896, -2689809, -2731982, -2621317, -2381122, -2059638, -1721313, -1418298, -1172693, -985360, -850448, -750485, -643422, -474680, -214199, 123385, 499259, 879860, 1237367, 1535968, 1738857, 1826511, 1794042, 1641208, 1391426, 1113993, 885397, 711106, 517619, 247001, -65540, -336449, -533960, -697783, -873885, -1071471, -1278914, -1472563, -1593564, -1557315, -1323011, -947153, -551433, -238408, -31839, 127088, 333955, 643256, 1011772, 1331185, 1532065, 1640851, 1720477, 1780166, 1778459, 1706305, 1627443, 1623226, 1721304, 1896123, 2123684, 2406888, 2734297, 3023738]
38317C023738J06644j95615n00439o87068p20543o53669n59205m78235m17571
38308a081963l60198k71806j28063M4353J66091J61417K2947j67747k75945j97500
38298b088414M8598L10548M30412L97160L40158L58410M04179L70496K49526J41778
38288I62851J20866J50090J46180Q1803K716k9738P100Q2296J33651J17300M9604
38277A824719n831J011O3453J30449J43308O1551j15988l34548n04838n66229
38267F97057n27492m34917l13360j59314J5982J65726K38941K17720J19628j8021
38257A950j47640k25733k38633k06404j46897m9029R3942K34881K98136K71154
38247a14273K38259K89473M07957M80986M23771K67258J19293O1324Q9549J34377
$$ y = [3023738, 3130382, 2934767, 2434328, 1747260, 1026717, 373048, -186157, -664392, -1081963, -1442161, -1713967, -1842030, -1797677, -1631586, -1470169, -1447222, -1614969, -1890914, -2088414, -2039816, -1729268, -1298856, -901696, -561538, -203128, 201051, 571547, 821073, 962851, 1083717, 1233807, 1379987, 1461790, 1464506, 1434768, 1441868, 1524164, 1657815, 1775115, 1824719, 1818888, 1819899, 1883352, 2013801, 2157109, 2218660, 2102672, 1768124, 1263286, 697057, 169565, -265352, -578712, -738026, -722044, -556318, -317377, -99657, 19971, 1950, -145690, -371423, -610056, -816460, -963357, -1012386, -918444, -683563, -385427, -114273, 123986, 413459, 821416, 1302402, 1726173, 1993431, 2112724, 2174048, 2263597, 2397974]
38237B397974J22490L4507q0794j51274j46444r5085m3224j1711K682N951j594
38226B033478k7152q5697j80179k75084l17020k96253k57848k28450j66666k7977
38216A71152J45354K52710K45755J58277K9032j38824l19547m31102m13794l10681
38206f11668k17255j64855j00168K4681J86631L23337L92416L82563K95778J48487
38196F59947j5695j37500j79618j55944j21141j21429j46550j35077l9981J08808
38186b84180K16059K02971Q0226n8595j18754q6545l1574k4198n9298p6923m8246
38175b89057o511J3863K7183N7820Q7568Q7223P8653J07743J56010J37456N958
38164D63909j75531k99687l17936k55850j59260o1276J7267P2624J17869J53019
$$ y = [2397974, 2520464, 2554971, 2474177, 2322903, 2176459, 2081374, 2038150, 2026439, 2029121, 2035072, 2033478, 2006326, 1920629, 1740450, 1465366, 1148346, 852093, 594245, 365795, 199129, 171152, 316506, 569216, 814971, 973248, 1002280, 863456, 543909, 112807, -300987, -611668, -828923, -993778, -1093946, -1069265, -882634, -559297, -166881, 215682, 511460, 659947, 644252, 506752, 327134, 171190, 50049, -71380, -217930, -353007, -392988, -284180, -68121, 134850, 215076, 156481, 37727, -48818, -80392, -104590, -163888, -240811, -289057, -295568, -281705, -254522, -196702, -109134, -21911, 56742, 164485, 320495, 457951, 463909, 288378, -11309, -329245, -585095, -744355, -805631, -788364, -715740, -597871, -444852]
38154d44852J47224P9044j6483p5015p4260m6468k1956K240L0695M6907M3961
38143c28963M6178O9593Q1317L2721p5170j90698k72077l15350l18915k62215
38133a533579j48104l8086M11j8059j641J07736K53467L17737K41095O9473r8175
38122h47725j78320j37914j5629Q0683M8998r7798k25693k18537j03820m514J3790
38111a686479k688J1175N0978P0039N0637R547m5843j25931k19967k73352k21454
38100b383338n3511J54490K85416K84826K19830K07469K78394L42184L00966J62660
38090b00614J5794p4930j07823j03133p6443n2553n8207q6359r9729q1505n2147
38079i77649k4747J9736Q7780J34517J08151K2052n2903o9347m9377m3298o6106
$$ y = [-444852, -297628, -218584, -235067, -310082, -384342, -430810, -452766, -450526, -419831, -372924, -328963, -282785, -213192, -131875, -99154, -174324, -365022, -637099, -952449, -1271364, -1533579, -1681683, -1719769, -1719358, -1737417, -1739058, -1631322, -1377855, -1060118, -819023, -749550, -847725, -1026045, -1163959, -1179588, -1098905, -1049907, -1147705, -1373398, -1591935, -1695755, -1700269, -1686479, -1689167, -1677992, -1627014, -1556975, -1506338, -1496791, -1542634, -1668565, -1888532, -2161884, -2383338, -2436849, -2282359, -1996943, -1712117, -1492287, -1284818, -1006424, -664240, -363274, -200614, -184820, -259750, -367573, -470706, -547149, -599702, -657909, -744268, -843997, -925502, -977649, -1002396, -982660, -894880, -760363, -652212, -630160, -683063, -752410, -801787, -845085, -911191]
38068i11191q8257p2606j195J26604K95590M60605N47003M96577L29017J45972
38058A328119N3597P5399J45986J85408J68154J23457Q7607O6057L5468k1740
38048B247512q1987q7050l665J22228J92121J48058K7795p9666j18088r4831m8661
38037B223766q361K6010P8636J67469K63181K92529K09352N7342o6331j11998
38027C131595j14852j26070j40475j17232n1877M696m89o9704j56326k04731j88556
38016A965979j27076p1734o4267r6789j18016q7882k2756K2671J7118j4851k5775
38005A376622K38L5420M2227L387p9165j91959l02304l58518l24366k20159j16859
37994a35436p9747j17210j80458k04962j56195n2587M7065R0137P9074P3749J35578
$$ y = [-911191, -999448, -1072054, -1073249, -946645, -651055, -190450, 356553, 853130, 1182147, 1328119, 1381716, 1457115, 1603101, 1788509, 1956663, 2080120, 2167727, 2233784, 2269252, 2247512, 2165525, 2078475, 2074810, 2197038, 2389159, 2537217, 2565012, 2485346, 2367258, 2272427, 2223766, 2215405, 2241415, 2320051, 2487520, 2750701, 3043230, 3252582, 3309924, 3243593, 3131595, 3016743, 2890673, 2750198, 2632966, 2581089, 2585785, 2585296, 2515592, 2359266, 2154535, 1965979, 1838903, 1767169, 1702902, 1606113, 1488097, 1400215, 1377459, 1400130, 1417248, 1402397, 1376622, 1376860, 1412280, 1454507, 1457894, 1378729, 1186770, 884466, 525948, 201582, -18577, -135436, -215183, -332393, -512851, -717813, -874008, -926595, -879530, -789393, -710319, -636570, -500992]
37983e00992K65388L99148M65502M45851L80208L20773K85747K59481K29713K08387
37973B759206K04411J84870Q7564j13309l61407n51791o12950n53833m37595l21566
37963B83600k22845j27854k2916Q3541J60805J74922J13428l38j12401j61466
37953A68476j11468K0391J59183K07546J12697q0145k44561k67243j45330J0655
37943a69799P9332L2674o5149j46851k02208k45966k60058k04511q4652K4414
37933a242774M2581l0415j05676q0676P6454L05502N00882N81269N34896M18846
37923A000889L17687K86047L10305L19746K48533J04660k1114l1965P5529J94176
37913B804493K01195O9468j23039k81195l61806l57695k63807j03120L6756N6123
$$ y = [-500992, -235604, 163544, 629046, 1074897, 1455105, 1775878, 2061625, 2321106, 2550819, 2759206, 2963617, 3148487, 3236051, 3122742, 2761335, 2209544, 1596594, 1042761, 605166, 283600, 60755, -67099, -90015, -6474, 154331, 329253, 442681, 442343, 329942, 168476, 57008, 77399, 236582, 444128, 556825, 476680, 232119, -35124, -180454, -169799, -90467, -57793, -122942, -269793, -472001, -717967, -978025, -1182536, -1267188, -1242774, -1200193, -1230608, -1336284, -1416960, -1340506, -1035004, -534122, 47147, 582043, 1000889, 1318576, 1604623, 1914928, 2234674, 2483207, 2587867, 2566753, 2534788, 2610317, 2804493, 3005688, 3075156, 2952117, 2670922, 2309116, 1951421, 1687614, 1584494, 1621250, 1677373]
37903A677373m7372j61688j80923j15512n3867m3879n9602p2861j00561j63859
37893F77249k40662k83165k57447j50176K7652K10928K86309J84840k7176j91666
37883B36686k09311j21853l5285O012M1081J08781J81353J90772J03278m2181
37873D59333j61467j87332j16920j1801M9886L2107l9921j14850j63079j85691
37863d39735j86752j57838r5842j7575N6976J20617J60836J45746O4027k7372
37853c76912m1269L8382J30195J52975J14311P0262L3613k2933q8660j05404n0927
37842a46367J7130K6450l2564j16457j85465k22661k18624j70324r0876k081P6999
37831a064840J25354J22702P6437L1663L1532P3296J17157J25187P5338m1330
$$ y = [1677373, 1630001, 1468313, 1287390, 1171878, 1118011, 1074132, 1014530, 941669, 841108, 677249, 436587, 153422, -104025, -254201, -226549, -15621, 270688, 455528, 428352, 236686, 27375, -94478, -129763, -123751, -82670, 26111, 207464, 398236, 501514, 459333, 297866, 110534, -6386, -18187, 31699, 63806, 23885, -90965, -254044, -439735, -626487, -784325, -880167, -897742, -840766, -720149, -559313, -413567, -349540, -376912, -418181, -379799, -249604, -96629, 17682, 87944, 121557, 98624, 9964, -95440, -146367, -129237, -102787, -135351, -251808, -437273, -659934, -878558, -1048882, -1139758, -1141839, -1064840, -939486, -816784, -740347, -708684, -677152, -603856, -486699, -361512, -286174, -327504]
37821c27504k02725l40748l79409l00188j56610k4955M6655N3076K7941K6797
37811a577670Q4935J78012K38864K19994J30098J5198p4729j04985p3510j6811
37801i80604K5536N6264J02425J50782J45473P0720o492j3192M0501R0856J14388
37790b03343J40308J80053K02159J87886J64943J67055J97603K51804L34494M24611
37780B047573M57079L86613K53903J40496N8275o8134k87732n25299o32660n34033
37770A296081l00988q4601J0096j9046j15476k34133l55776m52118m76777m12838
37760a145576l09382k37071k07590j67534q0807J3534M5993l942r7225j82013
37750b371613k17763j71975m5214R4180J48818R2056K30l6488q177L1419M2882
$$ y = [-327504, -530229, -870977, -1250386, -1550574, -1707184, -1732139, -1685484, -1632408, -1604467, -1577670, -1492735, -1314723, -1075859, -855865, -725767, -710569, -785298, -890283, -963793, -980604, -955068, -898804, -796379, -645597, -500124, -429404, -435896, -449088, -408587, -317731, -203343, -63035, 117018, 319177, 507063, 672006, 839061, 1036664, 1288468, 1622962, 2047573, 2504652, 2891265, 3145168, 3285664, 3343939, 3275805, 2988073, 2462774, 1830114, 1296081, 995093, 910492, 920588, 901542, 786066, 551933, 196157, -255961, -732738, -1145576, -1454958, -1692029, -1899619, -2067153, -2147960, -2134426, -2088433, -2092375, -2189600, -2371613, -2589376, -2761351, -2806565, -2712385, -2563567, -2471511, -2471281, -2507769, -2515946, -2484527, -2441645]
37739b441645K8839J2395L2379J39266L38785N40397O17321N35534L84988K70078
37729D58337K08842J55687P8623j5593r6492j15556k7201J56211L48353M61099
37719A612310M76404M21031L04219J31873l7576j18452r3174l9025m4131j26417
37709B487062k41679l35254l71991l47232k88574k29991j77546j21217p9126r4230
37699B00222j75612k74314l30966l19435k35478q3701R9062K41167K90599K57221
37689c31235J86207J16775Q2247J08508J76954K23030K13304J94281K17588K46068
37679A433727J98512P5599k9908n9634o2536j12483k00197k45336j90393n2543
37669G54808J00292J99368K11494J45572K4827j40037l29168m73480m84224l49195
$$ y = [-2441645, -2412806, -2400411, -2368032, -2228766, -1889981, -1349584, -732263, -196729, 188259, 458337, 667179, 822866, 901489, 885896, 789404, 673848, 646647, 802858, 1151211, 1612310, 2088714, 2509745, 2813964, 2945837, 2908261, 2789809, 2696635, 2657610, 2613479, 2487062, 2245383, 1910129, 1538138, 1190906, 902332, 672341, 494795, 373578, 294452, 200222, 24610, -249704, -580670, -900105, -1135583, -1219284, -1120222, -879055, -588456, -331235, -145028, -28253, 53994, 162502, 339456, 562486, 775790, 970071, 1187659, 1433727, 1632239, 1707838, 1677930, 1618296, 1555760, 1443277, 1243080, 997744, 807351, 754808, 855100, 1054468, 1265962, 1411534, 1436361, 1296324, 967156, 493676, 9452, -339743]
37659c39743j69136o3487n1764n3831M236J14353K13823K61075K72730K95391
37649D83647L49224M00910L92848K95153J25446o9440k32037l06317k69920j67150
37639A002364q0590n1328m8207k8889q23K200k5688o7841j23349j94710k43344
37628A39795k04155n9376J29181K74532L34832L26708K91031K54249K07249J16032
37618A810078l2273j92002k86929k82904k16616j47089r9535o8771n6956q2400
37608C44603j53122k47363l23481l44224k95013j87948n2421P7408J67814J90506
37598h23241J41672O1191J4465L3135P2297M4586q7342k55268l40063k93215j92824
37587a624607j60496k28206l12225l18743k38554j18485K0815J89122L61832M67850
$$ y = [-339743, -508879, -572366, -624130, -677961, -673725, -559372, -345549, -84474, 188256, 483647, 832871, 1233781, 1626629, 1921782, 2047228, 1977788, 1745751, 1439434, 1169514, 1002364, 921774, 870446, 822239, 793350, 792527, 794727, 769039, 701198, 577849, 383139, 139795, -64360, -123736, 5445, 279977, 614809, 941517, 1232548, 1486797, 1694046, 1810078, 1777805, 1585803, 1298874, 1015970, 799354, 652265, 552730, 483959, 427003, 344603, 191481, -55882, -379363, -723587, -1018600, -1206548, -1258969, -1181561, -1013747, -823241, -681569, -620378, -605913, -572778, -500481, -455895, -543237, -798505, -1138568, -1431783, -1624607, -1785103, -2013309, -2325534, -2644277, -2882831, -3001316, -2980501, -2791379, -2429547, -1961697]
37577a961697M63312L85989L13918K87881K92093K95624K90101K86375K84969
37568I38565K56319J61026J399j57219k40740k41297k12721j90794j53736p6301
37558H4501J4339P0792R1281J13937J52174J74371J56435J23967J19540J38477
37548A239814J19328R375j62999k94178k97391j88609o9835k9888p8063j68650
37538G8904k52232k85027k24872o2788J46749L19740M10988M32654M13277L63254
37528A340647K78157J52926n960j63199k59383k64744k25401k18781k55921k66205
37518A12136j95524q2223o425P127k629m895j2006l8298o0517m0097K8868J08233
37506a86250J48173J26617O4053N240j7776j0352n017k6451o2829o5003K2497
$$ y = [-1961697, -1498385, -1112396, -798478, -510597, -218504, 77120, 367221, 653596, 938565, 1194884, 1355910, 1357309, 1200090, 959350, 718053, 505332, 314538, 160802, 84501, 98840, 169632, 260913, 374850, 527024, 701395, 857830, 981797, 1101337, 1239814, 1359142, 1368517, 1205518, 911340, 613949, 425340, 355505, 325617, 247554, 78904, -173328, -458355, -683227, -746015, -599266, -279526, 131462, 564116, 977393, 1340647, 1618804, 1771730, 1765770, 1602571, 1343188, 1078444, 853043, 634262, 378341, 112136, -83388, -165611, -172036, -164909, -167538, -172433, -184439, -222737, -283254, -323351, -294483, -186250, -38077, 88540, 152593, 157833, 140057, 129705, 124688, 98237, 35408, -29595, -7098]
37495g098K10346M30440N66027N39486L74506J61943k7813j77275k74972k82384
37485A513206j82123l9919K6635m3450j96359l23292l59851l12428k07500n1840
37475a76921J45497L32903M24289L59052J56892q5060k52070k79991j80220j2349
37465D32022J59331K88248L46131L20981K16600M8160j58394l57590m89743n19534
37455B86212m71135m04546l51705k95150k14154j23106m4482L2357J34031K53629
37445a198049L46501L74219L31712K36023J14428K644p5105j32651k03981k89424
37435d93683l43770l30627k64426j81128r2373L275Q2613J12538J05232J22297
37425a280052K02233L00541L26595K43092J17478O6816J49551L09918M26516M14210
$$ y = [-7098, 203248, 633688, 1199715, 1739201, 2113707, 2275650, 2247837, 2070562, 1795590, 1513206, 1331083, 1291164, 1317799, 1274349, 1077990, 754698, 394847, 82419, -125081, -176921, -31424, 301479, 725768, 1084820, 1241712, 1156652, 904582, 624591, 444371, 432022, 591353, 879601, 1225732, 1546713, 1763313, 1811473, 1653079, 1295489, 805746, 286212, -184923, -589469, -941174, -1236324, -1450478, -1573584, -1618066, -1585709, -1451678, -1198049, -851548, -477329, -145617, 90406, 204834, 207478, 132373, -278, -204259, -493683, -837453, -1168080, -1432506, -1613634, -1706007, -1702732, -1620119, -1507581, -1402349, -1280052, -1077819, -777278, -450683, -207591, -90113, -23297, 126254, 436172, 862688, 1276898]
37415A276898K82003J03520n4189j72139k67910l58564m34413m64406m30502l56738
37405h76440k90525k45575j79276m9897J08758J99478J61766M1786n4633o7594
37395a252152k3556K0595M5828P4823J28107J94128K36407K18688J30599L535
37385b22998j02392j43411j26689r1596o4121m8658n5665r8303j48410j36122
37375a238365l0064J05838J81681K00712K59813M17522O01522O74328N69211L38829
37365B081027Q8133j12991k56757l62597m26957m12363k95547j19194L4210J31195
37355C48159K19220L45158M68196M92904L79884J87303M031j24343k01627k54603
37345A864282l20299m28877n67334o68318o57556n15391k88764n4504J21222K06503
$$ y = [1276898, 1558901, 1662421, 1608232, 1436093, 1168183, 809619, 375206, -89200, -519702, -876440, -1166965, -1412540, -1591816, -1641713, -1532955, -1333477, -1171711, -1129925, -1184558, -1252152, -1275708, -1255113, -1209285, -1134462, -1006355, -812227, -575820, -357132, -226533, -222998, -325390, -468801, -595490, -687086, -751207, -799865, -855530, -953833, -1102243, -1238365, -1268429, -1162591, -980910, -780198, -520385, -102863, 498659, 1172987, 1742198, 2081027, 2169160, 2056169, 1799412, 1436815, 1009858, 597495, 301948, 182754, 216964, 348159, 567379, 912537, 1380733, 1873637, 2253521, 2440824, 2444855, 2320512, 2118885, 1864282, 1543983, 1115106, 547772, -120546, -778102, -1293493, -1582257, -1636761, -1515539, -1309036]
37335a309036K14113J91372J84772K07972K45203K76669K88021K62268J85365
37326G46719O8500m9021j30207j65174j57152r7895K0257J68628K83414L16849
37316A004918K74287J87890O9385q5976k53221l66161l69144k71484j43744o8119
37306b1369r0504j96414l15026l58465k80180j03283J05968K82254L79119L71195
37296b26705K68849J28458K3661p091J6913M6029M6089K2661O032P624p919q9235
37284B35366k27590l40064l43408k32294o8757Q3607J86277K11065J51107M9731
37274b94960k7226o2512r5428j46342j76201j48534r2831o2130n0178k852Q7833
37263a071361J48053J01980l6951j75710k30983j92274j04762j4929N3218Q2514
$$ y = [-1309036, -1094923, -903551, -718779, -510807, -265604, 11065, 299086, 561354, 746719, 815219, 766198, 635991, 470817, 313665, 215770, 236027, 404655, 688069, 1004918, 1279205, 1467095, 1536480, 1450504, 1197283, 831122, 461978, 190494, 46750, -21369, -111873, -308287, -623313, -981778, -1261958, -1365241, -1259273, -977019, -597900, -226705, 42144, 170602, 194263, 187172, 204085, 250114, 296203, 318864, 324896, 332520, 324601, 235366, 7776, -332288, -675696, -907990, -976747, -893140, -706863, -495798, -344691, -294960, -322186, -384698, -480126, -626468, -802669, -951203, -1044034, -1106164, -1156342, -1159194, -1071361, -923308, -821328, -858279, -1033989, -1264972, -1457246, -1562008, -1576937, -1523719, -1441205]
37253a441205N6585j0101n2627j852J37886K77712L26215K72849J82808J26119
37243a25611J24986J53562J65216J23297K5735r2462j83126k10018j56387l0359
37233b05167J24925K46194K96960K90626K51505J70084K4990j60279l17839l97648
37223C24351m02548l56705k71100j57755n1391J4934N0215R6329J72525K43015
37213c38130K48293J64916L2686p1526q5416O23J38856K53495K89944K50162J76351
37202A060254R3473j6996j66985l03484l43794k75192j76260j19600r7088p5784
37192d21456q0859j56580k64060k95827k10010r0341m1598o8891r6338p1886j1977
37181a809823L9484N5736L4222r643m9909o7179o2090m7880l5959k9338j3473
$$ y = [-1441205, -1384620, -1394721, -1447348, -1449200, -1311314, -1033602, -707387, -434538, -251730, -125611, -625, 152937, 318153, 441450, 467185, 374723, 191597, -18421, -174808, -205167, -80242, 165952, 462912, 753538, 1005043, 1175127, 1200117, 1039838, 721999, 324351, -78197, -434902, -706002, -863757, -915148, -900214, -849999, -753670, -581145, -338130, -89837, 75079, 107765, 36239, -49177, -48554, 90302, 343797, 633741, 883903, 1060254, 1153727, 1136731, 969746, 666262, 322468, 47276, -128984, -248584, -345672, -421456, -502315, -658895, -922955, -1218782, -1428792, -1519133, -1560731, -1629622, -1725960, -1797846, -1809823, -1770339, -1714603, -1680381, -1690024, -1739933, -1807112, -1869202, -1917082, -1953041, -1982379, -1995852]
37170a995852M8459J81364L43158M34807L96794K76842J71348J17276P8286K1899
37160G4381m0147r2386j48372k19775k82811l01390k69837k15518j68955j41978
37150a806788j24353r1225k1177Q5508K08549L22077L97428M05086L43594K66322
37140a4979K45462K95984L61740L89429L84811L74485L46214K67506J46396L0421
37130B827469n3069j18502j79499k19363k17900j82325j35775r3918o7549p0613
37120A488956j05571j49867j74767j75083j69103j73888j91119k10214k10446
37111g1102j65571o9306L6907Q2422L4493n8787j11689q8738l2530J055J3331
37100d29515M9222J29078K25727L08769L76214M24964M18548L16073J25178r6038
$$ y = [-1995852, -1947393, -1766029, -1422871, -988064, -591270, -314428, -143080, -25804, 52482, 74381, 34234, -58152, -206524, -426299, -709110, -1010500, -1280337, -1495855, -1664810, -1806788, -1931141, -2022366, -2043543, -1958035, -1749486, -1427409, -1029981, -624895, -281301, -14979, 230483, 526467, 888207, 1277636, 1662447, 2036932, 2383146, 2650652, 2797048, 2827469, 2774400, 2655898, 2476399, 2257036, 2039136, 1856811, 1721036, 1627118, 1559569, 1488956, 1383385, 1233518, 1058751, 883668, 714565, 540677, 349558, 139344, -71102, -236673, -305979, -269072, -186650, -152157, -210944, -322633, -411371, -443901, -442846, -429515, -380293, -251215, -25488, 283281, 659495, 1084459, 1503007, 1819080, 1944258, 1848220]
37090A848220k80495l74221l36394j66021N9774K14557K23635J29377M3843M9242
37080A411517J51149L00504M31917M92746M67686L83732K80812J79719Q5085M341
37070D189208n6065j03326j45455j74539j87206k12545k84991l87537m56000m48156
37060A733388l75505k56697q3973J31793L18889L99109L74353L13166K50658J47820
37050B953001l3551k53878m23011m83453m40235l26483j77004l6558M3406M3400
37040H65634L408o711N2689J64800K80549L50232L31254J94747m3464l00389m63948
37029A428801m71864l47098j56161M4115K08816K90183K65321J74941R4501N3377
37019A584932R468q2387k02464k86959k96138k35835j25863J7441J62529K56101
$$ y = [1848220, 1567725, 1193504, 857110, 691089, 750863, 965420, 1189055, 1318432, 1362275, 1411517, 1562666, 1863170, 2295087, 2787833, 3255519, 3639251, 3920063, 4099782, 4184867, 4189208, 4133143, 4029817, 3884362, 3709823, 3522617, 3310072, 3025081, 2637544, 2181544, 1733388, 1357883, 1101186, 1017213, 1149006, 1467895, 1867004, 2241357, 2554523, 2805181, 2953001, 2919450, 2665572, 2242561, 1759108, 1318873, 992390, 815386, 778828, 822234, 865634, 869042, 862331, 915020, 1079820, 1360369, 1710601, 2041855, 2236602, 2193138, 1892749, 1428801, 956937, 609839, 453678, 497793, 706609, 996792, 1262113, 1437054, 1531555, 1584932, 1594400, 1512013, 1309549, 1022590, 726452, 490617, 364754, 382195, 544724, 800825]
37009H00825K57271J73814N4123n5811j43330k21721l02619l82867m54006n08028
36999g82349n22478m54099k75951k8261J88698K87707K53820J32367j5772j35926
36989a352244j91300j90039j88102k30354k91708l04482k38092j19532J8697J66928
36979b920228L07422M01582M33009M30562M22302L93797L19276K08389R1183j8965
36969F8329j09712j37208n8857J00627K55459L38313L45919L07193K43432J68014
36959A521509Q9399k114j21997k49632l26844l20164k62981k14150j93803j82536
36949b63313j63739j33656p7174L1394J90756L49615M30626L80977K12954O368
36939I64808j40297j80784j47159j04002q9085j05236j46238k02936k53744k78701
$$ y = [800825, 1058096, 1231910, 1286033, 1230222, 1086892, 865171, 562552, 179685, -274321, -782349, -1304827, -1758926, -2034877, -2063138, -1874440, -1586733, -1332913, -1200546, -1216318, -1352244, -1543544, -1733583, -1921685, -2152039, -2443747, -2748229, -2986321, -3105853, -3087156, -2920228, -2612806, -2211224, -1778215, -1347653, -925351, -531554, -212278, -3889, 87294, 68329, -41383, -178591, -237448, -136821, 118638, 456951, 802870, 1110063, 1353495, 1521509, 1610908, 1608794, 1486797, 1237165, 910321, 590157, 327176, 113026, -80777, -263313, -427052, -560708, -637882, -606488, -415732, -66117, 364509, 745486, 958440, 964808, 824511, 643727, 496568, 392566, 303481, 198245, 52007, -150929, -404673, -683374]
36929f83374k83307k84526k71909k07194p0912J06316K62616L41179L13949J99913
36919e77249P0007O466L4593J04774J53905J70204J82478K00510J92173J24054
36909F61915J2699p2198o1260M7704J75729K29619J88057J07619M1854j7984j04827
36898A208927k07664k80418l11111l41464m05377m76736m99680m56832l87864
36889b158219l44018l37804l37694l02693k18345j04126O143Q6323J26760J37500
36879c446173J50665K04675L05696M07026M47024M14535L63164L52822L88172
36870d12394M24221M22103L82847L26445K54678J50586J5993j05508j62003j52124
36860A144844j30881j41006j52974j00679K5004J49719J97580J77428J64763K09643
$$ y = [-683374, -966681, -1251207, -1523116, -1730310, -1801222, -1694906, -1432290, -1091111, -777162, -577249, -507242, -500776, -466183, -361409, -207504, -37300, 145178, 345688, 537861, 661915, 674614, 602416, 541156, 588860, 764589, 994208, 1182265, 1289884, 1331738, 1313754, 1208927, 1001263, 720845, 409734, 68270, -337107, -813843, -1313523, -1770355, -2158219, -2502237, -2840041, -3177735, -3480428, -3698773, -3802899, -3796756, -3710433, -3583673, -3446173, -3295508, -3090833, -2785137, -2378111, -1931087, -1516552, -1153388, -800566, -412394, 11827, 433930, 816777, 1143222, 1397900, 1548486, 1564479, 1458971, 1296968, 1144844, 1013963, 872957, 719983, 619304, 644308, 794027, 991607, 1169035, 1333798, 1543441]
36850A543441K87136L36477L23946K57051J55234K8725j11487k38227l19259l48139
36840A914898l54023l68688l85505l63306k73507j32883J2800J23326J76463J65812
36830E15387J07932M5853K3894N0367Q8728Q3935j002j53626k97222l24845j88764
36819d9363L2674J85218J76015M9553q0480j51185j82489k13608k48718k68159
36809g50542k57920k08953j10309K8289J52517J91808J28703L1472J792Q3395
36799g09748K22279L13089K80403J23530r5553k93205m04671m10627l38535k35643
36789a548681j37067n8666p499K2300O5012J66724L30240M86490N45346M79388
36779C43587L44615K17008J22871L6526o9487j88938k92395l53101l49632k54537
$$ y = [1543441, 1830577, 2167054, 2491000, 2748051, 2903285, 2932010, 2820523, 2582296, 2263037, 1914898, 1560875, 1192187, 806682, 443376, 169869, 36986, 49786, 173112, 349575, 515387, 623319, 669172, 693066, 743433, 832161, 916096, 915094, 761468, 464246, 139401, -49363, -16689, 168529, 344544, 394097, 313617, 162432, -20057, -233665, -482383, -750542, -1008462, -1217415, -1327724, -1299435, -1146918, -955110, -826407, -794935, -793143, -709748, -487469, -174380, 106023, 229553, 134000, -159205, -563876, -974503, -1313038, -1548681, -1685748, -1744414, -1751913, -1729613, -1664601, -1497877, -1167637, -681147, -135801, 343587, 688202, 905210, 1028081, 1064607, 995120, 806182, 513787, 160686, -188946, -443483]
36769d43483n1237K18503M41876N08205M08215K39527J02187J2467o3780j26644
36759A245836j37105q7220k6329m006k2116n9432j08825j61797j81765j31703
36749C25538k4536Q1738J40090J46103J16918O5864Q513k5675r875M9496J07995
36738I82169J16715O2857k5566j15274j97228k69684l03231k51345j05747P7665
36728b8669K20616K78037K49145J61972O7806K7793P1596J71587K73189L36106
36718A829178L28188K11277j4520k58756l91368l70079k82548k37398k40149k03482
36708C70343o0254J62901L74207M91367M89469M00696K83076J87261J41315J46950
36698B987331J72880J59325N5567j35119l54453n29561o03719n45705l69679j51639
$$ y = [-443483, -494720, -276217, 165659, 673864, 1082079, 1321606, 1423793, 1436260, 1372480, 1245836, 1108731, 1021511, 995182, 991176, 969060, 909628, 800803, 639006, 457241, 325538, 301002, 382740, 522830, 668933, 785851, 851715, 860228, 834553, 824678, 874174, 982169, 1098884, 1161741, 1136175, 1020901, 823673, 553989, 250758, -587, -106334, -28669, 191947, 469984, 719129, 881101, 948907, 976700, 1048296, 1219883, 1493072, 1829178, 2157366, 2368643, 2354123, 2095367, 1703999, 1333920, 1051372, 813974, 573825, 370343, 310089, 472990, 847197, 1338564, 1828033, 2228729, 2511805, 2699066, 2840381, 2987331, 3160211, 3319536, 3375103, 3239984, 2885531, 2355970, 1752251, 1206546, 836867, 685228]
36688F85228J2678Q6798J07505J12077Q8987K0999o3887j23385j56172j85848
36678E84980k08193j94876j37654n1656N1480J50665J86730J01698q3265k71151
36668A28758l81859m06041l62976k59899j23972k8696l1804r3627j00693J5117
36658a645692J98647L23610L17418K28631J69734J97396K59319K60373J61037
36649D70473l340j74590l06705l64006l37475k76592k62413l19398l73955l22342
36639b270343j29188J47310M06466N73488O44285O77239P19383P33823O32065
36630B134528L90298R5230j45393k95035l62684l38900k20258o9926J7871J7572
36620A223303j4719l0535m0828o9649j07867j39352j78333k50825l53678m47797
$$ y = [685228, 697906, 784704, 892209, 1004286, 1093273, 1114272, 1050385, 927000, 770828, 584980, 376787, 181911, 44257, -7399, 44081, 194746, 381476, 483174, 399909, 128758, -253101, -659142, -1022118, -1282017, -1405989, -1434685, -1466489, -1560116, -1660809, -1645692, -1447045, -1123435, -806017, -577386, -407652, -210256, 49063, 309436, 470473, 467133, 292543, -14162, -378168, -715643, -992235, -1254648, -1574046, -1948001, -2270343, -2399531, -2252221, -1845755, -1272267, -627982, 49257, 768640, 1502463, 2134528, 2524826, 2620056, 2474663, 2179628, 1816944, 1478044, 1257786, 1187860, 1205731, 1223303, 1208584, 1178049, 1137221, 1067572, 959705, 820353, 642020, 391195, 37517, -410280]
36610d10280m81533m20529k77884j19083j2353L3199O1641J08685J78529K74223
36600a065385L95367M88983M61057K82239M7883j13151j67981j77542j88962j85499
36590b22991j40539o9737j4147m140n1317j46100k47406k96677k60300j51508
36580a604862r452J28019K32431K91232L16375L29159L29974L00881K41594J77518
36570G32869J21826N8423j6855o4653m5430J8510O0958N3315L6514O0652J17506
36559A133635J51920J27072N8619j3614p0728j22392j74292k00472j61044n1073
36549F77631P8255J57244J51455P0495o2134k20720l59190m18374l81649l10548
36539f17535k92423l46163m00502l76009k73192j64693j08702q9032m5500M9125
$$ y = [-410280, -891813, -1312342, -1590226, -1709309, -1721662, -1688463, -1626822, -1518137, -1339608, -1065385, -670018, -181035, 280022, 562261, 610144, 496993, 329012, 151470, -37492, -222991, -363530, -433267, -447414, -451554, -502871, -648971, -896377, -1193054, -1453354, -1604862, -1614314, -1486295, -1253864, -962632, -646257, -317098, 12876, 313757, 555351, 732869, 854695, 913118, 896263, 831610, 786180, 804690, 865648, 918963, 955477, 1016129, 1133635, 1285555, 1412627, 1471246, 1457632, 1386904, 1264512, 1090220, 889748, 728704, 677631, 755886, 913130, 1064585, 1135080, 1072946, 852226, 493036, 74662, -306987, -617535, -909958, -1256121, -1656623, -2032632, -2305824, -2470517, -2579219, -2668251, -2713751, -2664626]
36529b664626J55597K10847J92046J30170O8772K7782J0084J9844N2345P6786
36519a720353N8486L376m2080m4976j9245R593N0347J25475K10363K30085J38458
36508a000471j2979j08206p7243L1107R3289L1951j07146k02772j80924p9353
36498a612747J2415N7149R2407J58425K35476K65969K20037J21886K0852m6385
36488d74516o8633n3781j7193L1174R5762J90091L15639M40562N02393M46006
36478A407504K72043M4396j62430l20786m41217n14478m98000l79830k29325j46449
36468i68572j62382k18193k43590k28428k07414k01491j94016j48717l3875J54304
36458b452374L67849N17025N34813M36319K95974J67585N2389n2571j14311j02369
$$ y = [-2664626, -2509029, -2298182, -2106136, -1975966, -1907194, -1879412, -1869328, -1849484, -1797139, -1720353, -1661867, -1658491, -1700571, -1745547, -1764792, -1755199, -1704852, -1579377, -1369014, -1138929, -1000471, -1013450, -1121656, -1198899, -1167792, -1074503, -1042552, -1149698, -1352470, -1533394, -1612747, -1600332, -1543183, -1450776, -1292351, -1056875, -790906, -570869, -448983, -428131, -474516, -543149, -596930, -614123, -582949, -487187, -297096, 18543, 459105, 961498, 1407504, 1679547, 1723943, 1561513, 1240727, 799510, 285032, -212968, -592798, -822123, -968572, -1130954, -1349147, -1592737, -1821165, -2028579, -2230070, -2424086, -2572803, -2606678, -2452374, -2084525, -1567500, -1032687, -596368, -300394, -132809, -80420, -132991, -247302, -349671]
36448c49671m6906k0089n5934j11862j14079k3172J44784L34318M73818N06239
36438G37446M24336K74689J14536l1535j64938k79252l56789l95113m10378m05277
36428d92275l53836k34680p0828P7023J52766J33854L2914j05405k09768k14636
36418a284871j13162K8353J29967J73620K00637K31626K19965J12955n7261j83991
36408e42162j93821j13207j7213N3084R6095J03910N7576l5318j35881k13299
36398i40236k62257k78136k45361j60434l9945J05186K75522M48923N72040O12581
36388H7883N95763N57255M80087L21358R8940r0460j56782j01127p752L1347j6544
36377A799968j06077j51086j03781j2147K0781m7856j44659j62335q2286J8458
$$ y = [-349671, -396577, -416666, -472600, -584462, -698541, -721713, -576929, -242611, 231207, 737446, 1161782, 1436471, 1551007, 1519472, 1354534, 1075282, 718493, 323380, -86998, -492275, -846111, -1080791, -1151619, -1074596, -921830, -787976, -755062, -860467, -1070235, -1284871, -1398033, -1369680, -1239713, -1066093, -865456, -633830, -413865, -300910, -358171, -542162, -735983, -849190, -866403, -813319, -717224, -613314, -555738, -591056, -726937, -940236, -1202493, -1480629, -1725990, -1886424, -1926369, -1821183, -1545661, -1096738, -524698, 87883, 683646, 1240901, 1720988, 2042346, 2141286, 2050826, 1894044, 1792917, 1785165, 1816512, 1799968, 1693891, 1542805, 1439024, 1426877, 1447658, 1399802, 1255143, 1092808, 1010522, 1028980]
36367A028980P7517J20043J98947K94528L18215K16995L9022j19957k11206k52669
36357A710415k73860k75591k44432j76385p5038M9943J65955K17342J64498J9160
36347A282007j67108l34095m21422l77051k03308M702J09978N1596r7761k03722
36337c56184j91216r1243J1849O2161P0263Q6277J36882J86470J67645N4539j01712
36326C5731k13642k24597j37300l59J16234J50082Q1880n1013j87586k89009l43394
36315a062973l37457k52390r6155Q1756K24840L10290L45413L37650K88767K14356
36305E4097J45314J00665P2335M5926K4771K2184M0000P0179J11377J66266K24703
36294A077817K68990K97093L18770L22062K69436J46766j161j08119j52190j65036
$$ y = [1028980, 1106497, 1226540, 1425487, 1720015, 2038230, 2255225, 2294247, 2174290, 1963084, 1710415, 1436555, 1160964, 916532, 740147, 665109, 715052, 881007, 1098349, 1262847, 1282007, 1114899, 780804, 359382, -17669, -220977, -216275, -106297, -54701, -152462, -356184, -547400, -638643, -626794, -564633, -494370, -408093, -271211, -84741, 82904, 137443, 35731, -177911, -402508, -539808, -540167, -423933, -273851, -191971, -242984, -430570, -719579, -1062973, -1400430, -1652820, -1748975, -1667219, -1442379, -1132089, -786676, -449026, -160259, 54097, 199411, 300076, 372411, 418337, 443108, 465292, 505292, 575471, 686848, 853114, 1077817, 1346807, 1643900, 1962670, 2284732, 2554168, 2700934, 2699773, 2591654, 2439464, 2274428]
36284B274428j84092k17404k50384k62736k38151j79550j18283q9927r9525j28181
36274E06195j69319k30228k95901l24852k94646k24616j38936l5503Q8834K10350
36264i08622L03587L71868M20592M18845L29126J73077L1381l1136j9975R418
36254A098161L626n6403j47133k18493k39493k34903k56465l11607l45025l05283
36244a013018k10074j26742j00679j21231j48784j52897j22254n6005M1746J61309
36234a848629K86759L95887M60650M54541L71476K42544J23006M6963l571o8929
36224D60697j51884k09994k14485j89097j69656j48590r0797R538J23345K31294
36214c49629L35368M22826M58485M29670L68680L09230K42185J35711j6349j84249
$$ y = [2274428, 2090336, 1872932, 1622548, 1359812, 1121661, 942111, 823828, 733901, 634376, 506195, 336876, 106648, -189253, -514105, -808751, -1033367, -1172303, -1207806, -1118972, -908622, -605035, -233167, 187425, 606270, 935396, 1108473, 1139854, 1108718, 1088743, 1098161, 1101787, 1045384, 898251, 679758, 440265, 205362, -51103, -362710, -707735, -1013018, -1223092, -1349834, -1450513, -1571744, -1720528, -1873425, -1995679, -2051684, -2009938, -1848629, -1561870, -1165983, -705333, -250792, 120684, 363228, 486234, 533197, 529626, 460697, 308813, 98819, -115666, -304763, -474419, -623009, -713806, -704268, -580923, -349629, -14261, 408565, 867050, 1296720, 1665400, 1974630, 2216815, 2352526, 2336177, 2151928]
36204B151928l25028l96822l67504k38566o0521R5550J87517K17827K08260J76147
36194A648788J35120J01113Q5498Q6052R2164R8731J07463J10394Q2829J2266
36184B560418o4773q2747k5421L4152K238j32376k88539l77377l65337k61658
36174I98580r2844R1254K20969K45356J59293p320k01028l48316l95405l65434
36164C05105l37554l45716l36012k49698j04516M2529J67106K60675K83825K09566
36154a04690R6156M3503P4142J18840J25527J19419J38736J70756J82534J70844
36144A135767J50153J24194R5984P6409O0508K6654j7418k2367L6302J07086J15510
36133A888782N2441k5311p3810j09048j73850k79158l82937m20471l60138k34953
$$ y = [2151928, 1826900, 1430078, 1062574, 824008, 763487, 859037, 1046554, 1264381, 1472641, 1648788, 1783908, 1885021, 1970519, 2056571, 2148735, 2247466, 2354929, 2465323, 2548152, 2560418, 2495645, 2412898, 2387477, 2421629, 2423867, 2291491, 2002952, 1625575, 1260238, 998580, 905736, 996990, 1217959, 1463315, 1622608, 1615288, 1414260, 1065944, 670539, 305105, -32449, -378165, -714177, -963875, -1068391, -1025862, -858756, -598081, -314256, -104690, -8534, 34969, 109111, 227951, 353478, 472897, 611633, 782389, 964923, 1135767, 1285920, 1410114, 1506098, 1582507, 1643015, 1669669, 1652251, 1629884, 1666186, 1773272, 1888782, 1941223, 1915912, 1842102, 1733054, 1559204, 1280046, 897109, 476638, 116500, -118453]
36123a18453j13285m0724k3357n4836j20783j73008j49350m7701N6437R9772J08402
36112e76886J49465K35129L18957L64160L62203K96420J49223m3740j97146k56800
36102H00985k44937k08750j56769p1233M0367J38054J91144K08075K17369K19797
36092A134102J65223m462k73441n28202o44924o00516m74632l49223k42615j45983
36082a964673p5762n2322m6948Q883J50078L24937M22802L63139J73496j6339
36072g12709p3819K8766K04494L40822L82608L36825K34647J09446j1264j17938
36062G21878k14559k88663l02688k36674j27597m1909j2358j9848l0902l0295
36052e83615j7728M643L2857O0992Q5005J00190R8381P8786N6566M4339K7686
$$ y = [-118453, -231738, -272462, -295819, -350655, -471438, -644446, -793796, -841497, -785060, -685288, -576886, -427421, -192292, 126665, 490825, 853028, 1149448, 1298671, 1254931, 1057785, 800985, 556048, 347298, 190529, 119296, 159663, 297717, 488861, 696936, 914305, 1134102, 1299325, 1294863, 1021422, 493220, -151704, -752220, -1226852, -1576075, -1818690, -1964673, -2040435, -2092757, -2139705, -2130822, -1980744, -1655807, -1233005, -869866, -696370, -712709, -786528, -757762, -553268, -212446, 170162, 506987, 741634, 851080, 839816, 721878, 507319, 218656, -84032, -320706, -448303, -490212, -502570, -522418, -553320, -583615, -601343, -596700, -563843, -502851, -417846, -317656, -219275, -140489, -83923, -39584, -11898]
36041a1898k0158r3078j38376j00702K3034J71334K53618K10986P2051m7564l7579
36030B81668Q8722J91371J52188J3853o8191j1224J02202J33706M8383p2756j49309
36019G10613j72287j58292r4052L3553J79636K58688K23088J01907l6718j38467
36009I07669j77566j49439p0913K1570R1851J25073J25727J01512N9175J5452
35999A050111J419M4898J41555K43486K86227K39145J31455K3601m6846q7327
35989B027724j24386j65806j86816j46719k8810J17788J84360Q6683j39596l50878
35979A273544m26275l74225k92271k42152j99443j18582m295R7604J51471J52090
35969A7466J12169N4168P642o554Q108L4478O6277J11442J71779K29879K59084
$$ y = [-11898, -32056, -125134, -263510, -364212, -341178, -169844, 83774, 294760, 366811, 319247, 281668, 370390, 561761, 713949, 727802, 659611, 648387, 750589, 884295, 932678, 859922, 710613, 538326, 380034, 285982, 319535, 499171, 757859, 980947, 1082854, 1046136, 907669, 730103, 580664, 509751, 531321, 623172, 748245, 873972, 975484, 1034659, 1050111, 1051530, 1096428, 1237983, 1481469, 1767696, 2006841, 2138296, 2161897, 2115051, 2027724, 1903338, 1737532, 1550716, 1403997, 1375187, 1492975, 1677335, 1764018, 1624422, 1273544, 847269, 473044, 180773, -61379, -260822, -379404, -383699, -286095, -134624, 17466, 129635, 183803, 191445, 184891, 192999, 227477, 293754, 405196, 576975, 806854, 1065938]
35958A065938K41501J78254R1720K0002m05M1931J21906J91572K14620J99728
35948B366767K02009K77656M22677N57501N82583M55133K17311l6455k13164k65731
35938D566287k19593j60575j67705k37540k85532k36521j05807K1030P9186Q0618
35928C333848Q5313J32279J97562K09732J11796p6351k55502l19501k37210o6329
35918C115637R9485J87493J74042R4767K9726M3327J18792J69892J33758L8799
35908D205718l1629k6852L6354J11604J70715K13745K47610K62151K29919J37169
35898E556504J2937r0131j48073j79515k04017k18155k28897k73277l67808m63210
35888C396358m93372m55090l94267l24247k12093m5793J43493L38284N50687P50537
$$ y = [1065938, 1307439, 1485693, 1577413, 1597415, 1597010, 1638941, 1760847, 1952419, 2167039, 2366767, 2568776, 2846432, 3269109, 3826610, 4409193, 4864326, 5081637, 5045182, 4832018, 4566287, 4346694, 4186119, 4018414, 3780874, 3495342, 3258821, 3153014, 3174044, 3253230, 3333848, 3419161, 3551440, 3749002, 3958734, 4070530, 3994179, 3738677, 3419176, 3181966, 3115637, 3215122, 3402615, 3576657, 3671424, 3701150, 3744477, 3863269, 4033161, 4166919, 4205718, 4174089, 4147237, 4183591, 4295195, 4465910, 4679655, 4927265, 5189416, 5419335, 5556504, 5569441, 5479310, 5331237, 5151722, 4947705, 4729550, 4500653, 4227376, 3859568, 3396358, 2902986, 2447896, 2053629, 1729382, 1517289, 1471496, 1614989, 1953273, 2503960, 3254497]
35878C254497Q38643P50069N51211L75855K82510K31472J91874K01106K94260
35869F971497M25071M99428M72627L86609L16971L01192L16244L12015K61406
35860A0263060J83353J27123J42570K57943M60123O82502Q35709Q82271Q78565
35851A4713219R20462J049149J228586J405021J554310J668311J735046J761104
35843B6035208J800862J941529K253713K749863L374924M037750M674578N298573
35835E2167000N990037O848078P957700R369352J1059909J2919879J4835947J6801097
35827A37948999J8894290K1125566K3315887K5071522K5731757K4330876J9903173
35820B96322070J2221497K377050p537830j5541485k0703038k3181117k3632248
$$ y = [3254497, 4093140, 4843209, 5394420, 5770275, 6052785, 6284257, 6476131, 6677237, 6971497, 7396568, 7895996, 8368623, 8755232, 9072203, 9373395, 9689639, 10001654, 10263060, 10446413, 10573536, 10716106, 10974049, 11434172, 12116674, 12952383, 13834654, 14713219, 15633681, 16682830, 17911416, 19316437, 20870747, 22539058, 24274104, 26035208, 27836070, 29777599, 32031312, 34781175, 38156099, 42193849, 46868427, 52167000, 58157037, 65005115, 72962815, 82332167, 93392076, 106311955, 121147902, 137948999, 156843289, 177968855, 201284742, 226356264, 252088021, 276418897, 296322070, 308543567, 310920617, 303382787, 287841302, 267138264, 243957147, 220324899]
35813B20324899k2728320k1048837j9073402j7089866j5164323j3277919j1471423
35806A00470809r838726q440587p276878o314020n500344m778544m121739l547731
35798E0652240l077204k697007k385642k148260j992034j883673j769477j633439
35790C3065504j503840j402283j314139j212823j087912r39605p63436n54504
35782B4286962l23603j04824N6509J34233J43096J13595L8279j26720l76945n98548
35772B3242034o39931m51169j23543K06353M52557N79513N67786M26675K17633
35763B4477908K2640j10513j75742j83713j62680j67972k41060l48753m02275
35754B2707840l59663k82790k65149l20703l77816l80521l63303m12766n74175
$$ y = [220324899, 197596579, 176547742, 157474340, 140384474, 125220151, 111942232, 100470809, 90632083, 82191496, 74914618, 68600598, 63100254, 58321710, 54199971, 50652240, 47575036, 44878029, 42492387, 40344127, 38352093, 36468420, 34698943, 33065504, 31561664, 30159381, 28845242, 27632419, 26544507, 25604902, 24841466, 24286962, 23963359, 23858535, 23915044, 24049277, 24192373, 24305968, 24344247, 24217527, 23840582, 23242034, 22602103, 22150934, 22027391, 22233744, 22686301, 23265814, 23833600, 24260275, 24477908, 24500548, 24390035, 24214293, 24030580, 23867900, 23699928, 23458868, 23110115, 22707840, 22348177, 22065387, 21800238, 21479535, 21101719, 20721198, 20357895, 19945129, 19370954]
35745A9370954q08446j025235j142549j129518j019955q88783p96705p48902p12658
35736A1098203o66799o12575n41651m33278l04080k29542k77990m30611n94011
35727G007666o85450o81133n95061m54773l05711j99068j49754j24682q8548m4718
35717C678768j9566k6863o2824j16590j66957j85493j63433j22353p9314j6884
35707B718491Q6084K02116K61245K13171P0826j00208k17871k22388j15271K9985
35697B926180J19742J18734O8231K2933j1555o5552j45772k15190k38780k32381
35687B346590k45703k94464l29831k94709j98556j04484m1074L0001J31784J95540
35677A195094J22109q2888k83919l44063k51760j08190j8117j2125m9959o8474
$$ y = [19370954, 18562508, 17537273, 16394724, 15265206, 14245251, 13356468, 12559763, 11810861, 11098203, 10431404, 9818829, 9277178, 8843900, 8539820, 8310278, 8032288, 7601677, 7007666, 6322216, 5641083, 5046022, 4591249, 4285538, 4086470, 3936716, 3812034, 3723486, 3678768, 3659202, 3632339, 3569515, 3452925, 3285968, 3100475, 2937042, 2814689, 2735375, 2718491, 2804575, 3006691, 3267936, 3481107, 3551933, 3451725, 3233854, 3011466, 2896195, 2926180, 3045922, 3164656, 3232887, 3255820, 3244265, 3178713, 3032941, 2817751, 2578971, 2346590, 2100887, 1806423, 1476592, 1181883, 983327, 878843, 837769, 867770, 999554, 1195094, 1317203, 1234315, 950396, 606333, 354573, 246383, 228266, 216141, 166182, 97708]
35667I7708l2635L6859Q4247P8749N2369O7623J49265K56010L17471K92390J94511
35656A594567P1395l8292j27534k03454k56291k59185j99588r7818Q757Q6935
35646E79492J12077P6042Q404k7579J2431J04502J74100J61428O1071q7649k23172
35635I51147k80660k27089r9195J0490K7595m4502j43440k13749k42235k39085
35625e00723k05200j24043K0235K16424M13981N44123N66529M98633L95400L03032
35615B128391K35620J85126J36553P4997m693r0659j68760k44907l33138m13744
35605A504786m26309l28904j58985j5574K3428l9107j34164j86430j64049q7914
35595a3222j170P1607J33071J83434K02721J81015J51965J65397K24549K75937
$$ y = [97708, 65073, 101932, 186179, 264928, 317297, 384920, 534185, 790195, 1107666, 1400056, 1594567, 1665962, 1627670, 1500136, 1296682, 1040391, 781206, 581618, 483800, 492557, 579492, 691569, 767611, 776015, 748436, 760867, 865369, 1039469, 1200897, 1261968, 1174319, 951147, 670487, 443398, 344203, 354693, 382288, 337786, 194346, -19403, -261638, -500723, -705923, -829966, -809731, -593307, -179326, 364797, 931326, 1429959, 1825359, 2128391, 2364011, 2549137, 2685690, 2760687, 2755994, 2665335, 2496575, 2251668, 1918530, 1504786, 1078477, 749573, 590588, 575014, 598442, 559335, 425171, 238741, 74692, -13222, -14392, 57215, 190286, 373720, 576441, 757456, 909421, 1074818, 1299367, 1575304]
35585A575304K68821K04708J23459O5281N6390J03073J73899K02163J33433k6637
35575B879894k19189l77045m54561m32751l22619j65664j6676P9526R9757N0702
35565A121374k4411o9349o8169o3293j00253j67440k12214j97807j10061P3588
35555A81965L61858O81277Q82584Q60111O51273L91713J85098M0042q2546k01171
35545C952204l02389l70375m04965m12719l92495l37021k49368j52715p6212l0313
35535A223632l112J7749K8725K0097p734m6674r3559j49072k03034k28232j94689
35524C64097r3974M6022J70039K26843K01345J21127L3906k0822k4329K3772J09387
35513A157413K03851K67062K62595J78849L4768j40552l28003n05257o20232o10654
$$ y = [1575304, 1844125, 2048833, 2172292, 2237573, 2293963, 2397036, 2570935, 2773098, 2906531, 2879894, 2660705, 2283660, 1829099, 1396348, 1073729, 908065, 891389, 970915, 1070672, 1121374, 1096963, 1027614, 959445, 896152, 795899, 628459, 416245, 218438, 108377, 181965, 543823, 1225100, 2107684, 2967795, 3619068, 4010781, 4195879, 4235921, 4153375, 3952204, 3649815, 3279440, 2874475, 2461756, 2069261, 1732240, 1482872, 1330157, 1253945, 1223632, 1220520, 1238269, 1266994, 1287091, 1279357, 1232683, 1139124, 990052, 787018, 558786, 364097, 270123, 316145, 486184, 713027, 914372, 1035499, 1069405, 1048583, 1024254, 1048026, 1157413, 1361264, 1628326, 1890921, 2069770, 2104538, 1963986, 1635983, 1130726, 510494, -100160]
35503a00160m71544k84506j50769r7401o8632k736J06504K18903K87688K86454
35493b76199K25732J53091J12259R0704L1700q7277k11575k63711k21942j26321
35483e73539k7266M6199Q2865Q6389P4444N8464K6841l3188j04977j58055j87887
35472g09710k09677k12935j58625l6307J04348K00430K35388K33372K14927J86429
35462a52360J61359J57538J67774J58112J06744L1709k6873m2639k1992l980l9984
35451D95408j43940k47988k36708n9387K01089M01586M78323M86009N01761N29756
35441B405909N16052M23145K59806N6768j52908l32287m46788m81363m44801l60887
35431A442646k63173j87846j54171j51798j53938j36731q3924N175R6221J31952
$$ y = [-100160, -571704, -856210, -1006979, -1104380, -1173012, -1175748, -1069244, -850341, -562653, -276199, -50467, 102624, 214883, 305587, 337287, 250010, 38435, -225276, -447218, -573539, -600805, -554606, -471741, -385352, -310908, -252444, -225603, -258791, -363768, -521823, -709710, -919387, -1132322, -1290947, -1327254, -1222906, -1022476, -787088, -553716, -338789, -152360, 8999, 166537, 334311, 492423, 599167, 630876, 604003, 561364, 539372, 535392, 495408, 351468, 103480, -133228, -192615, 8474, 410060, 888383, 1374392, 1876153, 2405909, 2921961, 3345106, 3604912, 3661680, 3508772, 3176485, 2729697, 2248334, 1803533, 1442646, 1179473, 991627, 837456, 685658, 531720, 394989, 311065, 316240, 412461, 544413]
35421E44413R3615L5664K4643N1692M5003k9762j22715j65870j49620j11177p4018
35410A41868k6927M8096J47008K36565K66338K00077M9041j30028k73297l40129
35400C18612l16849k22633j18619p4844r9096j15139l8135J34042L20202M35919
35390B23460M57299M16580L59359L09840K64141K08453J38764N7143m2862j64894
35380B227283k80690l37619l10022k25800j29697m0479L8510Q7814Q0520J9415
35370A129235n1238o9764P953J74280L54178M47758M19173L33566K79222K61262
35360C285625K02666N0409j49251k93100l21995k68559k12446j98930k06353j92953
35350A695113j61973j60676k18445l12484l99700m52756m54720l95560k98087
$$ y = [544413, 638028, 673692, 698335, 750027, 795030, 765268, 642553, 476683, 327063, 215886, 141868, 114941, 163037, 310045, 546610, 812948, 1013025, 1062066, 932038, 658741, 318612, 1763, -220870, -339489, -414333, -513429, -628568, -666703, -532661, -212459, 223460, 680759, 1097339, 1456698, 1766538, 2030679, 2239132, 2377896, 2435039, 2392177, 2227283, 1946593, 1608974, 1298952, 1073152, 943455, 902976, 941486, 1029300, 1109820, 1129235, 1077997, 1008233, 1016186, 1190466, 1544644, 1992402, 2411575, 2745141, 3024363, 3285625, 3488291, 3538700, 3389449, 3096349, 2774354, 2505795, 2293349, 2094419, 1888066, 1695113, 1533140, 1372464, 1154019, 841535, 441835, -10921, -465641, -861201, -1159288]
35341a159288k12002j48686n5757R8171K42505K70681J77915O8780K0739M980
35331f91962l0329n8042q768J15056K16245K01699P7351o3180j29926j10772o5242
35320e47870n6508r5150j45700j74117j78777j82996k07516k43765k48026j79258
35310b259683n8321L0770K8352k2594j8884Q3599K23075L03559K80263J69990
35300a239874J7085j26343k10060k06752j27095q905J05755J87745K29881K39061
35290a139502K08910J09956p0533k82590m30921m40094k91376j8476K90981N01597
35280a562048N03544L12756O5948j09622j97117k45724k64911k05226l3125K09103
35270a526422M23372N26369N08413M33608L77094L61235L63507L75292M16166
$$ y = [-1159288, -1371290, -1519976, -1575733, -1477562, -1235057, -964376, -786461, -717681, -696942, -691962, -722291, -780333, -789101, -674045, -457800, -256101, -178750, -241930, -371856, -482628, -547870, -604378, -699528, -845228, -1019345, -1198122, -1381118, -1588634, -1832399, -2080425, -2259683, -2318004, -2287234, -2258882, -2281476, -2300360, -2216761, -1993686, -1690127, -1409864, -1239874, -1222789, -1349132, -1559192, -1765944, -1893039, -1901944, -1796189, -1608444, -1378563, -1139502, -930592, -820636, -891169, -1173759, -1604680, -2044774, -2336150, -2354626, -2063645, -1562048, -1058504, -745748, -679800, -789422, -986539, -1232263, -1497174, -1702400, -1735525, -1526422, -1103050, -576681, -68268, 365340, 742434, 1103669, 1467176, 1842468, 2258634]
35261B258634M82503N19857M70038L23318J11096j20241l06590l76530l10540
35252C051545j78725q4009o8423r2543r4243m8390J1945N964j43425m26586p14580
35241A218530q43676p48545n07295k63094j14222o6017o1480n1164l7748m6301
35231a521012n6566k024J40042K89648L35719K52302J08491k0343j04814j32263
35221g10820q2161M5352K05556L33945L83101L36219K10628N4547q2483j83146
35211E10738k49685k64499j97982o1352Q4783J90233K50447K61539J78195l5800
35201F66617l21473n32362n50187l84971j54349K8357J40608K35207L56102M82107
35191c4344N51183N23503M12460K69403J53421J00113R0458N3406o8270k41996
$$ y = [2258634, 2741137, 3260994, 3731032, 4054350, 4165446, 4045205, 3738615, 3362085, 3051545, 2872820, 2788811, 2720388, 2627845, 2533602, 2485212, 2497157, 2503121, 2359696, 1933110, 1218530, 374854, -373691, -880986, -1144080, -1258302, -1324319, -1385799, -1436963, -1474711, -1521012, -1577578, -1579602, -1439560, -1149912, -814193, -561891, -453400, -473743, -578557, -710820, -792981, -747629, -542073, -208128, 174973, 511192, 721820, 776367, 693884, 510738, 261053, -3446, -201428, -262780, -177997, 12236, 262683, 524222, 702417, 666617, 345144, -187218, -737405, -1122376, -1276725, -1248368, -1107760, -872553, -516451, -34344, 516839, 1040342, 1452802, 1722205, 1875626, 1975739, 2066197, 2119603, 2051333, 1809337]
35181A809337l56929l28396j81995k6350M5734K2861l9829q2539r1715j01668
35171F68511j49305k29598l01395l31910l20679k80981k20715j54135j14728j31953
35161a566888j91780k31798j86258m5145J24631K23346K00891J03754L5188O6068
35151a467991J85824L28666M27773M45265L75199K35575N3597j44880l25474m32968
35141c19414m15414k73917p5105R6710J92425K06868J63312J05863Q3578J11942
35131a23152J54771J66148J48497J49236J97474K60905K73299J97339N7198q3976
35121A397739j75266k11311k19611k18543j93373j15325K1611J86026L26002L98738
35111A196687L91948L23411K19064R3912l9287j50291k01365j82212j18096l8759
$$ y = [1809337, 1452408, 1124012, 942017, 915667, 961401, 984262, 944433, 861894, 770179, 668511, 519206, 289608, -11787, -343697, -664376, -945357, -1166072, -1320207, -1434935, -1566888, -1758668, -1990466, -2176724, -2221869, -2097238, -1873892, -1673001, -1569247, -1534059, -1467991, -1282167, -953501, -525728, -80463, 294736, 530311, 583908, 439028, 113554, -319414, -734828, -1008745, -1083850, -987140, -794715, -587847, -424535, -318672, -235094, -123152, 31619, 197767, 346264, 495500, 692974, 953879, 1227178, 1424517, 1481715, 1397739, 1222473, 1011162, 791551, 573008, 379635, 264310, 285921, 471947, 797949, 1196687, 1588635, 1912046, 2131110, 2225022, 2185735, 2035444, 1834079, 1651867, 1533771, 1495012]
35101A495012L8225Q5251N9950m5996j72287k40162k30810j84611j34404q2335
35091E87833m1508m6671r9288j43848j34154r3254o8164n0689K431P6959Q8908
35080G8555j2753j72772k88104l09547k54469j49526j2567J15605J77828J62249
35070f65501J24138J20282J44180J51429J27555R5446O6741K7241k5719p0845
35060I4947j03318j51607k25612k75279k40484j31507k1858L6902N5491O0132
35050i02193N1935L4543L9847Q4331J23777J00013K7185j4910J7498P5024P5502
35039b87448p704j32766k35005k65399k12968j19988n9081o7444j13516j45478
35029a646797j49112j30204o9759N1781J96339K90727L16443L30126L79436M40545
$$ y = [1495012, 1533237, 1618488, 1678438, 1632442, 1460155, 1219993, 989183, 804572, 670168, 587833, 546325, 499654, 400366, 256518, 122364, 29110, -39054, -89743, -87312, -10353, 78555, 65802, -106970, -395074, -704621, -959090, -1108616, -1121183, -1005578, -827750, -665501, -541363, -421081, -276901, -125472, 2083, 97529, 164270, 191511, 165792, 94947, -8371, -159978, -385590, -660869, -901353, -1032860, -1054718, -1017816, -962325, -902193, -850258, -815715, -775868, -691537, -567760, -467747, -440562, -455472, -437974, -362950, -287448, -295152, -427918, -662923, -928322, -1141290, -1261278, -1320359, -1387803, -1501319, -1646797, -1795909, -1926113, -1995872, -1944091, -1747752, -1457025, -1140582, -810456, -431020, 9525]
35019I525M58518M12017L17592K09153J38738J55302K41457K99799K44436Q7897
35009B574434r4962k58037l90720m63114m39053l49910k90310l10745l54256l28073
34999g04746k11882p1983J2596K0051j922J9996J15903K40697L24538L52481L66824
34988D62553L87392L66736K47211L9959j75111l14888l45585k88314j91052q6945
34978A01956K6870J57125K64053K73670J52732n3140k64516m17921m60719l52206
34968e72096j20115J14132K26488K06929J47852J23724J24782J06800N4282k3490
34958C89288j17382k08767k58373k36322j58588p5977k7939j4586q419J4110M9472
34947f53483P0428N3701N072m2563n1021M59R3744J61729J25733k3168j88716
$$ y = [9525, 468043, 880060, 1197652, 1406805, 1545543, 1700845, 1942302, 2242101, 2486537, 2574434, 2479472, 2221435, 1830715, 1367601, 928548, 578638, 288328, -22417, -376673, -704746, -916628, -988611, -976015, -955964, -957886, -937890, -821987, -581290, -256752, 95729, 462553, 849945, 1216681, 1463892, 1503851, 1328740, 1013852, 668267, 379953, 188901, 101956, 128826, 285951, 550004, 823674, 976406, 923266, 658750, 240829, -219890, -572096, -692211, -578079, -351591, -144662, 3190, 126914, 251696, 358496, 412778, 389288, 271906, 63139, -195234, -431556, -590144, -666121, -694060, -708646, -717065, -702955, -653483, -583055, -529354, -524282, -566845, -617866, -617407, -523663, -361934, -236201, -259369, -448085]
34936d48085k51893j94074j09522r0346j30051j51173r5921K7777J57379K04802
34926a081107J03680j27837l76504n21305n35534m79568l99692k75223q0838J34950
34916c638978K71603K72252J73906O3957R364L1223J17175K26434K88110K32901
34906a952053N6712j50805k63350k16670n2802J26572K40509K69420K40657J91602
34896a510208J41980Q8599K1311n6728j27187j73776j93924j91015j64567j17085
34886b282600o6337l8968m4438n5264k0522Q7128K29992L22658L09103K19531
34876a339717J31711Q0059L2598l7993j03136j27670j35960j78402k43741k59327
34866b181578j88027p6445J6321R5729K00190L20898M01321M12167L86671L71853
$$ y = [-448085, -699978, -894052, -1003574, -1093920, -1223971, -1375144, -1471065, -1443288, -1285909, -1081107, -977427, -1105264, -1481768, -2003073, -2538607, -3018175, -3417867, -3693090, -3773928, -3638978, -3367375, -3095123, -2921217, -2857260, -2847896, -2816673, -2699498, -2473064, -2184954, -1952053, -1895341, -2046146, -2309496, -2526166, -2578968, -2452396, -2211887, -1942467, -1701810, -1510208, -1368228, -1279629, -1258318, -1315046, -1442233, -1616009, -1809933, -2000948, -2165515, -2282600, -2348937, -2387905, -2432343, -2487607, -2508129, -2421001, -2191009, -1868351, -1559248, -1339717, -1208006, -1127947, -1095349, -1133342, -1236478, -1364148, -1500108, -1678510, -1922251, -2181578, -2369605, -2446050, -2429729, -2334000, -2133810, -1812912, -1411591, -999424, -612753, -240900]
34856b40900L71079L46827K65108J30020j4529j16106j60559j88376k49427l40427
34846a97290m04103l91475l05804j82628n2243O4675J45112J68912J31825M8559
34836i74460m5721r9701q2815l1991l0271j12021k13824k50287k15033j66932
34826b223056j36874j02366m9324J455M3983J08391K03937K85587L13317L07841
34816a247109L05521K88186K09797P7859m5534j23740j77389k24571k33255j60623
34806a330858j7053J32583K22236K31238J95328J82226K35949L23625L46050K23797
34796G45121j7866k51695l38902k28570J1198K48116L78967L85280L13409K16538
34786A461596J21296L0974o4243j76053k94046l76175l90565l66304l66176l96984
$$ y = [-240900, 130179, 477006, 742114, 872134, 857605, 741499, 580940, 392564, 143137, -197290, -601393, -992868, -1298672, -1481300, -1533543, -1468868, -1323756, -1154844, -1023019, -974460, -1020181, -1119882, -1202697, -1234688, -1264959, -1376980, -1590804, -1841091, -2056124, -2223056, -2359930, -2462296, -2511620, -2510165, -2466182, -2357791, -2153854, -1868267, -1554950, -1247109, -941588, -653402, -443605, -365746, -411280, -535020, -712409, -936980, -1170235, -1330858, -1347911, -1215328, -993092, -761854, -566526, -384300, -148351, 175274, 521324, 745121, 727255, 475560, 136658, -91912, -80714, 167402, 546369, 931649, 1245058, 1461596, 1582892, 1613866, 1549623, 1373570, 1079524, 703349, 312784, -53520, -419696, -816680]
34776h16680l85019k68197q3590P0920J41756J48847J25804P8837Q095p3291j56384
34765a208902k38891k92064k56854j04733J11495K96651M02138M57801N14783
34756c18576N70972N58953M07663J22398j93031m06613m63833m19182l56657k94460
34746g92366j88514k0565J50372K38707K17630J38141P0790M1841K3283k8112
34736a48793j25401k36386l06620k98750k15184q9550L7748J37242J96751K23351
34726h25592K39381K66627L08634L50870L77374L78242L37744K30038M6074j74976
34716A534416l57630m41904m16963l06168j41920L0410J46513J57470P6213l0176
34706B50261r9387j10715p0560K498O5802O5249k121n6489q604J34808K71425
$$ y = [-816680, -1201699, -1469896, -1553486, -1482566, -1340810, -1191963, -1066159, -987322, -979227, -1052518, -1208902, -1447793, -1739857, -1996711, -2101444, -1989949, -1693298, -1291160, -833359, -318576, 252396, 811349, 1219012, 1341410, 1148379, 741766, 277933, -141249, -497906, -792366, -980880, -1001445, -851073, -612366, -394736, -256595, -185805, -143964, -120681, -148793, -274194, -510580, -817200, -1115950, -1331134, -1420684, -1382936, -1245694, -1048943, -825592, -586211, -319584, -10950, 339920, 717294, 1095536, 1433280, 1663318, 1709392, 1534416, 1176786, 734882, 317919, 11751, -130169, -99759, 46754, 204224, 280437, 250261, 150874, 40159, -30401, -27903, 37899, 103148, 101027, 44538, 35934, 170742, 442167]
34695D42167L11458K53765J51146M2477n6527j29230j65975j86425k20179k64132
34685A78545k83035k54025j89990j18038n6428j6556m489r169o659J0484K0792
34674g28568K939l5578p2851j02404j26751j28886q1110O267O8507M4512n1543
34663a205466j37324j48494j04127p2863q0295o9453L6338K38973M45033N38948
34653e58730M70708K77665M0475j68890l07620l60632l40164k84702k40038k24281
34643a696209k06583j27222M8990K89122N00617N93893N51362M38939L40350K73968
34633A007227J84460K6642j57638k75512k97916l03359l81891n17891o04884n68739
34623a889501m34033k61968p2515J33917L08788L69705K94668J65483R4875J26367
$$ y = [442167, 753625, 1007390, 1158536, 1201013, 1144486, 1015256, 849281, 662856, 442677, 178545, -104490, -358515, -548505, -666543, -722971, -739527, -744016, -753185, -759844, -749360, -728568, -725629, -761207, -834058, -936462, -1063213, -1192099, -1273209, -1266942, -1198435, -1153923, -1205466, -1342790, -1491284, -1595411, -1668274, -1748569, -1818022, -1781684, -1542711, -1097678, -558730, -88022, 189643, 230118, 61228, -246392, -607024, -947188, -1231890, -1471928, -1696209, -1902792, -2030014, -1981024, -1691902, -1191285, -597392, -46030, 392909, 733259, 1007227, 1191687, 1218329, 1060691, 785179, 487263, 183904, -197987, -715878, -1320762, -1889501, -2323534, -2585502, -2658017, -2524100, -2215312, -1845607, -1550939, -1385456, -1290581, -1164214]
34613a164214K16539K91504K97841K17959P4898p0920j56354j63874j27851r0205
34603f74677o5293n3197o3158j00269j38293j31282n8437N3417J53454K04984
34593h72751K04739J79702J67487J88788K34735K84061L24544L46244L25960K45241
34583A628750J24489J3473n8060r6824j09617q5947l5559q142m0423j04854j47574
34572A079712j60614j72027j72771j08816L7542K02700L06883L36038L30405L15674
34562A994726K83285K31174J84909J63726J45189Q2648m2060j91195l00775l37019
34552B214608l18182k79699k32382j70928j11501q7794j01954j11222q7355o8682
34542F44909j19351k38772l39779l27792j88930O402J75011K84147L46936L69231
$$ y = [-1164214, -947675, -656171, -358330, -140371, -65473, -136393, -292747, -456621, -584472, -674677, -739970, -793167, -856325, -956594, -1094887, -1226169, -1284606, -1231189, -1077735, -872751, -668012, -488310, -320823, -132035, 102700, 386761, 711305, 1057549, 1383509, 1628750, 1753239, 1766712, 1708652, 1611828, 1502211, 1416264, 1380705, 1372563, 1332140, 1227286, 1079712, 919098, 747071, 574300, 465484, 503026, 705726, 1012609, 1348647, 1679052, 1994726, 2278011, 2509185, 2694094, 2857820, 3003009, 3085657, 3043597, 2852402, 2551627, 2214608, 1896426, 1616727, 1384345, 1213417, 1101916, 1014122, 912168, 800946, 713591, 644909, 525558, 286786, -52993, -380785, -569715, -563313, -388302, -104155, 242781, 612012]
34532F12012L20273J72067l5385j93583k13029j10535L496K8043m0819j19298
34522D23242j23713m9078L4058N6505J5329m5851j06416j85345k82300l41844
34512f05413l10180k08255j13297p7716r9404j59523k39988k96727k67168j35617
34502b513288L7563J78315K65094L07066K87824J78034l011j80463k86828l08995
34492b038689k76010k28442j96600j72243r5635Q9963L50446N58540O07953N15624
34482h85093L94412L44947L90388M85422N52295N26090M06780K64545J64648R6248
34472B740682Q494r8023j67349j75535j64421j69168j65095j21424o6805n7012
34462A564344j00964j58535j96393k12375k18866k32788k66578k99078k75379
$$ y = [612012, 932285, 1104352, 1068967, 875384, 662355, 551820, 555316, 583359, 542540, 423242, 299529, 250451, 284509, 341014, 356343, 310492, 204076, 18731, -263569, -605413, -915593, -1123848, -1237145, -1314861, -1414265, -1573788, -1813776, -2110503, -2377671, -2513288, -2475725, -2297410, -2032316, -1725250, -1437426, -1259392, -1262403, -1442866, -1729694, -2038689, -2314699, -2543141, -2739741, -2911984, -3007619, -2917656, -2567210, -2008670, -1400717, -885093, -490681, -145734, 244654, 730076, 1282371, 1808461, 2215241, 2479786, 2644434, 2740682, 2749176, 2651153, 2483804, 2308269, 2143848, 1974680, 1809585, 1688161, 1621356, 1564344, 1463380, 1304845, 1108452, 896077, 677211, 444423, 177845, -121233, -396612]
34453c96612j72067m3490L9965Q4061J51969K62960L63759M00443L66013K75918
34443A332919J57966P7983J06288K23262L11717K82519J63507K8952j02750k43271
34433B339092l53208l66893k85933j79123q9313j919Q7549J37418J16361N0323
34423A454354j5036o4815j02515j18836j05308q1073p8293j11652j80273k79051
34413C17502l76262l92854k51061L3884L30445M84897M44320K84731J26844L5236
34403A037682o021m1813q9234j30180j45161j41578j43144j53285j41141p9431
34393c3306N701M5195l06r5687j74076k04814j97656j64637j18421r4848j25139
34382a157994j80462j91591j35674n7777O838P5841J57356K04317J83586J45393
$$ y = [-396612, -568679, -612169, -572204, -488143, -336174, -73214, 290545, 690988, 1057001, 1332919, 1490885, 1568868, 1675156, 1898418, 2210135, 2492654, 2656161, 2685113, 2582363, 2339092, 1985884, 1618991, 1333058, 1153935, 1064622, 1062703, 1150252, 1287670, 1404031, 1454354, 1439318, 1374503, 1271988, 1153152, 1047844, 966771, 888478, 776826, 596553, 317502, -58760, -451614, -702675, -668791, -338346, 146551, 590871, 875602, 1002446, 1037682, 1031661, 989848, 900614, 770434, 625273, 483695, 340551, 187266, 46125, -33306, -27605, 17590, 17284, -78403, -252479, -457293, -654949, -819586, -938007, -1032855, -1157994, -1338456, -1530047, -1665721, -1723498, -1716660, -1640819, -1483463, -1279146, -1095560, -950167]
34372i50167J58932K05297K01576J19080J0849p8732j66923k79330l95596m70028
34362a645042m69772l80390k13689k4026J24156K23741L21484M28365M77575M05364
34352g52234K39985P3633k6971m4824K0984J51833K74186K88390J65965p234j12604
34341B71109j11660n7086n039M7999J31741K38114L24690L74228M15638M75822
34331B105556N36710N54690N02662L82195K21604P9133J1992N697l8823k00149
34321D161267m30975o02908o45324n87505m69786k85459m0295J85558K86075K25108
34311A795756O0749j05728j88585j56960n3100L3321L0143p3209k35703l90877
34301G15807m62346l96074k07772J7904J91789K68565K31388P5551j57124l57356
$$ y = [-950167, -791235, -585938, -384362, -265282, -254433, -333165, -500088, -779418, -1175014, -1645042, -2114814, -2495204, -2708893, -2732919, -2608763, -2385022, -2063538, -1635173, -1157598, -752234, -512249, -438616, -465587, -510411, -489427, -337594, -63408, 224982, 390947, 383713, 271109, 159449, 102363, 97324, 145323, 277064, 515178, 839868, 1214096, 1629734, 2105556, 2642266, 3196956, 3699618, 4081813, 4303417, 4382550, 4394542, 4400239, 4361416, 4161267, 3730292, 3127384, 2482060, 1894555, 1424769, 1139310, 1099015, 1284573, 1570648, 1795756, 1856505, 1750777, 1562192, 1405232, 1352132, 1385453, 1415596, 1342387, 1106684, 715807, 253461, -142613, -350385, -332481, -140692, 127873, 359261, 434812, 277688, -79668]
34291g9668m11320k91821p2236J41987K83867L46483L58815L36131K49409O7220
34281I28867j58809k85628j99027N9964L13945L95318K67162K2739k01861l17162
34271H25508l13223k26653q8915Q1825K51929L75218M38114M70290M91272M75668
34261B781033L93004K52333Q3093r4635k48788l22270k92808k25205k10707k61903
34251A853147l13312l17183k87233k50014k10323j78379j78740k03596j94772
34242b80405j06238L4319J51746J98125J81303J30109N4948n1437j82841k99517
34232a69888l49633l13322k15066r1209L3057J27368J55815J28667J26204K17279
34222c50728L59234M29025L59662K02085M6605o4194j26102j34773j03153q2931
$$ y = [-79668, -490988, -782809, -855045, -713058, -429191, -82708, 276107, 612238, 861647, 928867, 770058, 484430, 285403, 345367, 659312, 1054630, 1321792, 1344531, 1142670, 825508, 512285, 285632, 196717, 278542, 530471, 905689, 1343803, 1814093, 2305365, 2781033, 3174037, 3426370, 3509463, 3414828, 3166040, 2843770, 2550962, 2325757, 2115050, 1853147, 1539835, 1222652, 935419, 685405, 475082, 296703, 117963, -85633, -280405, -386643, -352324, -200578, -2453, 178850, 308959, 363907, 312470, 129629, -169888, -519521, -832843, -1047909, -1139118, -1106061, -978693, -822878, -694211, -568007, -350728, 8506, 437531, 797193, 999278, 1045883, 981689, 855587, 720814, 617661, 534730]
34212E34730j13842j59803j39698k6864J13592J95086J94479J58719J47126J80922
34202A084447K35568K62348K18503R6499o1511j84342k22852j86018j22918p6051
34192A043673o5270j04475j95562k94830l25832k60687j65413j24566j33573j08872
34182g35407l148J32711K12409K02081J30902M8920O23J7594J02888K17393K92347
34171F19313K62417J02763j40560l54642m25416l26988j44128L011N3865L0097
34161c20268j6775o4583j31326k37299l62600m49287m50490l71016k54175j40587
34151b798406n0531J0256N0707R2397J45481J92629K16256K30314K60031L02815
34141a348051L41194L81458M36024M72255M30959L07038J64761N5936l0460j13013
$$ y = [534730, 420888, 261085, 121387, 94523, 208115, 403201, 597680, 756399, 903525, 1084447, 1320015, 1582363, 1800866, 1897365, 1835854, 1651512, 1428660, 1242642, 1119724, 1043673, 978403, 873928, 678366, 383536, 57704, -202983, -368396, -492962, -626535, -735407, -738555, -605844, -393435, -191354, -60452, -11532, -10909, 6685, 109573, 326966, 619313, 881730, 984493, 843933, 489291, 63875, -263113, -407241, -404230, -350365, -320268, -337043, -401626, -532952, -770251, -1132851, -1582138, -2032628, -2403644, -2657819, -2798406, -2848937, -2838681, -2787974, -2695577, -2550096, -2357467, -2141211, -1910897, -1650866, -1348051, -1006857, -625399, -189375, 282880, 713839, 1020877, 1185638, 1241574, 1211114, 1098101]
34131A098101j62023j44162r3357q8736j70016l05755m33122m98181m69436l50722
34121a617409j86018k7869J02535K09993K88400L14746K81794K14350J43196P6570
34111a99712R269m7117o1146k1528K8089K3629l2667m5945P1340K79145M31091
34100D34448M22047K75870P9013j19165l05304m45569m90727m33627l20689j99281
34090a102984p6860O3188K19423L47518L74917K56327K9931j91927l02951k73402
34080f56820j50514j8778L8199j5240j23485j73045j07112J1162Q0159Q0091P2874
34069i62509J05422J66190K30129K90140L32146L25820K65542J94373J64779J85609
34059A297641K15280J98937J18118K1526k160Q9485K33483L14073K74318J50652
$$ y = [1098101, 936078, 791916, 698559, 609823, 439807, 134052, -299070, -797251, -1266687, -1617409, -1803427, -1831296, -1728761, -1518768, -1230368, -915622, -633828, -419478, -276282, -199712, -190443, -237560, -298706, -320234, -292145, -268516, -301183, -347128, -275788, 3357, 434448, 856495, 1132365, 1211378, 1092213, 786909, 341340, -149387, -583014, -903703, -1102984, -1179844, -1116656, -897233, -549715, -174798, 81529, 111460, -80467, -383418, -656820, -807334, -826112, -787913, -803153, -926638, -1099683, -1206795, -1195633, -1115474, -1035383, -962509, -857087, -690897, -460768, -170628, 161518, 487338, 752880, 947253, 1112032, 1297641, 1512921, 1711858, 1829976, 1851502, 1849342, 1938827, 2172310, 2486383, 2760701, 2911353]
34049B911353L770j41293k73520l56451l47632k48600j14071j1633K3178J637
34039A446738l9917p8609j17712j54638j54378q5887J7305O8365J4201j11289
34029H04179k34028l17214l73253m16898m35590m08973l40577k58029j81425j00031
34019b261839N906J18284J77302J44404N8117M155L3086J24371K21537K77788
34009a096889K75389K34022K02875K14144K38930K19451J52957J10287J51109
34000G02275K44498K97614K53779J47224O5119O0390R7959R3547J4755p6113j06641
33989A794406r8266j32760k19460k61639j79564j2857J35647K13378K32951K12151
33979A683987J53905O8926k8978j41807k64272l53300l61151k93743j99393j03520
$$ y = [2911353, 2915123, 2773830, 2500310, 2143859, 1796227, 1547627, 1433556, 1421923, 1445101, 1446738, 1406821, 1328212, 1210500, 1055862, 901484, 815597, 832902, 901267, 915468, 804179, 570151, 252937, -120316, -537214, -972804, -1381777, -1722354, -1980383, -2161808, -2261839, -2255933, -2137649, -1960347, -1815943, -1757826, -1753671, -1720585, -1596214, -1374677, -1096889, -821500, -587478, -384603, -170459, 68471, 287922, 440879, 551166, 702275, 946773, 1244387, 1498166, 1645390, 1710509, 1770899, 1868858, 1962405, 1977160, 1901047, 1794406, 1696140, 1563380, 1343920, 1082281, 902717, 889860, 1025507, 1238885, 1471836, 1683987, 1837892, 1906818, 1877840, 1736033, 1471761, 1118461, 757310, 463567, 264174, 160654]
33969A60654P957J37913K44398K66767J67536m5086l08606n23017o07214n49277
33959a047975l95154k07856o0690l5116j57957l34387m01347k75470j7427K59176
33949b674203M93944O69530P49146O87859M99615K66343O7236p9618j97357k88060
33939A94435l05334j96535K4811K58335L86832L70122K59815J32085L4662n069
33929A154159K9682J15743J80855J63237P4091k0964p0337o4858j6209N7983J31013
33918A734395J78707J95275J76005R2628p7414k91089m46119m71741l96614l09849
33908C84184k70867k75624k92663k96780k63784j65443J584J87612L15380L44060
33898c32341K96578K15358J06950m9001k44665m27202n41391n62176m78233k82084
$$ y = [160654, 168611, 306524, 550922, 817689, 985225, 940139, 631533, 108516, -498698, -1047975, -1443129, -1650985, -1711675, -1746791, -1904748, -2239135, -2640482, -2915952, -2933379, -2674203, -2180259, -1510729, -761583, -73724, 425891, 692234, 759470, 679852, 482495, 194435, -110899, -307434, -282623, -24288, 362544, 732666, 992481, 1124566, 1159228, 1154159, 1183841, 1299584, 1480439, 1643676, 1717767, 1696803, 1626466, 1561608, 1545399, 1603382, 1734395, 1913102, 2108377, 2284382, 2377010, 2299596, 2008507, 1562388, 1090647, 694033, 384184, 113317, -162307, -454970, -751750, -1015534, -1180977, -1179393, -991781, -676401, -332341, -35763, 179595, 286545, 237544, -7121, -434323, -975714, -1537890, -2016123, -2298207]
33888b298207p924K48144L91490M08465L47782K32172M2075j98289l72671l59259
33878a566222j51737J36127L72653M84954M53728K93045O4745j20546j66653p1245
33868b71151P2789J63456J66285R9282l3510k50551n21274p24107p26740n16373
33858b541894k21041Q864J16943J34154J00513L5794k9714m8929j072Q6133J75398
33847b184851K60680L47689M10499M03981L28150K51145K39858K74752K62916
33838E94819J44665l6607j87028k61145k78040k57253j91789r6915l3660m1251
33828f44204p3769n3984J7203N5185P168o8080o2993N8047K23830L26595L05901
33817I0899J78398J5969j03649j48649j47307j43562j41511j11214m9509o693
$$ y = [-2298207, -2306131, -2057987, -1666497, -1258032, -910250, -678078, -636003, -834292, -1206963, -1566222, -1717959, -1581832, -1209179, -724225, -270497, 22548, 87293, -33253, -199906, -271151, -198362, -34906, 131379, 230661, 197151, -53400, -574674, -1298781, -2025521, -2541894, -2762935, -2754071, -2637128, -2502974, -2402461, -2366667, -2396381, -2445310, -2446382, -2360249, -2184851, -1924171, -1576482, -1165983, -762002, -433852, -182707, 57151, 331903, 594819, 739484, 702877, 515849, 254704, -23336, -280589, -472378, -569293, -602953, -644204, -717973, -771957, -754754, -699569, -692401, -760481, -823474, -765427, -541597, -215002, 90899, 269297, 285266, 181617, 32968, -114339, -257901, -399412, -510626, -560135, -566828]
33807e66828l1690j06308j61329j54839j09004o8258n2938o8029j22998k06385
33797a648606k59326k22082j11918j3626K4555N1430J43700L03152M56464N41666
33787g34591N56133N19037M23880K50046J0236k28575l76217l79373k62076j06379
33777c27879J4379Q2837J21094J46189J57542J55213J46123J31316J02576N3287
33767G82677j5921r7715j75920k32381k66282k92725l08665k80645j89468o6277
33757a143322M8420J61615K96963M16835M35205L26001J72005P8612P0349R4938
33747I57621R7022N8769o549o7128r1493q1956q2455j34880k34545l38820m04377
33736c28791m04164l27330j83449j400J80091L08456L17089J78466k7310j49224
$$ y = [-566828, -598518, -704826, -866155, -1020994, -1129998, -1198256, -1251194, -1319223, -1442221, -1648606, -1907932, -2130014, -2241932, -2255558, -2231003, -2179573, -2035873, -1732721, -1276257, -734591, -178458, 340579, 764459, 1014505, 1024741, 796166, 419949, 40576, -221500, -327879, -313500, -230663, -109569, 36620, 194162, 349375, 495498, 626814, 729390, 782677, 766756, 669041, 493121, 260740, -5542, -298267, -606932, -887577, -1077045, -1143322, -1094902, -933287, -636324, -219489, 215716, 541717, 713722, 792334, 862683, 957621, 1054643, 1113412, 1106863, 1039735, 948242, 866286, 783831, 648951, 414406, 75586, -328791, -732955, -1060285, -1243734, -1245134, -1065043, -756587, -439498, -261032, -288342, -437566]
33726d37566j11534Q803Q5976Q7658O5540M5512P161l6924k7244M9655J17688
33715a45275J04049L8419J6447Q2054J81230K27050J84120Q5938j4584r9654j86842
33704D72952k78935l34738l10550k19188j20429n6188k3319p961p175k561M9000
33693h39092J63162K82205L16910K40748J24083O4510Q9236J35008J25073N3786
33683G55629k0949o4204j12018k15718l63161m84756n24853m80318l84455k88896
33673b183699k49760k85231l42664l46469k82207j94428j03595J5916J56891K40556
33663c574690K02930Q3278j8021m5239j4461L6256P8150R1544Q0545Q0612J15938
33652b883158J61450J82089J89127K07738K04188J12977n2182j75628j58961k4146
$$ y = [-437566, -549100, -540297, -454321, -366663, -301123, -255611, -248450, -285374, -312618, -262963, -145275, -41226, -2807, 13640, 95694, 276924, 503974, 688094, 774032, 759448, 659794, 472952, 194017, -140721, -451271, -670459, -790888, -847076, -870395, -878356, -885531, -888092, -839092, -675930, -393725, -76815, 163933, 288016, 352526, 441762, 576770, 701843, 755629, 734680, 670476, 558458, 342740, -20421, -505177, -1030030, -1510348, -1894803, -2183699, -2433459, -2718690, -3061354, -3407823, -3690030, -3884458, -3988053, -3972137, -3815246, -3574690, -3371760, -3288482, -3306503, -3351742, -3366203, -3329947, -3251797, -3160253, -3079708, -2999096, -2883158, -2721708, -2539619, -2350492, -2142754, -1938566, -1825589, -1877771, -2053399, -2212360, -2236506]
33642b236506J28206K27046K67954K75657K70031K55300K11011J00229r0384l22332
33632i13788n25971o34303n93611l84155o7613K16085L53345L56451L23021L09361
33622a561178K93559K56250K26858K22663K00327J13722j7346j40655k41079l25491
33612i72370l65688l22324k19759j31572q1967k3146O8619J36595J23625N8728
33602a729259J1478l282j2753j4R3844K69323M32422M92540M59338M08685L80204
33591H02526L51119L02505K65534K80611L34451L69422L53919L10582K55690J42461
33581C768820q2729l66952n53718n37516l78894k22316j31512o6016M5K2068k7567
33570A423713q6880p4057M595O8187O7370L1255J0179J0258k604n3549j24534
$$ y = [-2236506, -2108300, -1881254, -1613300, -1337643, -1067612, -812312, -601301, -501072, -591456, -913788, -1439759, -2074062, -2667673, -3051828, -3119441, -2903356, -2550011, -2193560, -1870539, -1561178, -1267619, -1011369, -784511, -561848, -361521, -247799, -265145, -405800, -646879, -972370, -1338058, -1660382, -1880141, -2011713, -2093680, -2116826, -2048207, -1911612, -1787987, -1729259, -1717781, -1721063, -1733816, -1733830, -1639986, -1370663, -938241, -445701, 13637, 422322, 802526, 1153645, 1456150, 1721684, 2002295, 2336746, 2706168, 3060087, 3370669, 3626359, 3768820, 3686091, 3319139, 2765421, 2227905, 1849011, 1626695, 1495183, 1429167, 1429212, 1451280, 1423713, 1336833, 1262776, 1267371, 1335558, 1402928, 1434183, 1444362, 1454620, 1452016, 1398467, 1273933]
33559A273933j62446j20973k600J39782K45138K85688K71249K29000J82495J32004
33549B473270M6301j07488l12701m98821o03090o19376n71164m63252k95668j12222
33539a064211Q842K4516l6679j14916j72185j97102j83743j30931n5563J2585
33529a909387N3614P0758Q4162J15570J71205K26787K30930J42709j5590j47635
33519i76877j50156j0193J70380K60933K09878O1818j08154k41503k87509k05878
33509a277261j4439J92601L12925L18293K50927J59706P4808L0209N8810J49301
33499B55880K40731K78009K50493J66361K4744j58093l22717m10280m26488m23266
33489e24626m15662l60847k38353j09431n3462o4216n8189J2215J00183J36425
$$ y = [1273933, 1111487, 990514, 987914, 1127696, 1372834, 1658522, 1929771, 2158771, 2341266, 2473270, 2519571, 2412083, 2099382, 1600561, 997471, 378095, -193069, -656321, -951989, -1064211, -1055369, -1030853, -1067532, -1182448, -1354633, -1551735, -1735478, -1866409, -1921972, -1909387, -1855773, -1785015, -1700853, -1585283, -1414078, -1187291, -956361, -813652, -829242, -976877, -1127033, -1137226, -966846, -705913, -496035, -434217, -542371, -783874, -1071383, -1277261, -1291700, -1099099, -786174, -467881, -216954, -57248, 17560, 47769, 106579, 255880, 496611, 774620, 1025113, 1191474, 1216218, 1058125, 735408, 325128, -101360, -524626, -940288, -1301135, -1539488, -1648919, -1702381, -1766597, -1824786, -1812571, -1712388, -1575963]
33479a575963J18991R9144J07562J38226J91908K86115M12500N20808N62317N27390
33469A388998M30762K85892J09646o9389k27146l55507m43812m65316m00909k67528
33459a4309j09224L0825J19639J33711P2984k5888j05151j18005m8170Q3521K18884
33448B38817K86195K52326J57281Q5927R7986J79489K52617K34634J05974o9241
33438A822005j99920k49983k53180k50477k40729k01941j30285l6054P5734J94885
33428E30055K91938L38016L27129K63239J47725N126j00735j14126m6691L4901
33418A676577P1905M4535l6985j34403j87608j63869j02672p2770p7582l9109
33408I78019J07883L27576N00324N15167L47704P1002k01079l91963m86740m85567
$$ y = [-1575963, -1456972, -1357828, -1250266, -1112040, -920132, -634017, -221517, 299291, 861608, 1388998, 1819760, 2105652, 2215298, 2145909, 1918763, 1563256, 1119444, 654128, 253219, -14309, -123533, -92708, 26931, 160642, 233626, 207738, 102587, -15418, -63588, 19933, 238817, 525012, 777338, 934619, 1020546, 1118532, 1298021, 1550638, 1785272, 1891246, 1822005, 1622085, 1372102, 1118922, 868445, 627716, 425775, 295490, 259436, 335170, 530055, 821993, 1160009, 1487138, 1750377, 1898102, 1903228, 1802493, 1688367, 1641676, 1676577, 1748482, 1793017, 1756032, 1621629, 1434021, 1270152, 1167480, 1094710, 1017128, 978019, 1085902, 1413478, 1913802, 2428969, 2776673, 2847675, 2646596, 2254633, 1767893, 1282326]
33398A282326l72655j65906L7120J29911J16282J02238J55692K27169K32836J66056
33388A911069Q8684M6434L5140L2494K6264J7254J8834M8251J02407J49986J58411
33377B635228J17259K9433r9104k47137l75534m52515m66986m11037k78888j00941
33367C49778N1099J22040J18007P1163j3937j42280k73653l31642k75190j36134
33357d60749J8323J40238K15250K40911K01346O7257j64008m21154n76651n42465
33347a281702l46341r7893J10003K49252L28466L57554L42375K84393J79635M2301
33337A68043o7874p3574M4867K16963L39556L59078K93221J94021J13428R6348
33327A684077J70795L15316M39969M32420K53760j2585k30205l33783l66494l94482
$$ y = [1282326, 909671, 743765, 780885, 910796, 1027078, 1129316, 1285008, 1512177, 1745013, 1911069, 1999753, 2046187, 2081327, 2113821, 2140085, 2157339, 2176173, 2224424, 2326831, 2476817, 2635228, 2752487, 2781920, 2682816, 2435679, 2060145, 1607630, 1140644, 729607, 450719, 349778, 400877, 522917, 640924, 712087, 698150, 555870, 282217, -49425, -324615, -460749, -442426, -302188, -86938, 153973, 355319, 422576, 258568, -162586, -739237, -1281702, -1628043, -1725936, -1615933, -1366681, -1038215, -680661, -338286, -53893, 125742, 168043, 100169, 26595, 71462, 288425, 627981, 987059, 1280280, 1474301, 1587729, 1684077, 1854872, 2170188, 2610157, 3042577, 3296337, 3283752, 3053547, 2719764, 2353270, 1958788]
33317A958788m20657m05886l42379k61295j78199p8930L0062R5422O5340n2610
33307D09656j98350l10514l57049l29830k34743r5915L8041J06286P3568k9778
33297i28628j13311r5724J9209J42117J78688J09147n010p6976n6527M1728J52281
33286f33006K03332J63614O0708l6590n7946K3143J62266K69491K84573K29913
33276F69498J75443J56486J48900J20601P0502K699j00535k44487l77760m20222
33266B01125l37974j69901J4386J56770K17347J82331Q7401O705j0830J3761K5862
33255C86983M013l6046r2843j92031l30743m39962m37817l18852j67307p5455
33245a700060o0693o7114l5753L8927J18677J71979K00925K17929K15768J83054
$$ y = [1958788, 1538131, 1132245, 789866, 528571, 350372, 271442, 301504, 396926, 462266, 409656, 211306, -99208, -456257, -786087, -1020830, -1116745, -1078704, -972418, -898850, -928628, -1041939, -1137663, -1118454, -976337, -797649, -688502, -693512, -770488, -827015, -785287, -633006, -429674, -266060, -205352, -241942, -299888, -276745, -114479, 155012, 439585, 669498, 844941, 1001427, 1150327, 1270928, 1341430, 1344129, 1243594, 999107, 621347, 201125, -136849, -306750, -292364, -135594, 81753, 264084, 351485, 358190, 347360, 361121, 386983, 390996, 354950, 262107, 70076, -260667, -700629, -1138446, -1457298, -1624605, -1700060, -1760753, -1827867, -1863620, -1824693, -1706016, -1534037, -1333112, -1115183, -899415, -716361]
33235g16361J43924J50347K19333L00879L31275L01810K48788J91923J22234M9381
33225A343533J7469N4003J28565J80664J73422J12011L1568k3092l2336l2790
33215A953017q9496k19259l66480m72683n36161n72283n51774m32754k38202m3817
33205a569892J11621K49646L76109M38968L95566K85251J95731J72908J90835
33196H46743J95700J53085O4028l5607r3056q1544l4479k4417r7048k21673l04029
33185C67703k55495o9275J63439L27301L83460L85635L88993L65276K35612j4763
33175B277886k76897l85384k51145N6298L46418M43014L13438P8857j05254j79553
33165B317678j97726k35930l07535l62901l53346k88474k34003k46243l01264
$$ y = [-716361, -572437, -422090, -202757, 98122, 429397, 731207, 979995, 1171918, 1294152, 1343533, 1361002, 1415005, 1543570, 1724234, 1897656, 2009667, 2041235, 2018143, 1985807, 1953017, 1863521, 1644262, 1277782, 805099, 268938, -303345, -855119, -1287873, -1526075, -1569892, -1458271, -1208625, -832516, -393548, 2018, 287269, 483000, 655908, 846743, 1042443, 1195528, 1259556, 1223949, 1130893, 1049349, 1014870, 990453, 893405, 671732, 367703, 112208, 42933, 206372, 533673, 917133, 1302768, 1691761, 2057037, 2292649, 2277886, 2000989, 1615605, 1364460, 1420758, 1767176, 2210190, 2523628, 2602485, 2497231, 2317678, 2119952, 1884022, 1576487, 1213586, 860240, 571766, 337763, 91520, -209744]
33156b09744l04458j91286q753J30927J73828J68631J83205K17350K25226J95785
33146E80711J68747J72280J79010J39625M7148m5281p0850j1442Q6485J59691
33136A406124J86847J88488J74131J18886R177j13029j82484j77485j26484n6574
33126A427597K8685J17399J71163J54453O1464q9842k59177l73804l65168k49100
33116F23670j35005j11639j44085j26588j8186J28424K64443M01822N48361O42349
33106B073566O01795M18990J70344n5825k12012k84625k73608j92008o9187N8053
33096B235483J58112K12127K14740J67528P3653n5114j92699l18066m40247n81079
33086A474438p24783q07159p70392o15376l94248j74726k0723K8535p625n8403
$$ y = [-209744, -514202, -705488, -714241, -583314, -409486, -240855, -57650, 159700, 384926, 580711, 749458, 921738, 1100748, 1240373, 1287521, 1242240, 1171390, 1159948, 1246433, 1406124, 1592971, 1781459, 1955590, 2074476, 2083653, 1970624, 1788140, 1610655, 1484171, 1427597, 1456282, 1573681, 1744844, 1899297, 1960761, 1870919, 1611742, 1237938, 872770, 623670, 488665, 377026, 232941, 106353, 88167, 216591, 481034, 882856, 1431217, 2073566, 2675361, 3094351, 3264695, 3208870, 2996858, 2712233, 2438625, 2246617, 2177430, 2235483, 2393595, 2605722, 2820462, 2987990, 3061643, 3006529, 2813830, 2495764, 2055517, 1474438, 749655, -57504, -827896, -1443272, -1837520, -2012246, -2032969, -2004434, -2012059, -2070462]
33076b070462p1362n6758l6724J5737J32904K64037L00279K05446O9919N710K6395
33065a214879O4233P7378R7732J76230L08634M23923M43832L60649K53816K09710
33055A201258K21915J97398P1721j12538k62293l37245l61820l56298l06704k10723
33045b55329j16373r0846j59484k83261l87543m09162l28370j70385J6306J81425
33035b003022K82661K96201K32655J36964O2319M4372R6432K08519L39108M27659
33025A23868M38973L89112L12453K15938Q8780n2959j63978k18195k37395k62379
33015F34218l08909l57292l74956l47263k92948k41147j79775m2265K20122N50769
33005g39446Q07096Q86645Q16803P07071O29762N61064M24057J74414j44854m19577
$$ y = [-2070462, -2141824, -2198582, -2235306, -2219569, -2086665, -1822628, -1522349, -1316903, -1246984, -1241274, -1214879, -1150646, -1073268, -975536, -799306, -490672, -66749, 377083, 737732, 991548, 1201258, 1423173, 1620571, 1692292, 1579754, 1317461, 980216, 618396, 262098, -44606, -255329, -371702, -462548, -622032, -905293, -1292836, -1701998, -2030368, -2200753, -2184447, -2003022, -1720361, -1424160, -1191505, -1054541, -992222, -947850, -851418, -642899, -303791, 123868, 562841, 951953, 1264406, 1480344, 1569124, 1516165, 1352187, 1133992, 896597, 634218, 325309, -31983, -406939, -754202, -1047150, -1288297, -1468072, -1510337, -1290215, -739446, 67650, 954295, 1771098, 2478169, 3107931, 3668995, 4093052, 4267466, 4122612, 3703035]
32995C703035n45202n08433l91408k96242k72583l08519l59922l76843l30218
32986C13665k38701j56716j19201j12139j10449j19460j52496j90865k07054k20050
32976a313466k83924m09591n25775n32931l85074j21248J61065L62166M38880
32967b609898M25576L90287L70519L65453L79673M35391N27987O01505N94827
32958A481320M98631L50850J95188O6201m382n362K5074J6421p1776k13317l46134
32947A992714m25875m39924l86221k68351j18089M163N8360O6558P9069J00498
32937F62902Q3255P136o9429o8304J7858J25515J97131K24834K25131K05655J61330
$$ y = [3703035, 3157833, 2649400, 2257992, 1961750, 1689167, 1380648, 1020726, 643883, 313665, 74964, -81752, -200953, -313092, -423541, -543001, -695497, -886362, -1093416, -1313466, -1597390, -2006981, -2532756, -3065687, -3450761, -3572009, -3410944, -3048778, -2609898, -2184322, -1794035, -1423516, -1058063, -678390, -242999, 284988, 886493, 1481320, 1979951, 2330801, 2525989, 2592190, 2587808, 2582446, 2607520, 2623941, 2552165, 2338848, 1992714, 1566839, 1126915, 740694, 472343, 354254, 358417, 416777, 483335, 562404, 662902, 746157, 753293, 683864, 615560, 633418, 758933, 956064, 1180898, 1406029, 1611684, 1773014]
$$ [...]
##END NTUPLES=NMR SPECTRUM
##END=
