##TITLE=31Pdec_2a1611CFA
 aceton-d6, 24 sc
 17.11.2021
##JCAMPDX= 6.0         $$ Bruker NMR JCAMP-DX V2.0
##DATA TYPE= NMR SPECTRUM
##DATA CLASS= NTUPLES
##ORIGIN= UXNMR, Bruker Analytische Messtechnik GmbH
##OWNER= root
$$ XWIN-NMR		Version 3.5
$$ Wed Nov 17 10:43:54 2021 Russian Standard Time (UT+4h)  she@DPX200
##.OBSERVE FREQUENCY= 81.013821
##.OBSERVE NUCLEUS= ^31P
##.ACQUISITION MODE= SIMULTANEOUS
##.ACQUISITION SCHEME= undefined
##.AVERAGES= 24
##.DIGITISER RES= 16
##SPECTROMETER/DATA SYSTEM= spect
##.PULSE SEQUENCE= zgpg30
##.SOLVENT NAME= CDCl3
##.SHIFT REFERENCE= (INTERNAL, CDCl3, 0, 248.564)
##AUDIT TRAIL= $$ (NUMBER, WHEN, WHO, WHERE, WHAT)
$$ ##TITLE= Audit trail, XWIN-NMR		Version 3.5
$$ ##JCAMPDX= 5.01
$$ ##ORIGIN= Bruker BioSpin GmbH
$$ ##OWNER= she
$$ F:/spectra/data/she/nmr/P31/1/pdata/1/auditp.txt
$$ ##AUDIT TRAIL=  $$ (NUMBER, WHEN, WHO, WHERE, WHAT)
(   1,<2021-11-17 10:42:46.87 +0400>,<she>,<DPX200>,
      <created by zg, POWCHK disabled, PULCHK disabled
       configuration hash MD5:
       00 E9 B6 7A A2 85 ED C7 34 08 36 98 17 FE 4E 26
       data hash MD5: 32K
       9B 19 A7 C4 67 72 10 02 1B 99 0F 1E 03 F5 63 5A>)
(   2,<2021-11-17 10:42:53.21 +0400>,<she>,<DPX200>,
      <Start of raw data processing
       efp BC_mod = 2 LB = 1 FT_mod = 6 PKNL = 1 PHC0 = -9214.213 PHC1 = 149.2695 SI = 64K 
       data hash MD5: 64K
       6C 51 73 D0 B6 67 BF FA A0 21 64 80 FC 66 D8 AE>)
(   3,<2021-11-17 10:43:12.78 +0400>,<she>,<DPX200>,
      <pk PHC0 = 1.360396 PHC1 = 0 
       data hash MD5: 64K
       66 0C 7F 65 05 87 59 C4 C1 B0 18 22 FC E1 89 32>)
(   4,<2021-11-17 10:43:15.64 +0400>,<she>,<DPX200>,
      <abs ABSG = 5 
       data hash MD5: 64K
       FB AC 14 90 8A 6A 18 16 29 E5 68 28 EA 9D 8D 1E>)
$$ ##END=
$$ 
$$ hash MD5
$$ E5 1B 50 F2 66 64 7C 8C F8 3B C7 85 7D EF 59 CF
##$RELAX= 
##$RELAX= 
##$RELAX= 
##$RELAX= 
##$RELAX= 
##$RELAX= 
##$RELAX= 
##$RELAX= 
$$ Bruker specific parameters
$$ --------------------------
##$DU= <F:/spectra>
##$EXPNO= 1
##$NAME= <P31>
##$PROCNO= 1
##$TYPE= <nmr>
##$USER= <she>
##$AMP= (0..31)
100 100 100 100 100 100 100 100 100 100 100 100 100 100 100 100 100 100 
100 100 100 100 100 100 100 100 100 100 100 100 100 100 
##$AQSEQ= 0
##$AQ_mod= 1
##$AUNM= <au_zg>
##$AUTOPOS= <>
##$BF1= 81.014009
##$BF2= 200.13
##$BF3= 200.13
##$BF4= 200.13
##$BF5= 200.13
##$BF6= 200.13
##$BF7= 200.13
##$BF8= 200.13
##$BYTORDA= 1
##$CFDGTYP= 0
##$CFRGTYP= 5
##$CHEMSTR= <none>
##$CNST= (0..31)
1 1 145 1 1 1 1 1 1 1 1 1 1 1 1 1 1 1 1 1 1 1 1 1 1 1 1 1 1 1 1 1 
##$CPDPRG= <waltz16>
##$CPDPRG1= <>
##$CPDPRG2= <waltz16>
##$CPDPRG3= <>
##$CPDPRG4= <mlev>
##$CPDPRG5= <mlev>
##$CPDPRG6= <mlev>
##$CPDPRG7= <mlev>
##$CPDPRG8= <mlev>
##$CPDPRGB= <>
##$CPDPRGT= <>
##$D= (0..31)
0 1 0 0 0 0 0 0 0 0 0 0.03 2e-05 3e-06 0 0 0 0 0 0 0 0 0 0 0 0 0 0 0 0 
0 0 
##$DATE= 1637131366
##$DBL= (0..7)
120 120 120 11 120 120 24 19 
##$DBP= (0..7)
150 150 150 150 150 150 150 150 
##$DBP07= 0
##$DBPNAM0= <>
##$DBPNAM1= <>
##$DBPNAM2= <>
$$ [...]
##$SUBNAM3= <"">
##$SUBNAM4= <"">
##$SUBNAM5= <"">
##$SUBNAM6= <"">
##$SUBNAM7= <"">
##$SUBNAM8= <"">
##$SUBNAM9= <"">
##$SW= 501.771253377433
##$SWIBOX= (0..15)
0 1 3 0 0 0 0 0 0 0 0 0 0 0 0 0 
##$SW_h= 40650.406504065
##$TD= 32768
##$TD0= 1
##$TE= 0
##$TE2= 300
##$TE3= 300
##$TEG= 300
##$TL= (0..7)
0 120 53 12 22 120 120 120 
##$TP= (0..7)
150 150 150 150 150 150 150 150 
##$TP07= 0
##$TPNAME0= <>
##$TPNAME1= <>
##$TPNAME2= <>
##$TPNAME3= <>
##$TPNAME4= <>
##$TPNAME5= <>
##$TPNAME6= <>
##$TPNAME7= <>
##$TPOAL= (0..7)
0.5 0.5 0.5 0.5 0.5 0.5 0.5 0.5 
##$TPOFFS= (0..7)
0 0 0 0 0 0 0 0 
##$TUNHIN= 0
##$TUNHOUT= 0
##$TUNXOUT= 0
##$USERA1= <user>
##$USERA2= <user>
##$USERA3= <user>
##$USERA4= <user>
##$USERA5= <user>
##$V9= 5
##$VALIST= <valist>
##$VCLIST= <CCCCCCCCCCCCCCC>
##$VD= 0
##$VDLIST= <DDDDDDDDDDDDDDD>
##$VPLIST= <PPPPPPPPPPPPPPP>
##$VTLIST= <TTTTTTTTTTTTTTT>
##$WBST= 1024
##$WBSW= 4
##$XGAIN= (0..3)
0 0 0 0 
##$XL= 0
##$YL= 0
##$YMAX_a= 2265
##$YMIN_a= -2683
##$ZGOPTNS= <>
##$ZL1= 120
##$ZL2= 120
##$ZL3= 120
##$ZL4= 120
##$ABSF1= 248.5645
##$ABSF2= -253.2056
##$ABSG= 5
##$ABSL= 3
##$ALPHA= 0
##$AQORDER= 0
##$ASSFAC= 0
##$ASSFACI= 0
##$ASSFACX= 0
##$ASSWID= 0
##$AUNMP= <proc_1d>
##$AZFE= 0.1
##$AZFW= 0.5
##$BCFW= 0
##$BC_mod= 2
##$BYTORDP= 0
##$COROFFS= 0
##$CY= -3
##$DATMOD= 1
##$DC= 0
##$DFILT= <>
##$DTYPP= 0
##$F1P= 0
##$F2P= 0
##$FCOR= 1
##$FTSIZE= 65536
##$FT_mod= 6
##$GAMMA= 0
##$GB= 0
##$INTBC= 1
##$INTSCL= 5.30512e-09
##$ISEN= 30
##$LB= 1
##$LEV0= 0
##$LPBIN= 0
##$MAXI= 10000
##$MC2= 0
##$MEAN= 0
##$ME_mod= 0
##$MI= 50
##$NCOEF= 0
##$NC_proc= -9
##$NLEV= 6
##$NOISF1= 182.463
##$NOISF2= 159.3651
##$NSP= 0
##$NTH_PI= 0
##$NZP= 0
##$OFFSET= 248.5645
##$PC= 4
##$PHC0= -9212.853
##$PHC1= 149.2695
##$PH_mod= 1
##$PKNL= yes
##$PPARMOD= 0
##$PSCAL= 0
##$PSIGN= 0
##$REVERSE= no
##$SF= 81.014009
##$SI= 65536
##$SIGF1= 159.3651
##$SIGF2= -187.1042
##$SINO= 113.3802
##$SIOLD= 16384
##$SREGLST= <1H.CDCl3>
##$SSB= 0
##$STSI= 65536
##$STSR= 0
##$SW_p= 40650.406504065
##$SYMM= 0
##$S_DEV= 0
##$TDeff= 32768
##$TDoff= 0
##$TI= <>
##$TILT= no
##$TM1= 0
##$TM2= 0
##$TOPLEV= 0
##$USERP1= <user>
##$USERP2= <user>
##$USERP3= <user>
##$USERP4= <user>
##$USERP5= <user>
##$WDW= 1
##$XDIM= 65536
##$YMAX_p= 411318159
##$YMIN_p= -256102896
$$ End of Bruker specific parameters
$$ ---------------------------------
##NTUPLES= NMR SPECTRUM
##VAR_NAME=  FREQUENCY,     SPECTRUM/REAL,   SPECTRUM/IMAG
##SYMBOL=    X,             R,               I
##VAR_TYPE=  INDEPENDENT,   DEPENDENT,       DEPENDENT
##VAR_FORM=  AFFN,          ASDF,            ASDF
##VAR_DIM=   65536,         65536,           65536
##UNITS=     HZ,            ARBITRARY UNITS, ARBITRARY UNITS
##FACTOR=    0.620285442955139, 1,           1
##FIRST=     20137.2065510759, 0,            0
##LAST=      -20513.1999529892, 0,           0
##MIN=       -20513.1999529892, -256102896,  0
##MAX=       20137.2065510759, 411318159,    0
$$ Real data points
##PAGE= N=1
##DATA TABLE= (X++(R..R)), XYDATA
$$ [...]
##PAGE= N=2
##DATA TABLE= (X++(I..I)), XYDATA
$$ plain form
12939 7830915 5508326 -3282952 -12988474 -18030511 -17142632 -12351375 -6269652 -1213111
12931 -1213111 1414813 2367241 3589834 5127281 4964688 2663926 470517 -289425 -805873
12922 -805873 -1448318 -610200 1289722 1225771 -431339 990756 5197830 3471086 -8266171
12913 -8266171 -18860432 -14711161 152783 8544757 4248585 -614780 4909787 15302571
12905 15302571 18488869 11888590 1654940 -7019071 -11478740 -8841486 631020 10172133
12897 10172133 12627208 8200242 2145161 -2235434 -4102195 -2051595 4049200 9873327
12889 9873327 9724760 2430110 -7687002 -14114954 -12205324 -3971554 698021 -6337349
12881 -6337349 -19172623 -22815028 -13357262 -3937274 -4943480 -8303443 -1169603 12875381
$$ packed form
12939G830915k322589q791278r705522n042037Q87879M791257O081723N056541
12931a213111K627924R52428J222593J537447j62593k300762k193409p59942n16448
12922h05873o42445Q38118J899922o3951j657110J422095M207074j726744j1737257
12913h266171j0594261M149271J4863944Q391974m296172m863365N524567J0392784
12905A5302571L186298o600279j0233650q674011m459669K637254R472506R541113
12897A0172133K455075m426966o055081m380595j866761K050600O100795N824127
12889I873327j48567p294650j0117112o427952J909630Q233770M669575p035370
12881f337349j2835274l642405R457766R419988j006206l359963P133840J4044984
$$ plain form
12873 12875381 18954652 12837518 4763267 2797990 4702244 7044652 10749757 14494315
12865 14494315 12311712 2506148 -7550339 -9522974 -2913632 5797789 8778237 1984688
12857 1984688 -9876392 -14324213 -3788724 13039896 20022472 13701587 6208295 7423545
12849 7423545 13998398 18790497 21059736 21830686 17825584 7571925 -2089454 -2967412
12841 -2967412 4006870 10548223 10667317 4738121 -2877590 -6550061 -2679513 6366752
12833 6366752 13817264 15488418 12027027 4317831 -7050807 -16570385 -16163816 -6352099
12825 -6352099 2687497 5581693 8703615 16686058 21689552 15981905 7245044 8420564
12817 8420564 16831512 17595918 7020741 -1539113 1831354 9711660 9959760 2639141
$$ packed form
12873A2875381O079271o117134q074251j965277J904254K342408L705105L744558
12865A4494315k182603r805564j0056487j972635O609342Q711421K980448o793549
12857A984688j1861080m447821J0535489J6828620O982576o320885p493292J215250
12849G423545O574853M792099K269239P70950m005102j0253659r661379q77958
12841b967412O974282O541353J19094n929196p615711l672471L870548R046265
12833F366752P450512J671154l461391p709196j1368638r519578M06569R811717
12825f352099R039596K894196L121922P982443N003494n707647q736861J175520
12817H420564Q410948P64406j0575177q559854L370467P880306K48100p320619
$$ plain form
12809 2639141 -3358092 -4142732 -2980238 -1899334 1013798 6154000 10096470 10171754 7734175
12800 7734175 5318530 3116470 385674 -1249835 866622 5235307 5633177 -1222467
12792 -1222467 -9261680 -8710255 1731169 12632256 14725784 7865601 -1909581 -8871932
12784 -8871932 -8880983 -436785 10883981 14363156 6381349 -3463371 -4475927 1211477
12776 1211477 3938118 1494841 -337938 461326 478425 740384 7401282 19963480 28210102
12767 28210102 25038418 15228771 8001972 7445667 12877394 20956858 24212600 16194323
12759 16194323 2868608 -190996 11396869 21882008 16207374 1454737 -4372346
12752 -4372346 1153165 4056400 -2598088 -9732376 -8991092 -4604088 -3027085 -2356531
$$ packed form
12809B639141n997233p84640J162494J080904K913132N140202L942470P5284k437579
12800G734175k415645k202060k730796j635509K116457M368685L97870o855644
12792a222467q039213N51425J0441424J0901087K093528o860183r775182o962351
12784h871932r051Q444198J1320766L479175p981807r844720j012556N687404
12776A211477K726641k443277j832779P99264J7099K61959O660898J2562198Q246622
12767B8210102l171684r809647p226799n56305N431727Q079464L255742q018277
12759A6194323j3325715l059604J1587865J0485139n674634j4752637n827083
12752d372346N525511K903235o654488p134288P41284M387004J577003O70554
$$ plain form
12744 -2356531 349374 631741 -5279427 -10826561 -7558365 1278459 5638018 4300137
12736 4300137 4904303 9196855 9792500 4206293 1163517 6797096 13054087 8286542
12728 8286542 -5657493 -15519037 -13306630 -3266349 6067767 9016468 3013466 -9356137
12720 -9356137 -17528207 -11323730 4374138 11507819 430193 -17725669 -26364747 -23794831
12712 -23794831 -19675158 -17334277 -11707284 -3016058 287527 -4730719 -8802679 -2708663
12704 -2708663 10489105 20242631 20475590 12869422 3125782 -2131588 614263 6689261
12696 6689261 6328050 -3278950 -13466194 -15700959 -12635826 -12142045 -15187902 -16849753
12688 -16849753 -16111930 -16658182 -19050861 -19438122 -16162786 -11584343 -7209461 -2503520
$$ packed form
12744b356531K705905K82367n911168n547134L268196Q836824M359559j337881
12736D300137O04166M292552N95645n586207l042776N633579O256991m767545
12728H286542j3944035r861544K212407J0040281R334116K948701o003002j2369603
12720i356137q172070O204477J5697868P133681j1077626j8155862q639078K569916
12712b3794831M119673K340881N626993Q691226L303585n018246m071960O094016
12704b708663J3197768R753526K32959p606168r743640n257370K745851O074998
12696F689261l61211r607000j0187244k234765L065133M93781l045857j661851
12688a6849753P37823n46252k392679l87261L275336M578443M374882M705941
$$ plain form
12680 -2503520 1739545 4477245 8174060 14875434 18924625 11756708 -4351829 -15474579
12672 -15474579 -12710514 -2890368 1772731 -1249957 -5157209 -4147560 2259512 11327430
12664 11327430 17854589 15839599 5038022 -6091477 -8807252 -3653897 2433732 5752445
12656 5752445 7431085 7941449 6135324 2732945 -562968 -4377654 -9037759 -10525197
12648 -10525197 -5395523 1800272 3617827 1600132 4083538 11079308 11722994 1374350
12640 1374350 -8358937 -4569769 8793896 16915577 13950810 6939428 1606574 -5147784
12632 -5147784 -16104724 -25402149 -24707972 -13968749 -1854776 3040710 -637252 -7181159
12624 -7181159 -9673589 -6574392 -2775814 -3032640 -5395653 -3910943 2786864 9396875
$$ packed form
12680b503520M243065K737700L696815O701374M049191p167917j6108537j1122750
12672a5474579K764065R820146M663099l022688l907252J009649O407072R067918
12664A1327430O527159k014990j0801577j1129499k715775N153355O087629L318713
12656E752445J678640N10364j806125l402379l295913l814686m660105j487438
12648a0525197N129674P195795J817555k017695K483406O995770O43686j0348644
12640A374350r733287L789168J3363665Q121681k964767p011382n332854o754358
12632e147784j0956940r297425O94177J0739223J2113973M895486l677962o543907
12624g181159k492430L099197L798578k56826k363013J484710O697807O610011
$$ plain form
12616 9396875 11089816 9002958 7044085 6307911 4691298 -27736 -8030238 -16236170
12608 -16236170 -18742817 -11986065 -793309 4872704 1814211 -1877212 2026152 10103331
12600 10103331 12042152 4582916 -5585566 -11750531 -13158970 -10523017 -2835029 7839734
12592 7839734 13846763 9364428 -2035604 -11208103 -13357423 -11099432 -9104903 -8922900
12584 -8922900 -8628904 -5329544 1573384 8451081 10398969 7419793 4863999 5374294
12576 5374294 4068576 -3803137 -13615587 -16411009 -11930992 -8997348 -11978087 -14806996
12568 -14806996 -11735687 -6500382 -5090375 -5472792 -2034661 3736923 5449456 2795855
12560 2795855 1694244 3505023 2873385 -1774291 -4160653 -739256 2133450 -2250204
$$ packed form
12616I396875J692941k086858j958873p36174j616613m719034q002502q205932
12608a6236170k506647O756752J1192756N666013l058493l691423L903364Q077179
12600A0103331J938821p459236j0168482o164965j408439K635953P687988J0674763
12592G839734O007029m482335j1400032r172499k149320K257991J994529J82003
12584h922900K93996L299360O902928O877697J947888k979176k555794N10295
12576E374294j305718p871713r812450k795422M480017K933644k980739k828909
12568a4806996L071309N235305J410007l82417L438131N771584J712533k653601
12560B795855j101611J810779o31638m647676k386362L421397K872706m383654
$$ plain form
12552 -2250204 -9699953 -10560185 -3148105 5153555 8368160 6908833 3208222 -797807
12544 -797807 -1673411 3193046 9478191 8101574 -3462261 -16446522 -20395697 -14096443
12536 -14096443 -4409202 2269366 4360306 3926855 4406418 7469037 9865348 6104758
12528 6104758 -3400531 -10396961 -8411742 -914024 4279768 5221560 4993874 3975340
12520 3975340 587326 -1576432 3683686 13861400 17635912 10387557 2600987 6407550
12512 6407550 18826103 25970777 21300431 11751394 5857356 3449445 79399 -3834841
12504 -3834841 -3210962 3991977 12964601 16546687 12318946 4830733 879976 2638083
12496 2638083 6068149 6430406 3893417 2278509 3527152 5621314 5483051 1910191
$$ packed form
12552b250204p449749q60232P412080Q301660L214605j459327l700611m006029
12544g97807q75604M866457O285145j376617j1563835j2984261l949175O299254
12536a4096443R687241O678568K090940m33451M79563L062619K396311l760590
12528F104758r505289o996430J985219P497718N193792R41792k27686j018534
12520C975340l388014k163758N260118J0177714L774512p248355p786570L806563
12512F407550J2418553P144674m670346r549037n894038k407911l370046l914240
12504c834841O23879P202939Q972624L582086m227741p488213l950757J758107
12496B638083L430066L62257k536989j614908J248643K094162j38263l572860
$$ plain form
12488 1910191 -3926827 -8812719 -8772722 -2528058 6195384 11825465 12279848 9307036 4631097
12479 4631097 -914988 -4893419 -4227085 168210 3318971 2380536 -102246 -542522 1161826
12470 1161826 3043581 3961373 3412267 1533480 864500 4505322 10511242 12067520 5963038
12461 5963038 -2871945 -8137877 -9425152 -9513252 -8952015 -7375274 -5714170 -2781244 5080515
12452 5080515 15725529 19070153 10888250 2321878 5221387 13226433 10473562 -3701165
12444 -3701165 -13588149 -10944383 -4861142 -4680718 -7827610 -10136333 -14176507 -19757112
12436 -19757112 -19221108 -11069942 -5958361 -9452191 -11578167 -5047308 -271456 -6875081
12428 -6875081 -13065740 -3521423 11562248 9019145 -9914286 -19974554 -10883241 -891040
$$ packed form
12488A910191n837018m885892L9997O244664Q723442N630081M54383k972812m675939
12479D631097n546085l978431O66334M395295L150761r38435k482782m40276J704348
12470A161826J881755R17792n49106j878787o68980L640822O005920J556278o104482
12461E963038q834983n265932j287275q8100N61237J576741J661104K932926P861759
12452E080515J0645014L344624q181903q566372K899509Q005046k752871j4174727
12444c701165r886984K643766O083241J80424l146892k308723m040174n580605
12436a9757112N36004Q151166N111581l493830k125976O530859M775852o603625
12428f875081o190659R544317J5083671k543103j8933431j0060268R091313R992201
$$ plain form
12420 -891040 -4617671 -10901836 -5010236 6457687 8553422 1783603 -3127609 -4134191
12412 -4134191 -6138777 -7883860 -5297721 -2648508 -6661784 -13320614 -13283785 -7506814
12404 -7506814 -5078882 -7428513 -6884950 -656787 4870077 4601361 207176 -5271818
12396 -5271818 -9835683 -9940135 -4247555 634836 -2534814 -9134948 -7831605 1547584
12388 1547584 6803314 2108370 -3923663 -3238581 5709 -569097 -1951494 1157817
12380 1157817 5170661 3165507 -3121603 -6003554 -3765135 -1553832 -1756169 -1165964
12372 -1165964 2052135 4951240 4713887 2541848 1236454 1788305 3343637 4835604
12364 4835604 6310943 9140237 13630884 16098154 11554995 1301038 -5653720 -2167196
$$ packed form
12420h91040l726631o284165N891600J1467923K095735o769819m911212j006582
12412d134191k004586j745083K586139K649213m013276o658830L6829N776971
12404g506814K427932k349631N43563O228163N526864k68716m394185n478994
12396e271818m563865j04452N692580M882391l169650o600134J303343R379189
12388A547584N255730m694944o032033O85082L244290n74806j382397L109311
12380A157817M012844k005154o287110k881951K238419K211303k02337N90205
12372a165964L218099K899105k37353k172039j305394N51851J555332J491967
12364D835604J475339K829294M490647K467270m543159j0253957o954758L486524
$$ plain form
12356 -2167196 8579863 17641506 20711806 19926263 17739988 14227129 9546109 4335284
12348 4335284 -1948793 -8916578 -12446653 -9041599 -2421079 121684 -1678175 -713733
12340 -713733 5467676 9636959 6344786 1982548 6310876 17614319 24132497 19305208
12332 19305208 8412503 -510006 -5606422 -8963433 -11396968 -13052144 -15016262 -16760018
12324 -16760018 -15281083 -10137271 -6140499 -7424327 -11786155 -14606284 -14973499 -13400879
12316 -13400879 -7494250 3241535 11139395 7650187 -3558396 -9819683 -7058576 -4663611
12308 -4663611 -9350858 -13898530 -8718493 3101524 11019009 12177416 12156334 13538723
12300 13538723 12965574 9028656 5077932 3362946 2641606 2195103 2570090 1993529 -2222846
$$ packed form
12356b167196J0747059R061643L070300p85543k186275l512859m681020n210825
12348D335284o284077o967785l530075L405054O620520K542763j799859R64442
12340g13733O181409M169283l292173m362238M328328J1303443O518178m827289
12332A9305208j0892705q922509n096416l357011k433535j655176j964118j743756
12324a6760018J478935N143812L996772j283828m361828k820129l67215J572620
12316a3400879N906629J0735785P897860l489208j1208583o261287K761107K394965
12308d663611m687247m547672N180037J1820017P917485J158407k1082J382389
12300A3538723n73149l936918l950724j714986p21340m46503L74987n76561m216375
$$ plain form
12291 -2222846 -7983662 -9614285 -5936721 -2292310 -3368829 -8355038 -13913352 -17471624
12283 -17471624 -16930035 -11749171 -5206379 -1331472 695186 4499352 9055549 9002858
12275 9002858 3028534 -3982420 -8306431 -10975375 -12715773 -11613854 -7834620 -4593273
12267 -4593273 -2388252 1407666 5261320 3368768 -3879444 -7372053 -2367205 3345090
12259 3345090 1034415 -5552073 -6272930 413121 6827254 7934371 6063756 4491647
12251 4491647 2640311 -1776284 -9437878 -17713329 -20336854 -11921961 4131062 15992975
12243 15992975 15629103 7169066 -483039 -4472097 -6432251 -5440585 138066 6906645
12235 6906645 9556058 7818502 4746348 869517 -4208844 -7690848 -7228527 -5249545
$$ packed form
12291b222846n760816j630623L677564L644411j076519m986209n558314l558272
12283a7471624N41589N180864O542792L874907K026658L804166M556197n2691
12275I002858n974324p010954m324011k668944j740398J101919L779234L241347
12267d593273K205021L795918L853654j892552p248212l492609N004848N712295
12259C345090k310675o586488p20857O686051O414133J107117j870615j572109
12251D491647j851336m416595p661594q275451k623525Q414893J6053023J1861913
12243A5992975l63872q460037p652105l989058j960154R91666N578651O768579
12235F906645K649413j737556l072154l876831n078361l482004M62321J978982
$$ plain form
12227 -5249545 -3576286 1418103 10667094 15190583 7620637 -3553355 -4065027 4175245
12219 4175245 5423057 -5379708 -15441956 -15050217 -11340895 -14405592 -21578305 -23884256
12211 -23884256 -18792188 -8409229 6526483 21981191 27460442 17841426 3669894
12204 3669894 -130869 7055488 12919881 10140787 4028686 2381253 5432443 7714491
12196 7714491 4986833 -2223836 -9088740 -10340540 -5973737 -2115394 -3877722 -9041387
12188 -9041387 -11499619 -8822077 -3131856 3325055 9330338 12735926 11726344 8128228
12180 8128228 6266388 8148194 11843764 14453060 14762553 13061361 9878527 5283596
12172 5283596 -685407 -6577527 -9444470 -7948124 -4660823 -2745888 -1416379 1789800
$$ packed form
12227e249545J673259M994389R248991M523489p569946j1173992n11672Q240272
12219D175245J247812j0802765j0062248L91739L709322l064697p172713k305951
12211b3884256N092068J0382959J4935712J5454708N479251r619016j4171532
12204C669894l800763P186357N864393k779094o112101j647433L051190K282048
12196G714491k727658p210669o864904j251800M366803L858343j762328n163665
12188i041387k458232K677542N690221O456911O005283L405588j009582l598116
12180H128228j861840J881806L695570K609296L09493j701192l182834m594931
12172E283596n969003n892120k866943J496346L287301J914935J329509L206179
$$ plain form
12164 1789800 5295835 4897949 738354 -2325859 -1663786 1062342 4642802 8586198
12156 8586198 8494922 -422875 -13182325 -17210573 -8492372 2738539 6590147 4911487
12148 4911487 2982438 -267459 -6012912 -8574239 -4172160 872033 319137 -1132864
12140 -1132864 2146669 3751401 -4333756 -14705135 -13593763 -3323596 839751 -4775069
12132 -4775069 -7997840 -2932497 805253 -3725538 -8860977 -6628376 -2224713 -3996464
12124 -3996464 -10123482 -14559499 -17615416 -20984854 -19445755 -8186857 5840164 9899251
12116 9899251 1456772 -9222648 -11888359 -6241413 624786 2814152 1319353 1998978
12108 1998978 6833712 9091940 2117371 -8667564 -10641895 -1402249 8080484 9989304
$$ packed form
12164A789800L506035l97886m159595l064213O62073K726128L580460L943396
12156H586198r1276q917797j2759450m028248Q718201J1230911L851608j678660
12148D911487j929049l249897n745453k561327M402079N044193n52896j452001
12140a132864L279533J604732q085157j0371379J111372J0270167M163347n614820
12132d775069l222771N065343L737750m530791n135439K232601M403663j771751
12124c996464o127018m436017l055917l369438J539099J1258898J4027021M059087
12116I899251q442479j0679420k665711N646946O866199K189366j494799O79625
12108A998978M834734K258228o974569j0784935j974331R239646R482733J908820
$$ plain form
12100 9989304 8871901 9885503 8972884 2317099 -4251831 -4726766 -3628689 -7036765
12092 -7036765 -10027469 -4261493 7589527 16550481 21552147 26610361 28037857 18775044
12084 18775044 4109372 -1501425 5056744 11275850 8171325 1480335 -532823 937436
12076 937436 1355670 1249518 1728066 -482701 -6531362 -10295202 -6423392 1636493 7585911
12067 7585911 11138538 14765272 16419881 12719019 6367480 3665104 6169866 9972102
12059 9972102 11339252 8593387 1333665 -6787492 -7588173 2439920 14342701 15866754
12051 15866754 8068799 4503319 12168697 21620427 20445050 9476075 -1162818 -7267718
12043 -7267718 -13143511 -20445495 -23514556 -18529766 -10524013 -6636464 -6717358 -5726521 -2597926
$$ packed form
12100I989304j117403J013602r12619o655785o568930m74935J098077l408076
12092g036765k990704N765976J1851020Q960954N001666N058214J427496r262813
12084A8775044j4665672n610797O558169O219106l104525o690990k013158J470259
12076I37436M18234j06152M78548k210767o048661l763840L871810Q059885N949418
12067G585911L552627L626734J654609l700862o351539k702376K504762L802236
12059I972102J367150k745865p259722q121157q00681J0028093J1902781J524053
12051A5866754p797955l565480P665378R451730j175377j0968975j0638893o104900
12043g267718n875793p301984l069061M984790Q005753L887549q0894R90837L128595
$$ plain form
12034 -2597926 -1056932 -2725652 -4810839 -4772709 -2634312 1546422 7614844 12262521
12026 12262521 11577083 7900692 7958856 11760613 10320568 -996270 -13483320 -16202435
12018 -16202435 -10912126 -7693165 -9142533 -8395017 -2066857 4316552 5801263 5104123
12010 5104123 6677993 9308059 8697473 4169416 -531331 -1754473 226974 1328107
12002 1328107 -1728184 -6213637 -5979873 -1388105 -1173093 -8925180 -13910654 -5283289
11994 -5283289 8660486 8755984 -7472186 -20790744 -16944267 -4806325 -141814 -3094931
11986 -3094931 -3075454 2021926 4248566 -107665 -5639800 -6567447 -2298510 5100338 12343854
11977 12343854 14745453 10389441 3342430 -1914116 -6355742 -11475169 -12918114 -6845267
$$ packed form
12034b597926J540994j668720k085187L8130K138397M180734O068422M647677
12026A2262521o85438l676391N8164L801757j440045j1316838j2487050k719115
12018a6202435N290309L218961j449368P47516O328160O383409J484711o97140
12010E104123J573870K630066o10586m528057m700747j223142J981447J101133
12002A328107l056291m485453K33764M591768K15012p752087m985474Q627365
11994e283289J3943775R5498j6228170j3318558L846477J2137942M664511k953117
11986c094931J9477N097380K226640m356231n532135r27647M268937P398848P243516
11977A2343854K401599m356012p047011n256546m441626n119427j442945O072847
$$ plain form
11969 -6845267 984736 1989145 -1572365 -332359 5396114 4633024 -5958892 -14789522
11961 -14789522 -12343293 -5233466 -4624260 -8213186 -4594254 7768760 16722271 12490942
11953 12490942 -483929 -10419940 -11328263 -6142280 -644831 1913392 1613464 296105
11945 296105 -465064 -630094 -861144 -880816 -247514 -675068 -4791858 -11238727 -14080150
11936 -14080150 -10268506 -5290040 -6529735 -12027934 -12123854 -3518237 5190470 5758985
11928 5758985 1346852 -1113993 -3638685 -12416143 -23104952 -22638483 -7656051 8851360
11920 8851360 13444386 6827827 -1902408 -7967224 -11857152 -13734005 -13841713 -14755897
11912 -14755897 -17461588 -18287599 -14385452 -8681665 -4974833 -2209006 1783307 5406880
$$ packed form
11969f845267P830003J004409l561510J240006N728473p63090j0591916q830630
11961a4789522K446229P109827O09206l588926L618932J2363014Q953511m231329
11953A2490942j2974871r936011r08323N185983N497449K558223k99928j317359
11945B96105p61169j65030k31050j9672O33302m27554m116790o446869k841423
11936a4080150L811644M978466j239695n498199r5920Q605617Q708707N68515
11928E758985m412133k460845k524692q777458j0688809M66469J4982432J6507411
11920H851360M593026o616559q730235o064816l889928j876853j07708r14184
11912a4755897k705691q26011L902147N703787L706832K765827L992313L623573
$$ plain form
11904 5406880 7165901 9323316 11981110 9152793 -1909212 -12553525 -12434686 -3413046
11896 -3413046 4890018 9363842 13210218 14773514 8432761 -3751168 -12360064 -13712131
11888 -13712131 -12991118 -13457710 -12442351 -9559156 -8858287 -10275815 -8434404 -2905589
11880 -2905589 -477933 -3917419 -7448938 -6880520 -5082494 -3689460 735533 7329836
11872 7329836 7915726 -60996 -7213372 -6654862 -5415682 -11581865 -18146741 -11976831
11864 -11976831 5761706 20432564 23450973 20014066 17537000 16560864 14947233 12739101
11856 12739101 10006365 6091064 3482476 6945785 15881997 22090593 18810336 9348523
11848 9348523 3301365 5333942 10714245 12252962 9039727 5957381 5677830 5273488
$$ packed form
11904E406880J759021K157415K657794k828317j1062005j0644313J18839R021640
11896c413046Q303064M473824L846376J563296o340753j2183929q608896j352067
11888a3712131P21013m66592J015359K883195P00869j417528J841411N528815
11880b905589K427656l439486l531519N68418J798026J393034M424993O594303
11872G329836N85890p976722p152376N58510J239180o166183o564876O169910
11864a1976831J7738537J4670858L018409l436907k477066r76136j613631k208132
11856A2739101k732736l915301k608588L463309Q936212O208596l280257r461813
11848I348523o047158K032577N380303J538717l213235l082346k79551m04342
$$ plain form
11840 5273488 2312727 -211588 761910 1910469 -1323254 -5821244 -4888883 -6847
11832 -6847 557962 -4763289 -8574793 -7664866 -7850611 -11644705 -11766690 -3433619 6354157
11823 6354157 9495303 8215808 7410851 4085875 -4947347 -11776108 -6298898 7219845
11815 7219845 14488497 10737062 5303654 6726976 12542616 15122296 10817338 2498919
11807 2498919 -2443956 1917380 11985725 16278164 9960387 2049629 1584415 3928271
11799 3928271 538258 -4836093 -2795719 3913428 4241647 -1709669 -2353945 6114215
11791 6114215 14703475 17089571 15813768 11349289 123265 -13200550 -16783542 -9986859
11783 -9986859 -5819787 -9361454 -9755565 -1659279 2404425 -6526341 -15423502 -8378463
$$ packed form
11840E273488k960761k524315R73498J148559l233723m497990R32361M882036
11832f847N64809n321251l811504R09927j85745l794094j21985Q333071R787776
11823F354157L141146j279495q04957l324976r033222o828761N477210J3518743
11815G219845P268652l751435n433408J423322N815640K579680m304958q318419
11807B498919m942875M361336J0068345M292439o317777p910758m65214K343856
11799C928271l390013n374351K040374O709147L28219n951316o44276Q468160
11791F114215Q589260K386096j275803m464479j1226024j3323815l582992O796683
11783i986859M167072l541667l94111Q096286M063704q930766q897161P045039
$$ plain form
11775 -8378463 7605152 13971304 9662174 9550661 17725890 21698282 14236579 3980260
11767 3980260 24452 -391963 -3163177 -7046373 -8239392 -7216312 -5520145 -2055143
11759 -2055143 2863274 5438034 4474165 4009616 5578592 3474449 -6408896 -17253567
11751 -17253567 -18131753 -8884634 -1291621 -3973519 -11649367 -12953214 -5374920 2793554
11743 2793554 4591684 2605620 2766599 5132161 5918858 5359997 6757163 8930024 7205665
11734 7205665 2721773 2810819 9230493 13583793 9178170 850912 -2833543 -1398428
11726 -1398428 237598 1130173 3072140 3896276 776338 -2294221 343766 4545331
11718 4545331 258940 -11836186 -17715890 -8297417 7745154 15179568 10231675 1024858
$$ packed form
11775h378463J5983615O366152m309130j11513Q175229L972392p461703j0256319
11767C980260l955808m16415k771214l883196j193019J023080J696167L465002
11759b055143M918417K574760r63869m64549J568976k104143r883345j0844671
11751a7253567q78186R247119P593013k681898p675848j303847P578294Q168474
11743B793554J798130j986064J60979K365562P86697n58861J397166K172861j724359
11734G205665m483892Q9046O419674M353300m405623q327258l684455J435115
11726a398428J636026Q92575J941967Q24136l119938l070559K637987M201565
11718D545331m286391j2095126n879704R418473J6042571P434414m947893r206817
$$ plain form
11710 1024858 -5603668 -10119195 -14349311 -16613638 -14764547 -9796589 -3876076 2616085
11702 2616085 9348163 13139275 10715828 4687295 2588043 7272803 11779153 8489565
11694 8489565 932782 -627038 4724530 5645509 -4523189 -16162909 -16191303 -6901269
11686 -6901269 -2566749 -9358233 -18084481 -17852259 -8965529 524583 5195655 5869216
11678 5869216 6698306 11189912 18538111 22922898 19403430 10705751 4277308 2356284
11670 2356284 -155615 -6745220 -13459598 -14657648 -10295915 -4369395 525000 4021615
11662 4021615 6215513 7920372 10336159 12261391 10538638 5636030 3203257 6481728
11654 6481728 10358258 7661400 -719195 -7184961 -7929912 -6577019 -6841964 -7120404 -4900807
$$ packed form
11710A024858o628526m515527m230116k264327J849091M967958N920513O492161
11702B616085O732078L791112k423447o028533k099252M684760M506350l289588
11694H489565p556783j559820N351568R20979j0168698j1639720k8394R290034
11686f901269M334520o791484q726248K32222Q886730R490112M671072O73561
11678E869216Q29090M491606P348199M384787l519468q697679o428443j921024
11670B356284k511899o589605o714378j198050M361733N926520M894395L496615
11662D021615K193898J704859K415787J925232j722753m902608k432773L278471
11654F481728L876530k696858q380595o465766p44951J352893k64945k78440K219597
$$ plain form
11645 -4900807 -2156582 -2215913 -3543824 -1099324 6375840 14181803 17598411 16885109 14869917
11636 14869917 12524168 9705479 8166420 9903622 12973245 12841346 8698311 5127522
11628 5127522 6108845 10042411 12115890 9273628 1985221 -5998765 -8971807 -4379959
11620 -4379959 2228713 2499608 -2584093 -2807183 4876867 8514481 -1718836 -15771467
11612 -15771467 -15811364 -2544520 5412909 -846551 -9190210 -7989079 -3884480 -7720485
11604 -7720485 -14852350 -13543696 -5449156 -2235582 -5093838 -3502235 4663742 7100253
11596 7100253 -3368356 -15720560 -15756518 -5429860 2388475 2745094 2032406 5030841
11588 5030841 8325778 7690695 4633653 2982075 3651167 5056943 5503686 3821254 527552
$$ packed form
11645d900807K744225n9331j327911K444500P475164P805963L416608p13302k015192
11636A4869917k345749k818689j539059J737202L069623j31899m143035l570789
11628E127522R81323L933566K073479k842262p288407p983986k973042M591848
11620d379959O608672K70895n083701k23090P684050L637614j0233317j4052631
11612a5771467l9897J3266844P957429o259460q343659J201131M104599l836005
11604g720485p131865J308654Q094540L213574k858256J591603Q165977K436511
11596G100253j0468609j2352204l5958J0326658P818335L56619p12688K998435
11588E030841L294937o35083l057042j651578O69092J405776M46743j682432l293702
$$ plain form
11579 527552 -1020318 2024469 7022502 8244573 4983373 2299161 2082797 -373248
11571 -373248 -6994997 -10553832 -4582153 4987918 6852373 518465 -4301618 -3825518
11563 -3825518 -4473331 -8623111 -8149597 1047653 8517224 3559925 -7241496 -8835936
11555 -8835936 262896 7724019 7526485 6291755 7561423 4049367 -7798060 -17567973
11547 -17567973 -15268215 -7402629 -6847535 -11821152 -8197007 7683785 21046348 17640860
11539 17640860 1702370 -10809289 -11031202 -3220329 4103747 6264250 2769149 -4146421
11531 -4146421 -9464870 -7793246 1260350 11512711 16084124 14247478 10826970 9385554
11523 9385554 8394607 4935401 -18020 -2285720 324003 5782754 10707879 13182221
$$ packed form
11579E27552j547870L044787M998033J222071l261200k684212k16364k456045
11571c73248o621749l558835N971679R570071J864455o333908m820083M76100
11563c825518o47813m149780M73514R197250P469571m957299j0801421j594440
11555h835936R098832P461123j97534j234730J269668l512056j1847427r769913
11547a7567973K299758P865586N55094m973617L624145J5880792J3362563l405488
11539A7640860j5938490j2511659k21913P810873P324076K160503l495101o915570
11531d146421n318449J671624R053596J0252361M571413j836646l420508j441416
11523I385554r90947l459206m953421k267700K609723N458751M925125K474342
$$ plain form
11515 13182221 12478153 8810111 4746034 4133148 7058177 7958849 2262555 -6166215
11507 -6166215 -8417879 -1735990 6994790 10662442 10391665 10865022 10943362 5418734 -4542763
11498 -4542763 -9951016 -5973676 251838 -1102350 -8998322 -13438084 -9455050 -2539666
11490 -2539666 625692 444513 578283 989237 -942224 -5497613 -10843336 -16005126 -20097686
11481 -20097686 -20755589 -17240500 -13404801 -13357328 -15283236 -13920560 -8647603 -4516089
11473 -4516089 -4788736 -6805386 -6768817 -5133279 -4998095 -7146286 -8650406 -5875316 1585397
11464 1585397 9525139 12506507 9789263 6527472 7291529 10124297 9503819 3386106
11456 3386106 -5655507 -14139014 -18756200 -16265056 -7628707 -564945 -1769018 -7414313
$$ packed form
11515A3182221p04068l668042m064077o12886K925029R00672n696294q428770
11507f166215k251664O681889Q730780L667652k70777M73357P8340n524628r961497
11498d542763n408253L977340O225514j354188p895972m439762L983034O915384
11490b539666L165358j81179J33770M10954j931461m555389n345723n161790m092560
11481b0097686o57903L515089L835699M7473j925908J362676N272957M131514
11473d516089k72647k016650L6569J635538J35184k148191j504120K775090P460713
11464A585397P939742K981368k717244l261791P64057K832768o20478o117713
11456C386106r041613q483507m617186K491144Q636349P063762j204073n645295
$$ plain form
11448 -7414313 -8076527 -2669032 569753 -1991990 -3554331 1389126 8010785 9602575
11440 9602575 8081544 9100890 12087802 12778495 11840188 13038184 14977299 12346447
11432 12346447 4884253 -1393824 -2093879 1632991 6739999 10653132 10192292 3538533
11424 3538533 -5959952 -12313325 -13644005 -12439752 -9546835 -3241621 5134064 10314577
11416 10314577 9962804 7572905 6039108 2930254 -4281211 -12121116 -14940113 -12714193
11408 -12714193 -10152006 -8642213 -4051614 6028991 16779094 20799093 16078090 6392190
11400 6392190 -4214908 -12894491 -14942823 -6187045 8585293 15884326 8541966 -3407802
11392 -3407802 -4479607 5873875 13656053 11036984 6326955 9570118 17387629 18955234
$$ packed form
11448g414313o62214N407495L238785k561743j562341M943457O621659J591790
11440I602575j521031J019346K986912O90693r38307J197996J939115k630852
11432A2346447p462194o278077p00055L726870N107008L913133m60840o653759
11424C538533r498485o353373j330680J204253K892917O305214Q375685N180513
11416A0314577l51773k389899j533797l108854p211465p839905k818997K225920
11408a2714193K562187J509793M590599J0080605J0750103M019999m721003r685900
11400F392190j0607098q679583k048332Q755778J4772338P299033p342360j1949768
11392c407802j071805J0353482P782178k619069m710029L243163P817511J567605
$$ plain form
11384 18955234 11194914 1112642 -3644581 -1286770 4318295 6589082 2029388 -4720137
11376 -4720137 -6260361 -3952406 -6088572 -12300007 -11307585 -503373 5055202 -5611880
11368 -5611880 -20214006 -20685988 -10483636 -6250146 -8861086 -4270377 8517433 13077225
11360 13077225 2921958 -7934914 -9171686 -9514730 -17449322 -23936372 -17998641 -5900655
11352 -5900655 -68025 684411 5038538 11311636 10766949 3957436 128642 2959279
11344 2959279 8223630 13253171 18490997 21612902 19177263 12519549 5079100 -2745907
11336 -2745907 -9623963 -9807303 -1663522 6327083 6993668 5151203 6834531 6105706 -3816235
11327 -3816235 -13607240 -9058710 5084677 11134932 6885860 8081162 19992358 26614575
$$ packed form
11384A8955234p760320j0082272m757223K357811N605065K270787m559694o749525
11376d720137j540224K307955k136166o211435R92422J0804212N558575j0667082
11368e611880j4602126m71982J0202352M233490k610940M590709J2787810M559792
11360A3077225j0155267j0856872j236772l43044p934592o487050N937731J2097986
11352e900655N832630P52436M354127O273098n44687o809513l828794K830637
11344B959279N264351N029541N237826L121905k435639o657714p440449p825007
11336b745907o878056j83340Q143781P990605O66585j842465J683328p28825r921941
11327c816235r791005M548530J4143387O050255m249072J195302J1911196O622217
$$ plain form
11319 26614575 15686502 -2432712 -10721870 -7020319 235501 6383081 10383135 9396185
11311 9396185 3218503 -2803698 -6482823 -12451369 -20672054 -21428826 -10513090 619244
11303 619244 684780 -4290413 -1900667 6303252 9515387 7137572 7814482 11185077 6796157
11294 6796157 -6583423 -14921843 -7915988 6492581 13275807 8707667 1066386 -2141644
11286 -2141644 -1131082 208669 290299 779577 3149953 5540954 4503739 185717 -2822890
11277 -2822890 -1317063 2981450 7784074 13693218 19390642 18374278 7365948 -5094566
11269 -5094566 -6698335 2367086 8902344 3906547 -6331667 -9355214 -2149050 5874659
11261 5874659 3569951 -10187609 -24715314 -27608496 -17555284 -5655498 -2661123 -7813825
$$ packed form
11319B6614575j0928073j8119214q289158L701551P255820O147580M000054r86950
11311I396185o177682o022201l679125n968546q220685p56772J0915736J1132334
11303F19244O5536m975193K389746Q203919L212135k377815O76910L370595m388920
11294F796157j3379580q338420P005855J4408569O783226m568140p641281l208030
11286b141644J010562J339751Q1630M89278K370376K391001j037215m318022l008607
11277b822890J505827M298513M802624N909144N697424j016364j1008330j2460514
11269e094566j603769R065421O535258m995797j0238214l023547P206164Q023709
11261E874659k304708j3757560j4527705k893182J0053212J1899786K994375n152702
$$ plain form
11253 -7813825 -12956840 -13888652 -12744413 -11786613 -10597992 -8417889 -4647331 1506794
11245 1506794 7571988 6709032 -4064851 -16749169 -20058854 -12777763 -2921164 4385658
11237 4385658 10044333 13079507 9244489 -582426 -8594706 -9276115 -4305586 2777446
11229 2777446 9814229 13055526 9165735 2294230 944858 5075393 4818048 -4260691
11221 -4260691 -13337905 -13025898 -6096353 -1348598 -1390223 -3065677 -4602346 -5922967 -6164920
11212 -6164920 -6107777 -8476393 -11488538 -8356379 1312821 6698669 -37950 -10857334
11204 -10857334 -12046410 -2640501 6728877 9770741 9281146 8079259 5689053 4287703
11196 4287703 8387710 16374380 19766455 13698530 3092385 -3377206 -1628297 5756621
$$ packed form
11253g813825n143015r31812J144239R57800J188621K180103L770558O154125
11245A506794O065194q62956j0773883j2684318l309685P281091R856599P306822
11237D385658N658675L035174l835018r826915q012280o81409M970529P083032
11229B777446P036783L241297l889791o871505j349372M130535k57345r078739
11221d260691r077214L12007O929545M747755m1625j675454j536669j320621k41953
11212f164920N7143k368616l012145L132159R669200N385848o736619j0819384
11204a0857334j189076R405909R369378L041864m89595j201887k390206j401350
11196D287703M100007P986670L392075o067925j0606145o469591J748909P384918
$$ plain form
11188 5756621 11796923 9798627 -172710 -10132776 -12886886 -9665560 -5112428 1085510
11180 1085510 10582312 18028973 15915344 6913854 1934126 5091398 9514425 9576318
11172 9576318 8179145 8928285 9591196 7667817 5509103 5485330 5860263 5164787 4926877
11163 4926877 4774192 1254197 -4684320 -6016130 -412143 4248573 1551308 -2596469
11155 -2596469 1095007 10071962 12897201 5690306 -2923805 -3753009 2786284 9754886
11147 9754886 12020052 10056955 8606819 12114108 19420829 24017829 21903889 17062611
11139 17062611 15861657 18515309 20305212 18654669 13722896 4651269 -7514412 -14416183
11131 -14416183 -6898076 11003526 22689232 17880980 4516501 -3146591 -2412176 -1313858
$$ packed form
11188E756621O040302j998296r971337r960066k754110L221326M553132O197938
11180A085510R496802P446661k113629r001490m979728L157272M423027O1893
11172I576318j397173P49140O62911j923379k158714k3773L74933o95476k37910
11163D926877j52685l519995n938517j331810N603987M660716k697265m147777
11155b596469L691476Q976955K825239p206895q614111q29204O539293O968602
11147I754886K265166j963097j450136L507289P306721M597000k113940m841278
11139A7062611j200954K653652J789903j650543m931773r071627j2165681o901771
11131a4416183P518107J7901602J1685706m808252j3364479p663092P34415J098318
$$ plain form
11123 -1313858 -4134549 -6517434 -4579842 -969527 385221 -399983 -2193858 -6284813
11115 -6284813 -12486505 -15261184 -9118782 3102045 12080020 12538930 8153011 5119696
11107 5119696 4525516 3156532 -682611 -4752778 -5380549 -1108594 5177334 7564160
11099 7564160 2867369 -4394886 -6175431 -1465702 1754740 -1621418 -4972944 718242
11091 718242 11846390 15034707 5290520 -7023283 -10330112 -5740402 -1800998 -952579
11083 -952579 1788043 8945144 16171905 18532271 16882208 16181149 19014586 21671784
11075 21671784 17076384 3358493 -10600983 -12339038 -883938 9740158 6776821
11068 6776821 -4909562 -9328832 -742310 9282779 7818946 -3544213 -12938981 -13186554
$$ packed form
11123a313858k820691k382885J937592L610315J354748p85204j793875m090955
11115f284813o201692k774679O142402J2220827Q977975M58910m385919l033315
11107E119696n94180j368984l839143m070167o27771M271955O285928K386826
11099G564160m696791p262255j780545M709729L220442l376158l351526N691186
11091G18242J1128148L188317r744187j2313803l306829M589710L939404Q48419
11083i52579K740622P157101P226761K360366j650063p01059K833437K657198
11075B1671784m595400j3717891j3959476j738055J1455100J0624096k963337
11068F776821j1686383m419270Q586522J0025089j463833j1363159r394768k47573
$$ plain form
11060 -13186554 -7078286 -762175 2059771 -14361 -6314624 -12522571 -12881837 -6652363
11052 -6652363 -142662 214907 -4533226 -7671928 -5396788 -551530 2577831 3865216
11044 3865216 5338459 5820707 1655109 -6924534 -13901444 -14106323 -9275054 -4820172
11036 -4820172 -2600212 -738537 413528 -2472978 -8746344 -11044658 -3917737 7704556
11028 7704556 14057469 13356357 12637446 14686777 11560464 -3150268 -20396497 -22905613
11020 -22905613 -6956846 10643496 11300472 -4545122 -20246312 -23196803 -15768854 -6925303
11012 -6925303 -601412 3918670 5532626 1975755 -4125948 -6161464 -2401341 664791
11004 664791 -3083377 -11166486 -16894917 -18635349 -18693130 -15089883 -3116922 13326932
$$ packed form
11060a3186554O108268O316111K821946k074132o300263o207947l59266O229474
11052f652363O509701L57569m748133l138702K275140M845258L129361J287385
11044C865216J473243M82248m165598q579643o976910k04879M831269M454882
11036d820172K219960J861675J152065k886506o273366k298314P126921J1622293
11028G704556O352913p01112p18911K049331l126313j4710732j7246229k509116
11020b2905613J5948767J7600342O56976j5845594j5701190k950491P427949Q843551
11012f925303O323891M520082J613956l556871o101703k035516L760123L066132
11004F64791l748168q083109n728431j740432n7781L603247J1972961J6443854
$$ plain form
10996 13326932 21012504 13614240 1720951 -877536 4436994 5623921 -856394 -6690302
10988 -6690302 -6965521 -6749880 -9328145 -8841784 -682981 9347311 13354806 12331858
10980 12331858 11943882 13133235 14148633 16655584 21759998 24210028 19126037 11282845
10972 11282845 8913769 10833477 9163938 3346892 1128251 5062430 8137445 5356386
10964 5356386 739465 -835907 -899247 -2035137 -2156266 401502 1390941 -3564599 -10779811
10955 -10779811 -11860688 -4347450 5130354 8505277 4624300 -705242 -2125479 -922289
10947 -922289 -2078124 -5610725 -5357114 1312630 8104148 9372056 9702207 15760807 22745810
10938 22745810 19890132 8020472 -556817 -1076237 -2748611 -12055324 -21693822 -23310901
$$ packed form
10996A3326932P685572p398264j1893289k598487N314530J186927o480315n833908
10988f690302k75219K15641k578265M86361Q158803J0030292M007495j022948
10980A2331858l87976J189353J015398K506951N104414K450030n083991p843192
10972A1282845k369076J919708j669539n817046k218641L934179L075015k781059
10964E356386m616921j575372o3340j135890j21129K557768R89439m955540p215212
10955a0779811j080877P513238R477804L374923l880977n329542j420237J203190
10947i22289j155835l532601K53611O669744O791518J267908L30151O058600O985003
10938B2745810k855678j1869660q577289n19420j672374r306713r638498j617079
$$ plain form
10930 -23310901 -20903894 -22134595 -23954026 -17417539 -2600470 10754521 15502658 12763926
10922 12763926 7190698 2786391 1779438 2540333 531028 -4709817 -6894956 -1639813
10914 -1639813 6354654 9877290 8649610 6586453 4409288 1860054 2763486 9593712
10906 9593712 16082977 13727096 3740703 -5253730 -9301367 -10744356 -10120575 -5929415
10898 -5929415 -1435737 -1775147 -4069376 -463361 7664635 8846332 -1857965 -14578997
10890 -14578997 -17351105 -9569039 1141226 8128030 7922031 913940 -5649645 -2955510
10882 -2955510 6244676 8142501 -2475327 -12563228 -9809567 -2027012 -4497445 -14614841
10874 -14614841 -15824292 -5181664 1105027 -6053390 -13506622 -6457826 9073507 17108424
$$ packed form
10930b3310901K407007j230701j819431O536487J4817069J3354991M748137k738732
10922A2763926n573228m404307j006953P60895k009305n240845k185139N255143
10914a639813P994467L522636j227680k063157k177165k549234R03432O830226
10906I593712O489265k355881r986393q994433m047637j442989O23781M191160
10898e929415M493678l39410k294229L606015Q127996J181697j0704297j2721032
10890a4578997k772108P782066J0710265O986804k05999p008091o563585K694135
10882b955510R200186J897825j0617828j0087901K753661P782555k470433j0117396
10874a4614841j209451J0642628O286691p158417p453232P048796J5531333Q034917
$$ plain form
10866 17108424 15598191 14601533 16052741 11816281 1602399 -3002741 3394629 11067325
10858 11067325 10612026 6099501 5019318 5043228 551518 -5551580 -7395929 -7415486 -10555243
10849 -10555243 -12195332 -4921958 5553306 5595243 -5108395 -11682983 -6040571 2845723
10841 2845723 5207089 3956792 4961276 5513818 1552438 -2775043 -2162009 520729
10833 520729 710425 969827 4195672 4901825 -2200490 -10523022 -9885509 -2531675 646590
10824 646590 -2888657 -5979052 -5948579 -7523920 -10608827 -7400594 4340449 14978845
10816 14978845 15180546 7453268 963080 265355 3072768 4877042 2716705 -2164761
10808 -2164761 -3835045 2214341 11720890 15455324 11417777 7378709 9169036 12558071
$$ packed form
10866A7108424j510233r96658J451208m236460j0213882m605140O397370P672696
10858A1067325m55299m512525j080183K3910m491710o103098j844349j9557l139757
10849a0555243j640089P273374J0475264M1937j0703638o574588N642412Q886294
10841B845723K361366j250297J004484N52542l961380m327481O13034K682738
10833E20729J89696K59402L225845P06153p102315q322532O37513P353834L178265
10824F46590l535247l090395L0473j575341l084907L208233J1741043J0638396
10816A4978845K01701p727278o490188o97725K807413J804274k160337m881466
10808b164761j670284O049386R506549L734434m037547m039068J790327L389035
$$ plain form
10800 12558071 10596324 4101353 -69414 1558690 5780361 7809122 6729180 5981127
10792 5981127 9327486 15698057 18639193 13082945 2028601 -6740839 -10215326 -12164963
10784 -12164963 -15082080 -15225091 -8400801 3113668 12932240 17556839 17772111 14755320
10776 14755320 8683782 1432542 -2658188 -1024518 2998208 2705357 -4239761 -12057779
10768 -12057779 -12796252 -5454925 2924729 4984153 -413122 -8806717 -14088965 -12002167
10760 -12002167 -3666657 3783697 4058017 -295508 -1280980 2923213 5839665 3308530
10752 3308530 -1070950 -3556306 -5239860 -5628002 -280693 9133422 11630760 2316521
10744 2316521 -7241762 -4545956 4947756 6844469 446047 -1789007 4838933 11341667
$$ packed form
10800A2558071j961747o494971m170767J628104M221671K028761j079942p48053
10792E981127L346359O370571K941136n556248j1054344q769440l474487j949637
10784a2164963k917117j43011O824290J1514469R818572M624599K15272l016791
10776A4755320o071538p251240m090730J633670M022726k92851o945118p818018
10768a2057779p38473P341327Q379654K059424n397275q393595n282248K086798
10760a2002167Q335510P450354K74320m353525r85472M204193K916452k531135
10752C308530m379480k485356j683554l88142N347309R414115K497338r314239
10744B316521r558283K695806R493712J896713o398422k235054O627940O502734
$$ plain form
10736 11341667 10763248 6562464 2808238 -1822297 -6352764 -4829711 3363605 9548814
10728 9548814 7657115 2676327 2084617 5573088 8497096 9581317 9661112 7474375 2169063
10719 2169063 -3106971 -4460867 -1793877 2856415 8819122 15690547 20830463 20772681
10711 20772681 14702016 5786404 -613144 -1299140 927141 165403 -3905248 -4244479
10703 -4244479 2921228 10602223 10518593 5929469 6767374 14404828 20148919 18123864 11197622
10694 11197622 4175979 -754251 -1520140 2839184 7828327 7530364 3576947 2849685
10686 2849685 6060141 6544188 1210651 -5219205 -8284393 -8898088 -9137663 -9426357 -10365134
10677 -10365134 -11059164 -6526314 5722645 17777101 18857376 10229891 3513677 4530666
$$ packed form
10736A1341667n78419m200784l754226m630535m530467J523053Q193316O185209
10728I548814j891699m980788n91710L488471K924008J084221P9795k186737n305312
10719B169063n276034j353896K666990M650292N962707O871425N139916n7782
10711B0772681o070665q915612o399548o85996K226281p61738m070651l39231
10703d244479P165707P680995q3630m589124Q37905P637454N744091k025055o926242
10694A1197622p021643m930230p65889M359324M989143k97963l953417p27262
10686B849685L210456M84047n333537o429856l065188o13695k39575k88694r38777
10677a0365134o94030M532850J2248959J2054456J080275q627485o716214J016989
$$ plain form
10669 4530666 8370524 10035173 9479919 5971854 -1408540 -6807037 -2620968 6968091
10661 6968091 8994588 254740 -8688568 -10274355 -8648210 -8433487 -6776098 -898078
10653 -898078 6897038 15205039 24368578 29386394 23451488 10390057 1225301 -2856242
10645 -2856242 -9847210 -18234687 -16639788 -5792761 -1542042 -9053881 -13572496 -6450375
10637 -6450375 -609208 -7082102 -14882338 -10624369 -2033545 -3272342 -9857897 -7952570
10629 -7952570 1101523 5346195 4452456 8129272 16275391 18628622 12813419 7372135
10621 7372135 7145201 8573393 9209164 10544457 11622466 9544301 5931042 5016346 6586813
10612 6586813 7244200 6224681 4710300 3309979 4411420 10738889 17491232 14900894
$$ packed form
10669D530666L839858J664649n55254l508065p380394n398497M186069R589059
10661F968091K026497q739848q943308j585787J626145K14723J657389N878020
10653h98078P795116Q308001R163539N017816n934906j3061431r164756m081543
10645b856242o990968q387477J594899J0847027M250719p511839m518615P122121
10637f450375N841167o472894p800236M257969Q590824j238797o585555J905327
10629g952570R054093M244672q93739L676816Q146119K353231n815203n441284
10621G372135k26934J428192O35771J335293J078009k078165l613259r14696J570467
10612F586813O57387j019519j514381j400321J101441O327469O752343k590338
$$ plain form
10604 14900894 3963400 -1401723 4849188 10423289 4957020 -2287217 1698191 11643158
10596 11643158 13531692 7194837 3123447 3573640 3017424 2313371 6723820 13232406
10588 13232406 14111875 10454393 9614362 12303215 13676436 13285500 13100854 10705175 5096101
10579 5096101 2746304 6757903 8161513 847533 -4085837 5298594 19281246 18522243
10571 18522243 3118590 -8662754 -7255474 79083 5448629 7655088 4994608 -2962758
10563 -2962758 -7374448 895686 15321707 20926280 15480503 9231869 6280056 1899291
10555 1899291 -3325530 -2695037 3344819 7355010 7903312 9362553 10411143 6131519
10547 6131519 -253919 -920853 3379520 6001249 6599511 8050516 6584348 -750145
$$ packed form
10604A4900894j0937494n365123O250911N574101n466269p244237L985408R944967
10596A1643158J888534o336855m071390M50193n56216p04053M410449O508586
10588A3232406Q79469l657482q40031K688853J373221l90936j84646k395679n609074
10579E096101k349797M011599J403610p313980m933370R384431J3982652p59003
10571A8522243j5403653j1781344J407280P334557N369546K206459k660480p957366
10563b962758m411690Q270134J4426021N604573n445777o248634k951813m380765
10555A899291n224821O30493O039856M010191N48302J459241J048590m279624
10547F131519o385438o66934M300373K621729N98262J451005j466168p334493
$$ plain form
10539 -750145 -4786969 3387535 14250920 11631272 -1636031 -8038371 -2321225 4112680
10531 4112680 4093500 2696460 4740677 8951969 13585770 16130982 11643009 2075995
10523 2075995 -937623 5992834 9467674 1971702 -2971683 4715818 11002292 3317900
10515 3317900 -3625241 5559252 15127243 4977355 -10208468 -4708393 13141724 18471372
10507 18471372 14976446 20303368 24625304 11415934 1566198 22695293 50953719 44139328
10499 44139328 17897094 20074631 41996473 35237736 9009135 17767604 50700287
10492 50700287 41605979 3348873 23373765 80464320 10606995 -245450507 -484420080
10485 -484420080 -471302255 -249136252 -67113422 -46886921 -82140505 -59918267 -13907753
$$ packed form
10539g50145m036824Q174504J0863385k619648j3267303o402340N717146O433905
10531D112680j9180j397040K044217M211292M633801K545212m487973r567014
10523B075995l013618O930457L474840p495972m943385P687501O286474p684392
10515C317900o943141R184493R567991j0149888j5185823N500075J7850117N329648
10507A8471372l494926N326922M321936j3209370r849736K1129095K8258426o814391
10499D4139328k6242234K177537K1921842o758737k6228601Q758469L2932683
10492E0700287r094308l8257106K0024892N7090555o9857325k56057502k38969573
10485d84420080J3117825K22166003J82022830K0226501l5253584K2222238M6010514
$$ plain form
10478 -13907753 -13205538 -35698712 -28989618 -6316471 -5838631 -15729191 -6014311 10050703
10470 10050703 4066565 -12780808 -13396430 -5362302 -12907150 -30350580 -33828410 -22949970
10462 -22949970 -16233050 -18167793 -19804328 -20386108 -23687589 -23717066 -14917090 -5711379
10454 -5711379 -4497974 -4398136 2436189 9080576 7768734 5193094 8231228 8690308 -1338538
10445 -1338538 -12267090 -12184310 -7776254 -13015287 -25799953 -31836661 -25736637 -15042990
10437 -15042990 -7857983 -6442460 -8803442 -9859591 -5874303 -934419 -1683783 -4795305
10429 -4795305 -873122 8332484 10988810 5656570 4241907 10375080 12612664 5765186
10421 5765186 1006673 5689093 10195372 5973883 1274879 6373046 15715638 17236027
$$ packed form
10478a3907753P02215k2493174O709094K2673147M77840r890560R714880J6065014
10470A0050703n984138j6847373o15622Q034128p544848j7443430l477830J0878440
10462b2949970O716920j934743j636535n81780l301481k9477Q799976R205711
10454e711379J213405R9838O834325O644387j311842k575640L038134M59080j0028846
10445a338538j0928552Q2780M408056n239033j2784666o036708O100024J0693647
10437a5042990P185007J415523k360982j056149L985288M939884p49364l111522
10429d795305L922183R205606K656326n332240j414663O133173K237584o847478
10421E765186m758513M682420M506279m221489m699004N098167R342592J520389
$$ plain form
10413 17236027 9797199 1095953 -3387821 -1699557 5496118 11406643 8418589 857842
10405 857842 860517 8602125 10985331 3527027 -3115583 -3450378 -5531885 -11731694 -10370783
10396 -10370783 3146840 14870707 13574661 6603059 2899050 -1980803 -10443162 -10617537
10388 -10617537 3594850 15924783 9625834 -6857644 -14386917 -11910417 -11895042 -16376205
10380 -16376205 -16882361 -12000341 -7370396 -2867421 4409833 8875632 3410957 -6059796
10372 -6059796 -7259831 -74095 4593283 1948983 -2803886 -5691930 -8029149 -10521764
10364 -10521764 -12344029 -14461296 -16779483 -15173469 -7879309 -534011 1430206 269236
10356 269236 -100554 -1187389 -4454683 -5547136 -1120047 4587149 6224779 4365585
$$ packed form
10413A7236027p438828q701246m483774J688264P195675N910525k988054p560747
10405H57842K675P741608K383206p458304o642610l34795k081507o199809J360911
10396a0370783J3517623J1723867j296046o971602l704009m879853q462359j74375
10388a0617537J4212387J2329933o298949j6483478p529273K476500J5375m481163
10380a6376205n06156M882020M629945M502975P277254M465799n464675r470753
10372f059796j200035P185736M667378k644300m752869k888044k337219k492615
10364a0521764j822265k117267k318187J606014P294160P345298J964217j160970
10356B69236l69790j086835l267294j092453M427089N707196J637630j859194
$$ plain form
10348 4365585 1449664 -1929846 -3052913 1376442 6535147 3759284 -3432535 -1886163
10340 -1886163 8744301 13688514 9282461 10612953 22581285 26033793 9028295 -9382689
10332 -9382689 -7402623 5920609 8725143 1904562 781879 4325647 520661 -6953796
10324 -6953796 -5718945 -1646195 -10077007 -24389824 -23001560 -6798505 372401 -8686351
10316 -8686351 -13910475 -3647180 6944037 3723908 -4963992 -7713706 -9444015 -16558755
10308 -16558755 -20728596 -13488338 -3226058 -2242684 -7464300 -8068698 -3679740 -1731622
10300 -1731622 -3342575 -4121694 -4448156 -7946790 -12443545 -11646256 -4623454 3130821 7026003
10291 7026003 6728689 3462050 -1710319 -7301964 -11871816 -15198418 -18197204 -21765423
$$ packed form
10348D365585k915921l379510j123067M429355N158705k775863p191819J546372
10340a886163J0630464M944213m406053J330492J1968332L452508j7005498j8410984
10332i382689J980066J3323232K804534o820581j122683L543768l804986p474457
10324f953796J234851M072750q430812j4312817J388264J6203055P170906r058752
10316h686351n224124J0263295J0591217l220129q687900k749714j730309p114740
10308a6558755m169841P240258J0262280R83374n221616o04398M388958J948118
10300a731622j610953p79119l26462l498634m496755P97289P022802P754275L895182
10291G026003k97314l266639n172369n591645m569852l326602k998786l568219
$$ plain form
10283 -21765423 -24980892 -24402021 -18071401 -11040637 -11766091 -20175049 -25345095 -19469069
10275 -19469069 -7593003 1900841 8532037 13989615 14103507 7215014 2622741 7806023
10267 7806023 13725268 7091852 -8069363 -16709255 -16437793 -17638825 -21864003 -18662914
10259 -18662914 -5704665 5162047 5948001 1880188 -1093258 -4230641 -7506939 -6589227
10251 -6589227 -2593054 -2589371 -6882564 -8012244 -5057469 -5501668 -9854501 -8957133 -969943
10242 -969943 3573023 -773595 -5879528 -5045588 -2908555 -4128175 -5525076 -5603230 -8303776
10233 -8303776 -11439941 -6317905 4549875 5747867 -6681095 -16352913 -12446561 -6630415
10225 -6630415 -10615699 -14450896 -4774755 10188260 13883841 8235550 6646764 9339909
$$ packed form
10283b1765423l215469N78871O330620P030764p25454q408958n170046N876026
10275a9469069J1876066R493844O631196N457578J13892o888493m592273N183282
10267G806023N919245o633416j5161215q639892K71462j201032m225178L201089
10259a8662914J2958249J0866712P85954m067813k973446l137383l276298R17712
10251f589227L996173L683m293193j129680K954775m44199m352833Q97368P987190
10242i69943M542966m346618n105933Q33940K137033j219620j396901p8154k700546
10233h303776l136165N122036J0867780J197992j2428962r671818L906352N816146
10225f630415l985284l835197R676141J4963015L695581n648291j588786K693145
$$ plain form
10217 9339909 7191889 3677968 10334406 22731676 22861919 6991281 -8006889 -9379411
10209 -9379411 -2814094 1912586 4263672 6495317 6720675 4248738 1938683 -745006
10201 -745006 -7506041 -15161119 -14249023 -3629034 5421343 4483058 -1329533 -2851570
10193 -2851570 904119 5291233 8062763 9341019 8492822 5722463 3387034 2980090
10185 2980090 4028906 6716038 10920856 12502884 6876022 -2685658 -7167244 -4157394
10177 -4157394 -1328615 -5041004 -11870680 -14456109 -10057562 -763783 8984710 12835815
10169 12835815 7008961 -2978752 -6790667 -3222493 -2054652 -8492427 -14677247 -12539914
10161 -12539914 -6347166 -4131449 -3978843 888155 8397356 10162391 5324245 1028530
$$ packed form
10217I339909k148020l513921O656438J2397270J30243j5870638j4998170j372522
10209i379411O565317M726680K351086K231645K25358k471937k310055k683689
10201g45006o761035p655078R12096J0619989R050377r38285n812591j522037
10193b851570L755689M387114K771530J278256q48197k770359k335429m06944
10185B980090J048816K687132M204818J582028n626862r561680m481586L009850
10177d157394K828779l712389o829676k585429M398547R293779R748493L851105
10169A2835815n826854r987713l811915L568174J167841o437775o184820K137333
10161a2539914O192748K215717J52606M866998P509201J765035m838146m295715
$$ plain form
10153 1028530 -480688 -4859142 -14104049 -21072389 -18933679 -9621587 21067 5377703
10145 5377703 5574277 3065155 3010112 7659504 10665814 3645025 -10500493 -18872507
10137 -18872507 -15685822 -9153960 -7051786 -5439442 586897 4432393 -2043815 -12457687
10129 -12457687 -13511959 -5928619 -3295072 -9456714 -12145864 -4037917 3960682 -119787
10121 -119787 -9794062 -10398888 -2451782 -629355 -10629255 -20392640 -18054326 -8370260
10113 -8370260 -4599428 -10225871 -16225550 -13999881 -4320232 6575059 14146882 16908560
10105 16908560 14902084 10290897 7207252 7348832 6864943 1309503 -7223897 -12608491
10097 -12608491 -13948131 -15798359 -17668052 -11736379 3555306 15700864 13218218 2923367
$$ packed form
10153A028530j509218m378454r244907o968340K138710R312092R642654N356636
10145E377703J96574k509122n5043M649392L006310p020789j4145518q372014
10137a8872507L186685O531862K102174J612344O026339L845496o476208j0413872
10129a2457687j054272P583340K633547o161642k689150Q107947P998599m080469
10121a19787r674275o04826P947106J822427r999900r763385K338314R684066
10113h370260L770832n626443n999679K225669R679649J0895291P571823K761678
10105A6908560k006476m611187l083645J41580m83889n555440q533400n384594
10097a2608491j339640j850228j869693N931673J5291685J2145558k482646j0294851
$$ plain form
10089 2923367 535573 7042096 7939972 -3291738 -14839513 -14144997 -3763912 6597168
10081 6597168 13006732 14643781 8440172 -3626750 -9764335 -1869046 11382264 15052033
10073 15052033 7302070 -1428022 -4499306 -3838121 -1371096 3587512 9192830 12481437
10065 12481437 15122046 19416045 20397343 11550926 -2656270 -10317557 -8429344 -5459758
10057 -5459758 -6516828 -6707744 -2356470 1354067 -733564 -5120617 -5892082 -3967808
10049 -3967808 -4299031 -7274556 -7899066 -2395044 6894817 12846761 10095390 1453566
10041 1453566 -4268883 -2993425 -19398 -259261 255941 5906459 10276891 4173655
10033 4173655 -8430116 -14554088 -11133966 -7184632 -6788941 -3528105 5383944 12772754
$$ packed form
10089B923367k387794O506523Q97876j1231710j1547775O94516J0381085J0361080
10081F597168O409564J637049o203609j2066922o137585P895289J3251310L669769
10073A5052033p749963q730092l071284O61185K467025M958608N605318L288607
10065A2481437K640609M293999R81298q846417j4207196p661287J888213K969586
10057e459758j057070j90916M351274L710537k087631m387053p71465J924274
10049c967808l31223k975525o24510N504022R289861N951944k751371q641824
10041A453566n722449J275458K974027k39863N15202N650518M370432o103236
10033D173655j2603771o123972L420122L949334L95691L260836Q912049P388810
$$ plain form
10025 12772754 14087924 13988798 14670909 9776925 -2771315 -13340511 -14772580 -13690266
10017 -13690266 -17775506 -21167642 -14173309 -443914 7728742 6695128 2742134 -400952
10009 -400952 -4219484 -7505883 -6353624 -1954627 228966 -800979 -1001354 742288
10001 742288 831731 -2916180 -9057807 -15633428 -20226383 -18908172 -11214202 -3911672 -2903179
9992 -2903179 -3740202 1652221 10834642 13562706 8657148 6946400 14118743 21083829
9984 21083829 17462400 6234852 -2688683 -6897290 -10214971 -11098842 -3045981 13123292
9976 13123292 26647707 29541771 25155346 20566070 16757150 11457282 6337197 4241841
9968 4241841 2530032 -2875825 -8441067 -6807917 410678 3541809 769765 2273063
$$ packed form
10025A2772754J315170r9126O82111m893984j2548240j0569196j432069J082314
10017a3690266m085240l392136O994333J3729395Q172656j033614l952994l143086
10009d00952l818532l286399J152259M398997K183593j029945k00375J743642
10001G42288Q9443l747911o141627o575621m592955J318211P693970P302530J008493
9992b903179q37023N392423R182421K728064m905558j710748P172343O965086
9984B1083829l621429j1227548q923535m208607l317681q83871Q052861J6169273
9976A3123292J3524415K894064m386425m589276l808920n299868n120085k095356
9968D241841j711809n405857n565242J633150P218595L131131k772044J503298
$$ plain form
9960 2273063 13028909 22191170 18543523 7517526 1494828 499646 -3801253 -10100406
9952 -10100406 -9636630 -4797513 -8217532 -20480925 -25219260 -13024532 3936351 9786379
9944 9786379 5311778 622820 -1897049 -5375104 -6971214 -1657842 6416475 8041880
9936 8041880 2833109 -928469 263025 842078 -3838117 -10629276 -13657518 -11180930
9928 -11180930 -5655678 -437481 2203029 1754046 -969263 -4922041 -8320785 -7617070
9920 -7617070 -416648 9938148 16508500 16545970 13369157 10065572 6401479 2827186
9912 2827186 1464107 1284781 -1523202 -6280526 -7371598 -3293124 981672 3207366
9904 3207366 7272375 13818305 16243117 11177449 4509104 1175739 -2407103 -8958085
$$ packed form
9960B273063J0755846R162261l647647j1025997o022698r95182m300899o299153
9952a0100406M63776M839117l420019j2263393m738335J2194728J6960883N850028
9944I786379m474601m688958k519869l478055j596110N313372Q074317J625405
9936H041880n208771l761578J191494N79053m680195o791159l028242K476588
9928a1180930N525252N218197K640510m48983k723309l952778l398744P03715
9920g617070P200422J0354796O570352L7470l176813l303585l664093l574293
9912B827186j363079j79326k807983m757324j091072M078474M274796K225694
9904C207366M065009O545930K424812n065668o668345l333365l582842o550982
$$ plain form
9896 -8958085 -12453072 -8501130 -4494703 -8811583 -16124577 -14955022 -5793087 -25867
9888 -25867 -2444392 -5715076 -3120255 2095236 2943620 -1208201 -4153844 -1274158 3491319
9879 3491319 2190759 -3974051 -2942317 8338876 10228988 -15844207 -52702718 -60373055
9871 -60373055 -29525907 3072285 5550247 -7529677 -5472448 9047999 10300493 -4705695
9863 -4705695 -13656955 -7386101 -16090 90121 1416673 7036430 6567967 -2854983 -9526107
9854 -9526107 -8031209 -6994515 -9487249 -6162181 4352154 8623889 1539166 -3326453
9846 -3326453 2475386 7048674 32924 -7896511 -3320880 6496135 5472768 -6530790
9838 -6530790 -16702282 -18970165 -16606095 -12077484 -6913498 -5395646 -7497879 -5084970
$$ packed form
9896h958085l494987L951942M006427m316880p312994J169555R161935N767220
9888b5867k418525l270684K594821N215491Q48384m151821k945643K879686M765477
9879C491319j300560o164810J031734J1281193J890112k6073195l6858511p670337
9871f0373055L0847148L2598192K477962j3079924K057229J4520447J252494j5006188
9863d705695q951260O270854P370011J06211J326552N619757m68463r422950o671124
9854i526107J494898J036694k492734L325068J0514335M271735p084723m865619
9846c326453N801839M573288p015750p929435M575631R817015j023367j2003558
9838f530790j0171492k267883K364070M528611N163986J517852k102233K412909
$$ plain form
9830 -5084970 5016292 12860481 10969376 8168449 14926530 24312359 22726520 12009825
9822 12009825 4395871 881029 -8002332 -22242368 -29988302 -25762409 -16895772 -10516838
9814 -10516838 -6375909 -3611226 -3102821 -1883381 4237326 11673007 12739375 8340545
9806 8340545 6347757 7467668 4677294 -2141368 -3693392 3286891 9902914 9238541
9798 9238541 6176381 7380565 10521644 9789344 4998512 -413978 -4367712 -4759202 325585
9789 325585 6899976 6837920 76772 -2617040 5089446 14883655 16352902 12403390 12420595
9780 12420595 15530691 12373445 1614865 -6885565 -6709870 -2752358 -1238910 -384813
9772 -384813 3661286 7664627 4958973 -4056999 -10901687 -8838132 -255399 6744608
$$ packed form
9830e084970J0101262P844189j891105k800927O758081R385829j585839j0716695
9822A2009825p613954l514842q883361j4240036p745934M225893Q866637O378934
9814a0516838M140929K764683N08405J219440O120707P435681J066368m398830
9806H340545j992788J119911k790374o818662j552024O980283O616023o64373
9798I238541l062160J204184L141079p32300m790832n412490l953734l91490N084787
9789C25585O574391o2056o761148k693812P706486R794209J469247l949512J7205
9780A2420595L110096l157246j0758580q500430J75695L957512J513448Q54097
9772c84813M046099M003341k705654r015972o844688K063555Q582733P000007
$$ plain form
9764 6744608 7352759 4588999 5136205 11202880 17509149 17206354 9775106 1245623 -2670745
9755 -2670745 -1164117 3349759 7725560 8188043 2099259 -8029176 -15598886 -17601156
9747 -17601156 -17895473 -19818161 -19761286 -13329416 -4389912 -721567 -2052471 -393308 7159472
9738 7159472 13984514 14572103 11876220 10139246 7452920 1044332 -5494821 -6423243 -1594305
9729 -1594305 5056195 10773890 12864355 7436408 -3982081 -10951320 -5298470 7020312
9721 7020312 13252484 10749720 7914475 9682688 11557483 8787293 2790766 -3285749
9713 -3285749 -7722491 -7227915 1326357 13373920 18104131 11230332 668965 -3714732
9705 -3714732 -736069 4585858 8544333 10018067 8679044 5718637 3506585 2447604
$$ packed form
9764F744608O08151k763760N47206O066675O306269l02795p431248q529483l916368
9755b670745J506628M513876M375801M62483o088784j0128435p569710k002270
9747a7601156k94317j922688N6875O431870Q939504L668345j330904J659163P552780
9738G159472O825042N87589k695883j736974k686326o408588o539153r28422M828938
9729a594305O650500N717695K090465n427947j1418489o969239N652850J2318782
9721G020312O232172k502764k835245J768213J874795k770190n996527o076515
9713c285749m436742M94576Q554272J2047563M730211o873799j0561367m383697
9705c714732K978663N321927L958475J473734j339023k960407k212052j058981
$$ plain form
9697 2447604 1185217 614375 3267007 7763250 8847864 4388165 -2129248 -6546757
9689 -6546757 -6391031 982689 15043682 26649318 25337621 14368032 8564754 13103263
9681 13103263 15159754 3840179 -11570156 -14052043 -3178379 5024099 478308 -9373039
9673 -9373039 -11543433 -3171227 7503989 11428568 7661029 3346185 4932781 9589410
9665 9589410 8212981 -2343100 -14562485 -19962329 -18609188 -15575927 -12738355 -8868149
9657 -8868149 -4406609 -1304627 -178552 -922867 -3619723 -6319859 -5561023 -2049964 -1839327
9648 -1839327 -8345262 -16790013 -19864614 -15512501 -6695492 2158185 6075264 2363576
9640 2363576 -4352694 -5552108 -489968 1897366 -3580843 -10404864 -10921637 -7534928
$$ packed form
9697B447604j262387n70842K652632M496243J084614m459699o517413m417509
9689f546757J55726P373720J4060993J1605636j311697j0969589n803278M538509
9681A3103263K056491j1319575j5410335k481887J0873664Q202478m545791r851347
9673i373039k170394Q372206J0675216L924579l767539m314844J586596M656629
9665I589410j376429j0556081j2219385n399844J353141L033261K837572L870206
9657h868149M461540L101982J126075p44315k696856k700136P58836L511059K10637
9648a839327o505935q444751l074601M352113Q817009Q853677L917079l711688
9640B363576o716270j199414N062140K387334n478209o824021n16773L386709
$$ plain form
9632 -7534928 -6882193 -9328805 -11116206 -11261398 -9910792 -5710979 -833026 -1640142 -7880083
9623 -7880083 -9556848 -2619093 1495588 -7339989 -20219981 -21215305 -10236221 24111
9615 24111 4310877 6861535 7401119 1414643 -7069211 -8695972 -4803872 -5422576 -11157779
9606 -11157779 -12493915 -8147963 -7690518 -12959459 -13680699 -6870662 -3963656 -10488084
9598 -10488084 -13906050 -2610666 15153272 23252794 19459835 13770979 11723209 10339005
9590 10339005 6560761 903448 -4490461 -5729771 690216 11086010 15701740 11217687
9582 11217687 5291749 3836925 2239802 -4337330 -11110212 -12794364 -13906712 -19379009
9574 -19379009 -22517078 -14896614 -2655249 1065093 -2983859 -1303300 10222525 19389215
$$ packed form
9632g534928O52735k446612j787401j45192J350606M199813M877953q07116o239941
9623g880083j676765O937755M114681q835577j2879992r95324J0979084J0260332
9615B4111M286766K550658N39584n986476q483854j626761L892100o18704n735203
9606a1157779j336136M345952M57445n268941p21240O810037K907006o524428
9598a0488084l417966J1295384J7763938Q099522l792959n688856k047770j384204
9590A0339005l778244n657313n393909j239310O419987J0395794M615730m484053
9582A1217687n925938j454824j597123o577132o772882j684152j112348n472297
9574a9379009l138069P620464J2241365L720342m048952J680559J1525825R166690
$$ plain form
9566 19389215 16157758 5976016 -780947 -2828596 -4456113 -5179915 -1056956 6822573
9558 6822573 11880537 9703855 2338001 -4741671 -7367232 -4566367 2272734 11059757
9550 11059757 19449582 23989895 21166080 11605643 1959516 -575165 4176189 9530292
9542 9530292 9827466 6074654 3432420 4958093 8624873 9764410 6195643 857352
9534 857352 -1643275 -973910 -1117954 -3625499 -4287089 587670 7349941 8668296 2877742
9525 2877742 -4266950 -6828906 -4155395 623168 3689991 1665841 -6364985 -16121297
9517 -16121297 -20284857 -15598033 -6209230 1358142 4567346 4747694 3307397 1351955
9509 1351955 1759428 7339693 15724222 19333031 13181471 1589225 -5084899 -92685
$$ packed form
9566A9389215l231457j0181742o756963k047649j627517p23802M122959P879529
9558F822573N057964k176682p365854p079672k625561K800865O839101Q787023
9550A1059757Q389825M540313k823815r560437r646127k534681M751354N354103
9542I530292K97174l752812k642234J525673L666780J139537l568767n338291
9534H57352k500627O69365j44044k507545o61590M874759O762271J318355n790554
9525B877742p144692k561956K673511M778563L066823k024150q030826r756312
9517a6121297m163560M686824R388803P567372L209204J80348j440297j955442
9509A351955M07473N580265Q384529L608809o151560j1592246o674124M992214
$$ plain form
9501 -92685 14337252 29633592 36671576 30795500 15289497 65935 -6767112 -6588561
9493 -6588561 -6148590 -6389019 -1503051 9478448 17847248 16776394 11084522 8711926
9485 8711926 8156051 3181115 -4012501 -4884182 1386536 6367705 5690281 4040165 4791946
9476 4791946 4241778 -157862 -4294715 -4552378 -3145619 -2112375 706719 5182135 5911357
9467 5911357 1052762 -3198455 -2927937 -3752882 -10494532 -16904457 -14649035 -6445752 -393858
9458 -393858 3412189 9240830 12840302 5809117 -7697720 -12365639 -3001039 7455038
9450 7455038 6596279 -744990 -1920457 4649783 8900761 4244069 -4638524 -9187306
9442 -9187306 -6833761 -1936609 569656 597273 1677592 4909893 6517468 3456410 -1004450
$$ packed form
9501i2685J4429937J5296340P037984n876076j5506003j5223562o833047J78551
9493f588561M39971k40429M885968J0981499Q368800j070854n691872k372596
9485H711926n55875m974936p193616q71681O270718M981169o77424j650116P51781
9476D791946n50168m399640m136853k57663J406759J033244K819094M475416P29222
9467E911357m858595m251217K70518q24945o741650o409925K255422Q203283O051894
9458c93858L806047N828641L599472p031185j3506837m667919R364600J0456077
9450G455038q58759p341269j175467O570240M250978m656692q882593m548782
9442i187306K353545M897152K506265K7617J080319L232301J607575l061058m460860
$$ plain form
9433 -1004450 -1499083 1019541 548738 -4162145 -7185146 -4811854 -1691404 -3899226 -10259134
9424 -10259134 -15064813 -16446517 -17130221 -18215056 -16859377 -10775233 -2187839 3846870
9416 3846870 4422703 2183812 3505768 11409484 20004579 19176094 6705844 -7398221
9408 -7398221 -11867998 -6978475 -2232986 -3019140 -5179245 -3336817 1180470 3851795
9400 3851795 4139527 4523557 4649055 1819918 -2724555 -3285901 2392691 8695921 8970434
9391 8970434 4184754 905046 2187733 4765363 4819469 2050693 -2615769 -8854976 -14693812
9382 -14693812 -16589846 -14520639 -13541516 -16995290 -21166137 -20493483 -15484271 -10882744
9374 -10882744 -7939183 -3893840 1617528 5466678 7012120 9514781 13612708 14715583
$$ packed form
9433a004450m94633K518624m70803m710883l023001K373292L120450k207822o359908
9424a0259134m805679j381704o83704j084835J355679O084144Q587394O034709
9416C846870N75833k238891J321956P903716Q595095q28485j2470250j4104065
9408g398221m469777M889523M745489p86154k160105J842428M517287K671325
9400C851795K87732L84030J25498k829137m544473n61346N678592O303230K74513
9391H970434m785680l279708J282687K577630N4106k768776m666462o239207n838836
9382a4693812j896034K069207R79123l453774m170847O72654N009212M601527
9374a0882744K943561M045343N511368L849150J545442K502661M097927J102875
$$ plain form
9366 14715583 10349307 5584317 6163611 9091403 6204785 -3117976 -8824284 -2460839
9358 -2460839 11303744 19534354 15986336 6986499 1895901 2053072 2384186 919907
9350 919907 862139 2870956 1630440 -5828744 -12776895 -10077766 569808 7367281 3656436
9341 3656436 -3432502 -2815250 6367400 14767495 14618207 7065471 -1355030 -5384852 -3694489
9332 -3694489 1731233 6990107 8394799 4835052 -1422274 -5882368 -4224405 4272859
9324 4272859 14395329 18079726 12243879 2413810 -3767055 -5298383 -7029276 -11274291
9316 -11274291 -14556902 -13121801 -7499707 -217994 7173204 12870749 14416574 12300239
9308 12300239 10765495 12039465 12891307 10332815 7351741 8377565 11919043 13251069
$$ packed form
9366A4715583m366276m764990N79294K927792k886618r322761n706308O363445
9358b460839J3764583Q230610l548018q999837n090598J57171L31114j464279
9350I19907n7768K008817j240516p459184o948151K699129J0647574O797473l710845
9341C656436p088938O17252R182650Q400095j49288p552736q420501m029822J690363
9332c694489N425722N258874J404692l559747o257326m460094J657963Q497264
9324D272859J0122470L684397n835847r830069o180865j531328j730893m245015
9316a1274291l282611J435101N622094P281713P391198N697545J545825k116335
9308A2300239j534744J273970Q51842k558492k981074J025824L541478J332026
$$ plain form
9300 13251069 12249102 12195223 12267219 8727890 3561598 3672800 9557923 12853438 8661633
9291 8661633 2687974 1401201 2539803 1778007 1960605 7246896 13131105 12019788 6001061
9282 6001061 4181002 8111032 9491502 3413313 -4865592 -8766262 -8650160 -8308321 -9170172
9273 -9170172 -10633109 -11036703 -6680165 4446207 16488256 19867898 13805185 7797823
9265 7797823 7756763 8272477 3053961 -4712200 -8990161 -11310062 -16263285 -20873907 -17430276
9256 -17430276 -5643711 5397232 7547715 822371 -8887401 -14548254 -11662922 -2316011
9248 -2316011 5042350 4184624 -1502413 -4275601 -2777044 -2249352 -5348233 -8741914 -8967119
9239 -8967119 -6389529 -2786335 509296 1767157 372198 -998294 -37365 173850 -4744387
$$ packed form
9300A3251069j001967n3879P1996l539329n166292J11202N885123L295515m191805
9291H661633n973659j286773J138602p61796J82598N286291N884209j111317o018727
9282F001061j820059L930030J380470o078189q278905l900670J16102L41839q61851
9273i170172j462937m03594M356538J1126372J2042049L379642o062713o007362
9265G797823m1060N15714n218516p766161m277961k319901m953223m610622L443631
9256a7430276J1786565J1040943K150483o725344r709772n660853K885332R346911
9248b316011P358361q57726n687037k773188J498557N27692l098881l393681k25205
9239h967119K577590L603194L295631J257861j394959j370492R60929K11215m918237
$$ plain form
9230 -4744387 -11902365 -13387030 -7954699 -3371609 -4661222 -7049728 -4804946 -741862
9222 -741862 -687631 -2812565 -8584 8253946 13339409 8376501 -2742351 -9994419 -8643952
9213 -8643952 -3289385 -839836 -2053495 -2273681 249812 863716 -4006473 -9170507 -5920916
9204 -5920916 5604068 15183119 15202840 9190781 4702239 2773647 -482345 -5080440
9196 -5080440 -6310621 -2362811 2446339 3390773 671540 -2599835 -5042624 -7460776
9188 -7460776 -10030993 -11174408 -9410686 -5518781 -2541145 -3484619 -8490081 -13911420
9180 -13911420 -14612340 -8304336 1463394 7236192 4503101 -2784801 -5588185 -18937
9172 -18937 8129897 11336113 9862898 8956536 8892426 4601488 -4571634 -12127907 -14036465
$$ packed form
9230d744387p157978j484665N432331M583090j289613k388506K244782M063084
9222g41862N4231k124934K803981Q262530N085463m962908j1118852p252068J350467
9213h643952N354567K449549j213659k20186K523493O13904m870189n164034L249591
9204e920916J1524984R579051J9721o012059m488542j928592l255992m598095
9196e080440j230181L947810M809150R44434k719233l271375k442789k418152
9188g460776k570217j143415J763722L891905K977636r43474n005462n421339
9180a3911420p00920O308004R767730N772798k733091p287902k803384N569248
9172a8937Q148834L206216j473215r06362o4110m290938r173122p556273j908558
$$ plain form
9163 -14036465 -14190560 -16067986 -15673514 -9110859 -1542039 -507528 -4259958 -5770096
9155 -5770096 -5648562 -10617975 -19662660 -23045683 -17414313 -11077351 -10023549 -9106428 -3378818
9146 -3378818 1660283 -225706 -4266095 -2824584 1182233 207049 -3695792 -3094999 -241551
9137 -241551 -3873406 -11767070 -11420410 -650347 7120477 3704619 -1289695 2788272
9129 2788272 9801980 6654225 -7054410 -20339430 -26587846 -27755070 -26456831 -23293402
9121 -23293402 -19891241 -17062521 -12360238 -5623528 -2762067 -7216502 -12889174 -13553894
9113 -13553894 -13220513 -17187229 -19272760 -11178505 189281 463611 -8931494 -12006372
9105 -12006372 -3638162 3667758 2562337 2643582 11064611 17386291 10175837 -3297858
$$ packed form
9163a4036465j54095j877426L94472O562655P568820J034511l752430j510138
9155e770096J21534m969413r044685l383023N631370O336962J053802R17121N727610
9146c378818N039101j885989m040389J441511M006817r75184l902841O00793K853448
9137b41551l631855p893664L46660J0770063P770824l415858m994314M077967
9129B788272P013708l147755j3708635j3285020o248416j167224J298239L163429
9121b3293402L402161K828720M702283O736710K861461m454435n672672o64720
9113a3553894L33381l966716k085531Q094255J1367786K74330r395105l074878
9105a2006372Q368210P305920j105421Q1245Q421029O321680p210454j3473695
$$ plain form
9097 -3297858 -7833652 -2592392 1195195 -350117 -262747 4907263 9075961 6570166 234399
9088 234399 -2405311 3068958 14044738 22043322 19519614 7786577 -4357151 -10714456
9080 -10714456 -11430142 -6332667 6406020 21317648 25594874 15383465 3548517 2702242
9072 2702242 8529051 9762775 6860968 8369707 14261773 16360101 12620211 8419104
9064 8419104 5206325 -58215 -5077132 -3985747 842322 572425 -5398408 -8042675
9056 -8042675 -3976531 -779890 -3773196 -8136430 -8735341 -8305689 -10308128 -11393561 -6920274
9047 -6920274 1501757 8700275 11899813 11026321 7547750 5132342 6791527 10065749
9039 10065749 10236493 8772815 11831590 19316887 23275295 19770025 14737657 14203284
$$ packed form
9097c297858m535794N241260L787587j545312Q7370N170010M168698k505795o335767
9088B34399k639710N474269J0975780P998584k523708j1733037j2143728o357305
9080a0714456p15686N097475J2738687J4911628M277226j0211409j1834948q46275
9072B702242N826809J233724k901807J508739N892066K098328l739890m201107
9064H419104l212779n264540n018917J091385M828069k69897n970833k644267
9056h042675M066144L196641k993306m363234n98911M29652k002439j085433M473287
9047f920274Q422031P198518L199538q73492l478571k415408J659185L274222
9039A0065749J70744j463678L058775P485297L958408l505270n032368n34373
$$ plain form
9031 14203284 15335641 11807959 3023573 -6042810 -10408160 -8036681 -1303640 2985606
9023 2985606 -266571 -7204090 -9067745 -3985716 1417382 2412998 561329 -3084148
9015 -3084148 -10089809 -17354925 -16918702 -7403822 2378185 5759343 6360632 9133373 11293487
9006 11293487 8343079 2375918 -1937944 -4143389 -5521102 -5486613 -5074290 -7521609 -10734114
8997 -10734114 -6865002 4784223 12751103 8816932 416455 -1426618 922614 -1958249
8989 -1958249 -8823393 -9413785 -1989942 3151562 -926466 -8672940 -10974409 -6030635
8981 -6030635 1288655 5639003 4549535 -621682 -5417547 -6141780 -3326841 -162199
8973 -162199 1239075 1024858 1614517 7137126 18386467 27234125 22647123 5449459
$$ packed form
9031A4203284J132357l527682q784386r066383m365350K371479O733041M289246
9023B985606l252177o937519j863655N082029N403098R95616j851669l645477
9015c084148p005661p265116M36223R514880R782007L381158O01289K772741K160114
9006A1293487k950408n967161m313862k205445j377713L4489M12323k447319l212505
8997a0734114L869112J1649225P966880l934171q400477j843073K349232k880863
8989a958249o865144n90392P423843N141504m078028p746474k301469M943774
8981f030635P319290M350348j089468n171217m795865p24233K814939L164642
8973a62199J401274k14217N89659N522609J1249341Q847658m587002j7197664
$$ plain form
8965 5449459 -9798600 -12082304 -6026910 -1549955 298166 3396227 6161244 5187657
8957 5187657 3769928 6440215 9288968 6032880 -141266 -1553970 658710 -109851
8949 -109851 -1995388 3039848 13816097 19969796 18291820 16250901 17095914 14460148
8941 14460148 6084992 568521 3737777 8429735 5671981 -1689879 -4488425 -784202
8933 -784202 3487998 3717758 218540 -4894414 -9511942 -11791902 -11654315 -10341372 -7304152
8924 -7304152 -745494 7745524 13319338 13946744 11908527 8257471 1656164 -5174841
8916 -5174841 -4468915 6635305 19859713 24292749 18229758 9026601 4135601 5697569
8908 5697569 11339888 16640633 18066290 15921269 13688698 13750042 15164557 15421524 12200529
$$ packed form
8965E449459j5248059k283704O055394M476955J848121L098061K765017r73587
8957E187657j417729K670287K848753l256088o174146j412704K212680p68561
8949a09851j885537N035236J0776249O153699j677976k040919Q45013k635766
8941A4460148q375156n516471L169256M691958k757754p361860k798546L704223
8933g84202M272200K29760l499218n112954m617528k279960J37587J312943L037220
8924g304152O558658Q491018N573814O27406k038217l651056o601307o831005
8916e174841P05926J1104220J3224408M433036o062991r203157m891000J561968
8908E697569N642319N300745J425657k145021k232571O1344J414515K56967l220995
$$ plain form
8899 12200529 4425654 -5241001 -10537257 -8636499 -5229765 -6904442 -10596847 -8546106
8891 -8546106 -2401023 -1950631 -8486472 -10919017 -3000036 6474913 7739855 4765976
8883 4765976 6834048 13178698 16631380 17000786 19271743 21651825 17530110 9108216
8875 9108216 7367751 15525717 22356933 17253359 4767699 -2388954 -573444 1685061
8867 1685061 -3028223 -10981260 -13298039 -8487862 -4255693 -6466881 -10716079 -8443174
8859 -8443174 1002627 9489803 10919486 7441375 3586559 -173018 -4666807 -7317542
8851 -7317542 -4832716 1648824 7771130 10650643 9719329 5348493 -184217 -2624260
8843 -2624260 -202623 3426606 3874076 1963186 1653330 3483084 3838707 454395 -4306765
$$ packed form
8899A2200529p774875r666655n296256J900758L406734j674677l692405K050741
8891h546106O145083M50392o535841k432545P918981R474949J264942k973879
8883D765976K068072O344650L452682L69406K270957K380082m121715q421894
8875I108216j740465Q157966O831216n103574j2485660p156653J815510K258505
8867A685061m713284p953037k316779M810177M232169k211188m249198K272905
8859h443174R445801Q487176J429683l478111l854816l759577m493789k650735
8851g317542K484826O481540O122306K879513r31314m370836n532710k440043
8843b624260K421637L629229M47470j910890l09856J829754L55623l384312m761160
$$ plain form
8834 -4306765 -5962941 -2256021 4615184 9447051 9052973 6067131 5225356 5761805 1992616
8825 1992616 -6772924 -12130517 -6495397 6653202 17004515 19104231 15474348 10799591
8817 10799591 7947110 7935645 9070800 7244382 1059125 -4915519 -5906456 -3851345 -3983753
8808 -3983753 -6496888 -6869928 -3280383 1496689 4781355 5784848 3841830 -169215
8800 -169215 -2119180 15522 840790 -5360688 -13410011 -11875329 188250 10358592
8792 10358592 9753285 4063916 2891392 6176451 8119223 8156160 9694630 11921718 11246356
8783 11246356 8761620 8495384 9448699 6997455 1809185 -442831 1132553 1288785 -927152
8774 -927152 964169 9092814 14479631 9546270 1404591 3060546 14293590 21819221
$$ packed form
8834d306765j656176L706920O871205M831867l94078k985842q41775N36449l769189
8825A992616q765540n357593N635120J3148599J0351313K099716l629883m674757
8817A0799591k852481j1465J135155j826418o185257n974644r90937K055111j32408
8808c983753k513135l73040L589545M777072L284666J003493j943018m011045
8800a69215j949965K134702Q25268o201478q049323J534682J2063579J0170342
8792A0358592o05307n689369j172524L285059J942772L6937J538470K227088o75362
8783A1246356k484736k66236R53315k451244n188270k252016J575384J56232k215937
8774i27152J891321Q128645N386817m933361q141679J655955J1233044P525631
$$ plain form
8766 21819221 18672387 12641975 11760924 11510555 4149072 -6333387 -8749667 -1300656
8758 -1300656 6438316 8194073 8131960 10661292 11872143 6925064 -148335 -1474073 2664830
8749 2664830 4118115 -1052797 -7011540 -6447811 8837 5412299 4975185 289064 -3553503
8740 -3553503 -2646735 3407497 11574692 17212761 17408160 13601374 10106447 9200006 8786304
8731 8786304 6206369 2694423 1113064 239992 -4212116 -12116434 -17430454 -16577485 -13406889
8722 -13406889 -12063461 -10048071 -4156644 1165698 -654825 -6942889 -8646197 -3971101
8714 -3971101 -483503 -2988580 -7812664 -10507526 -10644786 -7023457 2681875 14398737
8706 14398737 19100293 15698600 12972802 14395330 12475923 4881222 3281829 14810829
$$ packed form
8766B1819221l146834o030412q81051k50369p361483j0482459k416280P449011
8758a300656P738972J755757o2113K529332J210851m947079p073399j325738M138903
8749B664830J453285n170912n958743N63729O456648N403462m37114m686121l842567
8740c553503R06768O054232Q167195N638069J95399l806786l494927r06441m13702
8731H786304k579935l511946j581359q73072m452108p904318n314020Q52969L170596
8722a3406889J343428K015390N891427N322342j820523o288064j703308M675096
8714c971101L487598k505077m824084k694862j37260L621329R705332J1716862
8706A4398737M701556l401693k725798J422528j919407p594701j599393J1529000
$$ plain form
8698 14810829 25992015 20283574 3841923 -3098723 4057039 11251773 11182636 12500172
8690 12500172 19891699 22959813 13665860 1096616 -1916690 2522778 2711848 -4797120
8682 -4797120 -12451736 -13562146 -9247628 -5140372 -6009309 -11766741 -16006829 -11873244
8674 -11873244 -1542818 4971251 2868508 -1619872 -1602229 1365562 3220562 4992708
8666 4992708 7793480 6946738 -523752 -7858229 -7303152 -2890884 -4272040 -10274741 -10143536
8657 -10143536 -1635488 3785581 -1973700 -10939352 -10350647 -494507 6602151 3742133
8649 3742133 -3495398 -5839562 -1585744 4004210 6990944 8088489 8359489 6212151
8641 6212151 1039519 -3408386 -3258852 -404189 340619 -1076707 -579779 1885576 1630754
$$ packed form
8698A4810829J1181186n708441j6441651o940646P155762P194734o9137J317536
8690A2500172P391527L068114r293953j2569244l013306M439468J89070p508968
8682d797120p654616j110410M314518M107256q68937n757432m240088M133585
8674a1873244J0330426O514069k102743m488380J7643K967791J855000J772146
8666D992708K800772q46742p470490p334477N55077M412268j381156o002701J31205
8657a0143536Q508048N421069n759281q965652N88705R856140P096658k860018
8649C742133p237531k344164M253818N589954K986734J097545K71000k147338
8641F212151n172632m447905J49534K854663P44808j417326M96928K465355k54822
$$ plain form
8632 1630754 -1676672 -1616523 4350240 8963239 5965280 808612 2647658 9796402 12265034
8623 12265034 7086195 1901540 2389913 4151721 129785 -9267383 -16749700 -16250323
8615 -16250323 -8961185 -2646859 -3982805 -9869032 -9734689 -201144 7413636 1478544
8607 1478544 -11973562 -16003736 -6499097 2711389 1161095 -3508391 1181711 13530413
8599 13530413 21060483 18042344 10742506 6746787 6192500 4451825 -519217 -4890741
8591 -4890741 -2642692 6491082 14030774 11817646 3304994 -658955 2278555 3051066
8583 3051066 -2915297 -7028998 -1734221 5605917 3178892 -7050568 -12920614 -10384032
8575 -10384032 -6719742 -6752329 -7137459 -5155526 -2904270 -587218 5253440 13884118 18656998
$$ packed form
8632A630754l307426O0149N966763M612999k997959n156668J839046P148744K468632
8623A2265034n178839n184655M88373J761808m021936r397168p482317M99377
8615a6250323P289138O314326j335946n886227J34343R533545P614780n935092
8607A478544j3452106m030174R504639R210486j550294m669486M690102J2348702
8599A3530413P530070l018139p299838l995719n54287j740675m971042m371524
8591d890741K248049R133774P539692k213128q512652l963949K937510P72511
8583C051066n966363m113701N294777P340138k427025j0229460n870046K536582
8575a0384032L664290l2587l85130J981933K251256K317052N840658Q630678M772880
$$ plain form
8566 18656998 16139689 10017457 3711554 -3127935 -8178949 -5563285 3474217 7075239
8558 7075239 -2974663 -19101419 -26914382 -22024816 -11466830 -2270069 4090165 7894029
8550 7894029 8856561 7956597 7263147 7711145 9168650 11128494 11571866 8294306 3629635
8541 3629635 3493928 8331204 10137549 3673496 -4255982 -3646361 4239712 9218358 6976413
8532 6976413 3197430 3161367 5188922 5978654 6012249 7412504 10969031 16593323 22879949
8523 22879949 26137613 24158634 20419461 19472620 19008819 12886641 1891274 -5923435
8515 -5923435 -6776674 -5389121 -5383703 -3474609 2505895 7075371 4742453 -1034912 -2975824
8506 -2975824 -371247 2019079 2870299 5422796 10357337 13388630 11058710 5141471
$$ packed form
8566A8656998k517309o122232o305903o839489n051014K615664R037502L601022
8558G075239j0049902j6126756p812963M889566J0557986R196761O360234L803864
8550G894029R62532q99964o93450M47998J457505J959844M43372l277560m664671
8541C629635j35707M837276J806345o464053p929478O09621P886073M978646k241945
8532F976413l778983l6063K027555P89732L3595J400255L556527N624292O286626
8523B2879949L257664j978979l739173r46841m63801o122178j0995367p814709
8515e923435q53239J387553N418J909094N980504M569476k332918n777365j940912
8506b975824K604577K390326Q51220K552497M934541L031293k329920n917239
$$ plain form
8498 5141471 140046 -1124067 1328969 5802313 9865024 10736066 6197970 -3128564
8490 -3128564 -11955487 -13364172 -6428676 976789 657802 -5916068 -10364631 -8785978
8482 -8785978 -4794102 -1765711 1209429 4735576 7209977 9152982 12699050 15034714
8474 15034714 10204908 364907 -3488498 3131449 10610310 9271969 2729168 -646836
8466 -646836 -1589996 -5124006 -8277722 -4462077 3672686 7649127 7338402 9953151 15723885
8457 15723885 16641057 10489273 4535301 2769312 502678 -4558053 -6341939 -967988
8449 -967988 5573981 6292080 2253927 -2907373 -9793857 -17457976 -17928458 -5737988 11323829
8440 11323829 19993025 17612709 11973161 6903034 -2149144 -16665779 -28204246 -27945531
$$ packed form
8498E141471n001425j264113K453036M473344M062711Q71042m538096r326534
8490c128564q826923j408685O935496P405465l18987o573870m448563J578653
8482h785978L991876L028391K975140L526147K474401J943005L546068K335664
8474A5034714m829806r840001l853405O619947P478861j338341o542801l376004
8466f46836r43160l534010l153716L815645Q134763L976441l10725K614749N770734
8457A5723885R17172o151784n953972j765989k266634n060731j783886N373951
8449i67988O541969P18099m038153n161300o886484p664119m70482J2190470J7061817
8440A1323829Q669196k380316n639548n070127r052178j4516635j1538467K58715
$$ plain form
8432 -27945531 -17749436 -6546746 981364 6846445 12559960 15293670 12402837 5631729
8424 5631729 -1244200 -5789104 -5759293 1447619 13671129 21177690 15501280 816302
8416 816302 -9795684 -10049055 -5772891 -3432723 -1837064 902715 975125 -3635285 -6522295
8407 -6522295 -2302625 3096046 1285446 -3922421 -1655994 8613465 16039108 14354280
8399 14354280 8264627 3178737 -1337070 -5993566 -8680073 -9120071 -9019982 -6808270
8391 -6808270 -435772 4723693 916505 -8308075 -10751662 -3838587 1906166 906281
8383 906281 779790 6632736 10210970 3688275 -6487748 -9521803 -5439188 -653394
8375 -653394 3900362 10247801 15462627 15943423 14346897 14030908 12485864 8145140 6564248
$$ packed form
8432b7945531J0196095J1202690P528110N865081N713515K733710k890833o771108
8424E631729o875929m544904K9811P206912J2223510P506561n676410j4684978
8416H16302j0611986k53371M276164K340168J595659K739779P2410m610410k887010
8407f522295M219670N398671j810600n207867K266427J0269459P425643j684828
8399A4354280o089653n085890m515807m656496k686507m39998J00089K211712
8391f808270O372498N159465l807188r224580k443587O913075N744753r99885
8383I06281j26491N852946L578234o522695j0176023l034055M082615M785794
8375f53394M553756O347439N214826M80796j596526l15989j545044m340724j580892
$$ plain form
8366 6564248 10814473 13195071 6845261 -1588197 -2373123 1109546 -345917 -4158314
8358 -4158314 -415037 9602378 14449847 10789006 6449737 5635288 4863741 3958039 7171356
8349 7171356 11875899 9720545 1511674 -2233644 1416963 3390952 -318373 -876572
8341 -876572 7494771 16242346 15545071 8578645 3920368 2187215 -488600 -2388008 709562
8332 709562 6437032 8267435 4749429 -112107 -3607281 -5859665 -6158748 -2730708 3849284
8323 3849284 9761044 10834417 6370252 894611 224171 3556684 3199500 -3385159 -6654364
8314 -6654364 1594081 12880226 12427487 2430863 -46112 10305677 18413024 11999837
8306 11999837 -1496292 -9180756 -10612920 -11489216 -10759932 -5507222 -113551 479498
$$ packed form
8366F564248M250225K380598o349810q433458p84926L482669j455463l812397
8358d158314L743277J0017415M847469l660841m339269q14449p71547r05702L213317
8349G171356M704543k155354q208871l745318L650607J973989l709325n58199
8341h76572Q371343Q747575o97275o966426m658277j733153k675815j899408L097570
8332G09562N727470J830403l518006m861536l495174k252384k99083L428040O579992
8323C849284N911760J073373m464165n475641o70440L332513l57184o584659l269205
8314f654364Q248445J1286145m52739r996624k476975J0351789Q107347o413187
8306A1999837j3496129p684464j432164q76296P29284N252710N393671N93049
$$ plain form
8298 479498 -207588 2396684 4732199 3138047 3282224 10209445 15850393 9161401 -6092568
8289 -6092568 -16158335 -16305309 -13008867 -10295187 -6573417 -3658105 -6445098 -12691563
8281 -12691563 -13451180 -5216380 6218529 14115790 15995840 11959637 5393400 3503361
8273 3503361 9475683 16451741 16895920 14130076 15511927 18607082 15314831 6174592
8265 6174592 -1607967 -7274734 -14320910 -18048311 -10952161 255206 77678 -11289661
8257 -11289661 -16102043 -6111145 5533681 6394390 2381260 3356939 5550030 902321
8249 902321 -6833032 -8388819 -4058943 -883387 -376129 551024 809206 -3401791 -11208405
8240 -11208405 -17879487 -19906310 -15159555 -3777249 6955182 6538079 -4288663 -11422958
$$ packed form
8298D79498o87086K604272K335515j594152J44177O927221N640948o688992j5253969
8289f092568j0065767j46974L296442K713680L721770K915312k786993o246465
8281a2691563p59617Q234800J1434909P897261J880050m036203o566237j890039
8273C503361N972322O976058M44179k765844J381851L095155l292251r140239
8265F174592p782559n666767p046176l727401P096150J1207367j77528j1367339
8257a1289661m812382R990898J1644826Q60709m013130R75679K193091m647709
8249I02321p735353j555787M329876L175556N07258R27153K58182m210997p806614
8240a1208405o671082k026823M746755J1382306J0732431m17103j0826742p134295
$$ plain form
8232 -11422958 -6089930 3526752 6554718 4740920 3942763 1344963 -6172140 -10689668
8224 -10689668 -5360716 -27162 -7886232 -22152337 -24376522 -13302595 -6189580 -10767612
8216 -10767612 -15137733 -9936950 -2570693 -1500101 -1644365 4109616 10372751 7729603
8208 7729603 -1480523 -6259608 -2001797 5314195 7651001 2518870 -5771339 -9475960
8200 -9475960 -4737686 3202497 5879821 2516866 -601943 -840091 -993169 -239688 6085568
8191 6085568 15060815 15853029 6022943 -2612008 -1285177 2998208 937128 -2656419
8183 -2656419 2315972 13023313 17444476 12704146 6982149 4248416 -820784 -11048089
8175 -11048089 -20060215 -21150785 -16026754 -11174945 -9974255 -11065193 -11685762 -10851509
$$ packed form
8232a1422958N333028R616682L027966j813798p98157k597800p517103m517528
8224a0689668N328952N333554p859070j4266105k224185J1073927P113015m578032
8216a0767612m370121N200783P366257J070592j44264N753981O263135k643148
8208G729603r210126m779085M257811P315992K336806n132131q290209l704621
8200i475960M738274P940183K677324l362955l118809k38148j53078P53481O325256
8191F085568Q975247P92214r830086q634951J326831M283385k061080l593547
8183b656419M972391J0707341M421163m740330n721997k733733n069200j0227305
8175a1048089r012126j090570N124031M851809J200690j090938o20569Q34253
$$ plain form
8167 -10851509 -10102571 -10506114 -9006209 -1986009 5950394 3673476 -10732903 -22793254
8159 -22793254 -18503942 -2998967 7507963 7861409 5792436 4389361 -2021433 -12455626
8151 -12455626 -15052244 -5412383 3088583 -2667248 -15526714 -16993885 -1747734 16667350
8143 16667350 22944883 14767333 970185 -8288266 -8714401 -3878588 -1111119 -3329752
8135 -3329752 -5953222 -3870171 1149043 3300470 589081 -4118292 -8020837 -10258546
8127 -10258546 -10158333 -7493746 -3611995 728160 6757461 13427812 14560891 5828681
8119 5828681 -6964680 -12937008 -9390344 -3817878 -2167961 -2093701 -20919 2394109
8111 2394109 3420570 6496271 13581155 17666020 10266865 -5011195 -14750490 -12626455
$$ packed form
8167a0851509P48938m03543J499905P020200P936403k276918j4406379j2060351
8159b2793254M289312J5504975J0506930L53446k068973j403075o410794j0434193
8151a2455626k596618R639861Q500966n755831j2859466j467171J5246151J8415084
8143A6667350O277533q177550j3797148r258451m26135M835813K767469k218633
8135c329752k623470K083051N019214K151427k711389m707373l902545k237709
8127a0258546J00213K664587L881751M340155O029301O670351J133079q732210
8119E828681j2793361n972328L546664N572466J649917P4260K072782K415028
8111B394109J026461L075701P084884M084865p399155j5278060r739295K124035
$$ plain form
8103 -12626455 -6372728 -4983031 -6411678 -3867763 1260389 1324196 -4506433 -7920965
8095 -7920965 -4081667 909621 -428871 -5365198 -5148790 1772065 7376028 5319814
8087 5319814 -898924 -3437750 -216293 3851709 4351779 2668090 2820535 5111887 5562099
8078 5562099 1964267 -2246040 -2678237 -759876 -1708899 -5957212 -7692664 -3780187 949268
8069 949268 1059917 -1033288 968216 7492664 12466920 10801307 2155759 -10381251
8061 -10381251 -20294638 -19200438 -5479123 9888232 13361903 4420634 -5653258 -9332685
8053 -9332685 -8501557 -5128968 2435924 11111576 12360729 5397121 1128633 6105305
8045 6105305 12100925 10190046 6013929 9781910 18177529 19505972 12980435 9142675
$$ packed form
8103a2626455O253727J389697j428647K543915N128152O3807n830629l414532
8095g920965L839298M991288j338492m936327K16408O920855N603963k056214
8087E319814o218738k538826L221457M068002N00070j683689J52445K291352M50212
8078E562099l597832m210307m32197J918361r49023m248313j735452L912477M729455
8069I49268J10649k093205K001504O524448M974256j665613q645548j2537010
8061a0381251r913387J094200J3721315J5367355L473671q941269j0073892l679427
8053i332685Q31128L372589P564892Q675652J249153o963608m268488M976672
8045F105305N995620j910879m176117L767981Q395619J328443o525537l837760
$$ plain form
8037 9142675 11871318 13146604 7727901 1429893 715987 3323232 4099959 3101127 3060647
8028 3060647 3894046 3608166 1004879 -4550195 -12072595 -16768166 -13972761 -6350999 -1674314
8019 -1674314 -2321891 -3181030 -1536546 -1862142 -7330857 -12987996 -12248290 -5953487 -792438
8010 -792438 -1677414 -8230570 -15546949 -16836820 -9354888 1064382 5968703 5142384 5190141
8001 5190141 6979211 3654070 -5906390 -11824743 -7641670 -1030830 -1788393 -6374982
7993 -6374982 -4242479 5248370 12222915 10174758 1943965 -6430450 -10436007 -7499390
7985 -7499390 424498 6537928 7554714 9215229 16717304 23910911 21078274 10334425
7977 10334425 3092256 3896562 7172893 9034205 11052033 11896669 7022835 -1005658
$$ packed form
8037I142675K728643J275286n418703o298008p13906K607245P76727r98832m0480
8028C060647Q33399k85880k603287n555074p522400m695571K795405P621762M676685
8019a674314o47577q59139J644484l25596n468715n657139P39706O294803N161049
8010g92438q84976o553156p316379j289871P481932J0419270M904321q26319M7757
8001E190141J789070l325141r560460n918353M183073O610840p57563m586589
7993f374982K132503R490849O974545k048157q230793q374415m005557K936617
7985g499390P923888O113430J016786J660515P502075P193607k832637j0743849
7977A0334425p242169Q04306L276331J861312K017828Q44636m873834q028493
$$ [...]
##END NTUPLES=NMR SPECTRUM
##END=
