##TITLE=31Pdec_2a1511CFA
 , 24 sc
 15.11.2021
##JCAMPDX= 6.0         $$ Bruker NMR JCAMP-DX V2.0
##DATA TYPE= NMR SPECTRUM
##DATA CLASS= NTUPLES
##ORIGIN= UXNMR, Bruker Analytische Messtechnik GmbH
##OWNER= root
$$ XWIN-NMR		Version 3.5
$$ Tue Nov 16 11:59:14 2021 Russian Standard Time (UT+4h)  she@DPX200
##.OBSERVE FREQUENCY= 81.013821
##.OBSERVE NUCLEUS= ^31P
##.ACQUISITION MODE= SIMULTANEOUS
##.ACQUISITION SCHEME= undefined
##.AVERAGES= 24
##.DIGITISER RES= 16
##SPECTROMETER/DATA SYSTEM= spect
##.PULSE SEQUENCE= zgpg30
##.SOLVENT NAME= CDCl3
##.SHIFT REFERENCE= (INTERNAL, CDCl3, 0, 248.564)
##AUDIT TRAIL= $$ (NUMBER, WHEN, WHO, WHERE, WHAT)
$$ ##TITLE= Audit trail, XWIN-NMR		Version 3.5
$$ ##JCAMPDX= 5.01
$$ ##ORIGIN= Bruker BioSpin GmbH
$$ ##OWNER= she
$$ F:/spectra/data/she/nmr/P31/1/pdata/1/auditp.txt
$$ ##AUDIT TRAIL=  $$ (NUMBER, WHEN, WHO, WHERE, WHAT)
(   1,<2021-11-16 11:58:18.45 +0400>,<she>,<DPX200>,
      <created by zg, POWCHK disabled, PULCHK disabled
       configuration hash MD5:
       00 E9 B6 7A A2 85 ED C7 34 08 36 98 17 FE 4E 26
       data hash MD5: 32K
       A8 F6 01 7D 05 4C 40 17 5D 09 37 6D EE 46 BB B0>)
(   2,<2021-11-16 11:58:22.39 +0400>,<she>,<DPX200>,
      <Start of raw data processing
       efp BC_mod = 2 LB = 1 FT_mod = 6 PKNL = 1 PHC0 = -9218.358 PHC1 = 149.2695 SI = 64K 
       data hash MD5: 64K
       0F 81 8C CE 42 07 FD 32 2E 5A A0 C3 77 3D 10 C3>)
(   3,<2021-11-16 11:58:39.57 +0400>,<she>,<DPX200>,
      <pk PHC0 = 4.145844 PHC1 = 0 
       data hash MD5: 64K
       90 6A A5 4F 95 E8 9C 1A A2 90 48 8B 8B CF CA 84>)
(   4,<2021-11-16 11:58:42.78 +0400>,<she>,<DPX200>,
      <abs ABSG = 5 
       data hash MD5: 64K
       58 DB 30 94 A8 FA A6 E4 07 B1 00 BB B6 03 26 E8>)
$$ ##END=
$$ 
$$ hash MD5
$$ 90 77 14 DF 86 44 18 3F E2 EF D5 4F 9C C3 40 EB
##$RELAX= 
##$RELAX= 
##$RELAX= 
##$RELAX= 
##$RELAX= 
##$RELAX= 
##$RELAX= 
##$RELAX= 
$$ Bruker specific parameters
$$ --------------------------
##$DU= <F:/spectra>
##$EXPNO= 1
##$NAME= <P31>
##$PROCNO= 1
##$TYPE= <nmr>
##$USER= <she>
##$AMP= (0..31)
100 100 100 100 100 100 100 100 100 100 100 100 100 100 100 100 100 100 
100 100 100 100 100 100 100 100 100 100 100 100 100 100 
##$AQSEQ= 0
##$AQ_mod= 1
##$AUNM= <au_zg>
##$AUTOPOS= <>
##$BF1= 81.014009
##$BF2= 200.13
##$BF3= 200.13
##$BF4= 200.13
##$BF5= 200.13
##$BF6= 200.13
##$BF7= 200.13
##$BF8= 200.13
##$BYTORDA= 1
##$CFDGTYP= 0
##$CFRGTYP= 5
##$CHEMSTR= <none>
##$CNST= (0..31)
1 1 145 1 1 1 1 1 1 1 1 1 1 1 1 1 1 1 1 1 1 1 1 1 1 1 1 1 1 1 1 1 
##$CPDPRG= <waltz16>
##$CPDPRG1= <>
##$CPDPRG2= <waltz16>
##$CPDPRG3= <>
##$CPDPRG4= <mlev>
##$CPDPRG5= <mlev>
##$CPDPRG6= <mlev>
##$CPDPRG7= <mlev>
##$CPDPRG8= <mlev>
##$CPDPRGB= <>
##$CPDPRGT= <>
##$D= (0..31)
0 1 0 0 0 0 0 0 0 0 0 0.03 2e-05 3e-06 0 0 0 0 0 0 0 0 0 0 0 0 0 0 0 0 
0 0 
##$DATE= 1637049498
##$DBL= (0..7)
120 120 120 11 120 120 24 19 
##$DBP= (0..7)
150 150 150 150 150 150 150 150 
##$DBP07= 0
##$DBPNAM0= <>
##$DBPNAM1= <>
##$DBPNAM2= <>
$$ [...]
##$SUBNAM3= <"">
##$SUBNAM4= <"">
##$SUBNAM5= <"">
##$SUBNAM6= <"">
##$SUBNAM7= <"">
##$SUBNAM8= <"">
##$SUBNAM9= <"">
##$SW= 501.771253377433
##$SWIBOX= (0..15)
0 1 3 0 0 0 0 0 0 0 0 0 0 0 0 0 
##$SW_h= 40650.406504065
##$TD= 32768
##$TD0= 1
##$TE= 0
##$TE2= 300
##$TE3= 300
##$TEG= 300
##$TL= (0..7)
0 120 53 12 22 120 120 120 
##$TP= (0..7)
150 150 150 150 150 150 150 150 
##$TP07= 0
##$TPNAME0= <>
##$TPNAME1= <>
##$TPNAME2= <>
##$TPNAME3= <>
##$TPNAME4= <>
##$TPNAME5= <>
##$TPNAME6= <>
##$TPNAME7= <>
##$TPOAL= (0..7)
0.5 0.5 0.5 0.5 0.5 0.5 0.5 0.5 
##$TPOFFS= (0..7)
0 0 0 0 0 0 0 0 
##$TUNHIN= 0
##$TUNHOUT= 0
##$TUNXOUT= 0
##$USERA1= <user>
##$USERA2= <user>
##$USERA3= <user>
##$USERA4= <user>
##$USERA5= <user>
##$V9= 5
##$VALIST= <valist>
##$VCLIST= <CCCCCCCCCCCCCCC>
##$VD= 0
##$VDLIST= <DDDDDDDDDDDDDDD>
##$VPLIST= <PPPPPPPPPPPPPPP>
##$VTLIST= <TTTTTTTTTTTTTTT>
##$WBST= 1024
##$WBSW= 4
##$XGAIN= (0..3)
0 0 0 0 
##$XL= 0
##$YL= 0
##$YMAX_a= 2088
##$YMIN_a= -2055
##$ZGOPTNS= <>
##$ZL1= 120
##$ZL2= 120
##$ZL3= 120
##$ZL4= 120
##$ABSF1= 248.5645
##$ABSF2= -253.2056
##$ABSG= 5
##$ABSL= 3
##$ALPHA= 0
##$AQORDER= 0
##$ASSFAC= 0
##$ASSFACI= 0
##$ASSFACX= 0
##$ASSWID= 0
##$AUNMP= <proc_1d>
##$AZFE= 0.1
##$AZFW= 0.5
##$BCFW= 0
##$BC_mod= 2
##$BYTORDP= 0
##$COROFFS= 0
##$CY= -3
##$DATMOD= 1
##$DC= 0
##$DFILT= <>
##$DTYPP= 0
##$F1P= 0
##$F2P= 0
##$FCOR= 1
##$FTSIZE= 65536
##$FT_mod= 6
##$GAMMA= 0
##$GB= 0
##$INTBC= 1
##$INTSCL= 5.30512e-09
##$ISEN= 30
##$LB= 1
##$LEV0= 0
##$LPBIN= 0
##$MAXI= 10000
##$MC2= 0
##$MEAN= 0
##$ME_mod= 0
##$MI= 50
##$NCOEF= 0
##$NC_proc= -8
##$NLEV= 6
##$NOISF1= 182.463
##$NOISF2= 159.3651
##$NSP= 0
##$NTH_PI= 0
##$NZP= 0
##$OFFSET= 248.5645
##$PC= 4
##$PHC0= -9214.213
##$PHC1= 149.2695
##$PH_mod= 1
##$PKNL= yes
##$PPARMOD= 0
##$PSCAL= 0
##$PSIGN= 0
##$REVERSE= no
##$SF= 81.014009
##$SI= 65536
##$SIGF1= 159.3651
##$SIGF2= -187.1042
##$SINO= 113.3802
##$SIOLD= 16384
##$SREGLST= <1H.CDCl3>
##$SSB= 0
##$STSI= 65536
##$STSR= 0
##$SW_p= 40650.406504065
##$SYMM= 0
##$S_DEV= 0
##$TDeff= 32768
##$TDoff= 0
##$TI= <>
##$TILT= no
##$TM1= 0
##$TM2= 0
##$TOPLEV= 0
##$USERP1= <user>
##$USERP2= <user>
##$USERP3= <user>
##$USERP4= <user>
##$USERP5= <user>
##$WDW= 1
##$XDIM= 65536
##$YMAX_p= 273252596
##$YMIN_p= -80527679
$$ End of Bruker specific parameters
$$ ---------------------------------
##NTUPLES= NMR SPECTRUM
##VAR_NAME=  FREQUENCY,     SPECTRUM/REAL,   SPECTRUM/IMAG
##SYMBOL=    X,             R,               I
##VAR_TYPE=  INDEPENDENT,   DEPENDENT,       DEPENDENT
##VAR_FORM=  AFFN,          ASDF,            ASDF
##VAR_DIM=   65536,         65536,           65536
##UNITS=     HZ,            ARBITRARY UNITS, ARBITRARY UNITS
##FACTOR=    0.620285442955139, 1,           1
##FIRST=     20137.2065510759, 0,            0
##LAST=      -20513.1999529892, 0,           0
##MIN=       -20513.1999529892, -80527679,   0
##MAX=       20137.2065510759, 273252596,    0
$$ Real data points
##PAGE= N=1
##DATA TABLE= (X++(R..R)), XYDATA
$$ [...]
13049g6171O45284K216347O76528k253499j087163K874080K486356k251033k679654
$$ -76171 569113 2785460 3461988 1208489 121326 2995406 5481762 3230729 551075
13040E51075L527177O651175K69961p501942o264680J140497M568907J864829
$$ 551075 4078252 10729427 10999388 3497446 -2767234 -1626737 2942170 4806999
13032D806999j465174l211449n028745n035487O1346O575699O835726O65729m181664
$$ 4806999 3341825 130376 -4898369 -9933856 -9872510 -3296811 3538915 4204644 22980
13023B2980l452013p65874J10285K12046J219103K490925L598860M660066L775378
$$ 22980 -3429033 -4194907 -4084622 -3872576 -2653473 -162548 3436312 8096378 11871756
13014A1871756n82774n014336n041875k728142l263957m801366q95597O357670
$$ 11871756 11288982 6274646 1232771 -1495371 -4759328 -9560694 -10456291 -4098621
13006d098621O562307k183167p810301k026593O403890N159109k717625m544767
$$ -4098621 2463686 280519 -7529782 -9556375 -3152485 2006624 -711001 -5255768
12998e255768J953189O268601K034194m379443m501938J002704N353453M719305
$$ -5255768 -3302579 2966022 5000216 620773 -3881165 -2878461 2474992 7194297
12990G194297P91296k710493l484219k019249p27026j060040j926671j819010
$$ 7194297 7985593 5275100 1790881 -228368 -955394 -2015434 -3942105 -5761115
12982e761115r37889K39263K228409M278770L622399p8302k483761n56479K148851
$$ -5761115 -6699004 -6459741 -4231332 47438 3669837 3591535 1107774 551295 2700146
12973B700146Q79778k295001j667567K610383M647179K049688j226501j850597
$$ 2700146 3579924 1284923 -382644 2227739 6874918 8924606 7698105 5847508
12965E847508j153668j027325j018828r53417j768617k467843q33941J731405
$$ 5847508 4693840 3666515 2647687 1694270 -74347 -2542190 -3376131 -1644726
12957a644726J050047k753882m284362j059762K523749K189837o6412j81913J728053
$$ -1644726 -594679 -3348561 -7632923 -8692685 -6168936 -3979099 -4045511 -4227424 -2499371
12948b499371K882154K286611N44062j753464k855151n18556L577715M025768
$$ -2499371 382783 2669394 3213456 1459992 -1395159 -1913715 1664000 5689768
12940E689768o57674m734721l276048P55357J935008P81852J132029K432984J191266
$$ 5689768 5032094 297373 -2978675 -2223318 -288310 493542 1625571 4058555 5249821
12931E249821j785353k275932j91382J24570k407938l497317n28791L292392L904438
$$ 5249821 3464468 1188536 997154 1121724 -1286214 -4783531 -5312322 -2019930 1884508
12922A884508J503836j400143l606492m554235k856752J690607O138216O829010
$$ 1884508 3388344 1988201 -1618291 -6172526 -9029278 -7338671 -1200455 5628555
12914E628555L428262q24983k695253k074677j482593k466463k961529J89174
$$ 5628555 9056817 8231834 5536581 3461904 1979311 -487152 -3448681 -3259507
12906c259507N625666P101306J258322o370258p233371j053007L443272L35719
$$ -3259507 2366159 9467465 10725787 4355529 -2877842 -3930849 -487577 -151858
12898a51858n409600n026243J808492O614809L717926k488351m159776n19890
$$ -151858 -5561458 -10587701 -8779209 -2164400 1553526 -934825 -5094601 -5614491
12890e614491K389376J199915p36145q7798Q08199j145888l254993j034584L514169
$$ -5614491 -3225115 -2025200 -2761345 -2849143 -2040944 -3186832 -6441825 -7476409 -3962240
12881c962240M234309P75420q49559J514994K822018J29758k160182m50451J589321
$$ -3962240 272069 1047489 197930 1712924 4534942 4664700 2504518 2054067 3643388
12872C643388J22109j630832P8096J486811k012208n742753j972209O251737P921589
$$ 3643388 3765497 2134665 2212761 3699572 1687364 -4055389 -6027598 224139 8145728
12863H145728O53821n635904l648707J856392L222478P13736q12865k38338J81140
$$ 8145728 8799549 3163645 -485062 1371330 4593808 5307544 4494679 4256341 4437481
12854D437481k39831o00007q38582r26972p2945Q72469p28362m516885n627487
$$ 4437481 4197650 3597643 2759061 1832089 1759144 2631613 1903251 -2613634 -8241121
12845h241121j217881M451280N202936J070945k510031k216815J51154J603608
$$ -8241121 -9459002 -5007722 195214 1266159 -1243872 -3460687 -3309533 -1705925
12837a705925J525522Q61493J42556o44671j293856j301062m74026O00105J070158
$$ -1705925 -180403 681090 823646 178975 -1114881 -2415943 -2889969 -2289864 -1219706
12828a219706R71834J103548J314952K75315k013957l242741k111874p16306j153279
$$ -1219706 -247872 855676 2170628 2445943 431986 -2810755 -4922629 -5638935 -6792214
12819f792214j828270n07659R61192n11092l058154j914431K581017M832148K722913
$$ -6792214 -8620484 -9128143 -8166951 -8678043 -11736197 -13650628 -11069611 -6237463 -3514550
12810c514550O35570J640827K332592r28381n140029m710962J98395L936977L105118
$$ -3514550 -2878980 -1238153 1094439 166058 -4973971 -9684933 -9486538 -5549561 -2444443
12801b444443L82110J95386K865036M422225K014354j817017k193803Q79986J913830
$$ -2444443 -2062333 -1866947 998089 5420314 7434668 5617651 3423848 4303834 6217664
12792F217664j662261m841306k774560J148016J050273j201835M41679M661467
$$ 6217664 4555403 -285903 -3060463 -1912447 -862174 -2064009 -1622330 3039137
12784C039137M336757n93185k148416J973643M078903l07212m798702l267274
$$ 3039137 7375894 6782709 4634293 6607936 10686839 10379627 5580925 2313651
12776B313651L61217K63321j228688L92683K446192L55573k894179j611302K057609
$$ 2313651 2674868 2938189 1709501 2102184 4548376 4903949 2009770 398468 2456077
12767B456077J491110k819690l825952O83727N009435M272462O4161l287564l435834
$$ 2456077 3947187 1127497 -2698455 -2014728 2994707 7267169 7331330 4043766 607932
12758F07932p26718K333499K757181N94500j004753j004930j991876m148416l257843
$$ 607932 -118786 2214713 4971894 5566394 4561641 3556711 1564835 -2583581 -5841424
12749e841424J385729L467749l30226l456135M8441M775881K849701k282763j983512
$$ -5841424 -4455695 -987946 -1318172 -4774307 -4725866 50015 2899716 616953 -1366559
12740a366559K178729J650082l167920l603838J152420K227445k888347n571960
$$ -1366559 812170 2462252 -705668 -4309506 -3157086 -929641 -3817988 -9389948
12732i389948j013645M077744L713172J734546K713883L395085J05565l305509
$$ -9389948 -10403593 -6325849 -2612677 -878131 1835752 5230837 5336402 2030893
12724B030893k042329J472294K400567R71887l69485j889523l521317k437133
$$ 2030893 -11436 1460858 3861425 4833312 4463827 2574304 -947013 -3384146
12716c384146J311641K439139j163003l668354n94466L357108K292219r49241
$$ -3384146 -2072505 366634 -796369 -4464723 -5059189 -1702081 590138 -359103
12708c59103m61101K144403J205776k540813l452463o96407J368272J070705N42532
$$ -359103 -820204 1324199 2529975 -10838 -3463301 -4159708 -2791436 -1720731 -1178199
12699a178199J47653j437725k577443o23431K356049K167356p6282K38318K624604
$$ -1178199 -1030546 -2468271 -5045714 -5669145 -3313096 -1145740 -1222022 -983704 1640900
12690A640900J943865k200428l921702o18280K749467J811113o26686P6214K856183
$$ 1640900 3584765 1384337 -2537365 -3155645 -406178 1404935 778249 854463 3710646
12681C710646K989139q02112m889603n420372k246442J397104K236211L54157
$$ 3710646 6699785 5897673 1008070 -4412302 -6658744 -5261640 -3025429 -2671272
12673b671272j084888k71698O44720o20955k088862m99418K681170K816905n55320
$$ -2671272 -3756160 -4027858 -3383138 -4004093 -6092955 -6592373 -3911203 -1094298 -1649618
12664a649618k749616j161826J110884O61630j243766j571098k91207N12195K41931
$$ -1649618 -4399234 -5561060 -4450176 -3788546 -5032312 -6603410 -6894617 -6382422 -6140491
12655f140491L7789O62454J820857K652079K100729L5744j801679j805576j307035
$$ -6140491 -6102702 -5440248 -3619391 -967312 1133417 1169161 -632518 -2438094 -3745129
12646c745129k564609l957554j303392M691229O990500J614793n360879n077083
$$ -3745129 -6309738 -10267292 -11570684 -6879455 111045 1725838 -3635041 -8712124
12638h712124J997487O743049L889307j628790k523572J140117L498900J572396
$$ -8712124 -6714637 28412 3917719 2288929 -234643 905474 4404374 5976770
12630E976770j685552k644766j726509j474763k180282j806955L17801K078277
$$ 5976770 4291218 1646452 -80057 -1554820 -3735102 -5542057 -5224256 -3145979
12622c145979J574370j07953n72026L70145O65657o44208j947331j574874k10854
$$ -3145979 -1571609 -1679562 -2251588 -1881443 -1215786 -1859994 -3807325 -5382199 -5593053
12613e593053M64833M39907R37489J697424P36224k387043m646607k647921K728805
$$ -5593053 -5128220 -4688313 -3750824 -2053400 -1317176 -3704219 -8350826 -10998747 -8269942
12604h269942O555135N299969P59836k417397k116282k33799O45948K00909k86757
$$ -8269942 -1714807 3585162 4344998 1927601 -188681 -422480 223468 424377 137620
12595A37620Q8520J335096K835043L264728J340204k236068m494302l307367k72900
$$ 137620 226140 1561236 4396279 7661007 9001211 6765143 2270841 -1036526 -1309426
12586a309426J061650l13704j875278j402336N4761L38421j28377Q86810L193983
$$ -1309426 -247776 -561480 -2436758 -3839094 -3784333 -3445912 -3574289 -2687479 506504
12577E06504L368614m66154n004408n307527j174598K687684K878047R18685r4014
$$ 506504 3875118 3408964 -1595444 -6902971 -8077569 -5389885 -2511838 -1593153 -1687167
12568a687167L76672J187090K059933K944240K682518P34449j292937k090907
$$ -1687167 -1310495 -123405 1936528 4880768 7563286 8297735 7004798 4913891
12560D913891k784487m084855l688308j34087L041002J811999j342861p36351
$$ 4913891 2129404 -1955451 -5643759 -5777846 -2736844 -924845 -2267706 -3004057
12552c004057L054727L721100k50300k855587o12047J836103N325k954027k131078
$$ -3004057 50670 3771770 3521470 665883 53836 1889939 1895264 -1058763 -3189841
12543c189841J137432K713977K597283K621753J420554j992559l490541K21591
$$ -3189841 -2052409 661568 3258851 5880604 7301158 5308599 1818058 2039649
12535B039649M276041K157054l171920l559994P01407J669315j994288k736008
$$ 2039649 6315690 8472744 5300824 1740830 2442237 4111552 2117264 -618744
12527f18744J616773K755569l583234q369869k717441P377801R448606K542156
$$ -618744 998029 3753598 170364 -8199505 -10916946 -3539145 5909461 8451617
12519H451617l289827k681291j19859N1479n71130k81696j034441l500398m465253
$$ 8451617 5161790 2480499 2360640 2412119 1840989 1559293 524852 -2975546 -7440799
12510g440799k300007n6018J122M07065L416565N775476L032702l237597o874025
$$ -7440799 -9740806 -9796824 -9795702 -9388637 -5972072 -196596 2836106 -401491 -7275516
12501g275516m845135r070L392482L906552K462308M60515r50347j262874r30177
$$ -7275516 -12120651 -12129721 -8737239 -4830687 -2368379 -1907864 -2858211 -4121085 -5051262
12492e051262o10387k67737K27191K77204m46526q11427M54000K602935L623279
$$ -5051262 -5661649 -5929386 -5702195 -5424991 -5871517 -6682944 -6228944 -3626009 -2730
12483b730K969679J887834J031200l75406k521981l916850l250710j124355R60824
$$ -2730 2966949 4854783 5885983 5510577 2988596 -928254 -4178964 -5303319 -4342495
12474d342495K285526K788144K362619J286917M56806J94697l25667j440873j775396
$$ -4342495 -2056969 731175 3093794 4380711 4837517 5032214 4706547 3265674 1490278
12465A490278j28690K117730K320941K58791j285556k00374K090888K502422K75455
$$ 1490278 1361588 3479318 5800259 6059050 4773494 4573120 6664008 9166430 9441885
12456I441885k176213k499378j375964j251351k460297k325764Q84031M591444
$$ 9441885 7265672 4766294 3390330 2138979 -321318 -2647082 -1763051 2828393
12448B828393M679996J033778k342801k892585k198451k161020j758130K19159
$$ 2828393 7508389 8542167 6199366 3306781 1108330 -1052690 -2810820 -2591661
12440b591661J958523J071613j610083l398312l223131j318995K217981N550183
$$ -2591661 -633138 438475 -1171608 -4569920 -7793051 -9112046 -6894065 -1343882
12432a343882M671538q55800m513923q12614N517705N288909j295406m812480
$$ -1343882 3327656 2471856 -2042067 -2854681 2663024 7951933 6656527 1844047
12424A844047j310366K230425J50605l077926j729257J220840K92119k281392
$$ 1844047 533681 2764106 2914711 -163215 -1892472 -671632 -379513 -2660905
12416b660905q22454L297740L954311O80802j487118j284624k138991m046827
$$ -2660905 -3483359 -185619 3768692 4449494 2962376 1677752 -461239 -4508066
12408d508066k702909K059286M485037J847836j356978r67788R05350P50632o42132
$$ -4508066 -7210975 -5151689 -666652 1181184 -175794 -1143582 -238232 512400 -129732
12399a29732j011376q86027j214962l32997K730513M770814K355394k577619m822868
$$ -129732 -1141108 -2027135 -3242097 -3575094 -844581 3926233 6281627 3704008 -1118860
12390a118860k584733J032503K502763J183655j462580l590992l706407j345122
$$ -1118860 -3703593 -2671090 -168327 1015328 -447252 -4038244 -7744651 -9089773
12382i089773K206759M291327K679017k046472n756415m242501J382496M990819
$$ -9089773 -6883014 -2591687 87330 -1959142 -7715557 -11958058 -10575562 -5584743
12374e584743L277336M66142J589736M156866K288331k933616m731118j883778
$$ -5584743 -2307407 -1841265 -251529 3905337 6193668 3260052 -1471066 -3354844
12366c354844l55052k270498k205713K093009M310533N15631k918288K6777L933167
$$ -3354844 -3709896 -5980394 -8186107 -6093098 -1782565 -1266934 -4185222 -4158445 -225278
12357b25278J197221l695190r90444O712277P028878j945131p437331j861689
$$ -225278 971943 -2723247 -3713691 2998586 10027464 8082333 645002 -1216687
12349a216687N393159L215249m023716m406062K511135N767859L53679n878602
$$ -1216687 4176472 7391721 3368005 -1038057 1473078 7240937 7594616 1716014
12341A716014m702369J106249L395608O30480j402105R17720M269011M076952
$$ 1716014 -2986355 -1880106 1515502 2145982 743877 1661597 5930608 10007560
12333A0007560Q95731j546549k116171k494749k877211j719791J03595m69751
$$ 10007560 10903291 9356742 7240571 4745822 1868611 148820 252415 -217336
12325b17336k928769k530893J887043M452959R60205l631876k444064K283620
$$ -217336 -3146105 -5676998 -3789955 663004 1623209 -2008667 -4452731 -2169111
12317b169111K933079r44676k441979O51287K621935M25347j126226J635513M566683
$$ -2169111 763968 -180708 -2622687 -1971400 650535 1075882 -50344 1585169 6151852
12308F151852K799869j561781l751282l246717j817088L63495K155901L05656
$$ 6151852 8951721 7389940 3638658 391941 -1425147 -1061652 1094249 1399905
12300A399905m229011m523221J862741O705933K833267l792773l091863K799705
$$ 1399905 -2829106 -7352327 -5489586 1216347 4049614 256841 -2835022 -35317
12292c5317L623029j288619k358951K838874M921524q13805n598166j640747M861739
$$ -35317 3587712 2299093 -59858 2779016 7700540 6886735 1288569 -352178 4509561
12283D509561L967824k334095m574787j138637R56390j406215l523596j862397
$$ 4509561 8477385 6143290 1568503 429866 1386256 -19959 -3543555 -5405952
12275e405952Q64912J483981J202080K099831L103012K211763L2175j260365r47353
$$ -5405952 -4541040 -3057059 -1854979 244852 3347864 5559627 5591802 4331437 3384084
12266C384084j42120J971m81613n83036L78633J483590R54202j358778l379207
$$ 3384084 3241964 3243935 2762322 2179286 2557919 4041509 4995711 3636933 257726
12257B57726l454417k211733q55223O13620K132947K472527J214801Q8092L59672
$$ 257726 -3196691 -5408424 -6263647 -5650027 -3517080 -1044553 170248 258340 618012
12248F18012O78892l41816j335107n68024O88075J74491j452847j882642j050236
$$ 618012 1296904 955088 -380019 -948043 -259968 -85477 -1538324 -3420966 -4471202
12239d471202n69502m41157L21951R42021L37670J17674K035326L647807J447770
$$ -4471202 -5040704 -5481861 -5159910 -4217889 -3880219 -3762545 -1727219 1920588 3368358
12230C368358k403170k371725J090683J197129m043466p148162k031784N999494
$$ 3368358 965188 -1406537 -315854 881275 -3162191 -10310353 -12342137 -6342643
12222f342643P270421J330932l240062j388091K695196L293700Q63202p62212
$$ -6342643 927778 2258710 -981352 -2369443 325753 3619453 4482655 3720443
12214C720443q46857j556970l088523k901449p0897K597521K321600L11728k48805
$$ 3720443 2873586 1316616 -1771907 -4673356 -4744253 -2146732 174868 486596 237791
12205B37791P60192L32885k326468l692703j156160K410275K624609L15179J07644
$$ 237791 997983 1330868 -995600 -4688303 -5844463 -3434188 -809579 -494400 -386756
12196c86756K921452M491646K196464j013081j507791j28349K94588l33351l70882
$$ -386756 2534696 7026342 9222806 8209725 6701934 6573585 6868173 6534822 6163940
12187F163940k08568j606984m143655n297574l854484r54793J986404M264647
$$ 6163940 5955372 4348388 204733 -5092841 -8947325 -9902118 -7915714 -3651067
12179c651067M932709L085748l52709k734515k392700m29055P16170l8992j551767
$$ -3651067 1281642 4367390 4014681 1280166 -1112534 -1541589 -825419 -864411 -2416178
12170b416178k044177j113579K23212J312282K547951L606334K547377j340057
$$ -2416178 -4460355 -5573934 -5350722 -4038440 -1490489 2115845 4663222 3323165
12162C323165m910336m347083p44250R69581o90652j542789J232344L839001J473870
$$ 3323165 -1587171 -5934254 -6678504 -5708923 -6399575 -7942364 -6710020 -2871019 -1397149
12153a397149l528871m167028J193556O057095M381200j625054m610078j112508
$$ -1397149 -4926020 -9093048 -7899492 -1842397 2538803 913749 -3696329 -4808837
12145d808837M821136O603648K176902m167645o530295l580046M95709J396044
$$ -4808837 12299 6615947 8792849 4625204 -1905091 -5485137 -4989428 -3593384
12137c593384j24568o9342K442485L445668J09054m000685k915333L037969O460558
$$ -3593384 -3717952 -3787294 -1344809 2100859 2209913 -1790772 -4706105 -1668136 4792422
12128D792422K424151m594297o668509l033812l9814j150172k525109j29544L918700
$$ 4792422 7216573 2622276 -4046233 -7080045 -7119859 -8270031 -10795140 -10924684 -7005984
12119g005984N423082M541802M009385L776507J839284j395321l647056m329462
$$ -7005984 -1582902 2958900 6968285 10744792 12584076 11188755 7541699 3212237
12111C212237m134992k784691n76801J31867j249432j173497K101538L860064
$$ 3212237 -922755 -3707446 -4284247 -4152380 -5401812 -6575309 -4473771 -613707
12103f13707K30877l697917j082262M438730L618921k765493m456158J413615
$$ -613707 -382830 -4080747 -5163009 -724279 2894642 129149 -4327009 -2913394
12095b913394N790666K984462j076578o82839N07621j421713k398092J089496
$$ -2913394 2877272 5861734 4785156 4102317 4609938 3188225 790133 1879629
12087A879629L947561J249643k697257k407248q74156k438360l508530j51553
$$ 1879629 5827190 7076833 4379576 1972328 1098172 -1340188 -4848718 -5000271
12079e000271K361317j285550m434217J620005J0865364R849930j134886q437960
$$ -5000271 -2638954 -3924504 -8358721 -6738716 4126648 13976578 12841692 4403732
12071D403732n814702r18032j62998m46730J361620K553170J736081J714946K188692
$$ 4403732 -1410970 -2329002 -2492000 -2938730 -1577110 976060 2712141 4427087 6615779
12062F615779q46475n873320n907433m68827K617468M12990p21837K297860L366940
$$ 6615779 5769304 -104016 -6011449 -6480276 -3862808 -3449818 -4171655 -1873795 1493145
12053A493145p96447l468207K69334M096580R16120n185784n862445j152559K726406
$$ 1493145 696698 -2771509 -2502175 1594405 2510525 -2675259 -8537704 -9690263 -6963857
12044f963857L130651J483165j321778l706655k240912K607448M553858P91677
$$ -6963857 -3833206 -2350041 -3671819 -7378474 -9619386 -7011938 -2458080 -1666403
12036a666403k486556K14968M591482M007829K02414j199754o72520k027534l976928
$$ -1666403 -4152959 -3937991 653491 4661320 4863734 3663980 2991460 963926 -3013002
12027c013002k795451P0643R70912J260381L728532N353577K016501k683019k192863
$$ -3013002 -5808453 -5737810 -4766898 -3506517 222015 5575592 7592093 4909074 2716211
12018B716211J888822K548616p22448k110627m28319l31344k755367l468025j798508
$$ 2716211 4605033 7153649 6431201 4320574 3892255 3560911 805544 -2662481 -4460989
12009d460989j799707l476651j719225L951187O997140M074377n630o84581J01890
$$ -4460989 -6260696 -9737347 -11456572 -7505385 -508245 3566132 3560502 2875921 2977811
12000B977811l44716k00917K151733L746043J876429j117750j943146j343319
$$ 2977811 2633095 2432178 4583911 8329954 10206383 9088633 7145487 5802168
11992E802168j355002j232307J91632J151405m22009l126083l857268j656436
$$ 5802168 4447166 3214859 3406491 4557896 4135887 1009804 -2847464 -4503900
11984d503900K044554M984501M697471L37708m806232n650601j655764K214216
$$ -4503900 -2459346 2525155 7222626 7560334 2754102 -2896499 -4552263 -2338047
11976b338047K251009K85474m96338k80559n85890p00095P34850K702281L092023
$$ -2338047 -87038 198436 -297902 -578461 -1164351 -1864446 -1129596 1572685 4664708
11967D664708J562656p02752k518840k662988l40572K962073M165126K371956
$$ 4664708 6227364 5524612 3005772 342784 2212 2964285 7129411 9501367
11959I501367j58815j643338k579832k930889j071926K429053L509534J46884
$$ 9501367 9342552 7699214 5119382 2188493 1116567 3545620 7055154 7202038
11951G202038l545712k316287K856452N914477L453929j778145m995589m442984
$$ 7202038 3656326 1340039 4196491 10110968 13564897 11786752 6791163 2348179
11943B348179j877818K81474J285924J815776K019487Q68510j730323l500686
$$ 2348179 470361 751835 2037759 3853535 5873022 6741532 5011209 1510523
11935A510523k539874o02760q46065k741059k677846J59090K422425K132244J499711
$$ 1510523 -1029351 -1632111 -2478176 -5219235 -7897081 -7737991 -5315566 -3183322 -1683611
11926a683611K286261K326035l24281l076828k346692R17200K975991K887146
$$ -1683611 602650 2928685 2604404 -472424 -2819116 -1901916 1074075 3961221
11918C961221K512502K057407k38606l850830n165194k212104K261743L932390
$$ 3961221 6473723 8531130 8292524 4441694 -723500 -2935604 -673861 3258529
11910C258529J729707j587164k835412j474939M31764P47616m78508j390456p17655
$$ 3258529 4988236 3401072 565660 -909279 -477515 270101 -208407 -1598863 -2316518
11901b316518Q46717J713363J132905l02083j256424p40282P22380J293838J74508
$$ -2316518 -1469801 243562 1376467 1074384 -182040 -922322 -199942 1093896 1268404
11892A268404p78489N83207L067798L156400n54l010549k745939l09460J081735
$$ 1268404 489915 1073122 4140920 7297320 7296766 4286217 1540278 1230818 2312553
11883B312553N04336l51011l38296k95621j259027k593022k543203m16676K154453
$$ 2312553 2816889 2465878 2127582 1831961 572934 -2020088 -4563291 -4979967 -2825514
11874b825514K634214N49260j629553j296834J191507L097977K371884p04107
$$ -2825514 -191300 357960 -1271593 -2568427 -1376920 1721057 4092941 3388834
11866C388834m075958n190075k859453J045442L194332L095491L471352M867699
$$ 3388834 -687124 -5877199 -8736652 -7691210 -4496878 -1401387 2069965 6937664
11858F937664L507819k175931o647554m229716J779209L474109J88598j544820
$$ 6937664 10445483 8269552 1621998 -2607718 -828509 2645600 2834198 1289378
11850A289378M45096R15484k488863m288576n04059M196643L857716J39397j568235
$$ 1289378 1734474 2649958 161095 -4127481 -4631540 -434897 3422819 3562216 1993981
11841A993981m36917P53818J132333J142412l34985l379692m557998j748398J524216
$$ 1993981 1557064 2310882 3443215 4585627 4250642 870950 -3687048 -5435446 -3911230
11832c911230J195500r94177j029109P40739J609507J914929K888762K341549
$$ -3911230 -2715730 -3709907 -4739016 -3998277 -2388770 -473841 2414921 4756470
11824D756470j424755m491223k750866N31811j2888j944121Q40263O051252N360391
$$ 4756470 3331715 -1159508 -3910374 -3378563 -3391451 -5335572 -4495309 1555943 6916334
11815F916334j217932m070086O50602M790914J661399l585757l180096J145825
$$ 6916334 5698402 1628316 2278918 7069832 8731231 5145474 1965378 3111203
11807C111203K423950m08644k738303k295245o94881Q13791J887691J118243j985741
$$ 3111203 5535153 5126509 2388206 92961 -601920 211871 2099562 3217805 1232064
11798A232064m501073l375071J76362K692642L199378K991616K569899J725792
$$ 1232064 -3269009 -6644080 -6467718 -3775076 -575698 2415918 4985817 6711609
11790F711609R88490M68796q91775k865434l220550j537452o40483j778198j953908
$$ 6711609 7700099 8168895 7277120 4411686 1191136 -346316 -986799 -2764997 -4718905
11781d718905Q41401L476772K573550L316p72355m53189j256713j783028J30496
$$ -4718905 -3877504 -400732 2172818 2176134 1403779 950590 -306123 -2089151 -1958655
11772a958655K228038J226431r79206m27726J712616J367098q28446r02039P79516
$$ -1958655 269383 1495814 516608 88882 1801498 3168596 2340150 1438111 2217627
11763B217627L83820j607032j068345J433240R82520k254546k267095K245527
$$ 2217627 2601447 994415 -73930 1359310 2341830 87284 -2179811 65716
11755F5716M834306J852956j816890j516275J04842n71785j588865n75594j47310
$$ 65716 4900022 6752978 4936088 3419813 3524655 2952870 1364005 788411 641101
11746F41101k220599k748340J268042M717834J708139m252203n210567p91822
$$ 641101 -1579498 -4327838 -3059796 1658038 3366177 -886026 -6096593 -6888415
11738f888415K663130K721271K478522K759347R29611k301588k539158O17394
$$ -6888415 -4225285 -1504014 974508 3733855 4663466 2361878 -177280 440114
11730D40114K281430L23447j422989j08719J561019M65293j789952j924761R3748
$$ 440114 2721544 3044991 1622002 1513283 3074302 3539595 1749643 -175118 -81370
11721h1370J844773J904208O52937o59640p28978M77861J320137R26304O79644
$$ -81370 1763403 3667611 4320548 3660908 2931930 3409791 4729928 5656232 6335876
11712F335876J044149n35788m746753o400107j181590N807479N715728o43333
$$ 6335876 7380025 6844237 2097484 -4302623 -5484213 323266 6038994 5395661
11704E395661l450960J157548N643319L394849j972519m139480l354595k564952
$$ 5395661 1944701 3102249 8745568 12140417 10167898 6028418 2673823 108871
11696A08871q52888K653618L620654j444782p621571p160739l37304N641186O728836
$$ 108871 -744017 1909601 5530255 4085473 -3536098 -10696837 -11034141 -5392955 1335881
11687A335881N005746L005597J108502K6746M93987N72672k103540n582893n427545
$$ 1335881 6341627 9347224 10455726 10482472 10976459 11549131 9445591 3862698 -1564847
11678a564847j228586K682916L048770O99984k000994l319102k014974J636748
$$ -1564847 -2793433 -110517 2938253 3638237 1637243 -1681859 -3696833 -2060085
11670b060085M776311M623776J783476j310466l761588n347209m450167o09370
$$ -2060085 2716226 7340002 9123478 7813012 4051424 -1295785 -5745952 -6355322
11662f355322K705776K147450j49536K22207K698862K824136j13802j968346n55688
$$ -6355322 -3649546 -1502096 -1651632 -1429425 1269437 4093573 3979771 2011425 1455737
11653A455737J517650J802529J237836J119767P34813n37850j831475k495235
$$ 1455737 2973387 4775916 6013752 7133519 7868332 7330482 5499007 3003772
11645C003772k622578j701904M91032J974411P43379j565290j674217K44594J289397
$$ 3003772 381194 -1320710 -829678 1144733 1888112 322822 -1351395 -1106801 182596
11636A82596R01644Q45071P46999j326200l961094l394811J11427K177448J321778
$$ 182596 1084240 1929311 2676310 1350110 -2610984 -6005795 -5894368 -3716920 -2395142
11627b395142O90919J742008J826298k13092j451474j06761J509872J414269P19268
$$ -2395142 -1704223 37785 1864083 1650991 199517 92756 1602628 3016897 3736165
11618C736165J35522j480650l258457k103136J640878L552307K128142P96333
$$ 3736165 3871687 2391037 -867420 -2970556 -1329678 2222629 4350771 5147104
11610E147104J037898P1591k127611j076557L241374L816638j686252n055283
$$ 5147104 6185002 6256593 4128982 3052425 6293799 10110437 8424185 3368902
11602C368902n56337M285843M70516o718276n468609L293431P226792J920297
$$ 3368902 2812565 7098408 7568924 850648 -4617961 -1324530 5902262 7822559
11594G822559l747594l028696l41058j105236k656852r06845J693535J118062
$$ 7822559 4074965 1046269 705211 -400025 -3056877 -3963722 -2270187 -1152125
11586a152125q37389j63334K247934K624714P63026n07383n19140r55764j745741
$$ -1152125 -1989514 -2152848 95086 2719800 3482826 2975443 2456303 1500539 -245202
11577b45202p41811K269712M116725J859377l309425o689125m852137L58869L674427
$$ -245202 -987013 1282699 5399424 7258801 3949376 -2739749 -7591886 -7233017 -3558590
11568c558590K696413M03267m6325j16684k173922l729235q20971M130142M374743
$$ -3558590 -862177 -458910 -505235 -621919 -2795841 -6525076 -7346047 -3215905 1158838
11559A158838o49905l511394K44487N543594N816963K056568q75722k341095m534907
$$ 1158838 508933 -3002461 -2757974 2785620 8602583 10659151 9783429 7442334 2907427
11550B907427o230240m261970J35477K281879J035201k03752M66604J152560N12506
$$ 2907427 -3322813 -7584783 -7449306 -5167427 -4132226 -4335978 -3869374 -2716814 -2204308
11541b204308k8238L89587L42835p93075j365376n60700L2904m57770m53874R25302
$$ -2204308 -2232546 -1842959 -1500124 -2293199 -3658575 -4219275 -4186371 -4644141 -5098015 -4172713
11531d172713J833848R34429l4273N68291J051141n72651k349397r02718K864152
$$ -4172713 -2338865 -1404436 -1438709 -870418 180723 -391928 -2741325 -3644043 -779891
11522g79891M407784J843153j789372l062734j987913m27159P02669J406211J771284
$$ -779891 3627893 5471046 3681674 618940 -1368973 -1796132 -1093463 312748 2084032
11513B084032K251623L192445L470862J535954j635215l029021j996040j427911
$$ 2084032 4335655 7528100 10998962 12534916 10899701 7870680 5874640 4446729
11505D446729k926221l679513q14157L489819M665583K160849m51272j179941
$$ 4446729 1520508 -2159005 -2973162 516657 5182240 7343089 6891817 5711876
11497E711876j676063l134705l629080j192651K670690M440727K587228j045150
$$ 5711876 4035813 901108 -2727972 -3920623 -1249933 3190794 5778022 4732872
11489D732872l297190k534443P9760J809171J078401j188268l094102l699013
$$ 4732872 1435682 -1098761 -1019001 790170 1868571 680303 -2413799 -6112812
11481f112812k843199m71420K503810L944199K848785R29107R4595k63754j319460
$$ -6112812 -8956011 -9427431 -6923621 -2979422 -130637 798470 893065 629311 -690149
11472f90149j815140j53884J771373P16941k373495l079807q5954K986510L180349
$$ -690149 -2505289 -2659173 -887800 -170859 -2544354 -5624161 -5710115 -2723605 456744
11463D56744J684145M28764q39040k212178k103837m28506J40933j291421j520708
$$ 456744 2140889 2569653 1730613 -481565 -2585402 -3013908 -2872975 -4164396 -5685104
11454e685104J303156L288559K46553m986934n868036j623349K047305J927514
$$ -5685104 -4381948 -1093389 -846836 -5833770 -11701806 -13325155 -11277850 -9350336
11446i350336J353719L369243M924619K019015k671776k723903K333784N818387
$$ -9350336 -7996617 -4627374 297245 2316260 -355516 -3079419 -745635 5072752
11438E072752L723804M50285J136690K844184l99025o257966o023514J409482
$$ 5072752 8796556 9246841 10383531 13227715 12828690 6570724 547210 1956692
11430A956692O232832K284965l305104j849682K559455K64264o855664p429775
$$ 1956692 8189524 10474489 7169385 5319703 7879158 8143422 1287758 -6142017
11422f142017R37410P337747M383038j586486k203702M31969m8532k911803l192555
$$ -6142017 -5204607 2133140 6516178 4929692 2725990 3157959 3109427 197624 -2994931
11413b994931j017918j88790o22429N75391K659409K492017P44852P51690K227586
$$ -2994931 -4012849 -4201639 -4824068 -4248677 -1589268 902749 1647601 2399291 4626877
11404D626877J879165m01587j440839n94893m59734j658194j802811j96130Q70995
$$ 4626877 6506042 6104455 4663616 4068723 3608989 1950795 147984 -48146 822849
11395H22849L33610r4868M62383M83447p13893j348579k69652Q42811R393j959465
$$ 822849 1156459 1061591 1523974 2007421 1293528 -55051 -324703 518108 527501 -1431964
11385a431964k418640k91127K392416K524956m39484l431142l390765j178204
$$ -1431964 -3850604 -4141731 -1749315 775641 336157 -3094985 -6485750 -7663954
11377g663954K83125Q82096K612658M207742J798499l533258m787004Q50935O409874
$$ -7663954 -7380829 -6498733 -3886075 321667 2120166 -1413092 -6200096 -5349161 1060713
11368A060713M648312j425307l577101m18705K229174J004371j536694k372018
$$ 1060713 5709025 4283718 706617 287912 2517086 3521457 1984763 -387255
11360c87255j296171Q64571K652939J501054k708820n139006j902219L354281
$$ -387255 -1683426 -818855 1834084 3335138 626318 -4512688 -6414907 -3060626
11352c060626M261973J297411K01666K187054K859484P21862m71496J116094K334890
$$ -3060626 1201347 2498758 2700424 4887478 7746962 8468824 7997328 9113422 11448312
11343A1448312P20780k153662m181858m737952k878140J308632L826631J171317
$$ 11448312 12169092 10015430 5833572 1095620 -1782520 -473888 3352743 4524060
11335D524060k926034k111073J729001P65002n026417o358907L13405O269729
$$ 4524060 1598026 -513047 1215954 1980956 -3045461 -9404368 -9090963 -2821234
11327b821234L993186j967719l961045k866323l142838l164575P77175N781136
$$ -2821234 1171952 -795767 -4756812 -7623135 -10765973 -13930548 -13153373 -7372237
11319g372237O336931L569634K489293K977049J411520j272520j337648k21863
$$ -7372237 -1035306 2534328 5023621 8000670 9412190 8139670 6802022 6580159
11311F580159k377958o148185n411951l77635K004219l42718j298243K428256
$$ 6580159 4202201 -1945984 -7357935 -7735570 -5731351 -6074069 -7372312 -4944056
11303d944056N293465K460781j844745j504643J475483J025921k488806l163807
$$ -4944056 349409 2810190 965445 -539198 936285 1962206 -526600 -3690407
11295c690407M69520L277922J759980j423922k609310j823004k08961K664687
$$ -3690407 -3220887 57035 1817015 393093 -2216217 -4039221 -4248182 -1583495
11287a583495N757995M778613j965743q394836o782575J474831O638284L251133
$$ -1583495 4174500 8953113 6987370 -1407466 -8190041 -6715210 -76926 3174207
11279C174207l115044m330932m41672K288672J054239r98191j017797j63308k27376
$$ 3174207 59163 -4271769 -4713441 -2424769 -1370530 -2368721 -3386518 -3549826 -3777202
11270c777202m51394N21391J960615K046554K89040k021572k947194j300509K104192
$$ -3777202 -4228596 -3707205 -1746590 299964 589004 -1432568 -4379762 -5680271 -3576079
11261c576079M732477M818426L021009P27349j802745m011679l867124r33453
$$ -3576079 1156398 5974824 8995833 9723182 7920437 3908758 41634 -891819
11253h91819J270281k80798k835604j638776K036702K358996j329517k746844
$$ -891819 378462 97664 -2737940 -4376716 -2340014 18982 -1310535 -4057379
11245d057379J201354M837339K375148k975065m081527o17649J512190q5624j457447
$$ -4057379 -2856025 1981314 4356462 1381397 -2700130 -3317779 -1805589 -1891213 -3348660
11236c348660L00613K398948J381627j252474j705078J58622R91605o59009k444854
$$ -3348660 -3048047 -649099 732528 -519946 -2225024 -2066402 -1074797 -1733806 -4178660
11227d178660k177436q11741M4634J102238L244846M300386J747226k123939k323764
$$ -4178660 -6356096 -7167837 -7123203 -6020965 -2776119 1524267 3271493 1147554 -1176210
11218a176210J080470K399330o80697l007711m09420L076562J795297k065565
$$ -1176210 -95740 2303590 1622893 -1384818 -1794238 1282324 3077621 1012056
11210A012056k399779M43325Q92156j751962k561797l10985N75838j225749j091173
$$ 1012056 -1387723 -944398 -52242 -1804204 -4366001 -4676986 -4101148 -5326897 -6418070
11201f418070K938699N796844L307519j572734m267309m814559m597009k266736
$$ -6418070 -3479371 2317473 5624992 4052258 -215051 -5029610 -9626619 -11893355
11193a1893355K282552M625946J826732k020381j555759J789919K938795J533120
$$ -11893355 -9610803 -4984857 -3158125 -5178506 -6734265 -4944346 -2005551 -472431
11185d72431J174517K088754Q30727k870020m628806j956307J985148K913776
$$ -472431 702086 2790840 3621567 751547 -3877259 -5833566 -3848418 -934642
11177i34642Q06048j080655q76266k4668p17228k414014k169667Q93493L149511
$$ -934642 -128594 -1209249 -2085515 -2110183 -2827411 -5241425 -7411092 -6517599 -3368088
11168c368088J084589k798899k726758J717989M620385K717618M387M31600J248602
$$ -3368088 -2283499 -5082398 -7809156 -6091167 -1470782 1246836 1251223 1682823 2931425
11159B931425j571934n322056m114298J541657M924036K726611r73510j560755
$$ 2931425 1359491 -3962565 -8076863 -6535206 -1611170 1115441 141931 -1418824
11151a418824j35818m36889k456842k497648Q83122L819284J827321l457022n247057
$$ -1418824 -1554642 -1991531 -4448373 -6946021 -6062899 -2243615 -416294 -3873316 -9120373
11142i120373o27020M468345K852892l452285n660659p57870M548501M145283
$$ -9120373 -9747393 -5279048 -2426156 -5878441 -11539100 -12296970 -7748469 -3603186
11134c603186P97656L81704K612491K684231m98364k955405j885596P75734J650293
$$ -3603186 -2805530 -2423826 188665 2872896 2374532 -580873 -2466469 -1690735 -40442
11125d0442L22178o27406O23402K213591Q64819k499076k473409K745102O603243
$$ -40442 281736 -345670 277732 2491323 3356142 857066 -1616343 1128759 7732002
11116G732002K831191m194451n270447o94701P90531k638141k931681K554600
$$ 7732002 10563193 6368742 1098295 403594 1194125 -1444016 -4375697 -1821097
11108a821097M871541j195593o789197k949032M561536N247817J033374R94110
$$ -1821097 3050444 1854851 -4934346 -7883378 -3321842 1925975 2959349 3953459
11100C953459M390346K594497m454186p245229k551677J892886P49647j594146
$$ 3953459 8343805 10938302 6484116 -761113 -3312790 -1419904 -670257 -2264403
11092b264403m31981J663629Q83440j346903k026322j212735N7466J662975K250425
$$ -2264403 -2696384 -1032755 -149315 -1496218 -3522540 -4735275 -4677809 -3014834 -764409
11083g64409J81450k109832l79759L627676L227885k448218n871464k480354K354787
$$ -764409 -582959 -2692791 -3072550 555126 3783011 1334793 -4536671 -7017025 -4662238
11074d662238K289846l04489N26854M187343N068807J652485j928440k455309
$$ -4662238 -2372392 -2676881 -2150027 2037316 7106123 8758608 6830168 4374859
11066D374859r67592K48223L84431k93119j076045j060262l61323m66481j992329
$$ 4374859 3407267 3655490 4039921 3746802 2670757 1610495 1249172 782691 -1209638
11057a209638l104906j767865J222897K926162J576042j658219l843090k971283
$$ -1209638 -4314544 -6082409 -4859512 -1933350 -357308 -2015527 -5858617 -8829900
11049h829900j53200J191135m78384k218332l53294L841683N428242K927147L50483
$$ -8829900 -8983100 -7791965 -8270349 -10488681 -10841975 -7000292 -1572050 1355097 1705580
11040A705580Q03266J948732N69839j625050q12499K095629K090204k215909n724406
$$ 1705580 2508846 4457578 5027417 3402367 2589868 4685497 6775701 4559792 -1164614
11031a164614l647326J799133M388121J981222j663613k812163j927516r60421
$$ -1164614 -4811940 -3012807 1375314 3356536 1692923 -1119240 -3046756 -4007177
11023d007177N7776J372846J323629r11595k546771j024183J155077P9465k432475
$$ -4007177 -3949401 -2576555 -1252926 -2164521 -4711292 -5735475 -4580398 -4500933 -6933408
11014f933408j153472L287385M166711p29038m937319k933198K079733M176442
$$ -6933408 -8086880 -4799495 -632784 -1361822 -6299141 -9232339 -7152606 -2976164
11006b976164L222350K353261J354798j683980n030036n095395j840859J803335
$$ -2976164 246186 2599447 3954245 2270265 -2759771 -7855166 -9696025 -7892690
10998g892690L979459L935721R14742l206795l545935J075478M499881J429354
$$ -7892690 -3913231 22490 937232 -2269563 -5815498 -4740020 -240139 1189215
10990A189215m066606m180937J138860M826587L309002J29814o24027R09847K265588
$$ 1189215 -2877391 -7058328 -5919468 -1092881 2216121 2345935 1721908 2631755 4897343
10981D897343J266492k741279p095361o956805j450234L899370M242452J449330
$$ 4897343 6163835 3422556 -3672805 -10629610 -12079844 -8180474 -3938022 -2488692
10973b488692o16865k112515l524791j465892N040324R203105N463130p37992
$$ -2488692 -3105557 -5218072 -8742863 -10208755 -5168431 4034674 9497804 8759812
10965H759812j113424J929683K51101n077964n584582m16460K556187N18710j180692
$$ 8759812 7646388 9576071 9827172 4749208 -835374 -1251834 1304353 1823063 642371
10956F42371m68362j475217m400803l799208O51470K583754O79097R48510M456544
$$ 642371 174009 -1301208 -5702011 -9501219 -8849749 -6265995 -5586898 -4638388 -181844
10947a81844M388872p70144l018186J048300L579002o24719m715284k007939K653798
$$ -181844 4207028 3436884 418698 1466998 5046000 4421281 -294003 -2301942 351856
10938C51856K387811K6006J139034L251111J596802j088690o0899J918072j71496
$$ 351856 2739667 2765673 3904707 7155818 8752620 7663930 7603031 9521103 9349607
10929I349607l888701l823854j234992n32432n71517J773792L539811L46271m330859
$$ 9349607 5460906 1637052 402060 -130372 -701889 1071903 4611714 4957985 627126
10920F27126l771716Q39676K834095J235677N33406J228434j41441k574825j370710
$$ 627126 -3144590 -2304914 529181 1764858 2298264 3526698 3385257 810432 -560278
10911e60278K672861L396189o24557l887783k980022o47136M61117J397778K518160
$$ -560278 2112583 5508772 4884215 996432 -1983590 -2630726 -2169609 -771831 1746329
10902A746329J582815j485924k998026r40278J868144J841749j183836m730659
$$ 1746329 3329144 1843220 -1154806 -2095084 -226940 1614809 430973 -4299686
10894d299686n974944l281166J807518M811485L462360J116097J545562K645342
$$ -4299686 -10274630 -13555796 -11748278 -6936793 -3474433 -2358336 -812774 1832568
10886A832568L24013l383520k647450K245129M302546L56691m231554l846026
$$ 1832568 2156581 -1226939 -3874389 -1629260 2673286 3029977 -1201577 -5047603
10878e047603k06571J557964L28363j060070o30534J132666K931925L540701K075500
$$ -5047603 -5254174 -3696210 -3367847 -4427917 -5058451 -3925785 -993860 2546841 4622341
10869D622341q93050l150404k844621l16531K372849L213343J669838r20660k482345
$$ 4622341 3729291 578887 -2265734 -2582265 -209416 3003927 4673765 3753105 1270760
10860A270760k117274m74430J594858L317232L154284K73114k737431k000936
$$ 1270760 -846514 -1320944 273914 3591146 6745430 7018544 4281113 2280177
10852B280177J596259K463974j376471m417042j709331L336370M110331M96785
$$ 2280177 3876436 6340410 4963939 546897 -1162434 2173936 6284267 6781052
10844F781052k288981k221305j612670j131535P10398K325227K9337m733542n605524
$$ 6781052 4492071 2270766 658096 -473439 236959 2562186 2591523 -2142019 -7747543
10835g747543q61793L290403K100836o76539L30786K954830J463493l087674l788647
$$ -7747543 -8609336 -5318933 -3218097 -3894636 -3563850 -609020 854473 -2233201 -6021848
10826f021848R02888M091796J180344k682610r53672L319587K303831l100884
$$ -6021848 -5118960 -1027164 153180 -2529430 -3483102 -163515 2140316 -960568
10818i60568l722315K697535O407966P23908o422456m304530L677583N594696
$$ -960568 -4682883 -1985348 4422618 5146526 -1275930 -5580460 -1902877 3691819
10810C691819j63545l734407q07381J787638j46622j045898K606259M332181r86463
$$ 3691819 3528274 -206133 -1013514 774124 627502 -418396 2187863 6520044 5533581
10801E533581o795555m783755J669209L333476l84983k176026Q96547M604707
$$ 5533581 -1261974 -6045729 -4376520 -1043044 -1428027 -3604053 -2707506 1897201
10793A897201N559564M345730J437020l241912o904937n900827j325899J852613
$$ 1897201 7456765 11802495 13239515 9997603 3092666 -2808161 -4134060 -2281447
10785b281447J140157j500896l125062k285927M81348K310308N58059k488201
$$ -2281447 -1141290 -2642186 -5767248 -8053175 -7571827 -5261519 -4703460 -7191661
10777g191661j526868L042241M155627p65426m712984k308488J409770N21577
$$ -7191661 -8718529 -5676288 -1520661 -2286087 -6999071 -9307559 -7897789 -7376212
10769g376212j007237K588944O701854L574724l181912l657124J769252L593508
$$ -7376212 -8383449 -5794505 907349 4482073 1300161 -2356963 -587711 3005797
10761C005797m15646k738749k63442J440007m05769j560763k84458k29568j390247
$$ 3005797 2590151 -148598 -412040 1027967 622198 -938565 -1223023 -1452591 -2842838
10752b842838J020713N817174N097598j936606n570068r68462L848547J611639
$$ -2842838 -1822125 3995049 9092647 7156041 1585973 617511 4466058 6077697
10744F077697k916351k758371n40112j812420m240632k683204Q59336J344481
$$ 6077697 3161346 402975 -137137 -1949557 -6190189 -8873393 -8014057 -6669576
10736f669576N6727J354304L843328K927154p71889k943785k909324k605730j128728
$$ -6669576 -6612849 -5258545 -1415217 1511937 740048 -2203737 -5113061 -7718791 -8847519
10727h847519K701224N034881J755700l404162l126270K189385M850656J403816
$$ -8847519 -6146295 -1111414 644286 -2759876 -5886146 -3696761 1153895 2557711
10719B557711l356853m516202k656803p0273K825276N313109N259148K258076
$$ 2557711 -799142 -5315344 -7972147 -8042420 -5217144 95965 5355113 7613189
10711G613189j324003l549941m307190l456766j070441N73183p65712k924264
$$ 7613189 6289186 2739245 -1567945 -5024711 -6095152 -5521969 -6287681 -9211945
10703i211945j579566K738245M729779K502729M21349J601173K824262N81218
$$ -9211945 -10791511 -8053266 -3323487 -820758 -399409 1201764 4026026 4607244
10695D607244k406393j687968J147816J023973j955421k593344N10219K269339
$$ 4607244 2200851 512883 1660699 2684672 729251 -1864093 -1353874 915465
10687I15465o34122m106625k964848R84613K024279m62384j445568J464989M320655
$$ 915465 281343 -3825282 -6790130 -5805517 -3781238 -4243622 -5689190 -4224201 96454
10678I6454L036689p65407k771237k014306q22088l94355L77799K108032L546471
$$ 96454 3133143 2367736 -403501 -2417807 -3239895 -3634250 -3256451 -1148419 2398052
10669B398052L384945J795402k19466j960451l173524l588489k639864k6992K994825
$$ 2398052 5782997 7578399 7358933 5398482 2224958 -1363531 -4003395 -4030387 -1035562
10660a035562L723145J004531k397567k759723o21835o6375k253610l297974l40917
$$ -1035562 2687583 3692114 1294547 -1465176 -2087011 -2153386 -4406996 -7704970 -8045887
10651h045887L685260M092674O51069l032757m199694k414804J356776M385138
$$ -8045887 -4360627 -267953 383116 -2649641 -6849335 -9264139 -7907363 -3522225
10643c522225L266855j504757m385881j606873L207401M135688J350563l25721
$$ -3522225 -255370 -1760127 -6146008 -7752881 -4545480 -409792 940771 615050
10635F15050M63402L92102k068146m185941l645594j415325Q36175K560943L039121
$$ 615050 1078452 1470554 -597592 -4783533 -8429127 -9844452 -9008277 -6447334 -3408213
10626c408213J696371Q9207K67974J102497j64044k755191k975687m02911J152286
$$ -3408213 -1711842 -1622635 -1354661 -252164 -416208 -3171399 -6147086 -6549997 -5397711
10617e397711Q9366l02972K112068L972245J620143k522580k993936Q14693L875605
$$ -5397711 -5308345 -5611317 -3499249 472996 2093139 -429441 -3423377 -2608684 1266921
10608A266921K609221p09802j921388q89576r29757l094325m122213j475126K134075
$$ 1266921 3876142 3166340 1244952 355376 -574381 -3668706 -7790919 -9266045 -7131970
10599g131970K343838j10446m33583K470690M088278J648965j454524j502087
$$ -7131970 -4788132 -4898578 -5332161 -2861471 1226807 2875772 1421248 -80839
10591h0839k60780r54533k238440j144337Q71753L96673j302543k7840L616819
$$ -80839 -341619 -1296152 -3534592 -4678929 -3807176 -3410503 -4713046 -4740886 -1124067
10582a124067M131038m62651n149750m659861m5471L384654K373617j478115l813893
$$ -1124067 3006971 2544320 -2605430 -7265291 -7310762 -3926108 -1552491 -3030606 -6844499
10573f844499j839723K507700M135476O99356m128735m973633j186162L054226
$$ -6844499 -8684222 -6176522 -2041046 -1341690 -5470425 -10444058 -11630220 -8575994
10565h575994M103190K200251O353m18893P07619J487019R71609P15034K090818
$$ -8575994 -4472804 -2272553 -2266200 -2685093 -1977474 -490455 481154 1196188 3287006
10556C287006L103150J041075k450842l323483j854113j973546l475251j532092
$$ 3287006 6390156 7431231 4980389 1656906 -197207 -2170753 -5646004 -7178096
10548g178096M153951O739720K243155m130348n735677k940255K02833K195759
$$ -7178096 -3024145 3715575 5958730 1828382 -3907295 -6847550 -6644717 -4448958
10540d448958K809499Q88429k365787k922216k67785J157354k46401m97997J981028
$$ -4448958 -1639459 -751030 -3116817 -6039033 -6306818 -5149464 -5395865 -5893862 -3912834
10531c912834L153508J426526O10362J268921j507895p477503q640381k321007
$$ -3912834 -759326 667200 1277562 2546483 1038588 -6438915 -15079296 -17400303
10523a7400303L708870M322755L771989M260013J146575m493283l613624L395885
$$ -17400303 -13691433 -9368678 -5596689 -1336676 -190101 -4683384 -8297008 -4901123
10515d901123L839118m485804o770338K215651O699187j467713o457971J882011
$$ -4901123 -1062005 -5547809 -12318147 -10102496 -3403309 -4871022 -11328993 -9446982
10507i446982P103639l337360j2279199l789285N869545j210586r208911O43812
$$ -9446982 -2343343 -5680703 -17959902 -21749187 -15879642 -17090228 -26299139 -25655327
10499b5655327J0460381j346056j4043017p78711J5232980m79326k3082832q304968
$$ -25655327 -15194946 -16541002 -30584019 -31362730 -16129750 -16609076 -39691908 -47996876
10491d7996876J7097879n623533m4005149N10947J20289483J69207875O3771970
$$ -47996876 -30898997 -36522530 -80527679 -80016732 40272751 209480626 273252596
10484B73252596q2656652j13045633l6633712J6892376j714103k3620722m014540
$$ 273252596 190595944 77550311 40916599 57808975 56094872 32474150 28459610
10477B8459610J5201426j046721k1011594j2096115M964956L045964n174838r40233
$$ 28459610 43661036 42614315 21602721 9506606 14471562 17517526 12342688 11402455
10469A1402455M702401j313478o751188p34027L911624k259350n327652L948873
$$ 11402455 16104856 14791378 8040190 7306163 11217787 8958437 3630785 7579658
10461G579658J0133873J583196p388872k996232L944319M98034m770908r52989
$$ 7579658 17713531 19296727 11907855 8911623 12855942 13353976 8583068 7630079
10453G630079L412748j891668p866104l144874M747566M011981n14388P84936
$$ 7630079 11042827 9151159 1285055 -1859819 2887747 6899728 6385340 7170276
10445G170276L359263q36749o006798k968087L554662L738835o52303k390948
$$ 7170276 10529539 9692790 3685992 717905 4272567 8011402 7359099 4968151
10437D968151k398735m290252m287090J207453O360857N117922J246494j88597
$$ 4968151 2569416 -1720836 -6007926 -4800473 1560384 6678306 7924800 7736203
10429G736203j853100n632198n631892Q31384N862894M013894J660098L949248
$$ 7736203 5883103 250905 -5380987 -4549603 1313291 5327185 6987283 10936531
10421A0936531M338840k188276p367866l104569M018826L910388j041737l065947
$$ 10936531 15275371 13087095 5719229 2614660 6633486 10543874 9502137 6436190
10413F436190k796643m057881l670996J568212N700318K785528k214960k198697
$$ 6436190 3639547 -418334 -4089330 -2521118 3179200 5964728 3749768 1551071
10405A551071K78031o274n56769K041332L559488O05533j193111K219717L938482
$$ 1551071 1829102 1822828 1266059 3307391 6866879 7472412 6279301 8499018 12437500
10396A2437500j903131q379364p373618l170505k663228k192086L036433O684458
$$ 12437500 10534369 2155005 -5218613 -8389118 -11052346 -13244432 -10207999 -3523541
10388c523541K411013k634675j19212L665177J45034l610858K503253J0328032
$$ -3523541 -1112528 -3747203 -3866415 -201238 -56204 -3667062 -1163809 9164223
10380I164223N361328o856330q345272J353300N503652p11242m232728O89853
$$ 9164223 14525551 7669221 -676051 677249 6180901 5469659 1236931 1926784
10372A926784L467670j357287l813294K317118P409620K775160m658493m602578
$$ 1926784 5394454 4037167 223873 2540991 9950611 12725771 8067278 3464700
10364C464700Q43813L424914J911769J24963j426870m013859n689745m090664
$$ 3464700 4308513 7733427 9645196 9770159 8343289 4329430 -1360315 -5450979
10356e450979o77750J807544K670303J929772j59756j157435J131750L882550
$$ -5450979 -6128729 -4321185 -1650882 278890 119134 -1038301 93449 3975999
10348C975999K526468j293397j681180J611859K795469J41076j554872k1599R58832
$$ 3975999 6502467 5209070 3527890 5139749 7935218 8076294 6521422 6499823 7458655
10339G458655q45541k586453k712021l455373m497020j728331M487796P160399
$$ 7458655 6613114 4026661 1314640 -2140733 -6637753 -8366084 -3878288 3282111
10331C282111K817547k591715k359414J733112L244121N5895m329358n570839
$$ 3282111 6099658 3507943 1148529 2881641 6125762 6181657 1852299 -3718540
10323c718540k158624L053510M254599q11859n975982l398002M905106Q786890
$$ -3718540 -5877164 -2823654 1430945 619086 -5356896 -8754898 -3849792 4937098
10315D937098M113279k065946k730617R0351J317236J134435K027866K528208
$$ 4937098 9050377 6984431 4253814 4344165 5661401 6795836 8823702 11351910
10307A1351910k33271m583932n972229l200537N00346J671986k27872k785428
$$ 11351910 11118639 6534707 562478 -2638059 -2137713 -465727 -693599 -3479027
10299c479027k706638N38827L144438J544768j981847k152811J176990K798809
$$ -3479027 -6185665 -5646838 -2502400 -957632 -2939479 -5092290 -3915300 -1116491
10291a116491P27167p97558J091483L019491J464668j236009j184799O45671P75663
$$ -1116491 -389324 -1186882 -95399 2924092 4388760 3152751 1967952 2613623 3389286
10282C389286q09101j396299k60407J250751K665241L807954K913825q16987m025384
$$ 3389286 2580185 1183886 923479 2174230 4839471 8647425 11561250 10744263 6718879
10273F718879k745490J326841K412775j088402m224907k950923J14203M69365
$$ 6718879 3973389 5300230 7713005 6624603 2399696 -551227 -437024 32341
10265C2341r09261L73712M089908M934920J120192j939471K50224L771031J828960
$$ 32341 -876920 -503208 3586700 8521620 9641812 7702341 7952565 11723596 13552556
10256A3552556m887668r055356o882505j847171J637303K810358K248180L51625
$$ 13552556 8664888 -390468 -7272973 -9120144 -7482841 -4672483 -2424303 -2072678
10248b072678p70449R67543L078242J207738k837741k557662K194700L651113
$$ -2072678 -2843127 -1875584 1202658 2410396 -427345 -2985007 -790307 2860806
10240B860806j124015m477830n62717M635863L079001k316044l229236M79255
$$ 2860806 1736791 -2741039 -3303756 1332107 4411108 2095064 -1134172 -654917
10232f54917K046631m11709k331485j340333L78740J467650K522153K869677J807810
$$ -654917 1391714 980005 -1351480 -2691813 -2313073 -845423 1676730 4546407 6354217
10223F354217J181286J645756j68318m866684n512669K260194J0049564O946303
$$ 6354217 7535503 9181259 9012941 4146257 -1366412 893782 10943346 17889649
10215A7889649l251848o909828j316394K240852k530516p671790n106689J012249
$$ 17889649 14637801 7727973 6411579 8652431 6121915 -1549875 -6656564 -5644315
10207e644315K626630J89604m49230J790008K806113L48148l225386m002293l87436
$$ -5644315 -3017685 -2828081 -3277311 -1487303 1318810 1666958 -1558428 -5560721 -5948157
10198e948157M612275N214136k33033n550187m249581J104673K968703M89929
$$ -5948157 -1335882 3878254 3645221 -1904966 -6154547 -5049874 -2081171 -1591242
10190a591242n14831J477242J539216j932887m078960k421849n80327m40209J151166
$$ -1591242 -2106073 -628831 910385 -1022502 -5101462 -7523311 -8103638 -8543847 -7392681
10181g392681M546861M515105k88943l048078N30142M507089K167012k994405
$$ -7392681 -2845820 1669285 1380342 -1667736 -1137594 3369495 5536507 2542102
10173B542102l103019J667621M018132N65048m507037n954692k832975K191308
$$ 2542102 -560917 1106704 5124836 5689884 1182847 -4771845 -7604820 -5413512
10165e413512N505893M969843J693931j300080k663870l011203k038183Q74616
$$ -5413512 92381 5062224 6756155 5456075 2792205 -218998 -2257181 -1382565
10157a382565L215968J484742k442157k668303J501463L816047J013112j912599
$$ -1382565 1833403 3318145 875988 -1792315 -290852 3525195 4538307 2625708
10149B625708k00530K868212J755798k357892l942245j452494J676026K459635
$$ 2625708 2425178 5293390 7049188 4691296 749051 -703443 972583 3432218
10141C432218R01037j400530k395250r39960J247272J201470o64124p47044J871008
$$ 3432218 4333255 2932725 537475 -402485 844787 2046257 1382133 635089 2506097
10132B506097L701738K446606P2892j376010k591005l746579l039218n91800O08689
$$ 2506097 6207835 8654441 8727333 7351323 4760318 1013739 -2025479 -2617279 -2008590
10123b008590m30580j385031j456025k292379k918769m4696M930076O224117L088993
$$ -2008590 -2439170 -3824201 -5280226 -7572605 -10491374 -10536070 -5605994 618123 3707116
10114C707116J200634K077205N4117o153111q532073k555753M210344L840945
$$ 3707116 4907750 6984955 7039072 885961 -7646112 -10201865 -5991521 -2150576
10106b150576J14142L54750K877289K126778l17755j08140K72317l040822n361779
$$ -2150576 -2036434 -1681684 1195605 3322383 3004628 2896488 3168805 127983 -5233796
10097e233796m28499O834846O631355L82090k021967Q89505J266411k431428k682287
$$ -5233796 -5662295 1172551 7803906 8185996 6164029 7053534 8319945 5888517 3206230
10088C206230K258441M025689j260057n964728l935564m2856m19015k324949q25968
$$ 3206230 5464671 9490360 8230303 2265575 -1669989 -1712845 -2131860 -4456809 -5282777
10079e282777K082731K380730J713661K847164K857771j528941o122661m641737
$$ -5282777 -3200046 -819316 894345 3741509 6599280 5070339 -1052322 -5694059
10071e694059J014470L470196J083042q59146N38632K296418K023739J519001
$$ -5694059 -4679589 -1209393 -126351 -985497 -446865 1849553 3873292 5392293
10063E392293K097629J613973j231699l740507l364044j787246j580468j397261
$$ 5392293 7489922 9103895 7872196 4131689 767645 -1019601 -2600069 -3997330
10055c997330J415191M958871M409082k59998l078978o41656K529242P83436l994839
$$ -3997330 -2582139 2376732 6785814 6525816 3446838 2805182 5334424 6117860 2123021
10046B123021n535346k831244o94471j256710j273198J067296K807836J959540
$$ 2123021 -3412325 -6243569 -6938040 -8194750 -9467948 -8400652 -5592816 -3633276
10038c633276R23164J261410N15965k171197k725036R79270L997871J601703k781329
$$ -3633276 -2710112 -1448702 -932737 -3103934 -5828970 -4849700 -851829 749874 -2031455
10029b031455l046427O4330J618461J289621K119369L119127J050388k086938
$$ -2031455 -5077882 -5013552 -3395091 -2105470 13899 3133026 4183414 2096476
10021B096476j503439J383770P86149k920108l354305M66792K111210q62633k701629
$$ 2096476 593037 1976807 2762956 -157152 -3511457 -3044665 -933455 -1796088 -4497717
10012d497717m5612K202845L42801j177349J548134L701179j45978n598134m615051
$$ -4497717 -4543329 -2340484 -1997683 -3175032 -1626898 2074281 1928303 -3669831 -8284882
10003h284882J769030N430440L580714R28175L32767o56614l170374m025510j470152
$$ -8284882 -6515852 -1085412 2495302 3423477 3756244 3099630 -70744 -4096254 -5566406
9994e566406J554246K259169J792840J904026J574054m07577k314100j636543
$$ -5566406 -4012160 -1752991 39849 1943875 3517929 3110352 796252 -840291
9986h40291J211860L348299K662375m02892l285767l146624K41631L236107J882245
$$ -840291 371569 3719868 6382243 5979351 2693584 -453040 -211409 3024698 4906943
9977D906943k934482o110429m605622n62220K623285M213362M438628K242488
$$ 4906943 1972461 -4137968 -8743590 -9305810 -6682525 -2469163 1969465 4211953
9969D211953k160674m917663k632606K338776M422031K062908j188827k452050
$$ 4211953 2051279 -2866384 -5498990 -3160214 1261817 3324725 2135898 -316152
9961c16152k352876j853315n12175J034320R70898R9300J427338M167833L212094
$$ -316152 -2669028 -4522343 -5034518 -4000198 -3029300 -2930000 -1502662 2665171 5877265
9952E877265k350812n650019j864021L376659K107657l387199m395090P8366K400701
$$ 5877265 3526453 -2123566 -3987587 -610928 1496729 -1890470 -6285560 -6207194 -3806493
9943c806493n18100k916512j173911L56987j359491j646583L034499P289601N136827
$$ -3806493 -4324593 -7241105 -8415016 -8058029 -9417520 -11064103 -8029604 -740003 4396824
9934D396824K10893m38935J893598Q76063k954349l188978O09778J634641k527021
$$ 4396824 4607717 4168782 6062380 6938443 3984094 795116 1404894 3039535 512514
9925E12514n663095l002414J885088L783375L121430K418224Q78323k482952m528813
$$ 512514 -5150581 -8152995 -6267907 -2484532 636898 3055122 3933445 1450493 -3078320
9916c078320k356131Q37131o6381l600741l284600K298087O743080M992510L46954
$$ -3078320 -5434451 -4597320 -4663701 -8264442 -11549042 -9250955 -2507875 2484635 2831589
9907B831589j098523O14768P21836j734425k442638N06059K889498J018203k212851
$$ 2831589 1733066 2347834 3069670 1335245 -1107393 -601334 2288164 3306367 1093516
9898A093516k058189M04794M53208k099273k535414R25768M135010L098582j018036
$$ 1093516 -964673 -559879 -106671 -2205944 -4741358 -3815590 319420 3418002 2399966
9889B399966m284009m203344r73773K368200J605893k981281m237080K666948
$$ 2399966 -1884043 -6087387 -7061160 -4692960 -3087067 -6068348 -10305428 -7638480
9881g638480J0396534P533953l637666q407176j374373N383428K193340k611312
$$ -7638480 2758054 10292007 6654341 -1752835 -3127208 2256220 4449560 1838248
9873A838248K273972J0745664Q366005m079236j1473046p084395m4351R69547
$$ 1838248 4112220 14857884 23223889 19144653 7671607 587212 542861 1512408
9865A512408j293607j174008J010130K673418L409810K449380j311679m667198
$$ 1512408 218801 -955207 54923 2728341 6138151 8587531 7275852 2608654
9857B608654k720550K329568K933248j717144m117756j204407R30861j316834
$$ 2608654 -111896 2217672 5150920 3433776 -683980 -1888387 -957526 -2274360
9849b274360k589497Q65383L475206K42650l683969j489475L722559M444812R29184
$$ -2274360 -4863857 -3998474 -523268 -280618 -3964587 -5454062 -1731503 2713309 3642493
9840C642493q40809K38474L04148j228415j301092J28201J75689r51154m83969
$$ 3642493 2801684 3040158 3344306 2115891 814799 943000 1118689 167535 -316434
9831c16434R09829p9190k727313k547315J072175L177087P31471l013257l726362
$$ -316434 593395 514205 -2213108 -4760423 -3688248 -511161 220310 -2792947 -6519309
9822f519309j804685n32538r63083j074272J000802M448927O302354M211628r07821
$$ -6519309 -8323994 -8856532 -9819615 -10893887 -9893085 -5444158 858196 5069824 4162003
9813D162003n141779n032379p72465L986077N150487J649552l060773l827546
$$ 4162003 -979776 -6012155 -6784620 -2798543 2351944 4001496 940723 -2886823
9805b886823K93260M291093L683712P71887N44283K324015J379603j965830k261108
$$ -2886823 -2593563 1697530 5381242 6153129 6697412 9021427 10401030 8435200 6174092
9796F174092R23616Q35833n089226r310457m971565L580253P264331M437687K98678
$$ 6174092 7097708 7933541 2844315 -6466142 -11437707 -7857454 -593123 3844564 4143242
9787D143242j846596k219814o53414K480216L708999P05553k974714k732483m5617
$$ 4143242 2296646 76832 -576582 1903634 5612633 6318186 3343472 610989 565372
9778E65372O69959m61539l52009P53781Q90580J492127L976419M111566k048208
$$ 565372 1235331 773792 421783 1175564 2066144 3558271 7534690 11646256 9598048
9769I598048q842234o968703K042838P081780L647518j211826j894730j776705
$$ 9598048 755814 -6212889 -4170051 2911729 6559247 5347421 3452691 1675986
9761A675986l923205m151058N86124M881572K974785j884803l175351j301868
$$ 1675986 -2247219 -6398277 -5812153 -930581 2044204 159401 -3015950 -4317818
9753d317818r10015j834775k52112L267308L978593O97760k521257k529677k76260
$$ -4317818 -5227833 -7062608 -7314720 -4047412 -68819 628941 -1892316 -4421993 -4698253
9744d698253K085225L183949J739455k098405m747630k475520K997614N883334
$$ -4698253 -2613028 570921 2310376 211971 -4535659 -7011179 -4013565 1869769
9736A869769L812264K01899j688132k904261m864035n131589j066453M374606
$$ 1869769 5682033 5883932 4195800 1291539 -3572496 -8704085 -9770538 -5395932
9728e395932N211159R43625j983006P62208M690767K860778l362926n620327q73928
$$ -5395932 -184773 758852 -1224154 -461946 4228821 7089599 3726673 -1893654 -2767582
9719b767582L787670J731122l254060l083080K075693M450852Q84366k898201
$$ -2767582 1020088 2751210 -502850 -3585930 -1510237 2940615 3824981 926780
9711I26780j701308J806290K343421j61460j905994j278805J41436Q29907N74056
$$ 926780 -774528 1031762 3375183 3213723 1307729 28924 170360 1000267 1574323
9702A574323l60162j305370j528327j516633k167013k203134O04396M720029N279559
$$ 1574323 1214161 -91209 -1619536 -3136169 -5303182 -7506316 -6901920 -2181891 3097668
9693C097668J193910k446725k021096q86516k813404m260970K48505P617972Q801511
$$ 3097668 4291578 1844853 -176243 -1062759 -3876163 -8137133 -7888628 -270656 8530855
9684H530855K005212m110380k581998K788478M207624Q53972j894320j404772
$$ 8530855 10536067 6425687 3843689 6632167 10839791 11693763 9799443 8394671
9676H394671n56853j891641l537172k556916L88139K041527J218784K12567J081637
$$ 8394671 7837818 5946177 2409005 -147911 240228 2281755 3500539 3713106 4794743
9667D794743K319476R43448k789904n063432l405647K49240K626537L145459K954923
$$ 4794743 7114219 8057667 5267763 204331 -3201316 -2952076 -325539 2819920 5774843
9658E774843J880189p58133l375128l490810j710833j173111k652882l318052
$$ 5774843 7655032 6896899 3521771 30961 -1679872 -2852983 -5505865 -8823917
9650h823917j256108J717660L158592L166410K663010J081615j734120l341193
$$ -8823917 -10080025 -8362365 -5203773 -2037363 625647 1707262 -26858 -3368051
9642c368051j462197K072804L115085O55945k156199k590957j382875m72753K8288
$$ -3368051 -4830248 -2757444 357641 1013586 -1142613 -3733570 -5116445 -5589198 -5560910
9633e560910J099706K386310K285143K70114k048087k564543r64611J039655J795927
$$ -5560910 -4461204 -2074894 210249 480363 -1567724 -4132267 -5096878 -4057223 -2261296
9624b261296J552991J593417J924161J254428m60736j335479n79050k59716j906602
$$ -2261296 -708305 885112 2809273 4063701 3602965 2267486 1688436 1428720 -477882
9615d77882l051277m12551M262750N506445J787448k089281j836976P03317J288985
$$ -477882 -3529159 -3941710 321040 5827485 7614933 5525652 3688676 4391993 5680978
9606E680978n35516k175485k472329j922598l07228K133687K655218p54626n060984
$$ 5680978 5145462 2969977 497648 -1424950 -1732178 401509 3056727 2302101 -2758883
9597b758883n400869k058718K99386J11160N10238K861240M190882K824414J410024
$$ -2758883 -8159752 -10218470 -9919084 -9807924 -9297686 -6436446 -2245564 578850 1988874
9588A988874J830942J924456J96435r39025r0041k90372l245779m850808j671739
$$ 1988874 3819816 5744272 5940707 5001682 4911641 4621269 1375490 -3475318 -5147057
9579e147057K343327J784736j234615j058256J423744O97198k926726l410054
$$ -5147057 -2803730 -1018994 -2253609 -3311865 -1888121 -1190923 -4117649 -7527703
9571g527703L85396K629560M68263j877465j097893O14939J541034L513498N847913
$$ -7527703 -7142307 -4512747 -4044484 -5921949 -7019842 -6404903 -4863869 -1350371 4497542
9562D497542L855045k402910n460799j757550J875124n96040m116496j642308
$$ 4497542 8352587 5949677 488878 -1268672 606452 10412 -4106084 -5748392
9554e748392L015498J641023l628525l412333K960236O074464J579249l786458
$$ -5748392 -2732894 -1091871 -4720396 -8132729 -5172493 901971 2481220 -1305238
9546a305238l601190o6565K245103K989796K792637L79600l208907l632933p1758
$$ -1305238 -4906428 -4972993 -2727890 261906 3054543 3434143 225236 -3407697 -3479455
9537c479455K622723J671770J97587K47483r73419l843591k994248L008041O257412
$$ -3479455 -856732 815038 1012625 1260108 286689 -3556902 -6551150 -3543109 2714303
9528B714303J383463m144486j121822N704057M611800l815543p308149j569754
$$ 2714303 4097766 -46720 -1168542 4535515 9147315 5331772 -1976377 -3546131
9520c546131L692844J335703k626718p26283L635254L225127j000945l176435
$$ -3546131 146713 1482416 -1144302 -1870585 1764669 4989796 3988851 812416
9512H12416k683955k793075k617379J283204O865971P864016L076913k016815
$$ 812416 -1871539 -4664614 -7281993 -5998789 867182 8731198 11808111 9791296
9504I791296l479228l076373l261089l232859j803621n9547P86305J111108J085053
$$ 9791296 6312068 3235695 -25394 -3258253 -5061874 -5121421 -4335116 -3224008 -2138955
9495b138955M5049j274220q56620J161780K134754J041788j63141n26530j838589
$$ -2138955 -2093906 -3368126 -4224746 -3062966 -928212 113576 -49565 -576095 -2414684
9486b414684m462926n000823j092845M165546N897799L652345Q55847l23173l46500
$$ -2414684 -6877610 -11878433 -12971278 -8805732 -2907933 744412 1600259 1277086 930586
9477I30586K70209J513710K259299J124099r91386j653132k61071J435974K102517
$$ 930586 1200795 2714505 4973804 6097903 5106517 3453385 3192314 4628288 6730805
9468F730805J957086J145666q14947l455196m885111l614862j59361L108699L421934
$$ 6730805 8687891 9833557 9018610 5563414 678303 -2936559 -3095920 12779 3434713
9459C434713J43704l442753k855674J639304M352284J805407j949932j454650
$$ 3434713 3578417 135664 -2720010 -1080706 3271578 5076985 3127053 1672403
9451A672403J579188J309555k380846l785578j046936J160903J28611o75893J222372
$$ 1672403 3251591 4561146 2180300 -1605278 -2652214 -1491311 -1362700 -2038593 -816221
9442h16221K510174O01671r65853J194180L718257K065468j496185j914188k0603
$$ -816221 1693953 2295624 1329771 2523951 6242208 8307676 6811491 4897303 4876700
9433D876700k52041k122802j351520J680745J970860j580688m458944l959241
$$ 4876700 4624659 2501857 1150337 2831082 4801942 3221254 -1237690 -5196931
9425e196931k056095j21078K864368N563762M120348j223135n085099m569182
$$ -5196931 -7253026 -7374104 -4509736 1054026 5174374 3951239 -1133860 -5703042
9417e703042k300742n3102M042764R043016R001942J918232n220945n824395k809988
$$ -5703042 -8003784 -8056886 -4014122 5028894 14030836 15949068 10728123 4903728 2093740
9408B093740k305323l214089n10710M477820N306586P99378l213631k808015l92375
$$ 2093740 -211583 -3425672 -3936382 541438 5848024 6647402 3433771 625756 233381
9399B33381N93902J01067o13229j179707j032137N26110K443039K821246J665690
$$ 233381 827283 928350 315121 -864586 -1896723 -1370613 1072426 3893672 5559362
9390E559362K22373j444697l244080l063477J15514K769819J218414j943700j246257
$$ 5559362 5781735 4337038 1092958 -1970519 -1855005 914814 2133228 189528 -1056729
9381a056729K735769M022012P73135k235007j625634L50689J168721J548151J617385
$$ -1056729 1679040 5701052 6474187 4239180 2613546 2964235 4132956 5681107 7298492
9372G298492m72692l657537l563433J83254K175745j2153j505475J281245L983331
$$ 7298492 6825800 3168263 -395170 -211916 1963829 1951676 446201 1727446 5710777
9363E710777J657368k729042l524374j512076r64396j375430N16739L246341K748145
$$ 5710777 7368145 4639103 1114729 -397347 -1361743 -2737173 -2220434 1025907 3774052
9354C774052J82287J19038K005266J101232k334836k667309J325296L802901J179796
$$ 3774052 3956339 4075377 6080643 7181875 4847039 2179730 3505026 7307927 8487723
9345H487723k597942k973358j187515n27907j128108j814679k819445l507597
$$ 8487723 5889781 2916423 1728908 1201001 72893 -1741786 -4561231 -8068828
9337h068828j510678K727719M640495K170473m20576O78921K407423K25229l597265
$$ -8068828 -9579506 -6851787 -2211292 -40819 -461395 217526 2624949 2850178 -747087
9328g47087l339798N51868K018004o96118k405693J56059K937519J396556j979859
$$ -747087 -4086885 -3535017 -1517013 -2213131 -4618824 -4462765 -1525246 -128690 -2108549
9319b108549j730910J736001K771404n02210l037152n55434L697981L538617j019820
$$ -2108549 -3839459 -2103458 667946 165736 -2871416 -3426850 271131 3809748 2789928
9310B789928l774070j418143J997988J702307n99688L1798L592755M907132J365217
$$ 2789928 -984142 -2402285 -404297 1298010 698322 730120 4322875 9230007 10595224
9301A0595224l338538m283657r82718L239195M861264K158594l556348p439240
$$ 10595224 7256686 2973029 1990311 5229506 10090770 12249364 8693016 1253776
9293A253776n009061J624090M712996P01752m251068k588434L524486N035563
$$ 1253776 -3755285 -2131195 2581801 3283553 -967515 -3555949 -31463 5004100
9285E004100p90891o321480m572069J265790L445298J050762P914K783283M307150
$$ 5004100 4213209 -2108271 -6680340 -5414550 -1969252 -918490 -910576 1872707 6179857
9276F179857L19963n105525m862326Q18030M574711K334552j705807k243389k48021
$$ 6179857 6499820 1394295 -3468031 -2650001 1924710 4259262 2553455 310066 62045
9267F2045L05640o28939k84601J118365R87299k29091L09400J952399J152185
$$ 62045 367685 -261254 -545855 572510 1559809 1330718 1640118 3592517 4744702
9258D744702j340096l06920M669301O408920P85708n794435n428298m42067J111636
$$ 4744702 3404606 3097686 7766987 14175907 14961615 9167180 3738882 3296815 4408451
9249D408451j604147k121125J556622L720278R13362k502563j826490J034442
$$ 4408451 2804304 683179 2239801 5960079 6873441 4370878 2544388 3578830
9241C578830J870184N92186o42890j825951l501156l903673j781112M22829J16543
$$ 3578830 5449014 6041200 5398310 3572359 71203 -3832470 -5613582 -5190753 -5074210
9232e074210j000244j13852J230966l92029l607669l242778J774253O155857N179105
$$ -5074210 -6074454 -6188306 -4957340 -5349369 -8957038 -12199816 -10425563 -4269706 909399
9223I09399L87595l113204k535609O47141K770363J292522k445589l951071r42939
$$ 909399 1296994 -1816210 -4351819 -3704678 -934315 358207 -2087382 -6038453 -6981392
9214f981392K909259K560849r87109k080964P91339K806391R88999p76182J613623
$$ -6981392 -4072133 -1511284 -2498393 -4579357 -3788018 -981627 7372 -768810 844813
9205H44813N245374M446183m43780l735795k723020n37629n09708j695183j278073
$$ 844813 6090187 10536370 10092590 6356795 3633775 3096146 2586438 891255 -386818
9196c86818J076717K706833J089897k752550m300524o88977M208308L412961l039764
$$ -386818 689899 3396732 4486629 1734079 -2566445 -3255422 952886 4365847 1326083
9187A326083o374604j080312O202430N783566q62798l921764m43311K381619j14640
$$ 1326083 -5048521 -6128833 73597 5857163 4994365 1072601 629290 3010909 2896269
9178B896269l171292j548977K299047L537829K378910J411862M60731j231122
$$ 2896269 -275023 -1824000 475047 4012876 6391786 7803648 8264379 7033257
9170G033257j958640r97028q85820k280000j411649K718020M178544p27777n507198
$$ 7033257 5074617 4077589 3191769 911769 -499880 2218140 6396684 5668907 161709
9161A61709k546428M121071M415380j905885n095205r40270L596483K358352j312615
$$ 161709 -2384719 1736352 6151732 4245847 -849358 -1789628 1806855 4165207 2852592
9152B852592j696342O00989J673666Q86589J0832n43871r88316m72054J055520
$$ 2852592 1156250 1757239 3430905 4317494 4328326 3784455 2796139 2324085 3379605
9143C379605J700726K85520k122813m277277n549310m435204j51536L915584L115301
$$ 3379605 5080331 5365851 3243038 -1034239 -6583549 -11018753 -11170289 -7254705 -4139404
9134d139404j169059k349269J682134N272813L772098r9905j881231j937635k386981
$$ -4139404 -5308463 -7657732 -5975598 -702785 3069313 2969408 1088177 -849458 -3236439
9125c236439k343573p32344L96370j02183Q20660M914908P843628N221129o4016
$$ -3236439 -5580012 -6312356 -5915986 -6018169 -5197509 -282601 7561027 12782156 12718140
9116A2718140k220354j172502q50142j583697p67663P40126l01496k869072k656761
$$ 12718140 10497786 9325284 8475142 6891445 6123782 6863908 6562412 3693340 1036579
9107A036579M36536K011900O11672o39206n05107j547284m032388l960825J48390
$$ 1036579 1473115 3485015 4096687 3457481 2952374 1405090 -2627298 -6588123 -6439733
9098f439733L627996K204044j705352k703244K91710L551597L514220n7979m394013
$$ -6439733 -2811737 -607693 -2313045 -5016289 -4724579 -1172982 2341238 2283259 -2110754
9089b110754n626092k033577L439779N721223L499523L51407p25738q56906j873245
$$ -2110754 -7736846 -9770423 -6330644 -609421 2890102 3241509 2515771 1658865 -214380
9080b14380k625897j379948N75392Q30360k25936m80165j0828o84225k216072
$$ -214380 -2840277 -4220225 -3644833 -2814473 -3040409 -3520574 -3531402 -4215627 -6431699
9071f431699j991971N50162K397434J391822k67447O01451K879648K529591r56255
$$ -6431699 -8423670 -7873508 -5476074 -4084252 -4351699 -3750248 -870600 1658991 702736
9062G02736l161235j252627J487031O37564k398120k701827J61825J593978k81317
$$ 702736 -2458499 -3711126 -2224095 -1586531 -3984651 -6686478 -6524653 -4930675 -5211992
9053e211992j675258J89000K496810K030874M93089O64805J125024m02413j655095
$$ -5211992 -6887250 -6698250 -4201440 -2170566 -1677477 -1012672 112352 -290061 -1945156
9044a945156N59652L588606K052756l110723n056861r77898M108928M862562J918040
$$ -1945156 -1385504 2203102 4255858 1145135 -3911726 -4889624 -780696 4081866 5999906
9035E999906r94720j800466j43953L200418N117964K319442l289246n429549j968668
$$ 5999906 5005186 3204720 3060767 6261185 11379149 13698591 10409345 4979796 3011128
9026C011128J605376L59312k629400j520676K754441L902392Q1731l345364j790539
$$ 3011128 4616504 4975816 2346416 825740 3580181 7482573 7564304 4218940 2428401
9017B428401K331605L516884L55402l772310n537895m561419j960726J406932
$$ 2428401 4760006 8276890 8632292 4859982 -677913 -5239332 -7200058 -5793126
9009e793126M409431N219408L152150Q2031j723187k567226l916539m500379j286991
$$ -5793126 -1383695 3835713 6987863 7069894 5346707 2779481 -1137058 -5637437 -6924428
9000f924428M693106P404546L466573k365583l176691Q50775L515363J589344
$$ -6924428 -2231322 5173224 8639797 6274214 3097523 3948298 7463661 9053005
8992I053005k025602l780893l331085j362700J848618M362028L122224j495284
$$ 9053005 7027403 3246510 -84575 -1447275 401343 4763371 7885595 6390311
8984F390311m944684m138532r89906J148015J535626Q93038n74725j783092l80400
$$ 6390311 1445627 -2692905 -3682811 -2534796 -999170 -106132 -680857 -2463949 -2844349
8975b844349L550461N893554L581080o58470j789350N64634J883301q31572n211905
$$ -2844349 706112 6599666 10180746 9522276 7732926 8297560 10180861 9349289 4137384
8966D137384o667057l586045J381934M365730L863007J347088j126522k811204
$$ 4137384 -2529673 -6115718 -4733784 -368054 3494953 4842041 3715519 904315
8958I04315l385876j944395J255078L330707J828741j286691j727976R96144K792201
$$ 904315 -2481561 -4425956 -3170878 159829 1988570 701879 -1026097 -29953 2762248
8949B762248J044009j654832j319136K178918N195413M236135q43384o189451
$$ 2762248 3806257 2151425 832289 3011207 8206620 12442755 11599371 5409920
8941E409920o775729j892469K922740K259990j879323l183440n99907P31230j372834
$$ 5409920 -1365809 -3258278 -335538 1924452 45129 -3138311 -3738218 -3006988 -4379822
8932d379822k455118N88208L797231K534525j150194k287303n61899P06934N12288
$$ -4379822 -6834940 -6246732 -2449501 85024 -1065170 -3352473 -3914372 -3207438 -2695150
8923b695150M21826P94968Q90994J139750J697353O64767k604771m609623k219150
$$ -2695150 -2273324 -1478356 -587362 552388 2249741 2914508 309737 -4299886 -6519036
8914f519036J917499K900102P17000q87039j035691j760367k384451n54M037628
$$ -6519036 -4601537 -1701435 -984435 -1871474 -2907165 -4667532 -7051983 -7052537 -3014909
8905c014909M201861p38107m602296k103584L791428O225387L354021o38574j838996
$$ -3014909 1186952 448845 -4153451 -6257035 -2465607 3759780 7113801 6475227 4636231
8896D636231o44461J74662q89383k788062l235936j178037J815710L081872J899729
$$ 4636231 3991770 4166432 3277049 488987 -2746949 -3924986 -2109276 972596 2872325
8887B872325J27966m03276M0809K14698j64858o76571j413655k361498k026259
$$ 2872325 3000291 2597015 2637824 2852522 2687664 2011093 597438 -1764060 -3790319
8878c790319J193624N704486P049402L423447r53715j059349J428886L18559n006533
$$ -3790319 -2596695 3107791 10157193 13580640 12626925 11567576 12996462 13315021 8308488
8869H308488p292022k153469M256960L679844k096111m311381k25833M425414
$$ 8308488 1016466 -1137003 3119957 6799801 4703690 392309 166476 4591890
8861D591890N245047L750749J540618k392616o586853o599415k361277M84263
$$ 4591890 9836937 13587686 15128304 12735688 6148835 -450580 -2811857 -2327594
8853b327594o37596j743681m14908L5918j705104j062738L354809M846415l75955
$$ -2327594 -2965190 -4708871 -5123779 -5087861 -6792965 -7855703 -4500894 345521 -30434
8844c0434m869527j116573N553917N019092j638578m735310j383027K237674K255306
$$ -30434 -4899961 -6016534 -462617 4556475 2917897 -1817413 -3200440 -962766 1292540
8835A292540P73930r40053l502839m201111M2762M870626L049142l256326m674092
$$ 1292540 2066470 1126417 -2376422 -6577533 -6534771 -1664145 1384997 -1871329 -6545421
8826f545421L04235L003655o48442l675333l20877M818176N132831J619807j136778
$$ -6545421 -6241186 -3237531 -3885973 -7561306 -7882183 -3064007 2068824 3688631 2551853
8817B551853k054108j789924K72440K982952K802483k40350j643784l97269j112827
$$ 2551853 497745 -1292179 -1019739 1963213 4765696 4525346 2881562 2484293 1371466
8808A371466m891749n777210r47623L356650J990889m50509J779817N107713L050989
$$ 1371466 -3520283 -9297493 -10245116 -6888466 -4897577 -5348086 -3568269 1539444 4590433
8799D590433k221730l580678m54808J872806J765099J824083J956150j83318k916635
$$ 4590433 2368703 -1211975 -1666783 206023 1971122 3795205 5751355 5568037 2651402
8790B651402k136540J316934K533276L80730j720278k310392k924104l036037
$$ 2651402 514862 1831796 4365072 4745802 3025524 715132 -2208972 -5245009
8782e245009m38525L189823L401966K56467j561582o29640n52849k479028k316581
$$ -5245009 -5683534 -2493711 908255 1164722 -396860 -1026500 -1579349 -4058377 -6374958
8773f374958J806689N028873K686570k379494l815538n58488K478436J569483
$$ -6374958 -4568269 460604 3147174 767680 -3047858 -3606346 -1127910 441573
8765D41573j372350j992807P84973L541998K886523J06106n11286J939255L155644
$$ 441573 -930777 -2923584 -2138611 1403387 4289910 4396016 3884730 5823985 8979629
8756H979629r4084m713095n337587j585196K245546L192366J712723r41996l466908
$$ 8979629 8885545 4172450 -1165137 -2750333 -504787 2687579 4400302 3458306 -8602
8747h602l507078m9430L618044L320566P101j705154n52498M27879n9017K42927
$$ -8602 -3515680 -3565110 52934 3373500 3380601 1675447 1122949 1550828 1491811 1734738
8737A734738J958228K238593l46j659493p19008K96713r72358k385761j242536
$$ 1734738 3692966 5931559 5931213 4271720 3552712 3849425 2877067 491306 -751230
8728g51230N89869l02091k730983k310152J463323L702064Q91102l702831l674790
$$ -751230 -161361 -463452 -3194435 -5504587 -4041264 -339200 551902 -3150929 -6825719
8719f825719K255317P821235O240425j334209o709246m549639J294924L476099
$$ -6825719 -4570402 3250833 9491258 8157049 1447803 -3101836 -1806912 1669187
8711A669187P05692k065143j662694j59383P5267J86834J734283L258852K509020
$$ 1669187 2374879 309736 -1352958 -1512341 -1437074 -1250240 484043 3742895 6251915
8702F251915j05091k409961l152756k224831M41K036217J799311o39375k444990
$$ 6251915 6146824 3736863 584107 -1640724 -1640283 395934 2195245 1555870 -889120
8693h89120j609843N17194J665656J659320J288731J79230j905408l142382j626596
$$ -889120 -2498963 -1981769 -316113 1343207 2631938 2811168 905760 -2236622 -3863218
8684c863218J480575L042004J789257p68821k802767l628284k987604q44374J759927
$$ -3863218 -2382643 659361 2448618 1679797 -1122970 -4751254 -7738858 -8583232 -6823305
8675f823305L077693K431038Q72000j19716k5547O09484R26426N99850J96598
$$ -6823305 -3745612 -1314574 -442574 -562290 -587837 21647 948073 1547923 1744521
8666A744521M76342J239197J436416O42187l33784o72262n41405l29258K07491
$$ 1744521 2220863 3460060 4896476 5538663 5204879 4532617 3991212 3661954 3869445
8657C869445J168996J632038O93750q99449j319451m9677J186234N09220j526228
$$ 3869445 5038441 6670479 7364229 6464780 5145329 5095652 6281886 6791106 5264878
8648E264878k361748p74204J145106N68860j934466k805636n72382J707511P85697
$$ 5264878 2903130 2128926 3274032 3842892 1908426 -897210 -1469592 237919 1023616
8639A023616j889279k337712n0994J470936K63144j345217p34187R96564J070812
$$ 1023616 -865663 -3203375 -3254369 -1783433 -1520289 -2865506 -3599693 -2603129 -1532317
8630a532317o29644j528649m0295K460879L374030J616283j388614l005617j814710
$$ -1532317 -2161961 -3690610 -3730905 -1270026 2104004 3720287 2331673 -673944 -2488654
8621b488654J053749L194969L318948J834287m18724k722414l872475k666773
$$ -2488654 -1434905 1760064 5079012 6913299 6494575 3772161 -100314 -2767087
8613b767087L13548K612605K488074Q48209j60846J35758N84542L21579J67206
$$ -2767087 -2453539 159066 2647140 3495349 3334503 3470261 4054803 4376382 4543588
8604D543588J219473K516572J494285k400362n761283m793663l71508K837988
$$ 4543588 5763061 8279633 9773918 7373556 1612273 -3181390 -3552898 -714910
8596g14910K384662L71996q04718j593467k481055j698132J325319L326902J714687
$$ -714910 1669752 2041748 1237030 -356437 -2837492 -4535624 -3210305 116597 1831284
8587A831284q76737o80130Q14660n43104m089605m900131j493148K178217K862461
$$ 1831284 954547 274417 1089077 545973 -3543632 -8443763 -9936911 -7758694 -4896233
8578d896233J525655O9650j238676k250265k480674k523671k596672n02568M615706
$$ -4896233 -3370578 -3300928 -4539604 -6789869 -9270543 -11794214 -14390886 -14893454 -10277748
8569a0277748P825451L786523l908643n958521p18714L363809Q82210k872929
$$ -10277748 -2452297 1334226 -2574417 -8532938 -9251652 -5887843 -5005633 -7878562
8561g878562j356148L278426M989656K980980M52944j326359k426315j473798
$$ -7878562 -9234710 -5956284 -966628 2014352 2467296 1140937 -1285378 -2759176
8553b759176J637656L491548J816424q47038j708596k022713l226634l290784
$$ -2759176 -1121520 2370028 4186452 3339414 1630818 -391895 -3618529 -6909313
8545f909313r23176J244198J709489L112928N909065N219443n96775m811086k354748
$$ -6909313 -7832489 -6588291 -4878802 -1765874 4143191 9362634 8765859 3954773 1600025
8536A600025J673586J196623q5298L418465P070697L242414m334349o011116k494009
$$ 1600025 3273611 4470234 4384936 7803401 14874098 18116512 13782163 7771047 5277038
8527E277038k385563n726372m290548J995471L669389j345229l720822P93903
$$ 5277038 2891475 -2834897 -7125445 -5129974 -1460585 -2805814 -6526636 -5732733
8519e732733M510323K323260N4937K060711K827121j498600m478608q82834L259550
$$ -5732733 -1222410 1100850 1155787 3216498 6043619 4545019 66411 -816423 2443127
8510B443127J347565k123075m67525K703539O36705l558977k300746K889910M203255
$$ 2443127 3790692 1667617 1200092 3903631 4540336 981359 -1319387 1570523 5773778
8501E773778O97791j613542o80151n5735j042041j494568j311970j886948j668497
$$ 5773778 6471569 4858027 4177876 4122141 3080100 1585532 273562 -1613386 -3281883
8492c281883J065220L332825K039499L26810J965220L076457j680674p868243
$$ -3281883 -2216663 1116162 3155661 3482471 5447691 8524148 6843474 -1024769
8484a024769o554307Q82601M192457L81876k680263l30829K031227l85520l789556
$$ -1024769 -7579076 -6696475 -2504018 -2122142 -4802405 -5133234 -3102007 -3487527 -7277083
8475g277083l256081m76978Q15891R12489J157584N10732p30177R59956O096877
$$ -7277083 -10533164 -11010142 -10194251 -9281762 -8124178 -7613446 -8343623 -7383667 -1286790
8466a286790Q787539M347559l301538o485923l528719L91139N12461k601602m667334
$$ -1286790 7500749 11848308 8546770 2060847 -1467872 -1076733 -564272 -3165874 -7833208
8457g833208k432462K546104M853579J620035k949076k599647K309247N520856
$$ -7833208 -10265670 -7719566 -2865987 -1245952 -4195028 -6794675 -4485428 1035428
8449A035428L919723P38295p20156j079840j293156m26701R79463L41470j993443
$$ 1035428 4955151 5693446 4973290 3893450 2600294 2173593 3153056 3494526 1501083
8440A501083k037915J238295L477941J801729p05418n65477N37394n43605k946147
$$ 1501083 -536832 701463 4179404 5981133 5275715 4710238 5247632 4704027 1757880
8431A757880l742864k369163o3393K194322K729702l72682n294315o674094k571469
$$ 1757880 -1984984 -4354147 -4417540 -2223218 506484 133802 -5160513 -11834607 -14406076
8422a4406076K490793M187782L879469M199190L735592N35019k904588l051368
$$ -14406076 -11915283 -7727501 -3848032 351158 4086750 4621769 1717181 -1334187
8414a334187r89389j60107q22939q50081K21965J632433L399707M460747J967130
$$ -1334187 -2323576 -2483683 -3306622 -4156703 -3934738 -2302305 1097402 5558149 7525279
8405G525279l676517o601220l007019K452681L151683J58444p96354O75088O1072
$$ 7525279 3848762 -2752458 -5759477 -3306796 -155113 3331 -793023 -117935 -56863
8396e6863k740485k435000K360552N819119L423165j622880l555530j685663K64376
$$ -56863 -2797348 -5232348 -2871796 2947323 6370488 4747608 1192078 -493585 -229209
8387b29209j25137j783114k467787j348814L95703R50949J03693l69985O59459
$$ -229209 -354346 -2137460 -4605247 -5954061 -5558358 -4607409 -4503716 -4873701 -4214242
8378d214242J633275L61656k578719m049343j770933L152595O693892N168741
$$ -4214242 -2580967 -2219311 -4798030 -8847373 -10618306 -7465711 -771819 4396922
8370D396922m60230m278097k164384K098046J849222k043405k441054J645324
$$ 4396922 3936692 -341405 -2505789 -407743 1441479 -601926 -3042980 -1397656
8362a397656K508741k778413n674197O8571O427628K916992n941938o986755J209537
$$ -1397656 1111085 -1667328 -7341525 -7272954 -845326 2071666 -3870272 -10857027 -9647490
8353i647490P123469M750580N83255K86588M15399k315078l917518j209433J345500
$$ -9647490 -2524021 2226559 2809814 3096402 3511801 1196723 -2720795 -3930228 -2584728
8344b584728n54596k935091p2857N651851P154766K918408j983125l395474j915133
$$ -2584728 -3139324 -6074415 -6147272 -495421 6659345 9577753 7594628 4199154 2284021
8335B284021j82077J56264p74179j427384p00265J73689m75332j268695L84670
$$ 2284021 2101944 2258208 1484029 56645 -643620 -469931 -945263 -2213958 -1829288
8326a829288L024564K258295k070709m754569k760314R79991L048051L646911
$$ -1829288 1195276 3453571 1382862 -3371707 -6132021 -5152030 -2103979 1542932
8318A542932L104734j28464m865375n869970j035101M625293N872657L774508
$$ 1542932 4647666 4519202 -346173 -6216143 -7251244 -2625951 3246706 7021214
8310G021214J750528j35270k628628l540293j389910R46787O62539p05302j428220
$$ 7021214 8771742 8636472 6007844 2467551 1077641 2024428 2686967 1981665 553445
8301E53445l167504n641050l464607M998998J1012181O202176m052920p490643
$$ 553445 -2614059 -8255109 -11719716 -6720718 4291463 10493639 6440719 -1049924
8293a049924k578884J156692o17347j875292J076839L029977M66544j124679K818750
$$ -1049924 -3628808 -2472116 -3089463 -4964755 -3887916 -857939 -391395 -1516074 1302676
8284A302676O478758K318825o039304q419256k934012K421949K617592J668585
$$ 1302676 7781434 10100259 4060955 -4358301 -7292313 -4870364 -2252772 -584187
8276e84187L669551M972051L76837p125635r042070k930179M191225N226140J372151
$$ -584187 3085364 8057415 8434252 1308617 -7733453 -10663632 -6472407 -1246267 125884
8267A25884j581163j785478j833726k541619j516220J571682L103657R66692j845761
$$ 125884 -1455279 -3240757 -5074483 -7616102 -9132322 -7560640 -4456983 -3490291 -5336052
8258e336052j727412M16503J465959J069475J081521J743860J684704P19588j33660
$$ -5336052 -7063464 -6646961 -5181002 -4111527 -3030006 -1286146 398558 1118146 984486
8249I84486o73239j299888j753517j967861k688248l276376j105950M100613P661172
$$ 984486 311247 -988641 -2742158 -4710019 -7398267 -10674643 -11780593 -7679980 -18808
8240a8808N327890n04913m021525l904925l425105l607329j768863K561876N426831
$$ -18808 5309082 4804169 782644 -3122281 -6547386 -10154715 -11923578 -9361702 -3934871
8231c934871M073354Q97480m70341m9285k34601j760839k982470k037566J322526
$$ -3934871 138483 1035963 565622 516337 281736 -1479103 -4461573 -6499139 -5176613
8222e176613N010707N540188J380205m420652o805845m129332O54147L859059
$$ -5176613 -165906 5374282 6754487 2333835 -4472010 -8601342 -7947195 -4088136
8214d088136L946308J116964k897517m630621j837562K729869L804103P07230
$$ -4088136 -141828 975136 -1922381 -6553002 -8390564 -5660695 -1856592 -1149362
8206a149362j588605P9244K386845R37615k913830m355883k313078l13468n81672
$$ -1149362 -2737967 -2658723 -271878 665737 -2248093 -6603976 -8917054 -9230522 -9812194
8197i812194r57446J222190M703087N745923L113523k44418r98153L35658M88008
$$ -9812194 -10769640 -9547450 -4844363 901560 4015083 3770665 2772512 3108170 3596178
8188C596178j605614l168507j857237N28705P91864o89595n55968K453467N675733
$$ 3596178 1990564 -1177943 -3035180 -2506475 -1714611 -2404206 -2960174 -506707 5169026
8179E169026N871711K309269l313742p869441q092170l450814K282076M739906
$$ 5169026 11040737 13350006 10036264 2166823 -5925347 -9376161 -7094085 -2354179
8171b354179L990757L221704L081162J181107k594115m686388l188631o52000
$$ -2354179 1636578 4858282 7939444 9120551 6526436 1840048 -1348583 -2000583
8163b000583K82996L75970P82720L73437j108722q55821K382394M619852J928322
$$ -2000583 -1717587 -1341617 -558897 -185460 -1294182 -2150003 232391 4852243 6780565
8154F780565k971374m230633j413760O80891Q5177o7186J873123K670112j35031
$$ 6780565 3809191 -421442 -1835202 -1154311 -1069134 -1136320 736803 3406915 3271884
8145C271884l450500k978342M38034K381240J180742o96662q73791L31515J533047
$$ 3271884 -178616 -3156958 -2718924 -337684 843058 146396 -727395 -395880 1137167
8136A137167K025705J490316j39196j974774k707031k098379q07265R34990K781610
$$ 1137167 3162872 4653188 4513992 2539218 -167813 -2266192 -3073457 -2138467 643143
8127F43143K918567q0181l868169l988684m1233L064100J860897j036399j722782
$$ 643143 3561710 3481529 -386640 -4375324 -4416557 -1352457 508440 -527959 -2250741
8118b250741q84041r53753o98898J965445M208544J907595k276980j969280J846473
$$ -2250741 -3134782 -4088535 -4787433 -2821988 1386556 3294151 1017171 -952109 894364
8109H94364J379274m559066o989788r78994N526832L951621j504762j599204K703454
$$ 894364 2273638 -2285428 -9275216 -10254210 -4727378 -775757 -2280519 -3879723 -1176269
8100a176269L148253j112901k761358P03161L655812K748045J055872K90308j940846
$$ -1176269 1971984 859083 -1902275 -1199114 2456698 5204743 6260615 6550923 4610077
8091D610077m752367k984667K950341N027364J8974m367928j497546L797143L814183
$$ 4610077 -142290 -3126957 -176616 4850748 4869722 501794 -995752 2801391 6615574
8082F615574J23890j158000o81478l008176o126607l912701K321433M524869O41382
$$ 6615574 6739464 5581464 4899986 1891810 -4234797 -8147498 -5826065 -1301196 -659814
8073f59814k427140m96957J755111j17624k592603q08831K707350K261331j496905
$$ -659814 -3086954 -3583911 -1828800 -1946424 -4539027 -5347858 -2640508 -379177 -1876082
8064a876082k761702J31545K693519J868539K09528O39977J503595M6479k190401
$$ -1876082 -4637784 -4506239 -1812720 55819 265347 905324 2408919 2455398 264997
8055B64997j571477J357597K144939p29168l394001k565015k99869K6935m95969
$$ 264997 -1306480 51117 2196056 1466888 -1927113 -4492128 -4791997 -4765062 -5261031
8046e261031J434667M977621N577725J697702k882148m290544k850376j192427
$$ -5261031 -3826364 1151257 6728982 8426684 5544536 1253992 -1596384 -2788811
8038b788811r13423k089766l611680l216375L43167M593712N483922K728965O5716
$$ -2788811 -3702234 -5792000 -9403680 -12620055 -12276888 -7683176 -2199254 529711 595427
8029E95427k51888L04624M60795J104242J856781J27869l948682n758288k507488
$$ 595427 343539 648163 1108958 2213200 4069981 4197850 249168 -5509120 -8016608
8020h016608K308886M046858L080852K210247J367092o07959j768713K18175K971598
$$ -8016608 -5707722 -1660864 1419988 3630235 4997327 4389368 2620655 2838830 5810428
8011E810428K177913j492102l208098j377984N66807J23706j012865p36689J68918
$$ 5810428 7988341 6496239 3288141 1910157 2476964 2600670 1587805 851116 1020034
8002A020034J09000o97359j204146j205740q45324N9007J316338K052207J635706
$$ 1020034 1129034 431675 -772471 -1978211 -2823535 -2764528 -1448190 604017 2239723
7993B239723K98057j120405j578365o34006O35084O04770m26431l93404J044912
$$ 2239723 2537780 1417375 -160990 -794996 -159912 444858 18427 -374977 669935
7984F69935J342541j060658l829930l701606o14658K960238N036344M780999K236293
$$ 669935 2012476 951818 -2878112 -6579718 -7194376 -4234138 802206 5583205 7819498
7975G819498r27508k521802k907283m012694m498176p59943N328119O086161l93912
$$ 7819498 6891990 4370188 1462905 -2549789 -7047965 -7807908 -2479789 3606372 3212460
7966C212460n055394p11058O178462N217159j519635l504805Q15537K647295j453803
$$ 3212460 -1842934 -2553992 3624470 8841629 7321994 3817189 4632726 7280021 5826218
7957E826218m725430l121949j471023k762720k155247K699654N223942R27704
$$ 5826218 1100788 -2021161 -3492184 -6254904 -8410151 -5710497 -486555 441149
7949D41149l667724j320476L843720L619762n08013p92499L113830L951521r00149
$$ 441149 -3226575 -4547051 -703331 2916431 2408418 1615919 4729749 8681270 7781121
7940G781121n888385o229855l049022Q65291L980503M294516P93279k818312j634833
$$ 7781121 1892736 -4337119 -7386141 -6520850 -2540347 1754169 2547448 -270864 -1905697
7931a905697K665126L435226p70787l893049j871920J698053K097656J35845j102908
$$ -1905697 759429 4194655 3423868 -469181 -2341101 -643048 1454608 1590453 487545
7922D87545j387947j428301M1957L068660L809402l20716n348583n350908p84848
$$ 487545 -900402 -2328703 -2286746 781914 4591316 4270600 -1077983 -6428891 -7213739
7913g213739K434917J360447j045290j392526P005J385527K239532K381178J195892
$$ -7213739 -4778822 -3418375 -4463665 -5856191 -5849186 -4463659 -2224127 157051 1352943
7904A352943n82933q07298P45493J185289j433528m720700m767710j034881L603465
$$ 1352943 770010 -37288 708205 1893494 459966 -4260734 -9028444 -10063325 -6459860
7895f459860O475327O595301L729618j192866n111108n073929j771730J349522
$$ -6459860 15467 6610768 10340386 9147520 4036412 -1037517 -2809247 -1459725
7887a459725K476421K469418J723852n05418k865487j912897K507858N349291
$$ -1459725 1016696 3486114 5209966 4704548 1839061 -73836 2434022 7783313
7879G783313K784830k336761m851107m356070l670726k604767J065285N300510
$$ 7783313 10568143 8231382 3380275 -975795 -4646521 -7251288 -6186003 -885493
7871h85493M884205r2207k871533J65572L717266J723209k998949k921261K589348
$$ -885493 3998712 3906505 1034972 1200544 4917810 6641019 3642070 720809 3310157
$$ [...]
##END NTUPLES=NMR SPECTRUM
##END=
