##TITLE=31Pdec_2a1111TCA
 aceton-d6, 24 sc
 12.11.2021
##JCAMPDX= 6.0         $$ Bruker NMR JCAMP-DX V2.0
##DATA TYPE= NMR SPECTRUM
##DATA CLASS= NTUPLES
##ORIGIN= UXNMR, Bruker Analytische Messtechnik GmbH
##OWNER= root
$$ XWIN-NMR		Version 3.5
$$ Fri Nov 12 11:08:33 2021 Russian Standard Time (UT+4h)  she@DPX200
##.OBSERVE FREQUENCY= 81.013821
##.OBSERVE NUCLEUS= ^31P
##.ACQUISITION MODE= SIMULTANEOUS
##.ACQUISITION SCHEME= undefined
##.AVERAGES= 24
##.DIGITISER RES= 16
##SPECTROMETER/DATA SYSTEM= spect
##.PULSE SEQUENCE= zgpg30
##.SOLVENT NAME= Acetone
##.SHIFT REFERENCE= (INTERNAL, Acetone, 0, 248.564)
##AUDIT TRAIL= $$ (NUMBER, WHEN, WHO, WHERE, WHAT)
$$ ##TITLE= Audit trail, XWIN-NMR		Version 3.5
$$ ##JCAMPDX= 5.01
$$ ##ORIGIN= Bruker BioSpin GmbH
$$ ##OWNER= she
$$ F:/spectra/data/she/nmr/P31/1/pdata/1/auditp.txt
$$ ##AUDIT TRAIL=  $$ (NUMBER, WHEN, WHO, WHERE, WHAT)
(   1,<2021-11-12 11:07:10.75 +0400>,<she>,<DPX200>,
      <created by zg, POWCHK disabled, PULCHK disabled
       configuration hash MD5:
       00 E9 B6 7A A2 85 ED C7 34 08 36 98 17 FE 4E 26
       data hash MD5: 32K
       7E 74 36 3F 47 AA 0B BD CD 41 C7 18 FC F0 1C 30>)
(   2,<2021-11-12 11:07:33.89 +0400>,<she>,<DPX200>,
      <Start of raw data processing
       efp BC_mod = 2 LB = 1 FT_mod = 6 PKNL = 1 PHC0 = -9197.424 PHC1 = 130.2694 SI = 64K 
       data hash MD5: 64K
       67 34 14 CA 7A 0B DB 82 40 27 15 33 80 AE E3 56>)
(   3,<2021-11-12 11:07:50.82 +0400>,<she>,<DPX200>,
      <pk PHC0 = -11.38359 PHC1 = 0 
       data hash MD5: 64K
       44 56 70 0E A2 8E D8 3F 36 4E 90 44 92 13 A8 DA>)
$$ ##END=
$$ 
$$ hash MD5
$$ 5F AB D2 C2 3E F3 A1 49 3F 60 02 93 E1 09 CA 57
##$RELAX= 
##$RELAX= 
##$RELAX= 
##$RELAX= 
##$RELAX= 
##$RELAX= 
##$RELAX= 
##$RELAX= 
$$ Bruker specific parameters
$$ --------------------------
##$DU= <F:/spectra>
##$EXPNO= 1
##$NAME= <P31>
##$PROCNO= 1
##$TYPE= <nmr>
##$USER= <she>
##$AMP= (0..31)
100 100 100 100 100 100 100 100 100 100 100 100 100 100 100 100 100 100 
100 100 100 100 100 100 100 100 100 100 100 100 100 100 
##$AQSEQ= 0
##$AQ_mod= 1
##$AUNM= <au_zg>
##$AUTOPOS= <>
##$BF1= 81.014009
##$BF2= 200.13
##$BF3= 200.13
##$BF4= 200.13
##$BF5= 200.13
##$BF6= 200.13
##$BF7= 200.13
##$BF8= 200.13
##$BYTORDA= 1
##$CFDGTYP= 0
##$CFRGTYP= 5
##$CHEMSTR= <none>
##$CNST= (0..31)
1 1 145 1 1 1 1 1 1 1 1 1 1 1 1 1 1 1 1 1 1 1 1 1 1 1 1 1 1 1 1 1 
##$CPDPRG= <waltz16>
##$CPDPRG1= <>
##$CPDPRG2= <waltz16>
##$CPDPRG3= <>
##$CPDPRG4= <mlev>
##$CPDPRG5= <mlev>
##$CPDPRG6= <mlev>
##$CPDPRG7= <mlev>
##$CPDPRG8= <mlev>
##$CPDPRGB= <>
##$CPDPRGT= <>
##$D= (0..31)
0 1 0 0 0 0 0 0 0 0 0 0.03 2e-05 3e-06 0 0 0 0 0 0 0 0 0 0 0 0 0 0 0 0 
0 0 
##$DATE= 1636700830
##$DBL= (0..7)
120 120 120 11 120 120 24 19 
##$DBP= (0..7)
150 150 150 150 150 150 150 150 
##$DBP07= 0
##$DBPNAM0= <>
##$DBPNAM1= <>
##$DBPNAM2= <>
##$DBPNAM3= <>
##$DBPNAM4= <>
##$DBPNAM5= <>
##$DBPNAM6= <>
##$DBPNAM7= <>
##$DBPOAL= (0..7)
0.5 0.5 0.5 0.5 0.5 0.5 0.5 0.5 
##$DBPOFFS= (0..7)
$$ [...]
##$SUBNAM2= <"">
##$SUBNAM3= <"">
##$SUBNAM4= <"">
##$SUBNAM5= <"">
##$SUBNAM6= <"">
##$SUBNAM7= <"">
##$SUBNAM8= <"">
##$SUBNAM9= <"">
##$SW= 501.771253377433
##$SWIBOX= (0..15)
0 1 3 0 0 0 0 0 0 0 0 0 0 0 0 0 
##$SW_h= 40650.406504065
##$TD= 32768
##$TD0= 1
##$TE= 0
##$TE2= 300
##$TE3= 300
##$TEG= 300
##$TL= (0..7)
0 120 53 12 22 120 120 120 
##$TP= (0..7)
150 150 150 150 150 150 150 150 
##$TP07= 0
##$TPNAME0= <>
##$TPNAME1= <>
##$TPNAME2= <>
##$TPNAME3= <>
##$TPNAME4= <>
##$TPNAME5= <>
##$TPNAME6= <>
##$TPNAME7= <>
##$TPOAL= (0..7)
0.5 0.5 0.5 0.5 0.5 0.5 0.5 0.5 
##$TPOFFS= (0..7)
0 0 0 0 0 0 0 0 
##$TUNHIN= 0
##$TUNHOUT= 0
##$TUNXOUT= 0
##$USERA1= <user>
##$USERA2= <user>
##$USERA3= <user>
##$USERA4= <user>
##$USERA5= <user>
##$V9= 5
##$VALIST= <valist>
##$VCLIST= <CCCCCCCCCCCCCCC>
##$VD= 0
##$VDLIST= <DDDDDDDDDDDDDDD>
##$VPLIST= <PPPPPPPPPPPPPPP>
##$VTLIST= <TTTTTTTTTTTTTTT>
##$WBST= 1024
##$WBSW= 4
##$XGAIN= (0..3)
0 0 0 0 
##$XL= 0
##$YL= 0
##$YMAX_a= 5849
##$YMIN_a= -1885
##$ZGOPTNS= <>
##$ZL1= 120
##$ZL2= 120
##$ZL3= 120
##$ZL4= 120
##$ABSF1= 0
##$ABSF2= 0
##$ABSG= 0
##$ABSL= 0
##$ALPHA= 0
##$AQORDER= 0
##$ASSFAC= 0
##$ASSFACI= 0
##$ASSFACX= 0
##$ASSWID= 0
##$AUNMP= <proc_1d>
##$AZFE= 0.1
##$AZFW= 0.5
##$BCFW= 0
##$BC_mod= 2
##$BYTORDP= 0
##$COROFFS= 0
##$CY= -3
##$DATMOD= 1
##$DC= 0
##$DFILT= <>
##$DTYPP= 0
##$F1P= 0
##$F2P= 0
##$FCOR= 1
##$FTSIZE= 65536
##$FT_mod= 6
##$GAMMA= 0
##$GB= 0
##$INTBC= 1
##$INTSCL= 5.30512e-09
##$ISEN= 30
##$LB= 1
##$LEV0= 0
##$LPBIN= 0
##$MAXI= 10000
##$MC2= 0
##$MEAN= 0
##$ME_mod= 0
##$MI= 50
##$NCOEF= 0
##$NC_proc= -8
##$NLEV= 6
##$NOISF1= 182.463
##$NOISF2= 159.3651
##$NSP= 0
##$NTH_PI= 0
##$NZP= 0
##$OFFSET= 248.5645
##$PC= 4
##$PHC0= -9208.808
##$PHC1= 130.2694
##$PH_mod= 1
##$PKNL= yes
##$PPARMOD= 0
##$PSCAL= 0
##$PSIGN= 0
##$REVERSE= no
##$SF= 81.014009
##$SI= 65536
##$SIGF1= 159.3651
##$SIGF2= -187.1042
##$SINO= 113.3802
##$SIOLD= 16384
##$SREGLST= <1H.CDCl3>
##$SSB= 0
##$STSI= 65536
##$STSR= 0
##$SW_p= 40650.406504065
##$SYMM= 0
##$S_DEV= 0
##$TDeff= 32768
##$TDoff= 0
##$TI= <>
##$TILT= no
##$TM1= 0
##$TM2= 0
##$TOPLEV= 0
##$USERP1= <user>
##$USERP2= <user>
##$USERP3= <user>
##$USERP4= <user>
##$USERP5= <user>
##$WDW= 1
##$XDIM= 65536
##$YMAX_p= 340990525
##$YMIN_p= -427568772
$$ End of Bruker specific parameters
$$ ---------------------------------
##NTUPLES= NMR SPECTRUM
##VAR_NAME=  FREQUENCY,     SPECTRUM/REAL,   SPECTRUM/IMAG
##SYMBOL=    X,             R,               I
##VAR_TYPE=  INDEPENDENT,   DEPENDENT,       DEPENDENT
##VAR_FORM=  AFFN,          ASDF,            ASDF
##VAR_DIM=   65536,         65536,           65536
##UNITS=     HZ,            ARBITRARY UNITS, ARBITRARY UNITS
##FACTOR=    0.620285442955139, 1,           1
##FIRST=     20137.2065510759, 0,            0
##LAST=      -20513.1999529892, 0,           0
##MIN=       -20513.1999529892, -427568772,  0
##MAX=       20137.2065510759, 340990525,    0
$$ Real data points
##PAGE= N=1
##DATA TABLE= (X++(R..R)), XYDATA
$$ [...]
##PAGE= N=2
##DATA TABLE= (X++(I..I)), XYDATA
13021E569742J399293l621872k706392K607614M193533j13511l735286k099518
13013A493603Q11370k82218l734429m466259j929527M06963J372381K671725L797413
13004A41022J714005l137204n261011j480808L564682L336297j222506l017181
12996e362704Q55982N217452M731612R76041j508525k247143l362888l843798
12988d543971j017434L101933K929277k186274n853840l236804K633895N874024
12980b299194N212884L085509N34198k734912n026758l631183J109126N556025
12972A805695O509619L488130j708742n836702n860318j920189K273607L599782
12964B350882K634975J228617n24967k612803l183609j527128m55269j969800
$$ plain form
13021 5569742 6969035 3347163 640771 3248385 7441918 7328407 3593121 1493603
13013 1493603 2304973 2022755 -1711674 -6177933 -8107460 -7700497 -6328116 -3656391 141022
13004 141022 1855027 -1282177 -6543188 -8023996 -4459314 -1123017 -2345523 -5362704
12996 -5362704 -4506722 710730 5442342 6418383 4909858 2662715 -700173 -4543971
12988 -4543971 -5561405 -2459472 469805 -1716469 -7570309 -10807113 -8173218 -2299194
12980 -2299194 2913690 5999199 6533397 3798485 -1228273 -4859456 -3750330 1805695
12972 1805695 8315314 11803444 10094702 4258000 -1602318 -3522507 -1248900 2350882
12964 2350882 4985857 6214474 5689507 3076704 -106905 -1634033 -2089302 -4059102
12956d059102l058228l66322L216614K299482k030174l293741M17815L971448
12948b902208L587191J419755J3336j568911l318211j994963K786168N398307
12940C420464J895789l377651m071109j208510m71392k600525k992224r5973K128241
12931g372890J100723l93065P67571L061966L053844L95905k502566l990490l838519
12922i717521j660288K425868N692460M355264j287518n404825k978225L257432
12914e317353N531379J206524l481386k076854L183202N156119K179131o61885
12906E718877j52978Q03542j013748l916826m441382k278393M14255K000592J709029
12897a157032m34041k329810j225144K019730L193098R35744r58968K94930J956855
$$ plain form
12956 -4059102 -7117330 -7483652 -4267038 -1967556 -3997730 -7291471 -6873656 -2902208
12948 -2902208 684983 2104738 2118074 549163 -2769048 -4764011 -1977843 3420464
12940 3420464 5316253 1938602 -2132507 -3341017 -3812409 -6412934 -9405158 -9501131 -7372890
12931 -7372890 -6272167 -6665232 -5897661 -2835695 218149 614054 -1888512 -5879002 -9717521
12922 -9717521 -11377809 -8951941 -3259481 1095783 -191735 -5596560 -8574785 -5317353
12914 -5317353 214026 1420550 -2060836 -4137690 -954488 4201631 6380762 5718877
12906 5718877 5565899 6369441 5355693 1438867 -3002515 -5280908 -4866653 -2866061 -1157032
12897 -1157032 -1591073 -3920883 -5146027 -3126297 66801 1002545 43577 338507 2295362
12888B295362O18667k000230k062153L60136K268266K529289J893547K85157k197112
12879C990929l480531k280376o78465n51153M8677L030656N544148L858295l51311
12870I130869k632863k545756k454025j724483J553314M593270K727864k206373
12862F441817l443779K66469K876235R53100j651652j257064J17451l09374j358243
12853B634960j307090r63352m49090J948619M898285L658550j901249m798069
12845C721564j014853L545928J867684l361899m482548p09785K116857J449767
12837C132715K80110J89409q05939k825286k729509J97974K188644P02379j717292
12828a386795j545354P15383J929657R07467m48324Q184J798733K227693J42387
$$ plain form
12888 2295362 2914029 913799 -1148354 -788218 1480048 4009337 5902884 6188041 3990929
12879 3990929 510398 -1769978 -2448443 -2999596 -2950919 79737 5623885 9482180 9130869
12870 9130869 6498006 3952250 1498225 -226258 1327056 5920326 8648190 6441817
12862 6441817 2998038 3264507 6140742 7093842 5442190 4185126 4302577 3993203 2634960
12853 2634960 1327870 364518 -84572 1864047 6762332 10420882 8519633 3721564
12845 3721564 2706711 6252639 8120323 4758424 275876 -433909 1682948 3132715
12837 3132715 3412825 3602234 2796295 -28991 -2758500 -2560526 -371882 330497 -1386795
12828 -1386795 -2932149 -2216766 -287109 620358 172034 180218 1978951 4206644 4349031
12819D349031j356402J538771O645086O594692j121830q925308q406690j681716
12811b364366K213014K47693k014579m08899K319107K628119J620621J518471
12803E759181J547897M12173r48555j707173k677765l251276q89611L650501N006434
12794F901806P15321m122458l994979r27126j23314j117811K95977L423027L180123
12785D230566r41055l383280j372646R76562m3211j723167O2074L775063M418770
12776E999676P47634l414787m211558j527282J735028K478934J67765k287408
12768c11998j566241J510201K486777n91502m020887l349322P23884L786664L376091
12759B043667O37964k316788l933954k941606O16504M198285M885194K764523
$$ plain form
12819 4349031 2992629 4531400 11176486 17771178 16649348 7724040 -682650 -2364366
12811 -2364366 -151352 96341 -1918238 -2327137 -8030 2620089 4240710 5759181
12803 5759181 7307078 7719251 6770696 5063523 2385758 -865518 -1755129 1895372 6901806
12794 6901806 7617127 3494669 -500310 -1427436 -1550750 -2668561 -2372584 1050443 4230566
12785 4230566 3289511 -93769 -1466415 -489853 -533064 -2256231 -2194157 1580906 5999676
12776 5999676 6747310 3332523 -879035 -2406317 -671289 1807645 1975410 -311998
12768 -311998 -1878239 -368038 2118739 1527237 -2493650 -5842972 -5119088 -1332424 2043667
12759 2043667 2681631 364843 -3569111 -6510717 -5894213 -1695928 3189266 5953789
12751E953789N11408j74014o4090n63428j886391k995996k445466J68216K984639
12742A488667L410626J549982L0398n42478k721184o628327p160851j067623O242742
12733e398048O620575L13892m728406l985185n29666K063105M098496N354439
12725C809202L046238k420025n284725k179629K447743K862924l0729j834748
12717D16251k001912k612755k509203J180542O494640P416682K110115l994390
12709F499970m987757j455950J117692o40313m238670m614434n29605L624291
12701e224776L584108J170637J284873L855639L820288K598j959500J278530M353213
12692A2165610J055340n654412p755142l653107R30524K208474J976295K081280
$$ plain form
12751 5953789 6465197 6291183 6227093 5663665 3777274 781278 -1664188 -1495972 1488667
12742 1488667 4899293 6449275 6479673 5937195 3216011 -3412316 -10573167 -11640790 -5398048
12733 -5398048 1222527 1536419 -3191987 -7177172 -7706838 -5643733 -1545237 3809202
12725 3809202 6855440 4435415 -849310 -3028939 -581196 2281728 2250999 416251
12717 416251 -1585661 -4198416 -6707619 -5527077 967563 8384245 10494360 6499970
12709 6499970 1512213 56263 1173955 533642 -3705028 -8319462 -8849067 -5224776
12701 -5224776 -1640668 -470031 814842 4670481 8490769 8493367 6533867 7812397 12165610
12692 12165610 13220950 7566538 -188604 -3841711 -2911187 -702713 1273582 3354862
12684C354862J384274m55968j146564L33187J532847L178l417855n781907m746363
12675h940309k47120M618534N332304J122911k859030j640312K711649M120132
12667D218759J122480k053114k362798j052989J47099J170443J376835l77091
12659B189624k643472k487670l51618L31811j069909j495051R3598Q72396n93362
12650e153653j926124j486665q62018r11958J44827K430485K695728k57938k542078
12641g869394p65569K862470M197761K797980Q59724m82978q02341P49230L185928
12632D732811L194266p7012k773883k128181j086179l019109n117692k555399
12624h830378K860879M478285Q99444j869969K85017L677700L145153j4840p55373
$$ plain form
12684 3354862 4739136 4283168 3136604 3469791 5002638 5005816 1587961 -4193946 -8940309
12675 -8940309 -9187429 -4568895 763409 1886320 -972710 -2613022 98627 4218759
12667 4218759 5341239 3288125 925327 -127662 19437 1189880 2566715 2189624
12659 2189624 -453848 -2941518 -3293136 -2961325 -4031234 -5526285 -5432687 -4560291 -5153653
12650 -5153653 -7079777 -8566442 -9428460 -10340418 -10195591 -7765106 -5069378 -5327316 -7869394
12641 -7869394 -8634963 -5772493 -1574732 1223248 2082972 1599994 797653 1546883 4732811
12632 4732811 7927077 7850065 5076182 2948001 1861822 -1157287 -6274979 -8830378
12624 -8830378 -5969499 -1491214 -591770 -2461739 -2176722 1500978 4646131 4631291 3875918
12615C875918J413464J837622j507710m334345k463349J469987J721860j772670
12607B40777l254340j22184L153525K372632k7115Q6496J345723M3301k389330
12598A449485j421480K374878L663570Q56742j846621j620345l91670L8616N51519
12589C654694Q42652j384423n279316o192600k563097J435501K465996K322138
12581d698455L195587L698144K503760J221402P32647p22198l142511l441983
12573f53607j210974k80307j589197q04741L173387M322503o21994n240874l062127
12564e967931K038018K743324J63145Q4915J769719J31691l661973l556724O61424
12555e594392L205434K363616J883084K311236l1706m461385n128925q54622K344061
$$ plain form
12615 3875918 5289382 7127004 5619294 1284949 -1178400 291587 2013447 240777
12607 240777 -3013563 -3135747 17778 2390410 2363295 2449791 3795514 3838815 1449485
12598 1449485 28005 2402883 6066453 6923195 5076574 3456229 3064559 3103175 3654694
12589 3654694 4497346 3112923 -2166393 -8358993 -10922090 -9486589 -7020593 -4698455
12581 -4698455 -1502868 2195276 4699036 5920438 6653085 5930887 2788376 -653607
12573 -653607 -1864581 -2144888 -3734085 -4538826 -1365439 2957064 2335070 -2905804 -5967931
12564 -5967931 -3929913 -1186589 -1023444 -938529 831190 962881 -2699092 -6255816 -5594392
12555 -5594392 -2388958 -25342 1857742 4168978 4137272 -324113 -5453038 -6307660 -3963599
12546c963599J131473l90471J112554K634566J407590L10684J968508L239975
12538G451280Q74535k058182j001450K335595K671435o26977l222113k626244
12530C797879q91636o09675j528461j599332L41119L005277L372814J92142l155589
12521B924538j874376L379434O074031K045794m907786q092272n798494j344327
12513g593458K139543L569585K601964K05561p43701J027987K251277n17470m552760
12504a611472l610981K864724P950286O178286P1144m539449n837982n385029
12496c920473l461869L82764L839874L670681P55555q56853n7002K98572j091664
12487d40415j916035r09443M6581L70475K461873O134719O451616J230294m044770
$$ plain form
12546 -3963599 -2832126 -3222597 -2110043 524523 1932113 2242797 4211305 7451280
12538 7451280 8325815 6267633 5266183 7601778 10273213 9646236 6424123 3797879
12530 3797879 2906243 2296568 768107 -831225 -490106 2515171 5887985 6080127 2924538
12521 2924538 1050162 4429596 10503627 12549421 7641635 -450637 -6249131 -7593458
12513 -7593458 -5453915 -1884330 717634 923195 179494 1207481 3458758 2941288 -1611472
12504 -1611472 -5222453 -2357729 5592557 11770843 11841987 7302538 1464556 -3920473
12496 -3920473 -7382342 -6999578 -3159704 510977 1266532 409679 352677 651249 -440415
12487 -440415 -2356450 -3265893 -3219312 -2848837 -386964 5747755 12199371 13429665 9384895
12478I384895l950643j283666j284492k085452J009046M989835K704580m193400
12470E290703o274582j195713K843908R70836j465384j29621M04340l481222n767855
12461h804590n38017O452630N417007k527434p137439l484583L252332O298372
12453a071722M155258l11439k755156m58323L864711L914745j318577m838463
12445A181034j953544K207984J361992j579180o39932J921722M5043m061072k925573
12436d441526K771068M528535r3303m063702k743457K13818J110240J695071L221698
12427B198442K675840j138727l958711k423686Q55616J979052J291919J228791
12419B708536K098361K533130J532112j323656n229186p371310n559059j457140
$$ plain form
12478 9384895 5434252 4150586 2866094 780642 1789688 6779523 9484103 5290703
12470 5290703 -983879 -2179592 664316 1635152 169768 40147 444487 -3036735 -8804590
12461 -8804590 -9342607 -2889977 2527030 -404 -7137843 -10622426 -7370094 -1071722
12453 -1071722 3083536 2772097 16941 -441382 3423329 7338074 6019497 1181034
12445 1181034 -772510 1435474 2797466 1218286 578354 2500076 2545119 -1515953 -4441526
12436 -4441526 -1670458 2858077 2764774 -1298928 -4042385 -3828567 -2718327 -1023256 2198442
12427 2198442 4874282 3735555 -223156 -2646842 -1791226 187826 1479745 2708536
12419 2708536 4806897 7340027 8872139 7548483 2319297 -5052013 -10611072 -12068212
12411a2068212J606315L046855M098244M342197L089786K039445K160478O92958
12403I008066l685825o270566l294093M06249j335967m793733k104786M623860
12395g446795O184962J814750k21770K352493K850219p20346j835211J481725
12387D460027K319803j836955l615552O98097L677564k77225n173209m296131
12379d043581j060327q42153j067356J843875L892774R56044k445800q21559K521659
12370a066424K176106N19186J800299K711294j370876o288771n279812n53000
12362g351998J127538J05096J174409L213178J685576j623870j442914R71414
12354b141571L82068k242587j811995Q40683R17671l31100K063102N899916M216534
$$ plain form
12411 -12068212 -10461897 -7415042 -3316798 1025399 4115185 6154630 8315108 9008066
12403 9008066 5322241 -948325 -4242418 -3836169 -5172136 -9965869 -12070655 -7446795
12395 -7446795 -1261833 552917 331147 2683640 5533859 4813513 2978302 4460027
12387 4460027 6779830 4942875 1327323 2025420 5702984 5425759 252550 -4043581
12379 -4043581 -5103908 -5946061 -7013417 -5169542 -1276768 -320724 -2766524 -3588083 -1066424
12370 -1066424 1109682 1628868 3429167 6140461 4769585 -1519186 -6798998 -7351998
12362 -7351998 -6224460 -6119364 -4944955 -1731777 -46201 -1670071 -3112985 -2141571
12354 -2141571 -1759503 -4002090 -5814085 -4973402 -4055731 -4386831 -2323729 3576187 7792721
12345G792721j740389l046130K363332O275377L437930j546118l355009l054353
12337G127361k775819j320473J282724J740895n65973j709707j09462O36697j561562
12328B744681l643369l149368k048035k105718j631248N80117K827119M081372
12320b344449N201263N097365J194016m554237o089303k094923J441474L00657
12312a848137k125265j357710J338040K499883J987133J079058n30104k179624
12304a136726j160064K052828K210338k621307o087285k255981M578363N425496
12296A005662m01503m829226l056141P64614J362538K2999R11028L428694K942151
12287B150816j576585m872022k212800L687178N797192K087307k127157k088314
$$ plain form
12345 7792721 6052332 3006202 5369534 11644911 15082841 13536723 10181714 7127361
12337 7127361 4351542 3031069 4313793 6054688 5488715 3779008 3669546 4306243 2744681
12328 2744681 -898688 -4048056 -6096091 -8201809 -9833057 -9252940 -6425821 -2344449
12320 -2344449 2856814 7954179 9148195 4593958 -1495345 -3590268 -2148794 -1848137
12312 -1848137 -3973402 -5331112 -3993072 -1493189 493944 1573002 1042898 -1136726
12304 -1136726 -2296790 -243962 1966376 -654931 -6742216 -8998197 -4419834 1005662
12296 1005662 604159 -4225067 -7281208 -6516594 -5154056 -5131057 -4220029 -791335 2150816
12287 2150816 574231 -4297791 -6510591 -2823413 2973779 5061086 2933929 845615
12279H45615K57014P03899m16811l18477J09296k082882n292550m423479R22330
12270i696045M809246L070012j512953l849971k378847J378427N271551O781097
12262C872517M345490J20901j801706j077650j299983l479310l937068o55110
12254c911919K953594L392066J929426J065743L68255o62212J99273L492463M714190
12245A3540879N27439m767134m754788p03607N35120k532501l993626l35991L973338
12236A489129L455458n52288k667548j128650R88436Q76539p50789j365828K72236
12227F16695K843549L599271J288938j751494j864641Q77964K011615j158770
12219F463127m960806m170209J5214J389307j689845l407668M82092N676017N677152
$$ plain form
12279 845615 1102629 1806528 1389717 1071240 1180536 -902346 -6194896 -10618375 -9696045
12270 -9696045 -4886799 -1816787 -3329740 -7179711 -9558558 -8180131 -2908580 3872517
12262 3872517 8218007 8338908 6537202 5459552 4159569 680259 -3256809 -3911919
12254 -3911919 -958325 2433741 4363167 5428910 5797165 5134953 5334226 8826689 13540879
12245 13540879 14068318 9301184 4546396 3842789 4377909 1845408 -2148218 -2484209 1489129
12236 1489129 4944587 4392299 1724751 596101 1584537 2461076 1710287 344459 616695
12227 616695 3460244 7059515 8348453 6596959 4732318 5610282 7621897 6463127
12219 6463127 1502321 -2667888 -2652674 -1263367 -2953212 -6360880 -5878788 -202771 5474381
12210E474381J265887k061863l298219n364797o583376j496339Q015015J1271605
12202G222294L352251o120847n565795K505990O055002R26438n036436m669424
12194a330527n2758L192516L406748J794709j112838m379304n217362j938414
12186e637230L064789N405720L184971j376946m140394k933444L0022M24291k572909
12177d551130m653579k111970K836901N105643L355573N60113o22830l898J366963
12168A281786J854071J52919k164618j562779J553706J883181k138011m005444
12160c145189N95275M753950L83322p103162n610847M014198Q150145J485855
12152C523547n211841k790095L146245L806209J147042J026183J108406l432181
$$ plain form
12210 5474381 6740268 4678405 1380186 -3984611 -10567987 -12064326 -4049311 7222294
12202 7222294 10574545 4453698 -1112097 1393893 7448895 8375333 3338897 -1330527
12194 -1330527 -1383285 1809231 5215979 7010688 5897850 1518546 -3698816 -5637230
12186 -5637230 -2572441 2833279 6018250 4641304 500910 -2432534 -2402512 -1978221 -4551130
12177 -4551130 -9204709 -11316679 -8479778 -3374135 -18562 541551 -81279 -85177 1281786
12168 1281786 3135857 3288776 1124158 -438621 1115085 2998266 860255 -3145189
12160 -3145189 -2549914 2204036 2587358 -4515804 -10126651 -6112453 2037692 3523547
12152 3523547 -1688294 -4478389 -1332144 2474065 3621107 4647290 5755696 2323515
12144B323515q018117m291844M998663Q056544J191503o015641n055872K70417
12136f540832J280823k736974m798730r81961M495371N811805L435918K339886
12128B305306L701861K998971k019767o195905m224425N91185J185469j970200
12120c627505k161861J788754L894163K117468J646072M189449L662655k525883
12112H983312p000818l869957J440999J513965j140593k37162K507547J581600
12104C778893j211501k49177K707571J340623l288833m044351n7876K205317J66358
12095A347024k039973k318779k939645l337554J16835N672780O613110K173545
12087E287343p71555O89618J260891k019562m119431j404979J672474O14594j786474
$$ plain form
12144 2323515 -5694602 -9986446 -4987783 3068761 4260264 -1755377 -6811249 -6540832
12136 -6540832 -5260009 -7996983 -12795713 -13777674 -9282303 -3470498 -34580 2305306
12128 2305306 6007167 9006138 6986371 790466 -3433959 -2842774 -1657305 -3627505
12120 -3627505 -5789366 -4000612 -106449 2011019 3657091 7846540 11509195 8983312
12112 8983312 1982494 -1887463 -446464 1067501 -73092 -310254 2197293 3778893
12104 3778893 2567392 2318215 5025786 6366409 3077576 -966775 -1024651 1180666 1347024
12095 1347024 -692949 -3011728 -5951373 -9288927 -9172092 -3499312 3113798 5287343
12087 5287343 4515788 5205406 6466297 4446735 327304 -1077675 594799 1209393 -577081
12078e77081j679145q67682j556645r66708K581326M436169J239805k040036r0608
12069D79395L153408J256059k981094k012767L180396M355072l50659l698512
12061C381298j256177K525489K414420m47923k290996k110974p48087J038248
12053B505298J705510O6238j702113m21390K209542J223733l301574n436008k652382
12044e803146L17273k33550j018392J664830M856817L879433K62533j041716N30324
12035C414406J722340J585839J481050P18448k065900m353879k529447J242254
12027A215111J173771k573077k988806K942635Q472814O069943k021267o731495
12019E559629l483365L382161O560214L212708l197197o562473l919622J408966
$$ plain form
12078 -577081 -2256226 -3123908 -4680553 -5647261 -3065935 1370234 2610039 570003 479395
12069 479395 3632803 4888862 1907768 -104999 3075397 7430469 7079810 3381298
12061 3381298 2125121 4650610 7065030 6617107 4326111 2215137 1467050 2505298
12053 2505298 4210808 4277046 2574933 2153543 4363085 5586818 2285244 -3150764 -5803146
12044 -5803146 -5485873 -5719423 -6737815 -5072985 -216168 3663265 3925798 2884082 3414406
12035 3414406 5136746 6722585 8203635 8922083 6856183 2502304 -27143 1215111
12027 1215111 2388882 -184195 -3173001 -230366 8242448 14312391 12291124 5559629
12019 5559629 2076264 5458425 12018639 15231347 12034150 5471677 1552055 2961021
12011B961021L251739l00442m783936n075730j155582L057750M501282K925229
12003E381331n6937j990667j173998J104460J457335j052185l279738k619703
11995b230102q20133p63434j815431j521076j4653P92912R74158J784760K191204
11986a421795K37994k656662k923594l42565J802668K337848L479441N454728
11978E968063M562903q83783o496534p031398l225390j69266m20993j808583j370619
11969a0875600J131229L637903M044110J977161p30832j623100j96430J806070
11961h29489K983472L749497M472616L891159R86209k765098m837678m679425
11953B971263l575522k079119L05195K770659K869372r0449k875315j864487J542324
$$ plain form
12011 2961021 6212760 5912318 1128382 -3947348 -5102930 -2045180 2456102 5381331
12003 5381331 5324394 3333727 2159729 3264189 4721524 3669339 389601 -2230102
11995 -2230102 -3050235 -3813669 -5629100 -7150176 -7164829 -6371917 -5397759 -3612999 -1421795
11986 -1421795 -1183801 -3840463 -6764057 -7106622 -5303954 -2966106 513335 5968063
11978 5968063 10530966 9647183 3150649 -3880749 -7106139 -7275405 -7696398 -9504981 -10875600
11969 -10875600 -9744371 -6106468 -2062358 -85197 -816029 -2439129 -2635559 -829489
11961 -829489 2153983 5903480 10376096 14267255 15253464 12488366 7650688 2971263
11953 2971263 -604259 -2683378 -2378183 392476 3261848 3171399 296084 -1568403 -26079
11944b6079J822395l018396p257464m175934M212116Q602889M414771k204030
11936B370268l063350J395719M417779L046528M18560q94060j979847l432105
11928B279492l452258j917248j761903l737381l706920J410148P759528Q494102
11920E367560K446743m431380o197035l056838J39975P5929j485901n87749L047973
11911d680723M895880J722376l168894l901032k35901K287405P28402j283253
11903c635740J23654K849590K358129j177404l165738j159994K173980K972987
11895A339464Q96208r93686l38598J385612P19329k576107m118566q49626L451341
11886a084629K612602k565291m600037k89157M062990J838950l927933m894891
$$ plain form
11944 -26079 1796316 -1222080 -8479544 -12655478 -8443362 159527 4574298 2370268
11936 2370268 -693082 702637 5120416 8166944 8585504 7691444 5711597 2279492
11928 2279492 -1172766 -3090014 -4851917 -8589298 -12296218 -10886070 -3126542 5367560
11920 5367560 7814303 3382923 -2814112 -5870950 -5730975 -5655046 -7140947 -7728696 -4680723
11911 -4680723 215157 1937533 -1231361 -5132393 -5368294 -3080889 -2352487 -3635740
11903 -3635740 -3512086 -662496 1695633 518229 -2647509 -3807503 -1633523 1339464
11895 1339464 2235672 1241986 903388 2289000 3008329 432222 -3686344 -4535970 -1084629
11886 -1084629 1527973 -1037318 -5637355 -5926512 -1863522 -24572 -3952505 -8847396
11878h847396P77626O494172O562667K425398j355391l118305l907314m056134
11870e024677k896441r61164M6624j65471K40949K274775L766895J996255j747650
11861b469905k855765N27428M660164N059817J870868j679940l715582l848890
11853b451805j450245K534909M217784J502501j701555p70658K075920J319522
11845E276373k362392l255725p08587J4183k156117j827625K364829L770799j167465
11836e1727n763255l174695K975957N013065K813945J466772J504811m40362l606529
11827G37982l479767M21820L489704K810330J74970j527456j106801J065333K932908
11818E519023J968867r64871j716366N74251J259870j749596l172328O68500L670373
$$ plain form
11878 -8847396 -8069770 -1575598 4987069 7412467 6057076 2938771 -968543 -5024677
11870 -5024677 -7921118 -8882282 -8835658 -9001129 -8760180 -6485405 -2718510 -722255 -2469905
11861 -2469905 -5325670 -4798242 -138078 4921739 6792607 5112667 1397085 -2451805
11853 -2451805 -3902050 -1367141 2850643 4353144 2651589 1880931 3956851 5276373
11845 5276373 2913981 -341744 -1050331 -1036148 -3192265 -5019890 -2655061 1115738 -51727
11836 -51727 -5814982 -8989677 -6013720 -1000655 1813290 3280062 4784873 4344511 737982
11827 737982 -2741785 -2319965 1169739 3980069 4155039 2627583 1520782 2586115 5519023
11818 5519023 7487890 6523019 4806653 5380904 6640774 4891178 1718850 2387350 6057723
11809F057723j130710q822047q578280m6542O509995N844712L038320K175326
11801E048497L88721l480091m159327N75414L667162j072733q180454p372520
11793a4585331J764377Q906752O479290j371124m883860q26394M137864K519590
11785B141164l690912n357574P11048O300569L394545l679616m677738J103539
11777c754975M601451J509830k401446k141676n62645r33204o24128K635635M924603
11768C253445K451312j541830k067224j88890K98434L7217J686746L456654J694024
11759I079888j987855k653462j94653O78985j400420k288058L97499K984768J279391
11750E896083l121498n034497k552045Q94334J249619j042083j837557Q62271
$$ plain form
11809 6057723 4927013 -3895034 -12473314 -12519856 -6009861 -165149 2873171 5048497
11801 5048497 5437218 1957127 -2202200 -1626786 2040376 967643 -7212811 -14585331
11793 -14585331 -12820954 -3914202 2565088 1193964 -3689896 -4516290 -378426 2141164
11785 2141164 -1549748 -6907322 -6196274 104295 3498840 -180776 -4858514 -3754975
11777 -3754975 846476 2356306 -45140 -2186816 -2749461 -3682665 -4306793 -1671158 3253445
11768 3253445 5704757 4162927 2095703 1906813 2205247 2242464 3929210 7385864 9079888
11759 9079888 7092033 4438571 4243918 4922903 3522483 1234425 1631924 4616692 5896083
11750 5896083 2774585 -2259912 -4811957 -3917623 -2668004 -3710087 -5547644 -4685373
11742d685373L690484K456978j402014k468138N93019L025339J526879q28012
11734A909162k27837J524076O01639k149106l088464k072450j650120j650554
11726f803654j47065J279381n51452l408867j387429M979158P321283J388465
11718B669820n882827o036265o57661K662583J917919J086343J254951n60126
11710c545263l614879k466708L716957P776940M533570j448214l012587o87423
11702A252393J92554q75460J8140K743158K684399q22364k743544r36420Q8879
11693A601735k788470n339629k638771K793496M791536K537097L75553L53943
11685A686490K47224j312222k442090j620207k88458m96371j845160j837880J281258
$$ plain form
11742 -4685373 -994889 1462089 60075 -2408063 -1815044 1210295 2737174 1909162
11734 1909162 1681325 3205401 3807040 1657934 -1430530 -3502980 -5153100 -6803654
11726 -6803654 -6950719 -5671338 -6222790 -9631657 -11019086 -6039928 1281355 2669820
11718 2669820 -3213007 -9249272 -9906933 -7244350 -5326431 -4240088 -2985137 -3545263
11710 -3545263 -7160142 -9626850 -5909893 1867047 6400617 4952403 1939816 1252393
11702 1252393 1444947 569487 587627 3330785 6015184 5192820 2449276 1512856 1601735
11693 1601735 -1186735 -6526364 -9165135 -6371639 -1580103 956994 1332547 1686490
11685 1686490 1933714 621492 -1820598 -3440805 -3729263 -4225634 -6070794 -7908674 -6627416
11676f627416N999793P949979M348773j793779m436038k200481N2897j180555
11668B113173l082835k026913K50135M08212j53562J828565M786098M389635Q39709
11659I352217j725453k197489l001190m063208k454618J403082L120705J252853
11651A686899n77433r8133K91590j182396j971478J95662L004247L139765J193507
11642E682230j50334n28381j438115k804175k792914p53626J430699J342627r48173
11633i60162k313989j54168L385335L268836j167089m251273k037703J445930
11625b784283N54620k720714k120801K252162L878848K19182l799041l766900
11617h286927j085680J278270K755586L167068J790659L1602M05163J833036Q21548
$$ plain form
11676 -6627416 -627623 7322356 11671129 9877350 5441312 3240831 3293728 2113173
11668 2113173 -969662 -2996575 -2746440 -2338228 -2491790 -663225 4122873 8512508 9352217
11659 9352217 7626764 5429275 2428085 -1635123 -4089741 -2686659 434046 1686899
11651 1686899 1109466 1011333 1302923 120527 -1850951 -1655289 1348958 4488723 5682230
11642 5682230 5531896 5003515 3565400 761225 -2031689 -2785315 -1354616 -11989 -960162
11633 -960162 -3274151 -3428319 -42984 3225852 2058763 -2192510 -4230213 -2784283
11625 -2784283 -2229663 -4950377 -7071178 -4819016 -940168 -720986 -4520027 -8286927
11617 -8286927 -9372607 -8094337 -5338751 -2171683 -381024 -349422 55741 1888777 2710325
11608B710325k053116k429208L01986J926628J020729R40754K556467K214266
11600G188831n46748p26740L161402N155975J329730l576000l996607j723721
11592F266122q80564o78780R57769J898116j7888k051433j567593j193878l245751
11583e13880m144752p76155K713375J569293j028002R9517K289919O3597l820118
11574c547206k304939L213131M429675j17358k907270j800L606142L367134J546132
11565G283641J216045J059323l73092j157982j85800J03258j706644l019350j694255
11556A525144K85672K54784j271583k400861k637843k072202m81277J377249K048515
11547c372402J686533J516591J067478p07998j892562L62702M036368L614044
$$ plain form
11608 2710325 657209 -1771999 -1470013 456615 1477344 2418098 4974565 7188831
11600 7188831 6642083 5915343 9076745 14232720 15562450 11986450 7989843 6266122
11592 6266122 5385558 4706778 5664547 7562663 7544775 5493342 3925749 2731871 -513880
11583 -513880 -4658632 -5434787 -2721412 -1152119 -2180121 -2080604 209315 272912 -3547206
11574 -3547206 -5852145 -2639014 1790661 1673303 -1233967 -1235767 2370375 5737509 7283641
11565 7283641 8499686 9559009 9185917 8027935 7842135 7945393 6238749 3219399 1525144
11556 1525144 1810816 2065600 794017 -1606844 -4244687 -6316889 -6798166 -5420917 -3372402
11547 -3372402 -1685869 -169278 898200 190202 -1702360 -1339658 2696710 6310754
11539F310754j497482n148373l200881Q40426J934301P55599R50728K541556K427675
11530E914303l57169l597500n164702m608837k296819Q28271L149619L481683
11522b651151J843186j064466l666967l109625J878027P175036O312490p70351
11514E946179o061497l719131J808429K468098j547368k773308J561041N245773
11506B928216K638494l085850m996666j994495J257854K009285K046915K816715
11498C620468K750477J110537N30969K744257M552689J899495l478609n726268
11490H004015l139930m49212j434570l231079j067874L885140N489119J046896
11482I102505m867961o200425k583914J362437K609374K638697L220315K445896
$$ plain form
11539 6310754 4813272 -335101 -3535982 -2695556 -761255 -5656 945072 3486628 5914303
11530 5914303 5557134 1959634 -3205068 -7813905 -10110724 -9282453 -6132834 -2651151
11522 -2651151 -807965 -1872431 -5539398 -8649023 -6770996 404040 6716530 5946179
11514 5946179 -115318 -3834449 -2026020 442078 -1105290 -3878598 -2317557 2928216
11506 2928216 5566710 2480860 -2515806 -4510301 -3252447 -1243162 803753 3620468
11498 3620468 6370945 7481482 8012451 10756708 15309397 17208892 13730283 8004015
11490 8004015 4864085 4414873 2980303 -250776 -1318650 2566490 8055609 9102505
11482 9102505 4234544 -1965881 -4549795 -3187358 -577984 2060713 5281028 7726924
11474G726924j865238o512666n615333L38746L534161j90116m647345k569489
11466i800356L113359M449732J578599J412004M258057K436795n529875r906492
11458g988177m281282L861974M502433j02383q26128L038462L867459p43928m011064
11449b682634p29606N174568O465770J590821m439159n938109k215352J841378
11441i32323J430278j876094k301450J216966L169463O07108j887066m45591J097247
11432G8538j524379m530667k522895J547575J744905L95094L561374P937004M222348
11423A0908897o342138j0973456l831151N292950N555162p56772m487691k755393
11415g389592O66082K884471L593624K527194J47807j341339q73470n6919j3962
$$ plain form
11474 7726924 5861686 -650980 -6266313 -5927567 -2393406 -2583522 -7230867 -9800356
11466 -9800356 -6686997 -2237265 -658666 753338 5011395 7448190 1918315 -7988177
11458 -7988177 -12269459 -8407485 -3905052 -4007435 -4833563 -1795101 2072358 1328430 -2682634
11449 -2682634 -3412240 1762328 8228098 9818919 5379760 -558349 -2773701 -932323
11441 -932323 497955 -1378139 -3679589 -2462623 706840 1313948 -573118 -1018709 78538
11432 78538 -1445841 -5976508 -8499403 -6951828 -5206923 -4811829 -1250455 6686549 10908897
11423 10908897 4566759 -6406697 -10237848 -4944898 610264 -146508 -4634199 -7389592
11415 -7389592 -6723510 -3839039 -245415 2281779 2429586 1088247 214777 157858 143896
11406A43896J6329l47647k608265m950703l290903J264342K367641j145966j936136
11397a0487412L883838Q642389M244793m313304n716642O22739M230169l7047
11389A069523m836870k291494M602855P318281L680196r72163k277224j501718
11381D791386j673872k896825l165256j808948o2773J071838J575134J092132
11373a077184r86412l444741l475690m91328K300685K117981N05559N27393J838884
11364b184853J708387k68004j780319j381503M94116L068575M847171L337691
11356G841261j282397m128465j651638K231090J447683k527259k908077J314444
11348C36642M029863K202218l29295p86265j410161k924613j757280K492711M041933
$$ plain form
11406 143896 160225 -187422 -2795687 -7746390 -11037293 -9772951 -7405310 -8551276 -10487412
11397 -10487412 -6603574 2038815 6283608 1970304 -3746338 -3123599 1106570 1069523
11389 1069523 -3767347 -6058841 -1455986 5862295 9542491 8570328 6293104 4791386
11381 4791386 3117514 220689 -2944567 -4753515 -4816288 -3744450 -2169316 -1077184
11373 -1077184 -2063596 -5508337 -8984027 -9475355 -7174670 -5056689 -4551130 -4023737 -2184853
11364 -2184853 -476466 -744470 -2524789 -3906292 -3412176 -343601 4503570 7841261
11356 7841261 6558864 2430399 778761 3009851 4457534 1930275 -977802 336642
11348 336642 4366505 6568723 6239428 5453163 4043002 1118389 -638891 1853820 5895753
11339E895753k6940m242789l376632n44204r72966l064387j997508J977855M980245
11330a371573N745281M888750J516559l739488n801821j407482M528740M853146
11322I212112J18986l205608k315231j07130N94325m82290k714468m092363j449919
11313d441586M191012N901412N5168o528195n521716M10731K272201r30797k034257
11304f626027J342693L787087K588154J483782K065419P30266k934872l603560
11296a167058J20147J830989k076142n633889k929888K261860L140654O07244
11288c846083Q2535J788954J725248l15755r01896L51510Q29487P69878K713946
11279C197824N310466M011236j097819m030685j523767K075154J432579k253823
$$ plain form
11339 5895753 5868813 1626024 -1750608 -2294812 -3267778 -6332165 -8329673 -6351818 -1371573
11330 -1371573 4373708 9262458 10779017 7039529 1237708 -169774 4358966 9212112
11322 9212112 9331098 6125490 3810259 3703129 4297454 3815164 1100696 -2991667 -4441586
11313 -4441586 -250574 5650838 5706006 -822189 -6343905 -5933174 -3660973 -4591770 -6626027
11304 -6626027 -5283334 -1496247 1091907 2575689 4641108 5371374 2436502 -1167058
11296 -1167058 -1046911 784078 -1292064 -6925953 -9855841 -7593981 -4453327 -3846083
11288 -3846083 -3763548 -1974594 -249346 -565101 -1466997 -1115487 -286000 483878 3197824
11279 3197824 8508290 12519526 11421707 7391022 5867255 7942409 9374988 7121165
11271G121165l945521k219811p0133M34027M18538J069573J493029P91295r9955
11262D992207j64484j26388p46530q22520P17200J834329k43955l845932l984512
11253b390585J12301K691236m71092n242442m642249J101439N034202L217576
11245e89614j020908k918471j707072Q92306L394652M145297J900463j380370
11237B716283j741129R75260K134212p39244l908626l386567j187345j388934
11229f526090k895554j369247L012132N116293K397809j696008k918360j124532
11221f003557J362491L100560L520902K132288l06743j623016r90874l86329j630626
11212h24904l365409k952721m91836J244620P24352n27945n25721M61383Q76101
$$ plain form
11271 7121165 3175644 955833 885700 1319727 1738265 2807838 4300867 5092162 4992207
11262 4992207 4827723 4701335 3954805 3132285 3849485 5683814 5439859 1593927 -2390585
11253 -2390585 -2278284 412952 -58140 -5300582 -9942831 -8841392 -3807190 -589614
11245 -589614 -1610522 -4528993 -6236065 -5343759 -1949107 2196190 4096653 2716283
11237 2716283 975154 1950414 4084626 3345382 -563244 -3949811 -5137156 -6526090
11229 -6526090 -9421644 -10790891 -7778759 -2662466 -264657 -1960665 -4879025 -6003557
11221 -6003557 -4641066 -1540506 1980396 4112684 3805941 2182925 1192051 805722 -824904
11212 -824904 -4190313 -7143034 -7634870 -6390250 -5665898 -6193843 -6719564 -6258181 -5382080
11203e382080M11882O0021P3609l78237j211173q03185J520112L738526L514826
11194A544301J368121m76838j598340l101699m182953k452939J448805L239393
11186d212149J090723j016453Q74717M423473M621559J530634n13538k80726p25380
11177E792860k590977k694551j01638J448857j22074j507533n4483J221948q13227
11168E79182l069623j195307K283098J587019k235908k343900K605357N711050
11160C920968K535672k233886k628784l22971o23164l392413l788856m38512K444300
11151d527646J324002k053718l259921k84616M492893O417771L019892k924542
11143B204115n925306m013980m66227J539062K740938M101438L092178j978153
$$ plain form
11203 -5382080 -4970198 -4910177 -4836568 -5214805 -6425978 -7229163 -5709051 -1970525 1544301
11194 1544301 2912422 2435584 837244 -2264455 -6447408 -8900347 -7451542 -4212149
11186 -4212149 -3121426 -4137879 -3263162 1160311 5781870 7312504 6798966 6518240 5792860
11177 5792860 3201883 507332 405694 1854551 1732477 224944 170461 1392409 579182
11168 579182 -2490441 -3685748 -1402650 184369 -2051539 -4395439 -1790082 3920968
11160 3920968 6456640 4222754 1593970 1270999 647835 -2744578 -6533434 -6971946 -4527646
11151 -4527646 -3203644 -5257362 -8517283 -8801899 -4309006 2108765 5128657 2204115
11143 2204115 -3721191 -7735171 -8201398 -6662336 -3921398 180040 3272218 1294065
11135A294065o580339m597362K359490N946295K213814l413525m166887l83840
11127g328289K972654L602930K874110J719332l58624k637826k994202j144747
11119c294662K83169p71991k684976k146911J186121L900373L323762J112948
11111I07833N60118J499797Q08825k062340l554080j356097J945848K851853J703709
11102C305466O38392m62057k346866l043774m97433K944707L214432O49051j205870
11093C196048j905221l740513n442022k668703L961183P641929M828540L35427
11085F206668l89454J048598L57387j782121j790324n2086r2297k176005k846129
11076a515763p49433J337534R46393q75040j756280j119809j02781K73226P0937
$$ plain form
11135 1294065 -5286274 -9883636 -7524146 -1577851 635963 -2777562 -6944449 -7328289
11127 -7328289 -4355635 -752705 2121405 3840737 3482113 844287 -2149915 -3294662
11119 -3294662 -3011493 -3783484 -6468460 -8615371 -7429250 -3528877 -205115 907833
11111 907833 1467951 2967748 3776573 1714233 -1839847 -3195944 -1250096 1601757 3305466
11102 3305466 3943858 3481801 1134935 -1908839 -2406272 538435 3752867 4401918 3196048
11093 3196048 1290827 -2449686 -7891708 -10560411 -6599228 1042701 5871241 6206668
11085 6206668 5817214 6865812 7223199 5441078 3650754 3598668 3506371 1330366 -1515763
11076 -1515763 -2265196 -927662 18731 -856309 -2612589 -3732398 -3835179 -3561953 -3491016
11067c491016N3447N48530Q91701O32446P79547K242868L467232K135291p46541
11058F513505j620876J59946J236990j81161j596431j011586k95670j047058j314877
11049H42782L0666m1134l077722m294955N38245O501388N089210l022081q271397
11040e704998n407279Q03795M250196M794562M396816K436173j138631l058145
11032A372489j504581K00805j178244l297375k296177O43918J612526N82885N84410
11023c279344J681768J152753p34849n85028J736498J843139j969225m839260
11015d993548j958505M179098O980889M318809P3198k028094k318577k546784
11007A706486k576288j323718Q24948K198105J829161L52025p92883o81426K85002
$$ plain form
11067 -3491016 -3437569 -2889039 -1997338 -1364892 -585345 1657523 5124755 7260046 6513505
11058 6513505 4892629 5052575 6289565 6108404 4511973 3500387 3204717 2157659 842782
11049 842782 873448 832314 -2245408 -6540363 -6002118 499270 5588480 2566399 -5704998
11040 -5704998 -11112277 -10308482 -6058286 -1263724 3133092 5569265 4430634 1372489
11032 1372489 -132092 68713 -1109531 -4406906 -6703083 -6059165 -4446639 -3863754 -3279344
11023 -3279344 -1597576 -444823 -1179672 -1764700 -28202 1814937 -154288 -4993548
11015 -4993548 -6952053 -2772955 4207934 8526743 8599941 6571847 4253270 1706486
11007 1706486 -869802 -2193520 -1368572 829533 2658694 3010719 2217836 1536410 1821412
10998A821412Q67432M95152k16466q23790j763312k668490j580427K041875M976544
10989C149930M032674J197553R23237K633717J251336l681332n598455j091663
10981B816997L347238N06908o031692o906581j084901L192823J399954j521288
10973d280542m74265K041173J507204q65376j009318Q88228J135694j326652l644453
10964f028307l229001l49085K922144M351465K918665J16034j114258L6591J090769
10955G15017j21196k413203l177395j693199Q43850K828568K527389r38917n235155
10946f664241n788350j364796L381812L462678j04144k235835n91267K587240
10938g316903M464054M236968K027819j712700n001288m988663j190132L212861
$$ plain form
10998 1821412 2688844 3183996 2967530 2143740 380428 -2288062 -3868489 -1826614 3149930
10989 3149930 7182604 8380157 9303394 11937111 13188447 9507115 3908660 2816997
10981 2816997 6164235 6671143 639451 -6267130 -7352031 -4159208 -2759254 -4280542
10973 -4280542 -4754807 -2713634 -1206430 -2071806 -3081124 -2192896 -1057202 -2383854 -6028307
10964 -6028307 -9257308 -9606393 -6684249 -2332784 585881 701915 -412343 -375752 715017
10955 715017 593821 -1819382 -4996777 -6689976 -5846126 -3017558 -490169 -1429086 -6664241
10946 -6664241 -12452591 -13817387 -10435575 -6972897 -7077041 -9312876 -9904143 -7316903
10938 -7316903 -2852849 1384119 3411938 1699238 -3302050 -8290713 -9480845 -6267984
10930f267984M451718K069867r21517j519536K92860K277626K983273K829910
10922F196217K137823R7687k978300m401110k545281k2125l18812k372076k210875
10913f416852N67973K283761J375037N47249J561912K286914Q28140j315039k300844
10904e81749k525179k186799j68606K388176J626435k851464n423052j895340
10896a1617578L959206N538362K243601j139404j556566J31474K190833L090095
10888B840023J160225k919733m982932k581317O48173J56094k082145o90609L870402
10879d581819N429334J760945j937526j042274K124955K692308J44278k347944
10871B242257k866280j845200J26372K505373L423399J027306l202722m689003
$$ plain form
10930 -6267984 -1816266 253601 -667916 -2187452 -1894592 383034 3366307 6196217
10922 6196217 8334040 8431727 5453427 1052317 -1492964 -1515089 -1833901 -4205977 -6416852
10913 -6416852 -5848879 -3565118 -2190081 -1642832 -80920 2205994 3034134 1719095 -581749
10904 -581749 -3106928 -5293727 -5462333 -3074157 -1447722 -4299186 -9722238 -11617578
10896 -11617578 -7658372 -2120010 123591 -1015813 -2572379 -2440905 -250072 2840023
10888 2840023 4000248 1080515 -3902417 -6483734 -5835561 -5679467 -7761612 -8452221 -4581819
10879 -4581819 847515 2608460 670934 -371340 1753615 4445923 4590201 2242257
10871 2242257 -624023 -2469223 -2342851 162522 3585921 4613227 1410505 -3278498
10863c278498r89600M242252M798169l14606n050384l807365J471806M362407
10855A434181K388059j298581l635098m476937l678181m05856L352170L498793
10847b821450J55291j350475J580752M517818K939321r59979k477898j475582
10839A07798o14131R6560J887204K950278Q01186k789512l999320k672337j458168
10830e690442q25155N21230J722511J057863L344J159146L046937K039948j067083
10821A968299j827469K90232O56362k732756n262286k313009L647268N993363
10813D20004K435702k311435k473549J892492N221398L527539p19016k628537
10805E364598k056060k806278n173002m707210n3239L599551K351119r0747J423257
$$ plain form
10863 -3278498 -4268098 -25846 4772323 4457717 -592667 -4400032 -2928226 1434181
10855 1434181 3822240 2523659 -1111439 -5588376 -9266557 -9672413 -6320243 -2821450
10847 -2821450 -2666159 -4016634 -2435882 2081936 5021257 4061278 1583380 107798
10839 107798 -506333 -409773 1477431 4427709 5228895 2439383 -1559937 -4232274 -5690442
10830 -5690442 -6515597 -5994367 -4271856 -3213993 -3210649 -2051503 995434 3035382 1968299
10821 1968299 140830 431062 1087424 -1645332 -6907618 -9220627 -5573359 420004
10813 420004 2855706 544271 -1929278 -36786 5184612 8712151 7993135 5364598
10805 5364598 3308538 502260 -4670742 -9377952 -9431191 -5831640 -3480521 -3571268 -2148011
10796b148011N096798N460457K110892n57437o19681k62874j060051k173969k738308
10787C107816k522944j249005k6299j280571m246984l837529J899754O871832
10779a283930M933147n16136j571392J896605K662194j741229n113193k445616
10771c179550K661353L557239l93361l473792j058939M324537N145114j774784
10763E807817r211458p221137K806477Q399554L101645m368766l693727J878650
10755b500945K484828k201400m255064j449145R47830Q61300J464142K725220
10747a923234Q86320k755437j985620L621552O767207L556225j224037k574598
10739D368378j913077k246922k895314k208496q49282j607N9150j114353k938412
$$ plain form
10796 -2148011 2948787 8409244 10520136 9962699 9343018 9080144 8020093 5846124 3107816
10787 3107816 584872 -664133 -690432 -1971003 -6217987 -10055516 -8155762 -1283930
10779 -1283930 3649217 3133081 1561689 3458294 6120488 4379259 -733934 -3179550
10771 -3179550 -518197 3039042 2645681 -828111 -1887050 2437487 7582601 5807817
10763 5807817 -3403641 -10624778 -7818301 581253 3682898 -685868 -4379595 -2500945
10755 -2500945 -16117 -2217517 -6472581 -7921726 -6973896 -6112596 -4648454 -1923234
10747 -1923234 -1036914 -3792351 -5777971 -2156419 4610788 8167013 6942976 4368378
10739 4368378 2455301 208379 -2686935 -4895431 -5744713 -5746320 -5687170 -6801523 -9739935
10730i739935k275738K227989N816646L447726j771691k828828J76462J236360
10722c711009n44098k48625K558012K462491j459186l176403K4377L223230K498669
10713A627458R4728j605651l691285n662901m076263R98313M809205N292228N012966
10704B798798M588444J684704k305304k848419q51246j827696n120353l848715
10696g729787K242884M641725J96527l535789j612526N84719j317806k429370
10688h959423J243904M391386K229233k75318K317736N524645L004146k058858
10680G417451l102319j627224k812784m750521k013065L471685M614763L85131
10672A583117l306605k885439n72138O44705J64770j310445k269424j237129O21679
$$ plain form
10730 -9739935 -12015673 -9787684 -3971038 -523312 -2295003 -5123831 -4947369 -3711009
10722 -3711009 -4255107 -4503732 -1945720 516771 -942415 -4118818 -4094441 -871211 1627458
10713 1627458 1722186 116535 -3574750 -9237651 -13313914 -12315601 -7506396 -2214168 2798798
10704 2798798 7387242 9071946 6766642 3918223 3066977 1239281 -3881072 -7729787
10696 -7729787 -5486903 -845178 -648651 -4184440 -5796966 -5212247 -6530053 -8959423
10688 -8959423 -7715519 -3324133 -1094900 -1370218 947518 6472163 9476309 7417451
10680 7417451 4315132 2687908 -124876 -4875397 -6888462 -3416777 1197986 1583117
10672 1583117 -1723488 -4608927 -5181065 -4536360 -4371590 -5682035 -7951459 -9188588 -8566909
10663h566909O90466N0787K303613N564062K998371n144946q435654j048173Q239208
10654c349175Q333449J283408l057692k116741r72326j634273j434728j45350
10646c093428m30111k105426k534065j686992j334865q45788J147543K911677
10638g971455K243788P26154R64443K116925K133574J350791K58357k274858m908794
10629e361075l163833K788179N663525J806890k134499r806L209642L31157m712621
10620a582441l240150K670089L100326k833412n156381P03609O859196N715042
10612F235878P47803n82781J774484J995160k165646o619534o782235k895745
10604h292616Q86698J405132k69560q12077O59370J521371k07412k579945k104334
$$ plain form
10663 -8566909 -7876443 -7825656 -5522043 42019 3040390 -2104556 -10540210 -11588383 -3349175
10654 -3349175 4984274 6267682 3209990 1093249 120923 -1513350 -2948078 -3093428
10646 -3093428 -3523539 -5628965 -8163030 -9850022 -11184887 -12030675 -10883132 -7971455
10638 -7971455 -5727667 -5001513 -4037070 -1920145 213429 1564220 1822577 -452281 -5361075
10629 -5361075 -8524908 -5736729 -73204 1733686 -400813 -410619 2799023 3130180 -1582441
10620 -1582441 -4822591 -2152502 947824 -1885588 -7041969 -6338360 520836 6235878
10612 6235878 6983681 6400900 8175384 10170544 8004898 1385364 -5396871 -8292616
10604 -8292616 -7405918 -6000786 -6270346 -7082423 -6423053 -4901682 -5109094 -7689039 -9793373
10595i793373J542085M570093L083458j975005m611930n99336N671732N400894
10587C288618k108112p071515l208580K683156J733167l114881l483904r7869
10579a1379920M56967q20449J937041O084978L737627k908839m002740N72920
10571f322415J457162k072869p54696N777084O159650k316154p655489l438012
10563i165739J425540P5501j485687J267692K306809j090883j132302M675210
10555c123859O099759j641340p741890m175316J120570J58227j448776J883740
10547h868885L830006j45626k335618J966917M101066j142113m504321m00392
10539g498966J263020n160771p842534P93469P758715J860018n940166k697883
$$ plain form
10595 -9793373 -8251288 -3681195 -597737 -2572742 -7184672 -7784008 -2112276 3288618
10587 3288618 1180506 -5891009 -9099589 -6416433 -4683266 -7798147 -11282051 -11379920
10579 -11379920 -10922953 -11743402 -9806361 -3721383 16244 -2892595 -6895335 -6322415
10571 -6322415 -4865253 -6938122 -7692818 -1915734 4243916 1927762 -5727727 -9165739
10563 -9165739 -7740199 -7664698 -9150385 -7882693 -5575884 -6666767 -7799069 -3123859
10555 -3123859 2975900 1334560 -6407330 -10582646 -9462076 -9303849 -10752625 -8868885
10547 -8868885 -5038879 -5184505 -7520123 -5553206 -1452140 -2594253 -7098574 -7498966
10539 -7498966 -6235946 -11396717 -19239251 -18445782 -10687067 -8827049 -14767215 -17465098
10531a7465098L975258K675214l85114L160432M760638l536882j0036066l617432
10523b0469050M529479J506932l304026K050680P642744J566652n333190n87959
10515a2397738M265868l603135j1183679m010210M611801p29056o578170K049575
10507b7574744R474630J47223p031607N112263J3139868m339942j9523937l674557
10499c4270803J4178037j368393k0732044l067525J8493212n275361l5184840
10492f7227717p429112L0661683j1631124p6616058n559770J86984082K67506109
10485C16688093J04971590j20935591j66005948m9177038K6809935q982632m5056961
10478E8311448j4130097J5730373o807801k9312443p218428J7733470M690361
$$ plain form
10531 -17465098 -13489840 -10814626 -11199740 -8039308 -3278670 -6815552 -16851618 -20469050
10523 -20469050 -15939571 -14432639 -17736665 -15685985 -8043241 -6476589 -11809779 -12397738
10515 -12397738 -8131870 -11735005 -22918684 -26928894 -22317093 -23046149 -29624319 -27574744
10507 -27574744 -18100114 -17952891 -24984498 -19872235 -6732367 -11072309 -30596246 -34270803
10499 -34270803 -20092766 -21461159 -42193203 -45260728 -26767516 -32042877 -67227717
10492 -67227717 -74656829 -43995146 -55626270 -132242328 -137802098 49181984 316688093
10485 316688093 421659683 300724092 134718144 85541106 112351041 103368409 58311448
10478 58311448 44181351 59911724 53103923 23791480 16573052 34306522 38996883
10471C8996883j4811196n720836P125166m385208j6110633j803579J5423601P990952
10463B6705150o057707j032424Q792488O72852j2497747q577580L080557L061653
10455A4147242k150048J563176N740379j757032r548299l607352M770201l29522
10447H828745r359178n077349O047067O524031j803010m597520o78777J296908
10439A180917J565467M811128O456467J106831m422360k153150K470165J153741
10431A2169206k327884j224678Q36016j309889k835933J105661M452527J306083
10423A2171109k664228j242384Q37065j677571l910652j268804J042464r70438
10415B316561j734511J537491J557603l964355m727863L486149Q220793J328307
$$ plain form
10471 38996883 24185687 18464851 25590017 21204809 5094176 3290597 18714198 26705150
10463 26705150 20647443 19615019 28407507 29080359 16582612 8005032 11085589 14147242
10455 14147242 11997194 13560370 19300749 17543717 7995418 4388066 9158267 8828745
10447 8828745 -530433 -5607782 439285 6963316 5160306 562786 -115991 1180917
10439 1180917 2746384 7557512 14013979 15120810 10698450 8545300 11015465 12169206
10431 12169206 9841322 8616644 9452660 8142771 5306838 6412499 10865026 12171109
10423 12171109 9506881 8264497 9101562 7423991 3513339 2244535 3286999 2316561
10415 2316561 582050 2119541 3677144 -287211 -5015074 -1528925 6691868 8020175
10407H020175n430995p13259O132162K335634n074171k600761N158845M653821
10399A2481451k199465l163512J565391J579648l432444m319602m07550M62095
10391B566012k133251j153517L231378L561634r73822l703357k914699k991847
10383d511469l925621j268633L868505N369397K452619K78488R02345J725081
10375D890712J567999J027166q73770l731700l178821K044618N372132J999842
10367I118178k703110k370382m27616k368656m403387q50724L727672K038997
10359A760972k079482m39584L890353J963535l853283l208591L634563N859614
10351G528097P18752k850082p96888K56317k951440l976453O89038M413742J897203
$$ plain form
10407 8020175 2589180 1875921 8008083 10343717 5269546 2668785 7827630 12481451
10399 12481451 10281986 7118474 8683865 10263513 6831069 2511467 2103917 2566012
10391 2566012 432761 -720756 2510622 6072256 5098434 1395077 -1519622 -4511469
10383 -4511469 -8437090 -9705723 -5837218 -467821 1984798 2263286 3165631 4890712
10375 4890712 6458711 7485877 6612107 2880407 -298414 1746204 7118336 9118178
10367 9118178 6415068 4044686 3617070 1248414 -3154973 -4005697 -278025 1760972
10359 1760972 -318510 -758094 3132259 5095794 1242511 -1966080 1668483 7528097
10351 7528097 8246849 5396767 4599879 4856196 1904756 -2071697 -1382659 3031083 4928286
10342D928286j951941j002706K209293K004278j185102l059727k465531j142946
10334a666096J89633J539898J947554R24831l48493q00070n42036K26819J165413
10325B637453R77300p49983j789539l44316J498569Q92256q39800n31700J180207
10316B930447J203575l42224p35928Q3875j08459r98105m01708Q39605o0178k131569
10306B79331j518241J629549K632302j44209k240415K11574M615456N330161P91343
10297A1586851m798121o058793j971647K910192L352427l04588k707704r28161
10289A080456J782845J460166q61977j891888j387154j026819n54786R68162K056977
10280A625982Q85941j058408j024906O92956J798671J853003J861219J495038
$$ plain form
10342 4928286 2976345 1973639 4182932 6187210 5002108 1942381 -523150 -1666096
10334 -1666096 -1476463 63435 2010989 2935820 2587327 1787257 1245221 1472040 2637453
10325 2637453 3614753 2864770 1075231 730915 2229484 3121740 2281940 1750240 2930447
10316 2930447 4134022 3791798 3055870 3139745 3031286 2033181 1631473 2471078 2410900 279331
10306 279331 -1238910 390639 3022941 2878732 638317 849891 5465347 10795508 11586851
10297 11586851 6788730 729937 -1241710 1668482 5020909 4716321 2008617 1080456
10289 1080456 2863301 4323467 3461490 1569602 182448 -844371 -1399157 -430995 1625982
10280 1625982 2511923 1453515 428609 1121565 2920236 4773239 6634458 8129496
10272H129496m7054j683000j887965j280974j243415j346488m58537J053723K171666
10263C407452K640484K148487K57761j786342j940540q32443q66721j462167N5716
10254A621687K240089N41138l799405l350246L560285Q137958L590361m558884
10246G982983o870252k797500J572647L401925L693378K244435j125816l616958
10238D484842l447924l158098m017079k246683L593975P394953M456832k99359
10230F761459o96992K92183k620004n813973k894013K770807L121696l89316L72703
10221I04550N237599N805763K17834l829858j982778J276886J693480N27065p93928
10212I056613k829617l783771j104135K046472K34543m302447m251783K12126
$$ plain form
10272 8129496 8082442 6399442 4511477 3230503 1987088 640600 182063 1235786 3407452
10263 3407452 6047936 8196423 8454184 6667842 4727302 3894859 3028138 1565971 1621687
10254 1621687 3861776 4402914 603509 -2746737 813548 8951506 12541867 7982983
10246 7982983 1112731 -1684769 -112122 3289803 6983181 9227616 8101800 4484842
10238 4484842 1036918 -2121180 -6138259 -8384942 -4790967 2603986 7060818 6761459
10230 6761459 6064467 6356650 3736646 -2077327 -4971340 -2200533 921163 531847 904550
10221 904550 6142149 11947912 12165746 8335888 6353110 7629996 9323476 9850541 9056613
10212 9056613 6226996 2443225 1339090 3385562 3620105 -682342 -4934125 -4721999
10204d721999J619821j311369j506578L000086M892427P79202k399077M32887
10196G85400L883518K141870j284570j163555j51921k746455n702642k939714
10188g178069L963219P855343O077031K004636j442502m029669n207925l913425
10180a871361j045377J196382J928881J495434J73684j235645j274885J50676
10172d82211J368063J436261Q77144l20457k305101k851720N59986N425743N761757
10163I469465N93737l870492k846343Q48320K147254J029560P36617J834788J971057
10154A1913963n6875k852128m129215k480948J270515L947914L086284J66760
10146A0866270j494169j476646j725065k219376j459715n74004j732053k766700
$$ plain form
10204 -4721999 -3102178 -4413547 -5920125 -2920039 1972388 2751590 352513 785400
10196 785400 4668918 6810788 5526218 4362663 4210742 1464287 -4238355 -7178069
10188 -7178069 -3214850 4640493 10717524 12722160 11279658 7249989 2042064 -1871361
10180 -1871361 -2916738 -1720356 208525 1703959 1877643 641998 -632887 -482211
10172 -482211 885852 2322113 3199257 2878800 573699 -2278021 -1718035 3707708 9469465
10163 9469465 10063202 6192710 3346367 4194687 6341941 7371501 8108118 9942906 11913963
10154 11913963 11857088 9004960 4875745 2394797 3665312 7613226 10699510 10866270
10146 10866270 9372101 7895455 6170390 3951014 2491299 1917295 185242 -2581458
10138b581458L92145N380091M697203k472287p028248k545423N232768O691373
10130G766164J234204l813722l818445p72203J540733J630630L03400l62713J139161
10121D847209L239312K462844j518796m651201l917862j092159N68920K22467
10113A60734j539280l919919m451930n25979N387403O698896J869375k228000
10105A451300n6777M240179L455516j696738m521399k853741r47966j399676j373024
10096c702326J727259N269536M455817j496527p693130p904750j028225O675080
10088c697266P598351J658839l484332k294060J988440K992400K0430k673508
10080B109294k877664k070078j203451O42153L197099M160472K272452r96569
$$ plain form
10138 -2581458 -2189313 3190778 7887981 5415694 -1612554 -4157977 1074791 7766164
10130 7766164 9000368 5186646 1368201 595998 2136731 3767361 4070761 3708048 4847209
10121 4847209 8086521 10549365 9030569 4379368 461506 -630653 -61733 160734
10113 160734 -1378546 -5298465 -9750395 -10276374 -4888971 1809925 3679300 1451300
10105 1451300 1394523 5634702 9090218 7393480 2872081 18340 -929626 -2329302 -3702326
10096 -3702326 -1975067 3294469 7750286 6253759 -1439371 -9344121 -10372346 -3697266
10088 -3697266 3901085 5559924 2075592 -218468 1769972 4762372 4782802 2109294
10080 2109294 -768370 -2838448 -4041899 -3399746 -202647 3957825 6230277 5233708
10072E233708l254551l131296o89487K448186L789802K412639K51018m71915k57511
10063F330593j066879k894385l692477k399741j70158J398603J766411J181465
10055D53432J88477m87657m73674j76461o1447K51531J443984L098230L467214
10046G703629J102225l103353n899684m767664j184325P39299m56957j762552
10038g629382n36826J541716K020343K333877M671232O326701K866743l661145
10030G933259n930300j822867K269346R89473k626033k877101Q3966J972167J500478
10021A492388J022573J545827J356869m94021k329735j988717N82219L055328
10013D242731K748287m58868l428926l257822r08928N73999O03940Q71130J325682
$$ plain form
10072 5233708 1979157 -1152139 -1841626 606560 4396362 6809001 7060019 6588104 6330593
10063 6330593 5263714 2369329 -1323148 -3722889 -3893047 -2494444 -728033 453432
10055 453432 641909 154252 -319422 -495883 -557330 -305799 1138185 4236415 7703629
10046 7703629 8805854 5702501 -197183 -4964847 -6149172 -5409873 -5866830 -7629382
10038 -7629382 -8166208 -6624492 -4604149 -2270272 2400960 8727661 11594404 7933259
10030 7933259 2002959 180092 2449438 3438911 812878 -2064223 -1980257 -8090 1492388
10021 1492388 2514961 4060788 5417657 4923636 2593901 605184 1187403 4242731
10013 4242731 6991018 6532150 3103224 -154598 -1063526 -489527 114413 985543 2311225
10004B311225J60881k202137l172967k408392k039779k178910q98934Q45044j18435
9995i702404k422059m59902O053903R363081M546643k664633l953605M10283L802955
9986D974262K932885J6846j959342j585547R27419K529192n81861o420562p348523
9977f515231q95753M922543K807786k685766k677379J897427K750288j746916
9969b143001m649087k147354J687616K834569K252139J408428k78968j937885
9961b973543j308849L88722l83477k559482j274116L174102M386708K02165l285016
9952c632786j500639J655366J124812j180380j005553N42845k0237j562804m64533
9943f043909K630074L876051K558111J256566P32114n28588k129116j628362J148382
$$ plain form
10004 2311225 2472106 269969 -2902998 -5311390 -7351169 -9530079 -10429013 -9583969 -9702404
9995 -9702404 -12124463 -12584365 -6530462 2832619 7379262 4714629 761024 1171307 4974262
9986 4974262 7907147 7923993 5964651 4379104 5306523 7835715 7253854 833292 -6515231
9977 -6515231 -7410984 -2488441 319345 -2366421 -5043800 -3146373 -396085 -2143001
9969 -2143001 -6792088 -8939442 -7251826 -4417257 -2165118 -756690 -1035658 -2973543
9961 -2973543 -4282392 -3893670 -4277147 -6836629 -8110745 -4936643 -549935 -347770 -3632786
9952 -3632786 -5133425 -3478059 -2353247 -3533627 -4539180 -3996335 -4016572 -5579376 -6043909
9943 -6043909 -3413835 462216 3020327 4276893 5009007 4480419 2351303 722941 1871323
9934A871323L349927L149151J633718L22410o18648j327975j609619j670140j840972
9925C259175j667430p77645j16238n90459j157517k26873J565874J985011K46150
9916B520048k251538l685924k850200L23802L437521K678502j973802m579520
9908f381111l99752O201891O448129l19823n033824j730126M167978M415776k48944
9899G120194k566063K778K766974J715721j690580m214059m756250l406919l15240
9890e343444K948923L778967J771572n81099j404577j449237j774931j866913
9882c920739j244686p35110p22989O6945K593134N523285O262955L228393k796120
9873H255068q274110q733951l443295K362832L052004j59343j469709M30954R48996
$$ plain form
9934 1871323 5221250 8370401 10004119 10326529 9707881 8379906 6770287 5100147 3259175
9925 3259175 1591745 814100 697862 107403 -1050114 -1276987 288887 2273898 2520048
9916 2520048 268510 -3417414 -6267614 -5943812 -2506291 172211 -1801591 -6381111
9908 -6381111 -6780863 -578972 5869157 5549334 515510 -1214616 2953362 7369138 7120194
9899 7120194 4554131 4556909 7323883 9039604 7349024 3134965 -1621285 -5028204 -5343444
9890 -5343444 -2394521 1384446 3156018 2574919 1170342 -278895 -2053826 -3920739
9882 -3920739 -5165425 -5900535 -6623524 -6556579 -3963445 1559840 7822795 11051188 8255068
9873 8255068 -19042 -8752993 -12196288 -9833456 -6781452 -6940795 -8410504 -7979550 -7030554
9864g030554j882469l675165j248781J932647K011964J275076L318270N939743
9856F40731M681220L93971k503786k935000k765942j751312J261940L837374K609370
9847C468566q13627k264887j895117k651118l445763p55059L820938M979817K619853
9838C063603J730310K912905J204706l983732o174589k268399K082750J738812
9830C06366l60154J60015J367269j39581k043538n87152J936564P63248k854991
9821a451954l299915N52253M014617L826838J679971K08131l17325m63978r9486
9812D649152M65475K3947j648990k704921j137922K301043L851838N69849n305877
9803A063594p704601l890552J919386M428206L962943L587779K675067p71234
$$ plain form
9864 -7030554 -8913023 -12588188 -13836969 -11904322 -9892358 -8617282 -5299012 640731
9856 640731 5321951 5715922 3212136 277136 -2488806 -4240118 -2978178 859196 3468566
9847 3468566 2654939 390052 -1505065 -4156183 -7601946 -8357005 -4536067 443750 3063603
9838 3063603 4793913 7706818 8911524 4927792 -1246797 -3515196 -1432446 306366
9830 306366 -53788 106227 1473496 1333915 -709623 -1296775 639789 1403037 -1451954
9821 -1451954 -4751869 -4199616 -184999 3641839 5321810 5529941 5212616 4748638 4649152
9812 4649152 5114627 5138574 3489584 784663 -353259 1947784 5799622 6369471 1063594
9803 1063594 -6641007 -10531559 -8612173 -4183967 -221024 3366755 6041822 5270588
9795E270588l661204j266757L547082K916906l324359o329857j990437K891620
9787a946418K107940q68879o72349R58133M56686j85062J550031K322554q65867
9778B856769l472332m49850M148745L086151k261899m659839k628763o33281K6340
9769c987959J653646L064205J010583k058919n77975L809520L428889k957542
9761C384448p575996n528605j077838P86521J405266L174251L851929J021025
9753e58999k556215k772274j14650K006678K184848J139404o21739k354888k289551
9744e937386J38744K739954L205443J934753O97045j08730j221982k434068k225015
9735c211242L71025L891751M965959J825881k694928l719161n53541K319673J771907
$$ plain form
9795 5270588 1609384 342627 3889709 6806615 3482256 -2847601 -4838038 -1946418
9787 -1946418 161522 -707357 -1379706 -421573 35113 -149949 1400082 3722636 2856769
9778 2856769 -615563 -1065413 3083332 6169483 3907584 -752255 -3381018 -4014299 -3987959
9769 -3987959 -2334313 729892 1740475 -318444 -896419 2913101 6341990 3384448
9761 3384448 -4191548 -9720153 -10797991 -10011470 -8606204 -5431953 -1580024 -558999
9753 -558999 -3115214 -5887488 -6002138 -3995460 -1810612 -671208 -1292947 -3647835 -5937386
9744 -5937386 -5798642 -3058688 146755 2081508 2778553 2669823 1447841 -986227 -3211242
9735 -3211242 -2840217 1051534 6017493 7843374 5148446 1429285 875744 3195417 4967324
9726D967324J22824L30111R08651n03385j895709j84427K687469K441585k38484
9717H635959p16355J878934L313318Q46759l397560o020545n505920j924523K869604
9708b0329N168225L041303p14455k464844k782219l792333m078870j438560J564562
9699e517520Q95365j766213j505403J618421L565707L977408N239679N251857
9691A1759301P3282o534042o183501L09360K628350k705722o444858j917493M182711
9682d832612L473374o40610j25662L893933M415818J189653J06379K113104K003912
9673A1597289j953864n145399m372142k116225j519411k036419j663490J56449
9665g053212K874242N085512M192051q98398o381975o341979J8655O782122Q163778
$$ plain form
9726 4967324 5090148 5420259 6328910 5825525 3929816 3745389 6432858 8874443 8635959
9717 8635959 7919604 9798538 13111856 13958615 10561055 4540510 -965410 -2889933 -20329
9708 -20329 5147896 8189199 7474744 5009900 2227681 -1564652 -5643522 -7082082 -5517520
9699 -5517520 -4622155 -6388368 -7893771 -6275350 -2709643 1267765 6507444 11759301
9691 11759301 11832583 5298541 -884960 -575600 2052750 -652972 -7097830 -9015323 -4832612
9682 -4832612 -1359238 -1999848 -2125510 1768423 6184241 7373894 7480273 9593377 11597289
9673 11597289 9643425 4498026 125884 -1990341 -3509752 -5546171 -7209661 -7053212
9665 -7053212 -4178970 906542 5098593 4200195 -2181780 -8523759 -8505104 -1722982 6440796
9656F440796M516437K06503k053213k547387j864572Q4418K158124J788381j596192
9647G133295m573184l574447J0457J510350k36531j325981Q72427L686498L795361
9638G298245K230693J429164O49191j600178l500303k874363j550655j863217
9630B18577j587458J856502M911365K670979j891778j657365K649970L264362
9622A0435154j339895l604721K10848L611384P37084m362421m850438j218314
9614c81319J350284R36948p48271k016118j330765K190754N396730L092601l580360
9605D910484o497594j968154L346111K501714j910338l561423k213584j352416
9597f745200r45444O89899J895178J084192J242547M480110O151489J663494m563888
$$ plain form
9656 6440796 10957233 11163736 9110523 6563136 4698564 4782982 6941106 8729487 7133295
9647 7133295 2560111 -1014336 -1003879 506471 269940 -1056041 -183614 3502884 7298245
9638 7298245 9528938 10958102 11607293 10007115 6506812 3632449 2081794 218577
9630 218577 -1368881 487621 5398986 8069965 6178187 4520822 7170792 10435154
9622 10435154 9095259 5490538 5701386 9312770 10049854 5687433 836995 -381319
9614 -381319 968965 1905913 1157642 -858476 -2189241 1513 5398243 8490844 4910484
9605 4910484 -1587110 -3555264 -209153 2292561 382223 -3179200 -5392784 -6745200
9597 -6745200 -7690644 -7000745 -5105567 -4021375 -2778828 1701282 7852771 9516265 4952377
9588D952377m962810o76051J066587o69601k02410L165697L063956k394419n791924
9579b448598j390006N595940O049706m93648n589630l061299L657669O445681
9571H765815K654178k263435k839241j100719k207963m843418k727206L889937
9563f72052O416934J023187m439914k429134K569139K085156k444353l138371
9555a029408R42806L712950L131544K680507K865500P74714k042442p24251L122839
9546A3434759K172390m320251q123432m824229l30946n63286k549337r76042K886093
9537c194281M498279L364305J639892o13676l679564m883614k020750K087753
9529b801656K862302L56708j329675j20149J653208P64644k857803n698975m091385
$$ plain form
9588 4952377 -10433 -686484 380103 -289498 -491908 2673789 5737745 3343326 -2448598
9579 -2448598 -3838604 1757336 7807042 7313394 1723764 -1337535 2320134 8765815
9571 8765815 11419993 9156558 6317317 5216598 3008635 -1834783 -4561989 -672052
9563 -672052 5744882 6768069 2328155 -100979 2468160 4553316 2108963 -1029408
9555 -1029408 -86602 3626348 6757892 9438399 12303899 13078613 11036171 10311920 13434759
9546 13434759 15607149 11286898 3163466 -1660763 -1991709 -2554995 -5104332 -6080374 -3194281
9537 -3194281 1303998 4668303 6308195 5694519 2014955 -2868659 -4889409 -2801656
9529 -2801656 60646 417354 -912321 -1032470 620738 1385382 -1472421 -7171396 -11262781
9520a1262781J209327M853329L325795L4219L57435L060009K194007k538443m169070
9511b936173N73920N303173L269322k647771m731922j620358J307225J001331
9503d81253L47263K356810N254700N088237J026979l436572m144694q30851K269439
9494G450058J229664k612951m510839k971737j504984k728762m135302k214046
9486a1998899J767188L468719J826629L11553J521674L238497J621323k759229
9478a002545m535987m24649N290098N353355n06894m597305k140152J727655J94763
9469f41661m282931m018345J396540M702674K875551J035390K645934L866499
9461G579651J333569j549591j028914K58101j365106l433714j826445J296975
$$ plain form
9520 -11262781 -10053454 -5200125 -1874330 -1840111 -1482676 1577333 3771340 1232897 -2936173
9511 -2936173 -2362253 2940920 6210242 3562471 -1169451 -2789809 -1482584 -481253
9503 -481253 -133990 2222820 7477520 12565757 13592736 10156164 6011470 5180619 7450058
9494 7450058 8679722 6066771 1555932 -1415805 -2920789 -5649551 -9784853 -11998899
9486 -11998899 -10231711 -6762992 -4936363 -4624810 -3103136 135361 1756684 -1002545
9478 -1002545 -5538532 -5963181 -673083 4680272 4173378 -423927 -2564079 -836424 -641661
9469 -641661 -4924592 -8942937 -7546397 -2843723 31828 1067218 3713152 7579651
9461 7579651 8913220 7363629 6334715 6592816 5227710 1793996 -32449 1264526
9453A264526P31045l014094m773499l167226j573946j192692M51951L346338L403282
9444d524315o95912l902419j328961M663827P290052L800302j773580m064602
9436e35608k275049K29952R52617J014453K330777L784743K504510j472777m527267
9427B006351m068530j368423J102139K542424K741928J023266j662400k243107
9419G3648K40044K207776L66577l010857l100045N43038L755326L811307K060443
9410F947257N61014m70383j227104j276331r63618j538810k846232k846716o04580
9401d265503J795282J619781j122985l744937l849173j422059J803307M243440
9393d942847N318714M880536K898250K30371j384551j292842r84616j730011k328425
$$ plain form
9453 1264526 1995571 -1018523 -5792022 -8959248 -10533194 -11725886 -11273935 -7927597 -4524315
9444 -4524315 -5220227 -9122646 -10451607 -5787780 1502272 5302574 3528994 -535608
9436 -535608 -2810657 -2580705 -1628088 -613635 1717142 5501885 8006395 6533618 2006351
9427 2006351 -2062179 -3430602 -2328463 213961 2955889 3979155 2316755 73648
9419 73648 313692 2521468 2888045 -122812 -3222857 -2679819 1075507 4886814 6947257
9410 6947257 7508271 7037888 5810784 4534453 3570835 2032025 -814207 -3660923 -4265503
9401 -4265503 -2470221 -850440 -1973425 -5718362 -9567535 -10989594 -9186287 -4942847
9393 -4942847 375867 5256403 8154653 8385024 7000473 5707631 4723015 2993004 664579
9384F64579j388677m94723j750874l156510r71744L363605M114676K28954k557308
9375a948022j114746K2143k644005m238211L63884O173700M509055k995712o121836
9366g993750j314281L983069L704071J196423J447622K708494R49083k608728
9358B072003l874365k564835j688300k293271k618516j348920J014800L102537
9350h198867L435991J684754l8683N89364K155790J206900j511488j280099K396691
9341D40353L451381j303287n781808k989108M400536P951354M992782r5829l879201
9332G187173o280813o186380j882229L683828M646077N35006k790246j778438
9324b866022P96730J858456K172482K284053K22502l530935m234694n8484L712588
$$ plain form
9384 664579 -724098 -1218821 -2969695 -6126205 -7097949 -3734344 380332 609286 -1948022
9375 -1948022 -3062768 -3040625 -5684630 -9922841 -9558957 -3385257 1123798 -1871914 -7993750
9366 -7993750 -9308031 -5324962 -1620891 -424468 1023154 3731648 4680731 2072003
9358 2072003 -1802362 -4367197 -6055497 -8348768 -10967284 -12316204 -11301404 -8198867
9350 -8198867 -4762876 -3078122 -3116805 -2527441 -371651 835249 -676239 -1956338 440353
9341 440353 3891734 2588447 -3193361 -6182469 -1781933 6169421 11162203 11066374 7187173
9332 7187173 906360 -5280020 -7162249 -3478421 1167656 1702662 -1087584 -2866022
9324 -2866022 -2069292 -210836 1961646 4245699 4468201 937266 -3297428 -3355912 356676
9315C56676K160906j803391k524353m81528k62418k239600k574414m18679R28357
9306f858444J35173k73496J035212J986819J293331P89148J761214K307734N86775
9297B763466j712977j558835R44909K298939o8082m100869m606535O99044P201852
9288A860912P803451J804800l806262l576819l61080J97163j843864k486329j140578
9279a548606n06572r09745o57621p39503k893220m071554p8141N624887N044573
9270g35502j378378l947335J268552N787819K201042m142119m124568J143929
9262c926560L721276J648450k85443J8092n1662j398779j825810q61235k90036
9253c251707j96703O61993J433970P73407L95137K137279L369498Q67223k691511
$$ plain form
9315 356676 2517582 714191 -1810162 -2291690 -2554108 -4793708 -7368122 -7786801 -6858444
9306 -6858444 -6723271 -6996767 -5961555 -3974736 -2681405 -1892257 -131043 2176691 2763466
9297 2763466 1050489 -508346 436563 2735502 2667420 -1433449 -6039984 -5340940 1860912
9288 1860912 9664363 11469163 7662901 4086082 3725002 3922165 2078301 -408028 -1548606
9279 -1548606 -2055178 -2964923 -3622544 -4362047 -7255267 -11326821 -11404962 -5780075 -735502
9270 -735502 -2113880 -6061215 -4792663 995156 3196198 -945921 -5070489 -3926560
9262 -3926560 -205284 1443166 1157723 1175815 1124153 -274626 -2100436 -2961671 -3251707
9253 -3251707 -3448410 -2786417 -1352447 -579040 -183903 1953376 5322874 6190097 3498586
9244C498586k430649J80873l79108l806159m140334M4000L431580K977315J505010
9235H81114P99268j066098l247321j126617M668333O173364o9063o258150m444258
9226c689428J788748L654476K33899k339248j386408K42030P77102J205560J202203
9217A688934l18436j107391J853000N764433M269558k726436p533613n202025
9209c311976k57738M79246k336780k511124K044101O225910M666826j373259n600922
9200a975716l994334R05635L190816M14782l652498l562623J136450N068798L374861
9191I06171k212166n192386k189503K941431M303434J593947l34476R94785K533318
9182C344555J314413q38816j092014n97251j625410k463865l01128K557786J267282
$$ plain form
9244 3498586 1067937 1248810 869702 -2936457 -7076791 -7032791 -3601211 -623896 881114
9235 881114 1680382 614284 -2633037 -3759654 908679 7082043 7012980 754830 -3689428
9226 -3689428 -1900680 1753796 1987695 -351553 -1737961 -1495931 -718829 486731 1688934
9217 1688934 1370498 263107 2116107 7880540 12150098 9423662 1890049 -3311976
9209 -3311976 -3569714 -3090468 -5427248 -7938372 -5894271 331639 4998465 3625206 -1975716
9200 -1975716 -5970050 -5064415 -1873599 -1458817 -5111315 -8673938 -7537488 -2468690 906171
9191 906171 -1305995 -6498381 -8687884 -5746453 -1443019 150928 -183548 811237 3344555
9182 3344555 4658968 3820152 2728138 2130887 505477 -1958388 -2259516 298270 1565552
9173A565552l243360m698785r75591K869434K779340J026135P01833M88829j303342
9164g89955k292514j39490K597685K354172M03704K88305J791243J979451L95394
9155F587995j136021k329337l816549m091667j507211J638102J553814q96310
9147c997184j034321K379007N071644L464034p98728l948568m559737l254258
9139f678111p14808J890049K538975P84931o66907Q02726L449390K785372j890641
9130B300976n271933k722789K625162L480288r60310l199870J161319N640007
9122C052850K203649n508387o517598J005392O760264L749900k131882k434491
9114A79697J498545K913769P43711r73891j129841j755075k344118p56942J349874
$$ plain form
9173 1565552 -1677808 -6376593 -7352184 -4482750 -1703410 -677275 24558 513387 -789955
9164 -789955 -3082469 -3221959 -624274 1729898 2133602 2421907 4213150 6192601 6587995
9155 6587995 5451974 3122637 -693912 -4785579 -6292790 -4654688 -3100874 -3997184
9147 -3997184 -5031505 -2652498 2419146 5883180 5084452 1135884 -3423853 -6678111
9139 -6678111 -7392919 -5502870 -2963895 -2178964 -2845871 -2043145 1406245 4191617 2300976
9130 2300976 -2970957 -5693746 -3068584 411704 -548606 -3748476 -2587157 3052850
9122 3052850 5256499 -251888 -6769486 -5764094 996170 4746070 2614188 179697
9114 179697 1678242 4592011 5335722 4361831 3231990 1476915 -867203 -1624145 -274271
9105b74271K87321k895320l230072L74575L434285K701294N8747j444890j514272
9096b502603j209326o03459Q18568L059412N220416N299098J697353l614383n775027
9087B390049l269266p19400k098369m138207j232609N309155Q522083N523401
9079A0286837P01037j041427J79062J028716q92406m785638o487670k221332N206904
9070A974083P343616R88058o003094n300932j07056R67489j851130j260238L020282
9061b28922L221900k481749o045239k799910J373490O88764j606598m76965K339353
9052f015876L035107K574312K848109J717853k113773m488289k108798J251739
9044c299616Q81769j088294l53080J495378N95653j129997P81602M431420L706714
$$ plain form
9105 -274271 13050 -2882270 -6112342 -5737767 -2303482 397812 456559 -988331 -2502603
9096 -2502603 -3711929 -4315388 -3496820 -437408 4783008 10082106 11779459 8165076 2390049
9087 2390049 -879217 -1598617 -3696986 -7835193 -9067802 -3758647 4763436 10286837
9079 10286837 10987874 9946447 10125509 11154225 10261819 5476181 -1011489 -3232821 1974083
9070 1974083 9317699 10305757 4302663 -998269 -1105325 -137836 -1988966 -3249204 -228922
9061 -228922 2992978 511229 -5534010 -8333920 -6960430 -6271666 -7878264 -8355229 -6015876
9052 -6015876 -2980769 -406457 2441652 4159505 2045732 -2442557 -4551355 -3299616
9044 -3299616 -2417847 -3506141 -3859221 -2363843 -1768190 -2898187 -2116585 2314835 6021549
9035F021549j549800m690940j904867L224909N528229L848466J94563k816837
9027G855272l243920j455779j13003k67133O10022L821230N604204K416784k667003
9018A2560674m108682k222845j470648k224215r25060K255489K896934j5929k407465
9009D338253k138131j554407j690983k29044K720615L049512k22889k140441K08323
9000B340808K404784O135l662993k672935J982218M140222J891689p51951j101231
8991D576746j048837k222749k751619r75992J127449R13922o58999m70932J949950
8982D38939L560714J965115j421995l299711k472684o99873m9655p43672j617809
8973d340631j427941M68311L302867M557861K372041j133972j479880J862407
$$ plain form
9035 6021549 4471749 -219191 -2124058 1100851 6629080 10477546 10672109 7855272
9027 7855272 4611352 3155573 3042570 2775437 3385459 7206689 12810893 15227677 12560674
9018 12560674 8451992 6229147 4758499 2534284 1609224 3864713 6761647 6745718 4338253
9009 4338253 2200122 645715 -1045268 -1274312 1446303 4495815 4272926 2132485 2340808
9000 2340808 4745592 4751727 1088734 -1584201 398017 4538239 6429928 5677977 4576746
8991 4576746 3527909 1305160 -1446459 -2422451 -1295002 -381080 -1040079 -1511011 438939
8982 438939 3999653 5964768 4542773 1243062 -1229622 -1929495 -1979150 -2722822 -4340631
8973 -4340631 -5768572 -5300261 -1997394 2560467 4932508 3798536 2318656 4181063
8965D181063L780842P14919l543693l382555l01819n99871m826676o069460m20842
8956a0468092O686802P929430L452473j071655k368244j416863J15479J033548
8948C892878j84942l319854m673340j329805L626126M200783l56962m475513l835263
8939f455892l23038J694129Q47179j046574j879671q66278J063754J758680M71423
8930d736288j02035K765624O384795M834068k017675o440823l062412L100165
8922G25419L696053j012019l475517p54455J917435M45239j885410o81615K204209
8913A179339K115514q76485k666236j684142l40443m35846r94626r03771n45202
8904e151898k18475N10123J266418Q83332l97064p05824P44579K413076K564454
$$ plain form
8965 4181063 7961905 8676824 5133131 1750576 1448757 848886 -3977790 -10047250 -10468092
8956 -10468092 -3781290 4148140 7600613 6528958 4160714 2743851 2859330 3892878
8948 3892878 3707936 388082 -4285258 -5615063 -1988937 2211846 1854884 -2620629 -6455892
8939 -6455892 -6778930 -5084801 -4237622 -5284196 -7163867 -8030145 -6966391 -5207711 -4736288
8930 -4736288 -4838323 -2072699 4312096 9146164 7128489 687666 -2374746 725419
8922 725419 4421472 3409453 -66064 -820519 1096916 1542155 -343255 -1024870 1179339
8913 1179339 3294853 2418368 -247868 -1932010 -2272453 -2708299 -3702925 -4606696 -5151898
8904 -5151898 -5370373 -4860250 -3593832 -2710500 -3107564 -3813388 -3068809 -655733 1908721
8895A908721J186500p30653k326176k736781j336413J161391L006809L321541
8887C454939K629403J381835n06837k381527k904739k061025j442740j744154
8879c574845j591163J57218K404977L191632J923423n12768k596942k624570l5117
8870c258155K961201L025176m7277k755330k670195j279451n44776K93474J820614
8861b454719J459815k523476o229103m415212J276395L826181R72242j752904
8853i840781M1441L044318K188621j168160j855755R16018L136659K712734J707769
8844H82864J756402J632098L71406q26230j119126j338674j564342n36939J110046
8835C67505N28959k353595l178110M58653M420793L931051R90693O55307K244857
$$ plain form
8895 1908721 3095221 2364568 38392 -2698389 -4034802 -2873411 133398 3454939
8887 3454939 6084342 7466177 6959340 4577813 1673074 -387951 -1830691 -3574845
8879 -3574845 -5166008 -5008790 -2603813 587819 2511242 1998474 -598468 -3223038 -3258155
8870 -3258155 -296954 2728222 2680945 -74385 -2744580 -4024031 -4568807 -4275333 -2454719
8861 -2454719 -994904 -3518380 -9747483 -14162695 -12886300 -9060119 -8087877 -9840781
8853 -9840781 -9799340 -6755022 -4566401 -5734561 -7590316 -6674298 -3537639 -824905 882864
8844 882864 2639266 4271364 4642770 3816540 2697414 1358740 -205602 -742541 367505
8835 367505 896464 -1457131 -4635241 -4176588 244205 4175256 5165949 5821256 8066113
8826H066113R23209k753851k552941K653142N405617P58452n647550n940137j270976
8817c58922J603205J057532O76808J006229q70255l925171l106390J913163M736704
8808B732903J587184l140022l849742j188492J248490L092696N299383N463151
8800A1245551P03927o086897q147955l408877K737017M180153P58841k954275
8792i72515l343518p53501J992641K655447J353016K4737K84706J657741J979715
8783D878469k01475l487397m435875j422513K647237L233052Q5104k059747N1810
8774g11335L628135M040490J131840j873025l593478m596556m010593r32863J719074
8765e198311K24771l142268k163144L620083P270282M451691p56703k774817j674698
$$ plain form
8826 8066113 8989322 6235471 3682530 6335672 11741289 12499741 6852191 912054 -358922
8817 -358922 1244283 2301815 2978623 3984852 3114597 -810574 -3916964 -2003801 2732903
8808 2732903 4320087 1180065 -2669677 -3858169 -2609679 483017 5782400 11245551
8800 11245551 11949478 5862581 -2285374 -5694251 -2957234 1222919 1981760 -972515
8792 -972515 -4316033 -5069534 -3076893 -421446 931570 956307 1241013 2898754 4878469
8783 4878469 4676994 1189597 -3246278 -4668791 -2021554 1211498 1296602 -763145 -711335
8774 -711335 2916800 6957290 8089130 6216105 2622627 -1973929 -5984522 -6917385 -5198311
8765 -5198311 -4973540 -8115808 -10278952 -6658869 611413 5063104 4306401 1531584 -143114
8756a43114J7003K243370M687804L933780j260131n494695l207347K893602N287469
8747H957741J798626k716549l628239r70301K459868L564345N78278m373639o007998
8738c37868k541899Q20861q08819m081275k367538L475588N980451K233380k430369
8729e7488k796970J3629K406385L346830L251328J807286o07797j986871j100836
8720D275496Q49856J819617P20102k093307m464555l757740p14357J30217k914583
8711f149254m506320K65700O833387O486141m41749m748733k291599Q30197l87712
8702d109942j831980J348413N386858L801159j899889m533951j848513J689128
8694a998717K644259K253064K057127R02309k142848n116762n297855k591177
$$ plain form
8756 -143114 -126111 2117259 6805063 10738843 9478712 3984017 776670 3670272 8957741
8747 8957741 10756367 8039818 4411579 3441278 5901146 9465491 10043769 5670130 -337868
8738 -337868 -2879767 -2058906 -2867725 -6949000 -9316538 -5840950 139501 2372881 -57488
8729 -57488 -2854458 -2840829 -434444 2912386 6163714 7971000 7363203 5376332 4275496
8720 4275496 5125352 6944969 7665071 5571764 1107209 -2650531 -3364888 -3234671 -6149254
8711 -6149254 -10655574 -10389874 -3556487 2929654 2487905 -2260828 -4552427 -3722230 -4109942
8702 -4109942 -5941922 -4593509 793349 4594508 2694619 -1839332 -3687845 -1998717
8694 -1998717 645542 2898606 4955733 5858042 3715194 -1401568 -6699423 -9290600
8686i290600L70743J077015l03605j371812p26779J55474l77833q07918J322389
8677i952926M437613M221085M97059j609290P17933L498999K109868j758904l176655
8668a015218j288308O86716J037422R33606J093267R67433R87902K159946L308816
8659H871582J904192j828808m368851l402985p50874L17738q20028j937996j155288
8650c171318O77270J033156r31036k684512j159729K716690M242449Q83191l696248
8641b090087l785645Q19069L997973Q89613n527522p373856j194399P546940J0535454
8632C817540N982164k72649k690092j888136j351757j713733j447088r20932j717295
8623b201978k940147k228059j06492O15440j37898O29327L577797N212744K947326
$$ plain form
8686 -9290600 -8919857 -7842842 -8146447 -9518259 -10245038 -10089564 -10467397 -11275315 -9952926
8677 -9952926 -5515313 -1294228 -797169 -2406459 -1688526 1810473 3920341 2161437 -1015218
8668 -1015218 -2303526 -1616810 -579388 354218 1447485 2414918 3402820 5562766 8871582
8659 8871582 10775774 8946966 4578115 1175130 424256 741994 -78034 -2016030 -3171318
8650 -3171318 -2494048 -1460892 -2391928 -5076440 -6236169 -3519479 722970 1606161 -2090087
8641 -2090087 -5875732 -5056663 -1058690 -169077 -5696599 -13070455 -14264854 -6717914 3817540
8632 3817540 9799704 9527055 6836963 4948827 3597070 1883337 436249 -484683 -2201978
8623 -2201978 -5142125 -7370184 -7476676 -6861236 -6999134 -6369807 -2792010 2420734 5368060
8614E368060j127373l056203j339892K290979M270236J587831m362072p058891
8606c427325j951543O254039Q296536K373601m038249m908630k025991O45656
8598A218094K206296K012750j432083n377231l566591L601621O746051Q62129
8590F271036o000801m471587K149530M228644R14115r54398M20962O61341p78756
8581B440086L7775K150895l4809n539496n791092J814248Q191860N264738k777389
8572E756816o414872l401537J288260L855313M088831K033087k080726n437100
8564c11928m633473k44232L484532L628371J295471o17055p48432L4496M76792
8555B364542P32293J688875K700016J769064j090694k879981j851061l37440o98353
$$ plain form
8614 5368060 4240687 1184484 -155408 2135571 6405807 7993638 3631566 -3427325
8606 -3427325 -5378868 875171 9171707 11545308 7507059 2598429 572438 1218094
8598 1218094 3424390 5437140 4005057 -1372174 -4938765 -1337144 5408907 6271036
8590 6271036 270235 -4201352 -2051822 2176822 3090937 2136539 2557501 3218842 2440086
8581 2440086 2477861 4628756 4593947 -945549 -6736641 -4922393 3269467 8534205 5756816
8572 5756816 -658056 -4059593 -2771333 1083980 5172811 7205898 5125172 -311928
8564 -311928 -4945401 -5189633 -1705101 1923270 3218741 2601686 1853254 1887750 2364542
8555 2364542 3096835 4785710 7485726 9254790 8164096 5284115 3433054 3095614 2397261
8546B397261j113158P60778K543433P34364k333828j426015K485206L020866j136416
8537E932491l841359j515210J549740J182881r5542R29768J580217j436697m719395
8528d33106k785682K739387N050375K087766j303800j107437R00916Q18291k209345
8519C757365n501404n627629j599499L477177M974916K248896m08816P24R71533
8510B293263n56309k282548k31876L845204M290171J2716m255048n271969m576705
8501f733101l757627j811957J122114K472922J962937K718888M824598L116326
8493C915100m093488r148965m633376M480180O496836q9326m418686P234N515453
8484a969038K711139m626727n583038J079051N861450L567749k00037J75494J695516
$$ plain form
8546 2397261 1284103 2044881 4588314 5322678 2988850 1562835 4048041 7068907 5932491
8537 5932491 2091132 575922 2125662 3308543 3213001 4142769 5722986 4286289 -433106
8528 -433106 -3218788 -479401 4570974 6658740 5354940 4247503 5148419 5966710 3757365
8519 3757365 -1744039 -7371668 -8971167 -5493990 -519074 1729822 1321006 1321730 2293263
8510 2293263 1736954 -545594 -777470 3067734 7357905 7370621 3115573 -2156396 -6733101
8501 -6733101 -10490728 -12302685 -11180571 -8707649 -6744712 -4025824 798774 3915100
8493 3915100 -178388 -9327353 -13960729 -9480549 -2983713 -3073039 -7491725 -7484491 -1969038
8484 -1969038 742101 -3884626 -9467664 -8388613 -2527163 1040586 840549 1016043 2711559
8475B711559k69187l144224j897833J686127J583243k618246n023863k239017
8467i211441K640655N229070M531257J933125o23492j086287O88492J522307r86067
8458D637619l732334j927795K971917M641334J471470j261796k60607R60781j071471
8449F429118l753073l157317l97007Q49936k77904k348850m036633l034075K926410
8440f799395J0310831J0403679J080840p240653m668588L451388M015169m134291
8432F418980q767430l244945L992697L207782k519211l888420J28435K485023
8424b187089j97892l677589l505561l71094K846154M764376M806782K368686j428191
8415C418582l540497k453762l29739r5787j523452j948251l32653J305455R17179
$$ plain form
8475 2711559 2442372 -701852 -2599685 -913558 669685 -1948561 -6972424 -9211441
8467 -9211441 -6570786 -1341716 3189541 5122666 4499174 3412887 4101379 5623686 4637619
8458 4637619 905285 -1022510 1949407 6590741 8062211 6800415 6539808 7500589 6429118
8449 6429118 2676045 -481272 -878279 -28343 -306247 -2655097 -6691730 -9725805 -6799395
8440 -6799395 3511436 13915115 14995955 7755302 3086714 6538102 10553271 6418980
8432 6418980 -2348450 -5593395 -1600698 1607084 -912127 -4800547 -4672112 -2187089
8424 -2187089 -2384981 -6062570 -9568131 -9939225 -7093071 -2328695 2478087 4846773 3418582
8415 3418582 -121915 -2575677 -2905416 -3001203 -4524655 -6472906 -6805559 -5500104 -4582925
8406d582925o81398j117420K06688J686714K218020K432763K657215J625161j200635
8397C244183l555506k860101J0982J804271J335553L20285j59917j010372k238219
8388c108841j892133L76498J501499o67823l355969k359093J662327L779744J441005
8379b622786k609081m429738l109645j35911K839297M304961L132998J89279j725225
8370d165851r80020R36089J607022N54175j066778k136272j826828J63560K368030
8361d546873K384654L96794l86082J300852K169516k66538k645643n73752L655487
8352A488415L849459m09399l134134j425904R30383J049214J385127L367074L117881
8343A0218116j536499n335991l001189J939317K551883n65693j318436R48533
$$ plain form
8406 -4582925 -5264323 -6381743 -6175055 -4488341 -2270321 162442 2819657 4444818 3244183
8397 3244183 -311323 -3171424 -3160442 -1356171 -20618 299667 139750 -870622 -3108841
8388 -3108841 -5000974 -4624476 -3122977 -3790800 -7146769 -9505862 -7843535 -4063791 -2622786
8379 -2622786 -5231867 -9661605 -12771250 -12907161 -10067864 -5762903 -2629905 -2440626 -4165851
8370 -4165851 -5145871 -4209782 -2602760 -2048585 -3115363 -5251635 -7078463 -6914903 -4546873
8361 -4546873 -2162219 -1765425 -2151507 -850655 1318861 1052323 -1593320 -2167072 1488415
8352 1488415 5337874 4928475 1794341 368437 1298820 2348034 3733161 7100235 10218116
8343 10218116 8681617 3345626 344437 2283754 4835637 4269944 2951508 3900041
8335C900041Q62892k713575m096222m53788L075266J393702k908993l924433o45901
8326e511011K923512L409138Q86876k158521k797804l07878K183610J049211k316549
8317b639416k673078J399749M994801L919189K50819j855518k187677k695863
8309a486994k687353j96847L334441L969150Q03959k517340k353600P67655L028774
8300B661845J465146k868560n708054m084189K12059K837317K147285M00591K2758
8291b913802R82085J886951J432186r79583l661917k756693K587358O509571L017337
8282F103493m424828o311863n80228M688241L934998J369396J690634J870643
8274H340486j522596m120594j143615K592539l85778o786967o325714K166777
$$ plain form
8335 3900041 4762933 2049358 -2046864 -2500652 574614 1968316 -940677 -4865110 -5511011
8326 -5511011 -2587499 821639 1708515 -450006 -3247810 -3555688 -1372078 -322867 -2639416
8317 -2639416 -5312494 -3912745 1082056 5001245 5252064 3396546 1208869 -1486994
8309 -1486994 -4174347 -4371194 -1036753 2932397 3736356 1219016 -1134584 -366929 2661845
8300 2661845 4126991 1258431 -4449623 -8533812 -8321753 -5484436 -3337151 -2936560 -2913802
8291 -2913802 -1931717 -44766 1387420 407837 -3254080 -6010773 -3423415 3086156 6103493
8282 6103493 1678665 -4633198 -5213426 -525185 3409813 4779209 6469843 8340486
8274 8340486 6817890 2697296 1553681 4146220 3760442 -3026525 -9352239 -7185462
8266g185462Q381804N449241j606616n020251m366389l444838k789523l06334
8258a0888368L509094N261338K963162j449396l883909k119100J604658K942489
8250b060032J022772m63380R18110K641507J901599L06063Q2911n38330l076025
8241G35195l754500O99830N392738L268400l303296n624111k232350J92379m50284
8232e075999J267284O287731P034887K36390o006014m519099m2424k57099l028371
8223d102714j574223K939704L686599O9581k004630n19069N48748m69579l55172
8214a780755K087055L331507J366448r34689r97050n08431j670339l163719k584318
8205d854291m07948R00320K78774j094362j465130j77091J632214J982697M66533
$$ plain form
8266 -7185462 1196342 6645583 5038967 18716 -4347673 -7792511 -10582034 -10888368
8258 -10888368 -7379274 -2117936 845226 -604170 -4488079 -6607179 -5002521 -2060032
8250 -2060032 -1037260 -1500640 -582530 2058977 3960576 4266639 4349550 3811220 735195
8241 735195 -3019305 -2319475 3073263 6341663 3038367 -2585744 -4818094 -4625715 -5075999
8232 -5075999 -3808715 2479016 9513903 9750293 3744279 -774820 -817244 -1074343 -4102714
8223 -4102714 -5676937 -2737233 949366 1018947 -985683 -1504752 -956004 -1425583 -1780755
8214 -1780755 306300 3637807 5004255 4069566 3072516 2564085 893746 -2269973 -4854291
8205 -4854291 -5262239 -4361919 -4083145 -5177507 -6642637 -6819728 -5187514 -3204817 -2738284
8196b738284r99672r27488l24636j71421J208953N038925P897551N137016j697341
8187A2423603n651314l654337m18114q69940l026432k061004J653244L198962
8179A594668O38938k412342k064117J207793M036633M032590J383857j714441
8171F703579k680040j041304N13351p44028l487480l790311j037356P36291j113420
8162e940718l660028k938668O6281J570449J089193J044895J521766M38334j212460
8153h020956K56780M483884O040572K385049k126133l100116k155864k323788
8145d560572k101748P62756L345450J519678k505442k897052P15450K862398O36083
8136b222999k999952m437402l078572K67785L966722M758794J256402k173322
$$ plain form
8196 -2738284 -3737956 -4665444 -4990080 -5161501 -3952548 1086377 8983928 14120944 12423603
8187 12423603 6772289 3117952 2699838 1829898 -1196534 -3257538 -1604294 1594668
8179 1594668 2233606 -178736 -2242853 -1035060 3001573 7034163 8418020 6703579
8171 6703579 4023539 2982235 3495586 2751558 -735922 -4526233 -5563589 -4827298 -5940718
8162 -5940718 -9600746 -12539414 -12473133 -10902684 -9813491 -8768596 -7246830 -6808496 -8020956
8153 -8020956 -7764176 -3280292 2760280 5145329 3019196 -80920 -2236784 -4560572
8145 -4560572 -6662320 -5899564 -2554114 -1034436 -3539878 -6436930 -5721480 -2859082 -2222999
8136 -2222999 -5222951 -9660353 -12738925 -12471140 -8504418 -3745624 -2489222 -4662544
8128d662544l85200M178599M405727k26393k692226J4296K303903L8882k474615
8119E00429l39109L457598L224681m52126k693325j928486l60149N04021L79260
8110B292794j232742l307355k964803j39919J062924q56211j262860K804697O232805
8101B629330L361830k347603l449240j44878J189052q21985j281491J401232K873204
8092C409451R59760q45031m1450R66026J240j213147r54487l91097l39884M87112
8082B038493J876337J113207k053096l619101j185866K151279K575544P63359
8074C660156o11836j387119k629169l443217k435766m75117R65324K411242M413026
8065D67524M812891J521759l007280l813672o4941L539155K905648m64925k252049
$$ plain form
8128 -4662544 -5047744 -869145 3536582 3310189 617963 632259 2936162 2975044 500429
8119 500429 161320 3618918 6843599 6391473 3698148 1769662 1409513 1913534 2292794
8110 2292794 1060052 -2247303 -5212106 -5352025 -4289101 -5145312 -6408172 -3603475 2629330
8101 2629330 5991160 3643557 194317 49439 1238491 416506 -864985 536247 3409451
8092 3409451 4369211 3524180 3482730 4448756 4449996 3236849 2282362 1891265 1551381 2038493
8082 2038493 3914830 5028037 2974941 -644160 -1830026 321253 2896797 3660156
8074 3660156 3048320 1661201 -967968 -4411185 -6846951 -7322068 -6356744 -3945502 467524
8065 467524 5280415 6802174 3794894 -18778 -83719 3455436 6361084 5896159 3644110
8056C644110j367745q30177k656948m244291j679046M271431Q046577N776088
8048A0959999l55528n424652p122625n854497k029701L297360O585494M743606
8040D799456k15976l110938k352288j161670j671661j935007k21367J581553J220302
8031c067596k14433l63373P70244J530772J222387J62235j214754j871673p97137
8022c843328O30141l63239k907651j961105M163869R219205O631072o20068l437212
8013G511684O84176M428107J507166m735829o770133l010723J554775K708241
8005C877464Q92587j503957l104658l353376k081538j84633R69559J342193J919664
7996a226695K422922J353460j018156j966209p2434K237555J897059n43116k161662
$$ plain form
8056 3644110 2276365 1446188 -1210760 -5455051 -7134097 -2862666 5183911 10959999
8048 10959999 10604471 5179819 -1942806 -7797303 -9827004 -6529644 55850 4799456
8040 4799456 4583480 1472542 -879746 -2041416 -3713077 -5648084 -5869451 -4287898 -3067596
8031 -3067596 -3282029 -3645402 -2875158 -1344386 -121999 40236 -1174518 -3046191 -3843328
8022 -3843328 -3213187 -3576426 -6484077 -8445182 -4281313 4937892 11568964 10948896 7511684
8013 7511684 8195860 12623967 14131133 9395304 2625171 -385552 1169223 3877464
8005 3877464 4770051 3266094 161436 -3191940 -5273478 -5458111 -4488552 -3146359 -1226695
7996 -1226695 1196227 2549687 1531531 -434678 -507112 1730443 3627502 3084386 922724
7987I22724k018427j517173j081641L31192K232527K416661P61915P8814J496706
7978C623298K014918p47917l853066k671799K014400M432027J554325k982807
7970C383379l985892j146343J601398J584007j44711j476175j980672j982364
7962d147373p36514K236342M600561K922891k063695m725809j447435L873128
7954E12096M594291K91697l041264j441175K581538M647655L517603L63637l056283
7945H969795m051298p93008L749757L777164j261354m931317k944686O60443L21179
7936C496675k592619l127656q52044R94548J648550K411627K341877J02291j791677
7927B631572l80463J890209Q24770j857237j410210Q93236l76661m349373m153577
$$ plain form
7987 922724 -1095703 -2612876 -3694517 -3363325 -1130798 1285863 2047778 2126592 3623298
7978 3623298 5638216 4890299 1037233 -1634566 379834 4811861 6366186 3383379
7970 3383379 -602513 -1748856 -147458 1436549 1291838 -184337 -2165009 -4147373
7962 -4147373 -4883887 -2647545 1953016 4875907 2812212 -1913597 -3361032 512096
7954 512096 5106387 5398084 2356820 915645 3497183 8144838 11662441 12026078 8969795
7945 8969795 4918497 4125489 7875246 11652410 10391056 5459739 2515053 3175496 3496675
7936 3496675 904056 -2223600 -3075644 -2081096 -432546 1979081 4320958 4423249 2631572
7927 2631572 2251109 4141318 4966088 3108851 1698641 2591877 2215216 -2134157 -6287734
7918f287734J109974L831568L85541k615669N17578M889712L158998k504117m128083
7909a642232r5874L651227K946361k95907k616346k747730p31671K549505M489948
7900E507281K579499k259664o171495o339555l128017J100944L827169L749724
7892a134114J752582M7378k92092l1808N7842q5961j055643l301998m741316k290523
7882a1075653L021749N949680L885314M24336k07450J122198J190227l20650j770152
7873B219599l048347m323428l611981K16831L679354K375102k278155m246430
$$ plain form
7918 -6287734 -5177760 -1346192 -960651 -3576320 -3058742 1830970 4989968 2485851 -1642232
7909 -1642232 -1738106 1913121 4859482 4563575 1947229 -800501 -1532172 1017333 5507281
7900 5507281 8086780 5827116 -344379 -6683934 -9811951 -8711007 -4883838 -1134114
7892 -1134114 618468 665846 373754 341946 399788 313827 -741816 -4043814 -8785130 -11075653
7882 -11075653 -8053904 -2104224 1781090 2205426 1997976 3120174 4310401 3989751 2219599
7873 2219599 -828748 -5152176 -8764157 -8547326 -4867972 -2492870 -4771025 -9017455
$$ [...]
##END NTUPLES=NMR SPECTRUM
##END=
