##TITLE=31Pdec_2SR59H
 d2O, 24 sc
 31.05.2021
##JCAMPDX= 6.0         $$ Bruker NMR JCAMP-DX V2.0
##DATA TYPE= NMR SPECTRUM
##DATA CLASS= NTUPLES
##ORIGIN= UXNMR, Bruker Analytische Messtechnik GmbH
##OWNER= root
$$ XWIN-NMR		Version 3.5
$$ Mon May 31 12:26:00 2021 Russian Standard Time (UT+4h)  she@DPX200
##.OBSERVE FREQUENCY= 81.013821
##.OBSERVE NUCLEUS= ^31P
##.ACQUISITION MODE= SIMULTANEOUS
##.ACQUISITION SCHEME= undefined
##.AVERAGES= 24
##.DIGITISER RES= 16
##SPECTROMETER/DATA SYSTEM= spect
##.PULSE SEQUENCE= zgpg30
##.SOLVENT NAME= D2O
##.SHIFT REFERENCE= (INTERNAL, D2O, 0, 248.564)
##AUDIT TRAIL= $$ (NUMBER, WHEN, WHO, WHERE, WHAT)
$$ ##TITLE= Audit trail, XWIN-NMR		Version 3.5
$$ ##JCAMPDX= 5.01
$$ ##ORIGIN= Bruker BioSpin GmbH
$$ ##OWNER= she
$$ F:/spectra/data/she/nmr/P31/1/pdata/1/auditp.txt
$$ ##AUDIT TRAIL=  $$ (NUMBER, WHEN, WHO, WHERE, WHAT)
(   1,<2021-05-31 12:24:53.79 +0400>,<she>,<DPX200>,
      <created by zg, POWCHK disabled, PULCHK disabled
       configuration hash MD5:
       00 E9 B6 7A A2 85 ED C7 34 08 36 98 17 FE 4E 26
       data hash MD5: 32K
       1E 5B BB 82 67 37 35 17 E9 7D 49 20 77 D7 B9 0D>)
(   2,<2021-05-31 12:24:58.81 +0400>,<she>,<DPX200>,
      <Start of raw data processing
       efp BC_mod = 2 LB = 1 FT_mod = 6 PKNL = 1 PHC0 = -6238.595 PHC1 = 69.4012 SI = 64K 
       data hash MD5: 64K
       04 2F 16 C2 D0 68 88 E6 1D BE 70 8F 24 21 23 48>)
(   3,<2021-05-31 12:25:30.57 +0400>,<she>,<DPX200>,
      <pk PHC0 = -120.9665 PHC1 = 302.4 
       data hash MD5: 64K
       00 D5 76 E4 FD 6F 07 11 47 39 A0 FE 43 AD 52 DB>)
(   4,<2021-05-31 12:25:33.53 +0400>,<she>,<DPX200>,
      <abs ABSG = 5 
       data hash MD5: 64K
       6D 65 39 91 41 E5 E2 E2 F9 2E E0 64 7F 24 09 03>)
$$ ##END=
$$ 
$$ hash MD5
$$ D1 6C CD 82 0F C8 61 9B 12 47 F4 43 AD E5 23 BA
##$RELAX= 
##$RELAX= 
##$RELAX= 
##$RELAX= 
##$RELAX= 
##$RELAX= 
##$RELAX= 
##$RELAX= 
$$ Bruker specific parameters
$$ --------------------------
##$DU= <F:/spectra>
##$EXPNO= 1
##$NAME= <P31>
##$PROCNO= 1
##$TYPE= <nmr>
##$USER= <she>
##$AMP= (0..31)
100 100 100 100 100 100 100 100 100 100 100 100 100 100 100 100 100 100 
100 100 100 100 100 100 100 100 100 100 100 100 100 100 
##$AQSEQ= 0
##$AQ_mod= 1
##$AUNM= <au_zg>
##$AUTOPOS= <>
##$BF1= 81.014009
##$BF2= 200.13
##$BF3= 200.13
##$BF4= 200.13
##$BF5= 200.13
##$BF6= 200.13
##$BF7= 200.13
##$BF8= 200.13
##$BYTORDA= 1
##$CFDGTYP= 0
##$CFRGTYP= 5
##$CHEMSTR= <none>
##$CNST= (0..31)
1 1 145 1 1 1 1 1 1 1 1 1 1 1 1 1 1 1 1 1 1 1 1 1 1 1 1 1 1 1 1 1 
##$CPDPRG= <waltz16>
##$CPDPRG1= <>
##$CPDPRG2= <waltz16>
##$CPDPRG3= <>
##$CPDPRG4= <mlev>
##$CPDPRG5= <mlev>
##$CPDPRG6= <mlev>
##$CPDPRG7= <mlev>
##$CPDPRG8= <mlev>
##$CPDPRGB= <>
##$CPDPRGT= <>
##$D= (0..31)
0 1 0 0 0 0 0 0 0 0 0 0.03 2e-05 3e-06 0 0 0 0 0 0 0 0 0 0 0 0 0 0 0 0 
0 0 
##$DATE= 1622449493
##$DBL= (0..7)
120 120 120 11 120 120 24 19 
##$DBP= (0..7)
150 150 150 150 150 150 150 150 
##$DBP07= 0
##$DBPNAM0= <>
##$DBPNAM1= <>
##$DBPNAM2= <>
$$ [...]
##$SUBNAM3= <"">
##$SUBNAM4= <"">
##$SUBNAM5= <"">
##$SUBNAM6= <"">
##$SUBNAM7= <"">
##$SUBNAM8= <"">
##$SUBNAM9= <"">
##$SW= 501.771253377433
##$SWIBOX= (0..15)
0 1 3 0 0 0 0 0 0 0 0 0 0 0 0 0 
##$SW_h= 40650.406504065
##$TD= 32768
##$TD0= 1
##$TE= 0
##$TE2= 300
##$TE3= 300
##$TEG= 300
##$TL= (0..7)
0 120 53 12 22 120 120 120 
##$TP= (0..7)
150 150 150 150 150 150 150 150 
##$TP07= 0
##$TPNAME0= <>
##$TPNAME1= <>
##$TPNAME2= <>
##$TPNAME3= <>
##$TPNAME4= <>
##$TPNAME5= <>
##$TPNAME6= <>
##$TPNAME7= <>
##$TPOAL= (0..7)
0.5 0.5 0.5 0.5 0.5 0.5 0.5 0.5 
##$TPOFFS= (0..7)
0 0 0 0 0 0 0 0 
##$TUNHIN= 0
##$TUNHOUT= 0
##$TUNXOUT= 0
##$USERA1= <user>
##$USERA2= <user>
##$USERA3= <user>
##$USERA4= <user>
##$USERA5= <user>
##$V9= 5
##$VALIST= <valist>
##$VCLIST= <CCCCCCCCCCCCCCC>
##$VD= 0
##$VDLIST= <DDDDDDDDDDDDDDD>
##$VPLIST= <PPPPPPPPPPPPPPP>
##$VTLIST= <TTTTTTTTTTTTTTT>
##$WBST= 1024
##$WBSW= 4
##$XGAIN= (0..3)
0 0 0 0 
##$XL= 0
##$YL= 0
##$YMAX_a= 8230
##$YMIN_a= -9590
##$ZGOPTNS= <>
##$ZL1= 120
##$ZL2= 120
##$ZL3= 120
##$ZL4= 120
##$ABSF1= 248.5645
##$ABSF2= -253.2056
##$ABSG= 5
##$ABSL= 3
##$ALPHA= 0
##$AQORDER= 0
##$ASSFAC= 0
##$ASSFACI= 0
##$ASSFACX= 0
##$ASSWID= 0
##$AUNMP= <proc_1d>
##$AZFE= 0.1
##$AZFW= 0.5
##$BCFW= 0
##$BC_mod= 2
##$BYTORDP= 0
##$COROFFS= 0
##$CY= -3
##$DATMOD= 1
##$DC= 0
##$DFILT= <>
##$DTYPP= 0
##$F1P= 0
##$F2P= 0
##$FCOR= 1
##$FTSIZE= 65536
##$FT_mod= 6
##$GAMMA= 0
##$GB= 0
##$INTBC= 1
##$INTSCL= 5.30512e-09
##$ISEN= 30
##$LB= 1
##$LEV0= 0
##$LPBIN= 0
##$MAXI= 10000
##$MC2= 0
##$MEAN= 0
##$ME_mod= 0
##$MI= 50
##$NCOEF= 0
##$NC_proc= -6
##$NLEV= 6
##$NOISF1= 182.463
##$NOISF2= 159.3651
##$NSP= 0
##$NTH_PI= 0
##$NZP= 0
##$OFFSET= 248.5645
##$PC= 4
##$PHC0= -6359.562
##$PHC1= 371.8012
##$PH_mod= 1
##$PKNL= yes
##$PPARMOD= 0
##$PSCAL= 0
##$PSIGN= 0
##$REVERSE= no
##$SF= 81.014009
##$SI= 65536
##$SIGF1= 159.3651
##$SIGF2= -187.1042
##$SINO= 113.3802
##$SIOLD= 16384
##$SREGLST= <1H.CDCl3>
##$SSB= 0
##$STSI= 65536
##$STSR= 0
##$SW_p= 40650.406504065
##$SYMM= 0
##$S_DEV= 0
##$TDeff= 32768
##$TDoff= 0
##$TI= <>
##$TILT= no
##$TM1= 0
##$TM2= 0
##$TOPLEV= 0
##$USERP1= <user>
##$USERP2= <user>
##$USERP3= <user>
##$USERP4= <user>
##$USERP5= <user>
##$WDW= 1
##$XDIM= 65536
##$YMAX_p= 499796300
##$YMIN_p= -12209738
$$ End of Bruker specific parameters
$$ ---------------------------------
##NTUPLES= NMR SPECTRUM
##VAR_NAME=  FREQUENCY,     SPECTRUM/REAL,   SPECTRUM/IMAG
##SYMBOL=    X,             R,               I
##VAR_TYPE=  INDEPENDENT,   DEPENDENT,       DEPENDENT
##VAR_FORM=  AFFN,          ASDF,            ASDF
##VAR_DIM=   65536,         65536,           65536
##UNITS=     HZ,            ARBITRARY UNITS, ARBITRARY UNITS
##FACTOR=    0.620285442955139, 1,           1
##FIRST=     20137.2065510759, 0,            0
##LAST=      -20513.1999529892, 0,           0
##MIN=       -20513.1999529892, -12209738,   0
##MAX=       20137.2065510759, 499796300,    0
$$ Real data points
##PAGE= N=1
##DATA TABLE= (X++(R..R)), XYDATA
$$ [...]
40213a359287K255100K037393R26208j37811o15221r46753j073190j22736J461481
40204B425184J514572n52636k003813n55901J684497R44624k389419l933644j519068
40195d385604J835316K300312O8655j883713j959446q21396N96261J708279J552428
40186i88908k78809k034161j315356J378275K722585J114681q92609l16969J826548
40177A215277K202734K61135j197203n40035N07366J07665q38742p32141j04204
40168H81852l01033p97043j60346J191541J566869Q80529O34843J120540R44252
40159E962004l44341j317002j014293l36278k41238k18759M18749J107016J043180
40150E059038O56239J031402K478021M343018N725593O070170N675305N595320
$$ plain form
40213 -1359287 895813 2933206 3859414 3721603 3106382 2159629 1086439 963703 2425184
40204 2425184 3939756 3387120 1383307 827406 2511903 3456527 1067108 -2866536 -4385604
40195 -4385604 -2550288 -249976 -181321 -2065034 -4024480 -4845876 -4249615 -2541336 -988908
40186 -988908 -1267717 -3301878 -4617234 -3238959 -516374 598307 -294302 -611271 1215277
40177 1215277 3418011 3679146 2481943 1941908 2449274 2556939 1718197 986056 881852
40168 881852 580819 -216224 -376570 814971 2381840 3262369 3897212 5017752 5962004
40159 5962004 5617663 4300661 3286368 2950090 2708852 2490093 2908842 4015858 5059038
40150 5059038 5715277 6746679 9224700 13567718 19293311 25363481 31038786 36634106
40142C6634106O131710N678596K474612k628513o837148q784943r213577q357950
40134A5096893n443360j457640O50510Q7724k56733J682689L876008L849186K818171
40125B0903448K895197K555030r09870n763995p224547m330018j178936p36143
40117F210166j319107m80954J098501J471133N41081n79925j386916j564752n24692
40108C464535J147966J399437o37927l048917l547846k272980r66456n51505p01397
40099e715090p73359j67661J237679K294825J523359m42821r37227J195156L701246
40090A916107L761107J304940j624280l296023k949844p96264J245533O66190
40082B27466k115860l293155p41425K462013K216508o71196j974604l42292J442019
$$ plain form
40142 36634106 42765816 48444412 50919024 48290511 41453363 32668420 23454843 15096893
40134 15096893 9653533 8195893 8846403 8934127 8677394 10360083 14236091 18085277 20903448
40125 20903448 23798645 26353675 25443805 19679810 12455263 8125245 6946309 6210166
40117 6210166 4891059 4410105 5508606 6979739 7520820 6940895 5553979 3989227 3464535
40108 3464535 4612501 6011938 5374011 2325094 -1222752 -3495732 -4462188 -5013693 -5715090
40099 -5715090 -6488449 -6656110 -5418431 -3123606 -1600247 -2043068 -2980295 -1785139 1916107
40090 1916107 5677214 6982154 5357874 2061851 -887993 -1684257 -438724 227466
40082 227466 -1888394 -5181549 -5922974 -3460961 -1244453 -1915649 -3890253 -4232545 -2790526
40073b790526J202111n188l81062L25614J547878K553254K074342l80911k737463
40064A408049k411073k29871N92647m34722n06418J206823J732297l90483j897244
40055i29995N4144K774371K015950j164629j963553P25933K883398J625641j069864
40046D951396k076320j327978n72624k97330P4448M01733J56350k38450O2316
40037A133541Q42220J042639K84515o85733r96293n37508P0723J05711m51825
40028H07990o33678M67532K152816K415154M36914j891060k015059l6237J267867
40019B972239O2668k088559k350802m19812J261754R88031j87464n90629m60262
40010h12836q15090j005545L11970K181508K044784o8961r06828R49189K146248
$$ plain form
40073 -2790526 -1588415 -1593603 -1974665 -1649051 -101173 2452081 4526423 4145512 1408049
40064 1408049 -1003024 -1232895 -640248 -1074970 -1581388 -374565 1357732 967249 -929995
40055 -929995 -875851 1898520 3914470 2749841 786288 1512221 4395619 6021260 4951396
40046 4951396 2875076 1547098 974474 677144 751592 1153325 1309675 1071225 1133541
40037 1133541 1975761 3018400 3302915 2617182 1620889 1083381 1154104 1259815 807990
40028 807990 174312 641844 2794660 5209814 5646728 3755668 1740609 1704372 2972239
40019 2972239 3034907 946348 -1404454 -1824266 -562512 425519 238055 -352574 -812836
40010 -812836 -1627926 -2633471 -2321501 -139993 1904791 1835830 929002 1878191 4024439
40001D024439n79390m645512m535572J65314L772438K402353r14634j177094J490584
39992B926K831203R37324j661909k166156q46292M21020Q11712P25196O51438
39983A706462P70681Q73847K81307j251839k411470j473336R85976K132603N92401
39974B206632j433830j280187K81054L79988j383786k244369m66776K063348K592385
39965G14459J169438K3255K50807P69985L10414r19032j780032j578759n64656
39956a604121N35322J232059J551507J590160J073764r4356j040737o95701M62948
39947C010845O70196n55261j444439o29050N28220j42333k238476l225053j901778
39938e927129M04429K046411K644672K292868J001203m99194r39466k04322L97484
$$ plain form
40001 4024439 3445049 -1200463 -5736035 -5570721 -1798283 604070 -310564 -1487658 2926
39992 2926 2834129 3771453 2109544 -56612 -902904 -481884 329828 1055024 1706462
39983 1706462 2477143 3350990 3632297 2380458 -31012 -1504348 -518372 1614231 2206632
39974 2206632 772802 -507385 -226331 153657 -1230129 -3474498 -3941274 -1877926 714459
39965 714459 1883897 1907152 2157959 2927944 3238358 2319326 539294 -1039465 -1604121
39956 -1604121 -1068799 163260 1714767 3304927 4378691 4284335 3243598 2547897 3010845
39947 3010845 3681041 3125780 1681341 1052291 1580511 1438178 -800298 -4025351 -5927129
39938 -5927129 -5522700 -3476289 -831617 1461251 2462454 1963260 1023794 819472 1216956
39929A216956Q0375m97311p62116j172723j851355j754607l21802J276302J735044
39920b051237J420995J353121J326346M34674j172915k358314k396130j297482
39912d740942O57351K592341K908469R21497j659774k288487o46237J004266O91844
39903e59672j016305j964806r57443J007681J846303O36210j311595j909565o43073
39894d872265J204678K445718K877363K261635J95927k287323k845507r09145
39886a928919R21247K34004j772122k149484l67274J566673K335249K292145J665803
39877B797322K64874j014969p40232O76450J240170M03446k29636K81895Q43849
39868D523169O04807N62202J652072K893577K865219J830647J035327P68806L65335
$$ plain form
39929 1216956 1297331 800020 37904 -1134819 -2986174 -4740781 -5062583 -3786281 -2051237
39920 -2051237 -630242 722879 2049225 2483899 1310984 -1047330 -3443460 -4740942
39912 -4740942 -4083591 -1491250 1417219 2338716 678942 -1609545 -2255782 -1251516 -559672
39903 -559672 -1575977 -3540783 -4498226 -3490545 -1644242 -1008032 -2319627 -4229192 -4872265
39894 -4872265 -3667587 -1221869 1655494 3917129 4113056 1825733 -1019774 -1928919
39886 -1928919 -1007672 -773668 -2545790 -4695274 -5062548 -3495875 -1160626 1131519 2797322
39877 2797322 3062196 2047227 1306995 1983445 3223615 3627061 3397425 3679320 4523169
39868 4523169 5127976 5690178 7342250 10235827 13101046 14931693 15967020 16735826 17101161
39859A7101161m80709j426590k053659j989625r88868M38295J026464J03525j419521
39850A0310473j973616j008327N97116J565620J476629J108658J346567J608173
39842A5031293J93804k980936n025466l202839R86226K978690P83379k527846
39834F236305k892641k45486J906404J046724j504515k303769J95414L637729
39826F076165M259299J457738j369975j366284J34785L45547l63171L20558J939639
39817A1434301J744302j92074o13592J251733J956800m40629l001944k779798
39809I359099j297322j056365j090002K19296J016840q14332k782888j190477
39801B363849K258052K688980R4513o35874K019809L781451J935966l42757K09976
$$ plain form
39859 17101161 16620452 15193862 13140203 11150578 10161710 10600005 11626469 11729994 10310473
39850 10310473 8336857 7328530 7925646 9491266 10967895 12076553 13423120 15031293
39842 15031293 15225097 12244161 7218695 4015856 5002082 7980772 8764151 6236305
39834 6236305 3343664 3098178 5004582 6051306 4546791 2243022 2438436 6076165
39826 6076165 10335464 11793202 10423227 9056943 9191728 9537275 9174104 9494662 11434301
39817 11434301 13178603 12986529 12372937 13624670 15581470 15140841 12138897 9359099
39809 9359099 8061777 7005412 5915410 6134706 7151546 6337214 3554326 2363849
39801 2363849 4621901 7310881 7405394 6769520 8789329 12570780 14506746 14163989 14373965
39792A4373965J483631j3938l152380m211785k705572j326978j424468j981377
39784A041098k257916k328051j550018N68375K343796J637218n31365j007525
39776b084388O89163J661181M50763o21780M89291K048592J505242k43968n66122
39767C327974L09966k19117k463124l673695k453348p75036m30997l60732P27538
39758f010571J710975J370316J045972K074961K537690J70903k826022k191631
39750b117407J538838L151670M48987k679046k511488n33053K88024L27331J055246
39741a030898J240815o09762k444487j488470Q77853J303126J87049P24976K980540
39732A740742L588485J422158q90806j626582j886218k078148q14358J340638
$$ plain form
39792 14373965 15857596 15843658 12691278 8479493 5773921 4446943 3022475 1041098
39784 1041098 -1216818 -3544869 -5094887 -4526512 -2182716 -545498 -1076863 -2084388
39776 -2084388 -1395225 265956 716719 94939 584230 2632822 4138064 3894096 3327974
39767 3327974 3637940 3418823 955699 -2717996 -5171344 -5946380 -6377377 -6738109 -6010571
39758 -6010571 -4299596 -2929280 -1883308 191653 2729343 2900246 74224 -2117407
39750 -2117407 -578569 2573101 3022088 343042 -2168446 -2701499 -2413475 -2086144 -1030898
39741 -1030898 209917 -399845 -2844332 -4332802 -3454949 -2151823 -1964774 -1239798 1740742
39732 1740742 5329227 6751385 5860579 4233997 2347779 269631 -544727 795911
39724G95911J259118j665786l721025k447268k87366L9116J10291K158176L996118
39715B37285K107439k031432l391171o38425K233034J884375l09368j253090m62739
39706a624092J90447m19454j289854p43792J294566K801040J994294n9710o52312
39697A491133O04755J219049J7930q62120M5448N44511j308851k958343j020355
39688b226843K629524L106469J3456k213918j486678n35177j230718j464571K07423
39679c201033J309855k15189k093467j449329N47633J222259R97704J701871K364229
39670A184533Q49354j607485j714588N32152J817541Q56761o2704N11155R00645
39661C267364k56791j362057n27830J323876J965898J004301j62082n73439n48430
$$ plain form
39724 795911 2055029 389243 -3331782 -5779050 -6066416 -6027300 -5917009 -3758833 237285
39715 237285 2344724 313292 -3077879 -3716304 -1483270 401105 91737 -1161353 -1624092
39706 -1624092 -1433645 -1853099 -3142953 -3886745 -2592179 208861 2203155 2143445 1491133
39697 1491133 2095888 3314937 3332867 2470747 2516195 3060706 1751855 -1206488 -2226843
39688 -2226843 402681 3509150 3522606 1308688 -177990 -713167 -1943885 -3408456 -3201033
39679 -3201033 -1891178 -2106367 -4199834 -5649163 -5101530 -3879271 -2881567 -1179696 1184533
39670 1184533 2033887 426402 -1288186 -756034 1061507 1918268 1855564 2366719 3267364
39661 3267364 3010573 1648516 1120686 2444562 4410460 5414761 5252679 4679240 4130810
39652D130810p83104j414690j738372q47327R03034J648119M16367r87322l60898
39643I66617J324461J284606m66614j018902N34309J501518Q2531j795409j867128
39634E45989q08634j57482K20549M66820n08074k158447j446746K016270L405240
39625A575485m82946m926372l335101K464477M430934K22405l789545k479970
39617f320633J327101K562099J050078l11068m89108o0045J016966K408721K581612
39608C765723J260558K79308J94758q75805l092924l277275k04062K244721Q08752
39599A103754j690022q73519K076282K611170O8414k154565k333012j651338o68129
39590c510965R62117J945989Q31343o40975J28901J796586J131708j068651j248047
$$ plain form
39652 4130810 3347706 1933016 194644 -652683 250351 1898470 2314837 1327515 966617
39643 966617 2291078 3575684 3109070 2090168 2624477 4125995 4208526 2413117 545989
39634 545989 -262645 -420127 -199578 267242 -240832 -2399279 -3846025 -1829755 1575485
39625 1575485 1092539 -3833833 -7168934 -4704457 -273523 -51118 -3840663 -6320633
39617 -6320633 -4993532 -2431433 -1381355 -1692423 -2181531 -2241576 -1224610 1184111 3765723
39608 3765723 5026281 5305589 5500347 4624542 1531618 -1745657 -1949719 295002 1103754
39599 1103754 -586268 -1459787 616495 3227665 3296079 1141514 -1191498 -2842836 -3510965
39590 -3510965 -2548848 -602859 228484 -412491 -283590 1512996 2644704 1576053 328006
39581C28006M09627M64666j016139n23620J572014P35471l056256l653554J142877
39572c596908M882601K410839j930469j797940J013650Q46585j620788j219927
39564a012357K064680L113591O07171j282340n30567j6151j371270j975964j45265
39555e48472J643336J136207j16935K2777Q72131R87920O76941L80906o46757
39546D408054k077452j769075N27207J546027p82993l536830k776290O68238K721580
39537a071534J995482O95276K74168k42221j335683j639655n87446J27002p10482
39528b495093j490418r3431K496208L010663L34808k693513k790939l60618J289676
39519b792657M18190j179600j090051M93547J691491J830451J672926J459927
$$ plain form
39581 328006 737633 1202299 186160 -337460 1234554 1970025 -1086231 -4739785 -3596908
39572 -3596908 1285693 3696532 1766063 -31877 981773 1828358 207570 -1012357
39564 -1012357 1052323 4165914 4773085 3490745 2960178 2944027 1572757 -403207 -548472
39555 -548472 1094864 2231071 2114136 2136913 3009044 3996964 4673905 5054811 4408054
39546 4408054 2330602 561527 1088734 2634761 1851768 -1685062 -4461352 -3793114 -1071534
39537 -1071534 923948 1619224 1893392 1651171 315488 -1324167 -1911613 -1784611 -2495093
39528 -2495093 -3985511 -4078942 -1582734 1427929 1762737 -930776 -3721715 -4082333 -2792657
39519 -2792657 -2374467 -3554067 -4644118 -4150571 -2459080 -628629 1044297 2504224
39511B504224O73103m41285r69591r53880j106549r81188L73161J816054R10896
39502A824945j921712l029767q49339J404871P51923p13445N41731L192025K847899
39493D049131p13309k862221j179829J248397J167583k04676l54479M9270q32073
39484C67794j878620p28849J562195J470247j456850l548860k299743L19728J257564
39475d935394O20404N31143J438500J882839J230001M82682K98040p4782j260515
39466B12918k292997j619407P50768K831422K669321N67807j140916q04925N27514
39457A701505N52017j079318k229384j292079O05772J354383O81987j43201o15476
39448d63794j262936j919387j554818n6135J414435K185141K612571K440060N74662
$$ plain form
39511 2504224 3177327 2736042 1766451 812571 -293978 -1275166 -902005 914049 1824945
39502 1824945 -96767 -3126534 -3975873 -2571002 -1819079 -2532524 -1990793 1201232 4049131
39493 4049131 3335822 473601 -706228 542169 1709752 1505076 1150597 1199867 367794
39484 367794 -1510826 -2239675 -677480 792767 -664083 -4212943 -6512686 -6192958 -4935394
39475 -4935394 -4314990 -3783847 -2345347 -462508 767493 1250175 1548215 1473433 212918
39466 212918 -2080079 -3699486 -2948718 -117296 2552025 3119832 1978916 1173991 1701505
39457 1701505 2253522 1174204 -1055180 -2347259 -1741487 -387104 294883 151682 -463794
39448 -463794 -1726730 -3646117 -5200935 -5257070 -3842635 -1657494 955077 3395137 3969799
39439C969799k433396l633828j295753K027621K319876o36560l136648k602595
39431e421484l99030R57790J190373J527241K133055K010777Q71612l35317p17743
39422A817274l71293K9091N7928n9292K57230J024818J244533Q8740j577204k062894
39412D48931j375359j222015j907900j357286J259497L117258J608059j035179
39404d63994o18739K207301K388985j573096m642315k547744J862156L117693
39396b69753J008910m20100J21281J64477j021341r94839R59584K070637Q69334
39387B488190l54323m3644l62499k704288l895806j005345K844790K452519j186384
39378a766790j971506J984140N443996L871203m71588k753853k241024j486652
$$ plain form
39439 3969799 1536403 -2097425 -3393178 -1365557 954319 317759 -2818889 -5421484
39431 -5421484 -5820514 -4862724 -3672351 -2145110 -12055 1998722 2870334 2535017 1817274
39422 1817274 1445981 1475072 1533000 1473708 1730938 2755756 4000289 4089029 2511825 448931
39412 448931 -926428 -2148443 -4056343 -5413629 -4154132 -1036874 571185 -463994
39404 -463994 -1082733 1124568 3513553 1940457 -2701858 -5249602 -3387446 -269753
39396 -269753 739157 319057 440338 604815 -416526 -1411365 -451781 1618856 2488190
39387 2488190 2133867 2090223 1727724 -976564 -4872370 -5877715 -3032925 -580406 -1766790
39378 -1766790 -3738296 -1754156 3689840 7561043 7089455 4335602 2094578 607926
39370F07926j387342o72771P94205J464965P52438j45946k13046L46645J031975
39361B579049J442066P98159j298456l438169l312716o29389K107519K448860
39353F96923P26764q47631j096815q19478r75866j100190k79144Q75488O04948
39344b215001j209893k005476K63264L661924M128464Q63996k423047k526169
39336a461938p04714N8238k80471M30047K264935K840675J247119m85663o42703
39327C265525j54823m59572j048658p74810r8409j69613o46291l73336K64856
39318a95131k93001j950383k408947l18607K411893K769530M69098j749671j688027
39309b953246k74508J31907q78711j456226m71620P92077Q13431L63042J121021
$$ plain form
39370 607926 -779416 -1452187 -657982 806983 1559421 1413475 1200429 1547074 2579049
39361 2579049 4021115 4819274 3520818 82649 -3230067 -3859456 -1751937 696923
39353 696923 1423687 576056 -520759 -1340237 -2316103 -3416293 -3695437 -2819949 -2215001
39344 -2215001 -3424894 -5430370 -5167106 -1505182 2623282 3487278 1064231 -1461938
39336 -1461938 -2166652 -2108414 -2388885 -1958838 306097 3146772 4393891 3908228 3265525
39327 3265525 3110702 2651130 1602472 827662 729253 559640 -86651 -459987 -195131
39318 -195131 -488132 -2438515 -4847462 -5166069 -2754176 15354 484452 -1265219 -2953246
39309 -2953246 -3227754 -3095847 -3974558 -5430784 -5902404 -5110327 -4296896 -3933854 -2812833
39300b812833K439346J864811p19705k009751P1115K722749J898357j580954k835027
39291i61892O6570L320287K988422L57462p99681p1842j31851j658903k281025
39282H27547q61854O13960O37407O20251J830676K480331N56839k221984k408119
39273B075054N7508J827218J111615l55894p96900q78671j464928j449208J57369
39264B83163J763109J168336r23328j662324j09570J527361J116761n80467j207568
39255A375473N5651J699272J921542O03551r31548j572778j308119o27574K01640
39246A417110Q90377Q34983j16658r79352o90855K88777N14593k91842q60042
39237A007091m21744J77377O1734k36319N0561L18769m85779j839911j931010
$$ plain form
39300 -2812833 -373487 1491324 771619 -1238132 -1167017 1555732 3454089 1873135 -961892
39291 -961892 -895322 2424965 5413387 5770849 4971168 4899326 4767475 3108572 827547
39282 827547 -34307 579653 1217060 1837311 3667987 6148318 6705157 4483173 2075054
39273 2075054 2132562 3959780 5071395 4715501 3918601 3039930 1575002 125794 283163
39264 283163 2046272 3214608 2291280 628956 519386 2046747 3163508 2583041 1375473
39255 1375473 1431124 3130396 5051938 5655489 4723941 3151163 1843044 1215470 1417110
39246 1417110 2307487 3142470 3025812 2046460 1355605 1644382 2158975 1867133 1007091
39237 1007091 585347 762724 824458 588139 638700 957469 471690 -1368221 -3299231
39228c299231p1925K170339K652744J001255j056059j619269o47325K91520L21406
39219b56545M02405J356060J784779j33249l103845l445635n1632L676702M150596
39210D379636J822546n20186j700859k177467j755748m2994J667931J657676M99183
39201C829718N5552K39916m80006j654172j181864N84912N66723j977793l459404
39192c476418j158843K398124L065866R95281l12577L66855P84436n30044k063105
39183F9575k109960j177451m00788M17716J687837K410599J419564m60468j081428
39174G75196K97105K066329K153296J27184k564213l848575k641053O2732J722675
39165a849324O88881j747754k566431o00480J979422K398303O40548r75378j010107
$$ plain form
39228 -3299231 -3371156 -1200817 1451927 2453182 1397123 -222146 -869471 -577951 -256545
39219 -256545 145860 1501920 3286699 3153450 49605 -3396030 -3447662 229040 4379636
39210 4379636 6202182 5681996 3981137 1803670 47922 4928 1672859 3330535 3829718
39201 3829718 3885270 4125186 3645180 1991008 809144 1394056 1960779 -17014 -3476418
39192 -3476418 -4635261 -2237137 828729 1824010 1511433 1878288 2662724 2132680 69575
39183 69575 -2040385 -3217836 -3618624 -3200908 -1513071 897528 2317092 1856624 775196
39174 775196 1072301 3138630 5291926 5419110 2854897 -993678 -3634731 -3571999 -1849324
39165 -1849324 -1160443 -2908197 -5474628 -6075108 -4095686 -1697383 -1056835 -2032213 -3042320
39156c042320k54927J06517J40403L14343K47663n77029j543191j521860n24538
39147f654939K91495K66157p392K48136Q98376J216563Q60616K36794J04842Q85276
39137a654076K091934K501672J336575o43852j718449j125160l997k2617j288802
39128e26772k128222j028845J517268L347863K754708J98224k036231j896886
39120B01107N02149K876043K936317P68570j286314j440769n39409m91901j252130
39111B273663r97054O71240J742005Q46749o98544j337051j791747k989860l268499
39102e549098p54532K530265K668256j07363j267021J193029L609001K270598
39094D593135j166862k677902j746930r82028j383000j333273J45354J880200
$$ plain form
39156 -3042320 -3297247 -3190730 -3050327 -2735984 -2488321 -3065350 -4608541 -6130401 -6654939
39147 -6654939 -6363444 -6097287 -6104679 -5856543 -4958167 -3741604 -2880988 -2644194 -2539352 -1654076
39137 -1654076 437858 2939530 4276105 3632253 1913804 788644 784647 762030 -526772
39128 -526772 -2654994 -3683839 -2166571 1181292 3936000 4134224 2097993 201107
39120 201107 703256 3579299 6515616 7284186 5997872 4557103 4017694 3525793 2273663
39111 2273663 1276609 1947849 3689854 4536603 3838059 2501008 709261 -2280599 -5549098
39102 -5549098 -6303630 -3773365 -1105109 -1212472 -2479493 -1286464 2322537 4593135
39094 4593135 3426273 748371 -998559 -1980587 -3363587 -4696860 -4551506 -2671306
39086b671306K392149J360046o74650k514664k527087k18633K583979L415538
39078A145372J841757m44370j608795r17432J075726K585914J885352m90256k069695
39069C003573j829509j398753j746576j188601J251293L076170J857526o20704
39061B404419j161867k44717m58484j391232n34895J540469J656070l84247j327023
39052I8493p4932Q09990J16107r9314R32547P80809j338302k088021O16003L368504
39042C121884K000471k071467l956575k154003K01644K93719j129227j623506
39034e317060k62266J523740J717811K44106p08587K72249J415074L74844j648211
39025b388300j417475J040630K254724P80194r22490q73114L0312R88858K487393
$$ plain form
39086 -2671306 -279157 1080889 406239 -2108425 -4635512 -4854145 -2270166 1145372
39078 1145372 2987129 2542759 933964 16532 1092258 3678172 5563524 5073268 3003573
39069 3003573 1174064 -224689 -1971265 -3159866 -1908573 1167597 3025123 2404419
39061 2404419 1242552 997835 539351 -851881 -1386776 153693 1809763 1425516 98493
39052 98493 23561 833551 949658 850344 1782891 2563700 1225398 -862623 -246620 3121884
39042 3121884 5122355 3050888 -905687 -3059690 -2858046 -2564327 -3693554 -5317060
39034 -5317060 -5579326 -4055586 -2337775 -2093669 -2802256 -2530007 -1114933 -740089 -2388300
39025 -2388300 -3805775 -2765145 -510421 269773 -652717 -1525831 -1495519 -506661 1980732
39016A980732L235036O35074l798833m601589o17320K245704J17269k520197n07589
39007c831713L272078L147921K81095k95423R12976n52973l892720l782761n9176
38998d800696J524146p55723j719104J344858L670831J048795l066485k999211
38990e752589P76379L183060J829973r91251k028547j76778K958674M203044J982588
38981E984553j169610j514244M80109R43390r57662j727136J70995J467118k20051
38972C457462k324689k017559r28588j535544k262093l49270K874514L772077
38964F86310J837340l05649j095451j003467m17130N56862J127124R80851J152834
38955C519624J774807R28954j969002l981299k652009Q9827J082350N96937M74084
$$ plain form
39016 1980732 5215768 5850842 2052009 -2549580 -3166900 -921196 -803927 -3324124 -3831713
39007 -3831713 -559635 2588286 2869381 2573958 3486934 2933961 -958759 -4741520 -4800696
38998 -4800696 -3276550 -4032273 -5751377 -4406519 -735688 313107 -2753378 -5752589
38990 -5752589 -4976210 -1793150 36823 -954428 -2982975 -3159753 -201079 4001965 5984553
38981 5984553 4814943 3300699 3780808 4724198 3766536 2039400 2210395 3677513 3457462
38972 3457462 1132773 -884786 -1813374 -3348918 -5611011 -5960281 -3085767 686310
38964 686310 2523650 2218001 1122550 119083 -298047 258815 1385939 2366790 3519624
38955 3519624 5294431 6223385 4254383 273084 -2378925 -2289098 -1206748 -609811 -135727
38946a35727J76593j265133j851411J52039J811021k95122l395168k229815J814198
38937e218525K400075r83712j771627K438626N250443J825474l024348k467581
38929a551175J905873L490459R96938j043859l13177P99638M16860k37461j20126
38920D343970k77063j419791k419909k155644r26918L99934J132934P16930n84653
38911a190210j334406o41541M24167N28976J43417L02881O19279M78785P23647
38902E4995J772801J726025o26953k488302o22318K781410K417063j973175m614462
38893a572916k059545K038169K670641P5859k180354k524107j617831K72324K782251
38884b115509L869821J892730j533362l263271k478085o70800J220332L170106
$$ plain form
38946 -135727 40866 -1224267 -3075678 -2923639 -1112618 -1407740 -4802908 -7032723 -5218525
38937 -5218525 -2818450 -3802162 -5573789 -3135163 2115280 3940754 916406 -1551175
38929 -1551175 354698 3845157 4842095 3798236 3485059 4284697 4701557 4464096 4343970
38920 4343970 4066907 2647116 227207 -1928437 -2855355 -2455421 -1322487 -605557 -1190210
38911 -1190210 -2524616 -3166157 -2741990 -2213014 -2069597 -1766716 -1147437 -668652 54995
38902 54995 1827796 3553821 2926868 438566 -183752 2597658 5014721 3041546 -1572916
38893 -1572916 -3632461 -1594292 1076349 1152208 -1028146 -3552253 -5170084 -4897760 -2115509
38884 -2115509 1754312 3647042 2113680 -1149591 -3627676 -4298476 -3078144 91962
38876I1962M182976K725390p08931l414479l333505j014913J259427J459630o10640
38867F36917k812358k454192M85043K894197K358788J47027j085682j061685j197995
38858b089940j392165k80854J674516K142707L79230j495048j396245J78850J238085
38849a040864P76884m17412q18710J35571J130860L62178j785093k723689j202863
38840e583138Q23662J331673J302333K397339L358132J842322j241746k642748
38832A587829j581175l48638j82332J34257J191383J616345N77147r55100k023018
38823A6698k478235j876318j10212J021056j55680j799919p03400K194840K534533
38814a356637o29041l044699j622113J560269L243395L017702J599192q78746
$$ plain form
38876 91962 4274938 7000328 6291397 2876918 -456587 -1471500 -212073 1247557 636917
38867 636917 -2175441 -4629633 -4144590 -1250393 1108395 1255422 169740 -891945 -2089940
38858 -2089940 -3482105 -3762959 -2088443 54264 433494 -1061554 -2457799 -2278949 -1040864
38849 -1040864 -263980 -681392 -1500102 -1364531 -233671 128507 -1656586 -4380275 -5583138
38840 -5583138 -4759476 -3427803 -2125470 271869 3630001 5472323 4230577 1587829
38832 1587829 6654 -341984 -524316 -390059 801324 2417669 2994816 2039716 16698
38823 16698 -2461537 -4337855 -4448067 -3427011 -3582691 -5382610 -6086010 -3891170 -1356637
38814 -1356637 -1985678 -5030377 -6652490 -5092221 -1848826 1168876 2768068 1889322
38806A889322k835994j642737J664049K321674r41000l261077j414969P64762
38798c455970q38678l199705j289788L032128L885038Q96277q54771N01584J452962
38789A29077j38814j788890j044103J053123K351106K042059J25910k521197l466576
38780c258305j237036J665332J553493r36902j715383N01673K577003J970031
38772A119906j34120j383662j036119L17254J384561N96390j840592l102778j498892
38763e578052M02549l57268j953362p30829K281179K938546J050850K51895J195063
38754d99429Q39644j184606j614407J06880N88519r84978j145076J145833K139557
38745f08063J43573j221205L83454J911534R30053J33969J757211K725562J54646
$$ plain form
38806 1889322 -946672 -2589409 -925360 1396314 455314 -2805763 -4220732 -3455970
38798 -3455970 -4294648 -7494353 -8784141 -5752013 -1866975 -970698 -1825469 -1323885 129077
38789 129077 -9737 -1798627 -2842730 -1789607 561499 2603558 2729468 208271 -3258305
38780 -3258305 -4495341 -2830009 -1276516 -2213418 -3928801 -3427128 -850125 1119906
38772 1119906 985786 -397876 -1433995 -1116741 267820 864210 -976382 -4079160 -5578052
38763 -5578052 -5175503 -5532771 -7486133 -8216962 -5935783 -2997237 -1946387 -1694492 -499429
38754 -499429 340215 -844391 -2458798 -2351918 -1763399 -2748377 -3893453 -2747620 -608063
38745 -608063 -464490 -1685695 -1302241 609293 1539346 1673315 3430526 6156088 6310734
38736F310734k928378k512942l28019l11243j674154j004827J244017J832716
38728F27904N97762K05489J126791J255939j51894j725788k393649j792493L75892
38719a874047K934567L136940M78971j764241j289448o9329j82902l8332J736635
38710C068814K604690O57857j092655K9260Q20783k138852n116822k704750K335120
38701a536555K846427q98020j873571J589209L321483J99073k979793k209320
38693a541067l79800r91018k054208n38133J955730K158243K03043j689991k562065
38684e439266k069764M14266L620958M345722J844225o77098q83274l91028j063994
38675b99253j718278r22775J53720K27701K68271R66536Q27089p22989j353943
$$ plain form
38736 6310734 3382356 869414 541395 230152 -1444002 -2448829 -1204812 627904
38728 627904 1225666 1431155 2557946 3813885 3661991 1936203 -457446 -2249939 -1874047
38719 -1874047 1060520 4197460 4676431 2912190 1622742 1553413 1370511 1332179 3068814
38710 3068814 5673504 6331361 5238706 5267966 6088749 3949897 -1166925 -3871675 -1536555
38701 -1536555 1309872 411852 -1461719 127490 3448973 3648046 668253 -1541067
38693 -1541067 -1920867 -2911885 -4966093 -5504226 -3548496 -1390253 -1187210 -2877201 -5439266
38684 -5439266 -7509030 -7094764 -3473806 871916 2716141 2039043 1155769 764741 -299253
38675 -299253 -2017531 -2940306 -2786586 -2558885 -2290614 -1324078 -496989 -1219978 -2573921
38666b573921K76305J569838K7901k333242j972545P73111K620895K235813J092284
38657A716439M13139l9463o36519j307159j799437j427443L16680K133877J755763
38648A125877o44136k131273j249589N528j26501m30391L83060R64245n576j050815
38638c159571m87225N76689M92396K6373L55280M90935l80180m53728J495814
38629a043217K881102J047681j862281k000479q2177K8999k039743k783240r04238
38620f757593Q88746Q14852N47335J541759K386897J531353N715l16695N76172
38611A218541J211376O00877q60333j678708n27288J879728K898602J239972r46275
38602E036492j061337J38982J49071j000528j063703L91787J445960J275552J087496
$$ plain form
38666 -2573921 -2297616 -727778 -699877 -3033119 -5005664 -4232553 -1611658 624155 1716439
38657 1716439 2129578 2090115 1453596 146437 -1653000 -3080443 -2763763 -629886 1125877
38648 1125877 481741 -1649532 -2899121 -2893593 -3020094 -3450485 -3067425 -2103180 -2108756 -3159571
38638 -3159571 -3646796 -3070107 -2577711 -2551338 -2196058 -1705123 -2085303 -2539031 -1043217
38629 -1043217 1837885 2885566 1023285 -977194 -1059371 -1030372 -3070115 -5853355 -6757593
38620 -6757593 -5868847 -5053995 -4506660 -2964901 -578004 953349 959064 642369 1218541
38611 1218541 2429917 3030794 2170461 491753 -35535 1844193 4742795 5982767 5036492
38602 5036492 3975155 4114137 4263208 3262680 2198977 2590764 4036724 5312276 6399772
38593F399772J274529M98265j690669l687930l993712k695330n88418J344955
38585c138538J765554L84735p77591J72120J843822J530922k67579n70246J107865
38576B051064K138628J324104K93576j44302j128298k372930j759518M02590R00299
38567A705213q23965r99994K045907M111838J366155l213739l948775n16359K459195
38558B185476K285813N19787p54128j221057j131314p29617p34707j241820q89390
38549a710957Q63015J967471P17575j102389r09939L48063J8078j333746q12746
38540a955575J544065K563612J133825l96403n89063p84535j575958j221721P93237
38531d88516J999663P72598r36997q37843K29431L36101j44504L41792J516353
$$ plain form
38593 6399772 7674301 8172566 6481897 2793967 -1199745 -3895075 -4483493 -3138538
38585 -3138538 -1372984 -988249 -1765840 -1593720 250102 1781024 1513445 943199 2051064
38576 2051064 4189692 5513796 5807372 5663070 4534772 2161842 402324 804914 1705213
38567 1705213 881248 -118746 1927161 6038999 7405154 4191415 242640 -273719 2185476
38558 2185476 4471289 4991076 4236948 3015891 1884577 1154960 420253 -821567 -1710957
38549 -1710957 -847942 1119529 1837104 734715 -175224 172839 190917 -1142829 -1955575
38540 -1955575 -411510 2152102 3285927 2889524 2300461 1515926 -60032 -1281753 -488516
38531 -488516 1511147 2283745 1346748 508905 738336 1074437 929933 1271725 2788078
38522B788078J661458R9715k339157m304492m217346j175055L015530M506357
38514C5088J919543j474278k028919m28316K15748o90204j113952k07085Q45310
38505b927065J369940J770412J717695M83518r31070o90867O92410P95831p55744
38496A525060j627442p64162o0634p79874j190843K66904J877295J161995j156965
38487g48666k218765j034568Q46279J990674K240646J615038J36309j226448j204646
38478C95853o8007N59299m6644q13127n08353O71377J482471J031060l52021j360589
38468I91319j065111j59401j51320j070501j213227J62550J438882J170319L58651
38459D62161L42966Q2221j734243l105429q66293L713319N327401J720613k990144
$$ plain form
38522 2788078 4449536 4549251 2210094 -2094398 -6311744 -7486799 -4471269 35088
38514 35088 1954631 480353 -1548566 -1976882 -1761134 -2451338 -3565290 -3772375 -2927065
38505 -2927065 -1557125 213287 1930982 2414500 1483430 792563 1484973 2280804 1525060
38496 1525060 -102382 -866544 -927178 -1707052 -2897895 -2630991 -753696 408299 -748666
38487 -748666 -2967431 -4001999 -3155720 -1165046 1075600 2690638 2826947 1600499 395853
38478 395853 327846 887145 840501 27374 -480979 190398 1672869 2703929 2351908 991319
38468 991319 -73792 -233193 -384513 -1455014 -2668241 -2505691 -1066809 103510 462161
38459 462161 805127 887348 -846895 -3952324 -4818617 -1105298 4222103 5942716 2952572
38450B952572l864084j172856J312961J642868N73034j080901k873609l353057
38442e863072j248471J953514L057322J175322j188784j506216o0536J146710
38434b534211J024791J90669j48872L96740R07266K16878j307790j840844o17802
38425c713175P12433N13967k12480M00623J555074P09881k000380l215596j182243
38416f431896J488650J573138l38660j292075l68458P64549R37333P06993N75914
38407b384512Q6937r02328j657323j730290j342592l04077J887325M272621M456239
38398B382000J660379j514171j966064M9056J606276J159346m8829o63613j145140
38389A519240k071837k337796p84970J321191J410672q58643k837271k127069
$$ plain form
38450 2952572 -911512 -2084368 -771407 871461 1444495 363594 -2510015 -5863072
38442 -5863072 -7111543 -5158029 -2100707 -925385 -2114169 -3620385 -3680921 -2534211
38434 -2534211 -1509420 -1318751 -1467623 -1070883 -163617 53261 -1254529 -3095373 -3713175
38425 -3713175 -3000742 -2486775 -2699255 -2298632 -743558 -33677 -2034057 -5249653 -6431896
38416 -6431896 -4943246 -3370108 -3708768 -5000843 -5369301 -4604752 -3667419 -2960426 -2384512
38407 -2384512 -2297575 -3199903 -4857226 -6587516 -7930108 -8234185 -6346860 -2074239 2382000
38398 2382000 4042379 2528208 562144 611200 2217476 3376822 3327993 2664380 1519240
38389 1519240 -552597 -2890393 -3675363 -2354172 -943500 -1802143 -4639414 -6766483
38381f766483N93141K662350K563030J173019K70487N24158J094439R29103J26271
38372C169515l02722L1953K99612j86237p88207o64073m12978j169522k286733
38363b309392j685555J021855L355688K882951J84342k105341k348251j007761
38355b011464M99946R44090j46884j906319k481974j025191R26443J106065n46312
38346d641600j674746m52027K128668L404304K055119n70336k147753j931233
38338c829604j096948o95359l27832N45563J171876P70005L06981J056891J976820
38329a21607R75068j374236k291281j290662q52664j602615p07744K743151M703585
38320A80995K059611j743348j527127J551279K048460r28301k674386p74880J546346
$$ plain form
38381 -6766483 -6173342 -3510992 -947962 225057 495544 1019702 2114141 3043244 3169515
38372 3169515 2866793 2898746 3198358 3012121 2223914 1559841 1146863 -22659 -2309392
38363 -2309392 -3994947 -2973092 382596 3265547 3449889 1344548 -1003703 -2011464
38355 -2011464 -1511518 -567428 -714312 -2620631 -5102605 -6127796 -5201353 -4095288 -4641600
38346 -4641600 -6316346 -6768373 -4639705 -1235401 819718 249382 -1898371 -3829604
38338 -3829604 -4926552 -5621911 -5949743 -5404180 -4232304 -3462299 -3155318 -2098427 -121607
38329 -121607 853461 -520775 -2812056 -4102718 -4955382 -6557997 -7265741 -4522590 180995
38320 180995 2240606 497258 -1029869 521410 2569870 1641569 -1032817 -1807697 -261351
38311b61351J277250j16991l26143J04093R0608M55264J547581J553401l14834
38302D008878j802268j275969n70393j468975k154230l79637K220118K547909
38294A125433R71762K61623R30466J129857K63719n99528j237919k128548k452326
38285a735461j227684K69367K42064l05452O72725K031209R54902j625790j661669
38276b385789J359086K937919L74685l066850l194864o68274J100508J136616
38268b406963R18222J074889J063872R93216J210148R37605m69353j749344j337160
38259B35132L4019M54588j16776j77418L89378J34744j096458j429459K19352
38250a352898K387436L083673K246822J158174L34487p90722k366531l349242
$$ plain form
38311 -261351 1015899 898908 572765 676858 767466 1222730 2770311 4323712 4008878
38302 4008878 2206610 930641 360248 -1108727 -3262957 -3642594 -1422476 1125433
38294 1125433 2097195 2358818 3289284 4419141 4682860 4083332 2845413 716865 -1735461
38285 -1735461 -2963145 -2693778 -2451714 -2757166 -2084441 -53232 901670 -724120 -2385789
38276 -2385789 -1026703 1911216 2285901 -780949 -3975813 -4644087 -3543579 -2406963
38268 -2406963 -1488741 -413852 650020 1643236 2853384 3790989 3321636 1572292 235132
38259 235132 269151 723739 606963 429545 818923 953667 -142791 -1572250 -1352898
38250 -1352898 1034538 4118211 6365033 7523207 7857694 7066972 4700441 1351199
38242A351199k621774n17160J273348J446023L75193o61827j088005j132262p42573
38233b317838L71444J595012J721020Q00388K53767N44943L58624r30432j740666
38224F56262q20887L34584j84612j227138k33143K210767K647392j9903k614512
38215G48810k233304q2652J036535Q86941J031585J409786N41075j291627j817792
38206B29357k27948J351984Q18764j096337k173248j703362p93946l46055j12989
38197d053780L48399Q95703J146762R10049J97687o12456p13565K87266J474907
38188a19028J457987K62943n55919p1122P57939O27599k66083q51959q32459n70236
38178a60338m342R71408J545195R45162O0669L60675J267024O44941j706979l232377
$$ plain form
38242 1351199 -1270575 -1787735 -514387 931636 1306829 645002 -443003 -1575265 -2317838
38233 -2317838 -1946394 -351382 1369638 2170026 2423793 2968736 3327360 2396928 656262
38224 656262 -164625 169959 -14653 -1241791 -1474934 735833 3383225 3363322 748810
38215 748810 -1484494 -1567146 -530611 356330 1387915 2797701 3338776 2047149 229357
38206 229357 1409 1353393 2172157 1075820 -1097428 -2800790 -3594736 -3940791 -4053780
38197 -4053780 -3705381 -2809678 -1662916 -752867 -555180 -1167636 -1881201 -1593935 -119028
38188 -119028 1338959 1601902 1045983 974861 1732800 2360399 2094316 1242357 409898 -160338
38178 -160338 -164680 806728 2351923 3297085 3357754 3718429 4985453 5630394 3923415 691038
38168F91038k209035j01917R82055J157740J297938P04114j216676k472695q50852
38159b018290J990449K232760l03197j702111j51066J133152p63900l418435k574372
38150e575010J312992L650905K109786q91350k219265j592845l86192O24208J080699
38141a886072M69470r05600j634159j010945m4986K81056M95088J213988J548629
38132a473531N74187n75279o0157J638737K076312L33208j703648k019898q19835
38123b029904M76908J140240J157130N71196k27782n17776l71445p05599j406939
38114a913971q80393J216650K422278Q09093j407550n66483K586986L246582m46108
38105E067084m118439k970169J684333M449462K876547n12218k521289k582682
$$ plain form
38168 691038 -1517997 -1619914 -637859 519881 1817819 2521933 1305257 -1167438 -2018290
38159 -2018290 -27841 2204919 1901722 199611 48545 1181697 417797 -3000638 -5575010
38150 -5575010 -4262018 -611113 1498673 607323 -1611942 -3204787 -3590979 -2966771 -1886072
38141 -1886072 -1416602 -2322202 -3956361 -4967306 -5012292 -4731236 -4236148 -3022160 -1473531
38132 -1473531 -899344 -1474623 -1534780 103957 2180269 2513477 809829 -1210069 -2029904
38123 -2029904 -1552996 -412756 744374 1315570 1087788 570012 198567 -507032 -1913971
38114 -1913971 -2794364 -1577714 844564 1653657 246107 -320376 2266610 5513192 5067084
38105 5067084 948645 -2021524 -337191 4112271 6988818 6476600 3955311 1372629
38097A372629j563593k7238J239724R44817r92638k505468j452735J770393M445182
38088C231073M124921P90012l108530m633728l012343m15107N06576l27277q31916
38079c676319J0704R52167Q65050N28320R71451J553060J189990M10440M76442
38070C281305J140110J041197K057q49843j180106j798825k578182j933552O21316
38061b254523K931632K665316M07998j225595j092306n20290p88749j254972p46596
38052a878085M09292R89071Q82814J077634J670328J372693l68411j979951j659840
38043E15545O7939J094810P00995J96680M40034M48525o45451j720646j222283
38034a23852K41141N29626r64528k400924j970961j37975J191251R93073j0434
$$ plain form
38097 1372629 -190964 -218202 1021522 1966339 973701 -1531767 -2984502 -1214109 3231073
38088 3231073 7355994 8146006 5037476 403748 -2608595 -3023702 -2517126 -2844403 -3676319
38079 -3676319 -3665615 -2713448 -1848398 -1320078 -348627 1204433 2394423 2804863 3281305
38070 3281305 4421415 5462612 5464669 4614826 3434720 1635895 -942287 -2875839 -2254523
38061 -2254523 677109 3342425 3750423 2524828 1432522 912232 123483 -1131489 -1878085
38052 -1878085 -1468793 -479722 403092 1480726 3151054 4523747 4155336 2175385 515545
38043 515545 583484 1678294 2379289 2575969 3016003 3464528 2819077 1098431 -123852
38034 -123852 117289 646915 -317613 -2718537 -4689498 -4827473 -3636222 -2643149 -2653583
38025b653583m64110J33327R93911R37159k26028j322668j081932L64898J610731
38016a708295J517138K61746j073184j538345r57835P7587P79623Q81857O69848
38007a089860K48598o60739j807169k032899p30320Q03304O88460r23034j793877
37998g297536m42051K058448L597101L387439K159340Q07684k64773q91929j119516
37989A994207j385588k071050k716599k133558K77498L280235M344530K158857
37981C748532j353753k557536l25378K261051J695677j280011k713424r41170
37973a466012J309598J105965o03699q38798Q67550J967142O52117j749925k607040
37964a363102j119102R95247J534994J21642j593457j955046j111882k98812J55157
$$ plain form
38025 -2653583 -3117693 -2984366 -1990455 -1053296 -1279324 -2601992 -3683924 -3319026 -1708295
38016 -1708295 -191157 70589 -1002595 -2540940 -3498775 -3421188 -2641565 -1759708 -1089860
38007 -1089860 -841262 -1502001 -3309170 -5342069 -6072389 -5269085 -4580625 -5503659 -7297536
37998 -7297536 -7739587 -5681139 -2084038 1303401 3462741 4270425 4005652 3113723 1994207
37989 1994207 608619 -1462431 -4179030 -6312588 -6035090 -2754855 1589675 3748532
37981 3748532 2394779 -162757 -488135 1772916 3468593 2188582 -524842 -1466012
37973 -1466012 -156414 949551 345852 -492946 374604 2341746 2993863 1243938 -1363102
37964 -1363102 -2482204 -1486957 48037 169679 -1423778 -3378824 -4490706 -4789518 -4634361
37955d634361Q56728J538928R98060n91300j131007M18700K104597J647668k76759
37946I31254j344041j090172q64211r81468m80741M30214L26405o49193n37770
37937d259723J002709J514788m76140k646874j981811P91777K328390J471081
37929b255803L53095O22762J038544j24091k050424k413320o57010J302153J610330
37920b573764N00865n29451o48780k28117k9035m46318j199309j330021k0943
37911f504873K015464K691956J115876o75748j11528K124776K703619K97284k541219
37902A115607l003701j461461M4030Q07100J189311R99056J89651j29043O07110
37893C57660J021839J88828k19790J182764K229878L58939k387185j935478R60098
$$ plain form
37955 -4634361 -3777633 -2238705 -1240645 -1831945 -2962952 -2544252 -439655 1208013 931254
37946 931254 -412787 -1502959 -2367170 -3348638 -3829379 -3399165 -3072760 -3721953 -4259723
37937 -4259723 -3257014 -1742226 -2218366 -4865240 -6847051 -6055274 -3726884 -2255803
37929 -2255803 -1902708 -1279946 -241402 -365493 -2415917 -4829237 -5486247 -4184094 -2573764
37920 -2573764 -2072899 -2602350 -3251130 -3479247 -3508282 -3954600 -5153909 -6483930 -6504873
37911 -6504873 -4489409 -1797453 -681577 -1357325 -1468853 655923 3359542 3656826 1115607
37902 1115607 -1888094 -3349555 -3305525 -2498425 -1309114 -310058 -120407 -249450 357660
37893 357660 1379499 1568327 1348537 2531301 4761179 5120118 2732933 797455 1757553
37884A757553J595678o90054j201835J729160L076864n86621m491503k642412
37876a453170K499918L637536j15646k323636M14127L455069J501943l641664
37868C974477n788733k356250L052299N089837K118366k464629l961897j666933
37860b003463M82168n06362k299499j005582K317828K952376l1081k157062m78756
37851b729433K112765J711289r50207k454719j700922p8959J351500K096529J324792
37842F82635n67011j030708J181452L108552J337261k432885l245123R488L085748
37833B129409K515243k15062j819505j541478o01153K82587Q24894L78748q76647
37824A077036j309159j37076R56430L31781q48703o29011J55201p61045k599790
$$ plain form
37884 1757553 3353231 2663177 1461342 3190502 6267366 5680745 1189242 -1453170
37876 -1453170 1046748 4684284 4568638 2245002 2659129 6114198 7616141 3974477
37868 3974477 -1814256 -4170506 -1118207 3971630 6089996 3625367 -336530 -2003463
37860 -2003463 -1521295 -2027657 -4327156 -5332738 -3014910 -62534 -93615 -2250677 -2729433
37851 -2729433 -616668 1094621 144414 -2310305 -4011227 -4090186 -2738686 -642157 682635
37842 682635 115624 -915084 266368 3374920 4712181 2279296 -965827 -956339 2129409
37833 2129409 4644652 4429590 2610085 1068607 467454 750041 1574935 1953683 1077036
37824 1077036 -232123 -369199 587231 919012 70309 -558702 -403501 -1164546 -3764336
37815c764336j906700J833787M299085K095270k130320l204952n16898J698853
37807a596211P13025j416860j622933J7411J439098J759969J443249P73624j1431
37798A498941j83102K29664j87570j852327k551593n43648J978741J652840n92032
37789e50086p09215J689834K209297j104491l871420j889171K142071K806775
37781G23594L68051k98127J896268K669561o6186k515462j259348J286170J135722
37772C940243q85852j151722N08336R86197n40750j522024p02885o791p79619
37763a54867j490269o84842N22589O65938L14567L86478J86093p95302j082875
37754b132490L27653J437634P0016k075127j535313J417747L027986J853679N39392
$$ plain form
37815 -3764336 -5671036 -3837249 461836 2557106 426786 -2778166 -3295064 -1596211
37807 -1596211 -883186 -2300046 -3922979 -3905568 -2466470 -706501 736748 1510372 1498941
37798 1498941 1315839 1545503 1357933 -494394 -3045987 -3589635 -1610894 41946 -550086
37789 -550086 -1259301 430533 2639830 1535339 -2336081 -4225252 -2083181 723594
37781 723594 1091645 793518 2689786 5359347 5293161 2777699 1518351 2804521 3940243
37772 3940243 3054391 1902669 2411005 3397202 2856452 1334428 631543 624752 -154867
37763 -154867 -1645136 -2329978 -1807389 -1141451 -826884 -440406 -254313 -1049615 -2132490
37754 -2132490 -1804837 -367203 -297187 -2372314 -3907627 -2489880 538106 2391785 2931177
37745B931177R11250J058453p89204k726503k235550m23451j79486j612385k296721
37736e362420j205103L40630J184439J353944Q41970l82377j317894r43046l8764
37727e528621K1847j50627R97540K673691K348378j20213j892707j375917j95129
37718c221758J02403M32555J656643K333911J134542o04718r86833m51777l20166
37709G4802j60655Q45884J469571L13759j073898l30317J226407R6339l300727
37700h38835m230229p21198K933993K388094l20269k86779K397420K929816l78333
37691C873680l225878j794969J680711K569332M81619j139143o80574P9751j11688
37682A732841j27052O09824N61968q61833j403718N79281K848512K198450p83942
$$ plain form
37745 2931177 3842427 4900880 4111676 1385173 -850377 -1273828 -1453314 -3065699 -5362420
37736 -5362420 -6567523 -6226893 -5042454 -3688510 -2846540 -3228917 -4546811 -5489857 -5528621
37727 -5528621 -5506774 -5657401 -4659861 -1986170 362208 241995 -1650712 -3026629 -3221758
37718 -3221758 -3119355 -2686800 -1030157 1303754 2438296 1833578 846745 394968 74802
37709 74802 -85853 760031 2229602 2543361 1469463 1139146 2365553 2461892 -838835
37700 -838835 -5069064 -5790262 -2856269 -468175 -788444 -1075223 1322197 4252013 3873680
37691 3873680 647802 -1147167 533544 3102876 3584495 2445352 1764778 1844529 1732841
37682 1732841 1605789 2215613 2777581 1915748 512030 1091311 3939823 6138273 5354331
37673E354331k706661k195215q29486K07954J347704K405376K068756K68998j316080
37664D605677j722895j510601q30035P70106K153972J142607j723326k854182
37656C1323n61877K297078K411862L35117j253620j367172o49797N11841J618801
37647C373556J557459M78773L19193J550464J759589k44963j692085l49269J063475
37638G816192p90447l425987j790600L118740M788678Q36003l498563l260759
37630C793257k10251J363365J042648R37777J015584j43819j551700p18901J971098
37621G499058L099580R94270j796038j937083L96694K163661J701772O09774R02632
37612A3634320J800558J092871q96452j197022J314782L806751L448340J269385
$$ plain form
37673 5354331 2647670 452455 -377031 -169077 1178627 3584003 5652759 5921757 4605677
37664 4605677 2882782 1372181 542146 1312252 3466224 4608831 2885505 31323
37656 31323 -530554 1766524 4178386 4513503 3259883 1892711 1242914 1754755 3373556
37647 3373556 4931015 5409788 5728981 7279445 9039034 8794071 7101986 6752717 7816192
37638 7816192 7025745 3599758 1809158 4927898 9716576 10552579 7054016 3793257
37630 3793257 3583006 4946371 5989019 6926796 7942380 7798561 6246861 5527960 7499058
37621 7499058 10598638 11592908 9796870 7859787 8256481 10420142 12121914 12731688 13634320
37612 13634320 15434878 16527749 15631297 14434275 15749057 19555808 23004148 24273533
37604B4273533m5297j25559K1996R68269L425869N357560M559370L192520N187637
37595D6815898R401068J0437107P084753M750057P514248J2527427J5157775J5587044
37587A29275377J6781928J9261491K1772789K4678983K8731124L2170470L2735142
37580C05407304L1369974L0670419L0712214K9533358K6637911K2673025J6497828
37573D93502033O294267o460618j7577629k5171572l1036895l6280016l8600380
37566C44669190l5605640k8820294k2431765j8855333j6978183j4576315j1408829
37559A95992831r419319j0055492j2128735j3158568j2507864j1819693j2196952
37552A14706208j2583796j1613926r534259p430753n958080n581904o419939p051589
$$ plain form
37604 24273533 24228236 24102677 24124673 25092942 28518811 33876371 38435741 41628261 46815898
37595 46815898 56216966 66654073 73738826 78488883 86003131 98530558 113688333 129275377
37587 129275377 146057305 165318796 187091585 211770568 240501692 272672162 305407304
37580 305407304 336777278 367447697 398159911 427693269 454331180 477004205 493502033
37573 493502033 499796300 493335682 475758053 450586481 419549586 383269570 344669190
37566 344669190 309063550 280243256 257811491 238956158 221977975 207401660 195992831
37559 195992831 186573512 176518020 164389285 151230717 138722853 126903160 114706208
37552 114706208 102122412 90508486 80974227 73543474 67585394 62003490 55583551 48531962
37544D8531962n511802k525797j429671l414718n364743m342766j625544J07745
37536B4424666Q96461J796070J681562n05410k488008j783332k70852j120549
37528B2630608k841226j706276J004881L98708l351194m389817p70364J943943
37520A2919263l14596l538035k433685J188488K169539M85841Q6269J478180J486226
37511A3527490m15981j231075j88955j81323k240959l214490j013065J665860
37503F707502J576587p1634K2701J899444K698354J386305j29889n23326p17759
37494A2848285j384531j340892J79093J542362P76772j472474k741471j925009
37486F482135j95052Q60829O90880k92002r82514k12291J588097K014581l29235
$$ plain form
37544 48531962 43020160 40494363 39064692 35649974 30285231 25942465 24316921 24424666
37536 24424666 25321127 27117197 28798759 28293349 25805341 24022009 23751157 22630608
37528 22630608 19789382 18083106 19087987 19486695 16135501 11745684 10975320 12919263
37520 12919263 12604667 9066632 6632947 7821435 9990974 10476815 10563084 12041264 13527490
37511 13527490 13111509 11880434 11691479 11510156 9269197 6054707 5041642 6707502
37503 6707502 8284089 8212455 8235156 10134600 12832954 14219259 14089370 13566044 12848285
37494 12848285 11463754 10122862 10301955 11844317 12621089 11148615 8407144 6482135
37486 6482135 6287083 7147912 7838792 7546790 6564276 6351985 7940082 9954663 9625428
37477I625428l206426l388072j400195p19178k238120k972204j077745J437719
37469c938793K568994L293395M457253M169601J308357j455060j586833q72505
37461G944409j911978l190105k067032j55109n10616j532010L59265L357635K398422
37452D692881j687295k493811J475125M139104K006151m11790Q50066K238401
37444A0808832l68778l672209k501538J053842J232566j606492k153980L94585
37436C186828J376414q72707k381648o08312J696535J681116O03800M78737M75939
37427E636702p20990j979654j628656j34203J033636J338721O80135r07555j903561
37418A414575j87678L248117M189577Q20270l123542l327738p02954Q16088L07837
$$ plain form
37477 9625428 6419002 3030930 1630735 911557 -1326563 -4298767 -5376512 -3938793
37469 -3938793 -1369799 1923596 6380849 10550450 11858807 10403747 8816914 7944409
37461 7944409 6032431 2842326 775294 620185 109569 -1422441 -1063176 2294459 4692881
37452 4692881 3005586 511775 1986900 6126004 8132155 7720365 8570431 10808832
37444 10808832 10440054 6767845 4266307 5320149 6552715 4946223 2792243 3186828
37436 3186828 4563242 3690535 1308887 700575 2397110 4078226 4682026 5160763 5636702
37427 5636702 4915712 2936058 1307402 1173199 2206835 3545556 4225691 3318136 1414575
37418 1414575 1226897 4475014 8664591 9484861 6361319 3033581 2330627 3146715 3454552
37409C454552M588N64333L15417q66973r59297J86813Q3880j647737j607260J774306
37399A302622M440886K310173j927206k398669Q98936K186304o63880k665128
37391C484038m2593L286798J808313k828714m454558j714289Q25761L82961o45391
37382A02326J45204J390628J283692Q69996J575620K242687J163392q30693j550055
37373F392797m78230R92386J335361k8961k162716k694261l54776K261334J178160
37364F441094k932959m526311p52768M052629M214480L14981k448678j609547
37356B752921N22348J261883O04456j37986k58560R4452J76744o34122j602392
37347B779744j228369J38890K15725j458998k162461k90740J708900J364523L85870
$$ plain form
37409 3454552 3459140 4023473 4338890 3471917 2512620 2699433 2783313 1135576 -471684 1302622
37399 1302622 5743508 8053681 6126475 3727806 4626742 6813046 6149166 3484038
37391 3484038 3441445 6728243 8536556 5707842 1253284 -461005 364756 747717 102326
37382 102326 247530 1638158 2921850 3791846 5367466 7610153 8773545 7942852 6392797
37373 6392797 5914567 6906953 8242314 8213353 6050637 3356376 3001600 5262934 6441094
37364 6441094 3508135 -1018176 -1770944 2281685 6496165 6811146 4362468 2752921
37356 2752921 3275269 4537152 5141608 5003622 4745062 4839514 5016258 4382136 2779744
37347 2779744 1551375 1690265 1905990 446992 -1715469 -2006209 -297309 1067214 1453084
37338A453084J366767K755842J412023j589571k432026q33447j9667q15610o78714
37329F18681J081499J937062R04051J43115M98612j78263k441677l161983n16408
37320a115311K449915K103998o63933k389833j892182n25568O05310J124334M82507
37311A79237j053932j568807K52153K817904L340790J230516j559738k864207
37303G73916j880499O73337K805493K468074l01518k961705l011737n61478K020136
37294B4019K514807Q53768p35063j0415K144400K138831j232383l979781k180396
37285d62213J630706J794149j507312k290234J404686L996767J464697k017241
37277D014005j203749J429785K53342l443365l189555J819295M760566J386711
$$ plain form
37338 1453084 2819851 5575693 6987716 5398145 2966119 2132672 2113005 1297395 618681
37329 618681 1700180 3637242 4541293 4684408 5183020 5004757 2563080 -598903 -1115311
37320 -1115311 1334604 3438602 2774669 384836 -1507346 -2032914 -1427604 -303270 179237
37311 179237 -874695 -2443502 -2191349 626555 3967345 5197861 3638123 773916
37303 773916 -1106583 -433246 2372247 4840321 4538803 1577098 -1434639 -1996117 24019
37294 24019 2538826 3392594 2657531 2647116 4791516 6930347 5697964 1718183 -462213
37285 -462213 1168493 2962642 1455330 -834904 569782 4566549 6031246 4014005
37277 4014005 2810256 4240041 4493383 1050018 -2139537 -320242 4440324 5827035
37269E827035l718881l914854N74236L908477K567300j099282k625677o17909
37261I00445K182137K377222l46j648591n38011J291782R65845q13275j181826
37252C535382R9694O11947j41113J64266K062396K457285n01686l711867l243646
37243A332658j20226J429614L73029k40686J146864K007526K69129j788054j025111
37234C384743J259997J174452j405553k381456k8768K030881O55772j619088q04696
37225B266284J795128J769630q28401j486481J027396K458286K69303k124642
37217E146503j269476O97053K59217j319343p42371J144020J135049n5575J186360
37208F181437M589420N670562K828164j77135k43369R24856O26675o71186j348066
$$ plain form
37269 5827035 2108154 -1806700 -1232464 2676013 5243313 4144031 1518354 900445
37261 900445 3082582 5459804 5459458 3810867 3272856 4564638 5530483 4717208 3535382
37252 3535382 3635076 4247023 4105910 4270176 6332572 8789857 8288171 4576304 1332658
37243 1332658 1212432 2642046 3015075 2774389 3921253 5928779 6197908 4409854 3384743
37234 3384743 4644740 5819192 4413639 2032183 2003415 4034296 4690068 3070980 2266284
37225 2266284 4061412 5831042 5002641 3516160 4543556 7001842 7271145 5146503
37217 5146503 3877027 4574080 4833297 3513954 2771583 3915603 5050652 4995077 6181437
37208 6181437 10770857 16441419 19269583 19092448 18849079 19773935 20400610 19729424 18381358
37199A8381358j657264k173022j801288n312J105471l32765k590948k648428o58997
37190G618805O09749O6703o59025l07993K84720n0039j116693j957568j960978
37181B527681j035660L84291J333442J094777L9874r04545j360136j351732n72266
37172A55726J043358K285213J636748n03654j862938j106221M60939P91054j50893
37163B749332o39066J69225J086249P07648n78517j204716o37188m686l61065
37154A287216j175043j178573k35025M85569J89904m16179o7112J332354K361161
37145B584272J600835o31724k410549k312478j017434j34512J78887J044151K195970
37136A097418J525599j407308l311671j110951L073949M026820N92657k583485
$$ plain form
37199 18381358 16724094 14551072 12749784 12744472 13849943 13517178 10926230 8277802 7618805
37190 7618805 8228554 8295257 7636232 7328239 7612959 7562920 6446227 4488659 2527681
37181 2527681 1492021 1876312 3209754 4304531 4344405 3439860 2079724 727992 155726
37172 155726 1199084 3484297 5121045 4617391 2754453 1648232 2109171 2900225 2749332
37163 2749332 2110266 2279491 3365740 4073388 3494871 2290155 1652967 1648281 1287216
37154 1287216 112173 -1066400 -1301425 -815856 -625952 -1042131 -1109243 223111 2584272
37145 2584272 4185107 3553383 1142834 -1169644 -2187078 -2321590 -2142703 -1098552 1097418
37136 1097418 2623017 1215709 -2095962 -3206913 -132964 3893856 4486513 1903028
37128A903028j676484J090737J249641j235933k441068o25379J602535J588380
37120A455457J16976n63248L5530R09871J477711J610238Q56570p25028j676419
37111C497658p05215J222832J876431O87020p75904j213546r06177l97668M39053
37102C724484J371712J429059N53982K29697J206353J917216P64292j152464j588151
37093H456180o14532j55613m25436M42159K816697M350104L462426J692481J053482
37084B1077948J127808O23926r3058k96490j069593l389934n207290l747676m00699
37075H624942K66261k902009n424845l289927J497123L991713K998275J560002
37067G321535J570956J320340q09145k997901k417255L94659J986887P02502j279952
$$ plain form
37128 1903028 226544 1317281 2566922 1330989 -1110079 -1735458 -132923 1455457
37120 1455457 1572433 1009185 1044715 1954586 3432297 5042535 5899105 5174077 3497658
37111 3497658 2792443 4015275 5891706 6578726 5802822 4589276 3683099 3285431 3724484
37102 3724484 5096196 6525255 7079237 7308934 8515287 10432503 11196795 10044331 8456180
37093 8456180 7841648 7686035 7260599 7702758 10519455 14869559 18331985 20024466 21077948
37084 21077948 22205756 22829682 22736624 22440134 21370541 17980607 12773317 9025641 8624942
37075 8624942 8891203 5989194 564349 -2725578 -1228455 2763258 5761533 7321535
37067 7321535 8892491 10212831 9403686 6405785 3988530 4383189 6370076 7072578 5792626
37058E792626j441032n08501o74912j511764n47999K022220K481506q82615m166011
37049E63518k763213J799814L694816J013265j891573j196494J160854J358322
37041C739309l14594p23254O46903J242038p479j173078q62731k65077n15053
37032A766984n33329P87830K103115J400625p86843k004369j261693O2295O36134
37023B170749P12371Q25986N24405o34486j788701j614157j34967J181740J123070
37014B366010l6960j034944r64593n5189P04877O89084L15713L30210M91918k57506
37004B548620j908352k565529o62284K401855L344994J066686j769873k117472
36996C38645l42738P91610J85538n69641k98947j04330q91754r80235J477863
$$ plain form
37058 5792626 4351594 3843093 3168181 1656417 1108418 3130638 5612144 4729529 563518
37049 563518 -2199695 -399881 3294935 4308200 2416627 1220133 2380987 3739309
37041 3739309 3424715 2701461 3348364 4590402 4582923 3409845 2547114 2282037 1766984
37032 1766984 1233655 2021485 4124600 5525225 4738382 2734013 1472320 1534615 2170749
37023 2170749 2883120 3709106 4233511 3599025 1810324 196167 61200 1242940 2366010
37014 2366010 2329050 1294106 329513 274324 979201 1668285 1983998 2314208 2806126 2548620
37004 2548620 640268 -1925261 -2587545 -185690 3159304 4225990 2456117 338645
36996 338645 -4093 787517 973055 403414 104467 137 -891617 -1871852 -393989
36987c93989M629562M401676K09266l590742l303987n96630M88388o94064j434773
36978b85293m25320P38831P48256K95229R9274j44926k16054O57023J617854Q29327
36968C914201r01522n49004J722624J592377k446993n292288k372963K948351
36960a385217M192130J297823n99844k25100j137626l774635l703942L81976L439216
36951a515219J917308p24685j60471J925563J647883j96612j72398J362207J018432
36942E102008j610662l287258k217753j25030Q63583N58088j81912n68673k13921
36933a681530K75534k14736j188023o00565J645057K672826J005288q20665n22819
36924E70367J61068o93331r25185J639242L836385J561514k616612k717897Q72817
$$ plain form
36987 -393989 4235573 8637249 8846515 5255773 1951786 1355156 1843544 1149480 -285293
36978 -285293 -710613 28218 776474 1071703 1170977 1026051 809997 1467020 3084874 3914201
36968 3914201 3012679 2463675 4186299 5778676 3331683 -1960605 -4333568 -1385217
36960 -1385217 2806913 4104736 3504892 3279792 2142166 -1632469 -5336411 -4954435 -1515219
36951 -1515219 402089 -322596 -483067 1442496 3090379 2893767 2721369 4083576 5102008
36942 5102008 3491346 204088 -2013665 -2138695 -1275112 -717024 -898936 -1467609 -1681530
36933 -1681530 -1405996 -1620732 -2808755 -3409320 -1764263 908563 1913851 1093186 570367
36924 570367 731435 38104 -887081 752161 4588546 6150060 3533448 815551 1688368
36915A688368J985340q39270j976888J312313L879870J283238k894775l180984
36907A257212p57625k92056j681706r65538K233917L869911J935847q75506j667310
36898C057146q90332l19575k02096K00589Q92435J185492P16098j92473q37407
36889C609877p58753l16507l17422q04229q49268M7905J103625J308250O54578
36880C678056j54906n62654l79270J52945L54524n4570k23112O14523J434813
36871D860349N76752j395896j969295l07239J340321P15361j584593l175050k449311
36862c388601M47377L680126M445828J553636k309559l112711p86021O82169o74976
36853E37268j837845K04427L526600M185019J925690j12863r9559R69945J721961
$$ plain form
36915 1688368 3673708 2834438 857550 2169863 6049733 7332971 4438196 1257212
36907 1257212 499587 207531 -1474175 -2439713 -205796 3664115 5599962 4724456 3057146
36898 3057146 2166814 1847239 1645143 1845732 2738167 3923659 4639757 4447284 3609877
36889 3609877 2851124 2534617 2217195 1412966 563698 611603 1715228 3023478 3678056
36880 3678056 3523150 2960496 2581226 2734171 3088695 3034125 2811013 3425536 4860349
36871 4860349 5437101 4041205 2071910 1764671 3104992 3820353 2235760 -939290 -3388601
36862 -3388601 -2941224 738902 5184730 6738366 4428807 1316096 530075 1212244 537268
36853 537268 -1300577 -1096150 2430450 6615469 8541159 8428296 8328737 9298682 11020643
36844A1020643J890410J720599J709635K402984L117965K059898p90966k594424
36836B0536744j523468O1028r61189l439189l770519j781782q28135j978056k186410
36827D129024M33151L053676K205998r89597k465450r54839O45314k33837k195798
36818C627642j958106R65341L315822K141932j439778l662688k679830k53762
36810E6573J034890O52729k48691o07999j59028N43872L82329q84712j466233
36801f96270K78463K469924J377870k707839m709442j887240J708912J165286
36793c000336j891251k226705O22287K135871M88528r26054L46537J985785J367453
36784a097885j10692k4778Q15373L63749n65871K88411K303637K510944K28486
$$ plain form
36844 11020643 12911053 14631652 16341287 18744271 21862236 23922134 23131168 20536744
36836 20536744 19013276 19074304 18113115 14673926 10903407 9121625 8293490 6315434 4129024
36827 4129024 4562175 7615851 9821849 8832252 6366802 5411963 6057277 5823440 3627642
36818 3627642 1669536 2634877 5950699 8092631 6652853 2990165 310335 56573
36810 56573 1091463 1744192 1495501 887502 728474 1272346 1654675 769963 -696270
36801 -696270 -417807 2052117 3429987 722148 -3987294 -5874534 -4165622 -3000336
36793 -3000336 -4891587 -7118292 -6496005 -4360134 -3871606 -4797660 -4451123 -2465338 -1097885
36784 -1097885 -1208577 -1233355 -417982 -54233 -620104 -331693 1971944 4482888 4711374
36775D711374j920303j969450q51189P6097J071073K140774J582334j246664l456186
36766A37860j965145J528351K351580l16826k203241o44973J443324Q06304o83280
36757D53954K61024K060784Q47133k290070k428022R57969K782263N31357j935549
36748A240843r71738J521239K226199J406326N49065q68958k783534k659775L912
36739c36421J210607j250649l077760j45402L904489L063860j049702j849584
36731D69438J302225K582572j42211k367272j310407j5831q18666j174655Q27087
36722f47720K318976P36970j429156q35056J296843J704203K87461o72788m00057
36713B359676K38871P55311Q31102k03845j768757j818872N0059J420380O34352
$$ plain form
36775 4711374 2791071 821621 -29568 46529 1117602 3258376 4840710 3594046 137860
36766 137860 -1827285 -298934 2052646 1735820 -467421 -1112394 330930 1137234 453954
36757 453954 714978 2775762 3622895 1332825 -1095197 -137228 2645035 3176392 1240843
36748 1240843 269105 1790344 4016543 5422869 5971934 5102976 2319442 -340333 -336421
36739 -336421 874186 -376463 -3454223 -3599625 304864 3368724 2319022 469438
36731 469438 1771663 4354235 4212024 1844752 534345 518514 -300152 -1474807 -647720
36722 -647720 1671256 2408226 979070 144014 1440857 3145060 3432521 2759733 2359676
36713 2359676 2598547 3353858 4184960 3981115 2212358 393486 443545 1863925 2498277
36704B498277q00864j106132r26994j144723o57481J282509K918557K614913J420910
36695F098972P10777l43039k429936l695052k530789n44571J59392L81299J407424
36686g85523J662858m29453k407816r94210K143293K543091L3526j202688M24603
36677I87681J786118O78987r31231q96630k04938k70107j62347J138941K287774
36668D414248J703146J95012o51695r97545j599772j735665n63518O15047j04987
36659A274271j997610k344831k97871J963606K340776J286074L31643l38747j393717
36650H23594k236005j270724J349039K845721J024030k388614l293394k32377
36642c378730L685258M513943J830363j590357l285408k896073j223811P90859
$$ plain form
36704 2498277 1697413 591281 -335713 -1480436 -2137917 -855408 2063149 4678062 6098972
36695 6098972 6809749 6466710 4036774 341722 -2189067 -2733638 -2574246 -2192947 -785523
36686 -785523 877335 447882 -1959934 -2954144 -810851 1732240 1765766 563078 987681
36677 987681 2773799 3452786 2521555 1624925 1419987 1149880 987533 2126474 4414248
36668 4414248 6117394 6312406 5660711 4663166 3063394 1327729 764211 1379258 1274271
36659 1274271 -723339 -3068170 -3366041 -1402435 938341 2224415 2556058 2217311 823594
36650 823594 -1412411 -2683135 -1334096 1511625 2535655 147041 -3146353 -3378730
36642 -3378730 306528 4820471 6650834 5060477 1775069 -1121004 -2344815 -1553956
36634a553956K162592K268806J451086M67729n38610j729033k585597k397672
36626b454655j535983r36399l79562J173370L292141L873444K047195k74772r84198
36617C820581n72368p25782j240909n92404Q14891O05674j682290l134109j495939
36608d202655J225846J491004o44093j853169o05253J050656J231405Q10772R55547
36599e39940P78774m18388p64764J502142M339229L961637J44038l342323l575219
36590B085186j264737J358094K841458K341682k00121k845390k954936p32734
36582F28502O59465m00287j629857m67499K043530L000668J708703j79194j528535
36573C835496k443434k536907p17274K761666N441693M825209J185478k315492
$$ plain form
36634 -1553956 608636 2877442 4328528 4796257 4257647 2528614 -56983 -2454655
36626 -2454655 -3990638 -4927037 -5306599 -4133229 -841088 3032356 5079551 4804779 3820581
36617 3820581 3248213 2522431 1281522 689118 1504009 2109683 427393 -2706716 -4202655
36608 -4202655 -2976809 -1485805 -2129898 -3983067 -4588320 -3537664 -2306259 -1495487 -539940
36599 -539940 238834 -179554 -944318 557824 4897053 8858690 9002728 5660405 2085186
36590 2085186 820449 2178543 5020001 7361683 7161562 4316172 1361236 628502
36582 628502 1287967 887680 -742177 -1209676 833854 3834522 5543225 5364031 3835496
36573 3835496 1392062 -1144845 -1862119 899547 6341240 11166449 12351927 10036435
36565A0036435k750577o79567N38830q37914k560970j844844L13983R10166K6261
36556C151803M84669K337253J957688j834175m752053k906125J448790L332726
36548C220576J879526K02550L0890J88528k56407o68711o39362n13824j72602
36539C271164O19250J000914J77017p81257m10557N52128L45303p45981j030028
36530B997953n40001p54742j518222j164243K72213Q95639K69401j9935M13683
36521H51746J4074j336157j268350J165927L211987K118260q43351k257778j132725
36512E23633N26485R25156L31263r8617R9230N12060N39733Q0502l88102n66108
36502B485235q88999j712872k276168j492452L18328J553439J226903j17174j207785
$$ plain form
36565 10036435 7285858 6606291 7145121 6307207 3746237 1901393 2215376 3125542 3151803
36556 3151803 3636472 5973725 7931413 6097238 1345185 -1560940 -112150 3220576
36548 3220576 5100102 5302652 5333542 5522070 5265663 4596952 3957590 3443766 3271164
36539 3271164 3890414 4891328 5068345 4287088 3876531 4428659 4773962 4027981 2997953
36530 2997953 2457952 1703210 184988 -979255 -707042 188597 457998 438063 851746
36521 851746 865820 -470337 -1738687 -572760 2639227 4757487 3914136 1656358 523633
36512 523633 1050118 1975274 2306537 2207920 2307150 2819210 3358943 3439445 3051343 2485235
36502 2485235 1596236 -116636 -2392804 -3885256 -3566928 -2013489 -786586 -903760 -2111545
36493b111545r28383J000961L073454K688855m22988k531363k93399L879698M283886
36484H639176r4804l929122l122466j60134N26801q17295q00203J152692K304806
36475C699451J283326k75616q19758p60894q31114q59806p77947j019275j366256
36466a727889r27182K26554P42391j58213j560892k002426q98469J269382L232560
36457a804184L393162J175693j835161l134767j939250K61726J768069K160936
36449D6224J711555P13996k03948m25679m99465j603037l262910l188471m64993
36440g176728K565355L134029J558230J18983n43988j556965k769280k329113
36432f999477J63389K539087L162356K921869K676672J043470k801656n850700
$$ plain form
36493 -2111545 -3039928 -2038967 1034487 3723342 3300354 768991 475592 4355290 8639176
36484 8639176 8544372 4615250 1492784 1332650 1859451 1042156 241953 1394645 3699451
36475 3699451 4982777 4707161 3887403 3126509 2295395 1435589 657642 -361633 -1727889
36466 -1727889 -2655071 -2428517 -1686126 -1844339 -3405231 -5407657 -6306126 -5036744 -1804184
36457 -1804184 1588978 2764671 929510 -2205257 -4144507 -3882781 -2114712 46224
36449 46224 1757779 2471775 2267827 1842148 1342683 -260354 -3523264 -6711735 -7176728
36440 -7176728 -4611373 -1477344 80886 199869 -344119 -1901084 -4670364 -6999477
36432 -6999477 -6836088 -4297001 -1134645 1787224 4463896 5507366 2705710 -3144990
36424c144990m196975J112708M508539K883174p72910k036487o65138O05422P66002
36415i40655J035298J551965P50757j510001k788695j330150J183364J745081
36407c03036K9448j316626k84983J932356K546359O14058j908661k487549p86271
36398a964905J162110J263154n29031k368543k529441j154507R8962K59606M16138
36389e346457J997347L916245L229039n06938l493113k346328R52869J658307
36381F0971q73775k425006m28686K419313K634101Q09262l22417j20699L34512
36372B087576P84448J185198L55174j860994k786104n35876K126371J394622j348498
36363A401917j442886J376806K358163m41275k900131j559292J014881Q18438
$$ plain form
36424 -3144990 -7341965 -6229257 -1720718 1162456 389546 -1646941 -2312079 -1706657 -940655
36415 -940655 94643 1646608 2397365 887364 -1901331 -3231481 -2048117 -303036
36407 -303036 -273588 -1590214 -1875197 57159 2603518 3217576 1308915 -1178634 -1964905
36398 -1964905 -802795 460359 -68672 -2437215 -4966656 -6121163 -6022201 -5762595 -5346457
36389 -5346457 -3349110 567135 3796174 3289236 -203877 -2550205 -1597336 60971
36381 60971 -812804 -3237810 -3666496 -1247183 1386918 2196180 1873763 1753064 2087576
36372 2087576 2872024 4057222 4412396 2551402 -234702 -770578 1355793 2750415 1401917
36363 1401917 -40969 1335837 3694000 3252725 352594 -1206698 -191817 626621
36355F26621j291880j744577j48277R85053Q61709Q80808J248527O66439p37533
36346A346890j217388l20222N53162O39452N36245L49713n36659j624040j520615
36337a793462l39397L31506J66821M49321J239142Q35038j042320k169235j227492
36328c550078K13663O45130R33597J749795J449815p46191k018554Q5491L026696
36319A789364K784928M10874R0688J483419j9014m612431o076031j280273M013798
36310a414678L257294j486795l524439j540740L11869K02336J90502Q13956K81958
36301b908737p28116O30625L447141L272713k37042j867366N32395J989800j240537
36292B890876m832109l152722J464322K457505o73405k373264k48853K024966
$$ plain form
36355 626621 -665259 -2409836 -2558113 -1573060 -711351 169457 1417984 2084423 1346890
36346 1346890 129502 -190720 362442 1001894 1538139 1887852 1351193 -272847 -1793462
36337 -1793462 -2132859 -1801353 -1634532 -1185211 53931 888969 -153351 -2322586 -3550078
36328 -3550078 -3336415 -2691285 -1757688 -7893 1441922 695731 -1322823 -1237332 1789364
36319 1789364 4574292 4985166 5075854 6559273 6540259 1927828 -4148203 -5428476 -1414678
36310 -1414678 1842616 355821 -3168618 -4709358 -4397489 -4195153 -4004651 -3190695 -2908737
36301 -2908737 -3636853 -3006228 440913 3713626 3476584 1609218 2141613 4131413 2890876
36292 2890876 -1941233 -5093955 -3629633 -1172128 -1845533 -4218797 -4467650 -2442684
36284b442684J444148j55471j73909P69786Q61926O0712o96085j061613q37937
36275b231127K04898J286187J125365k4222n88295j51598J58729q5000o5837L19272
36265e1628R3125p92190j135636o41669l95803p14673n32196N10468J326036J343345
36255i90821J300091J448971R16982l58264r18365M963J131327R44269l99493
36246C079660j692642k053109j212646L79966J448894J088629J21352n0796L54932
36237A464240K04878p4421Q72949K294690J761412p93919k313355j016491J037263
36228C437246J279729K20760j01828N82143R77028N10625k39233o24376l22668
36219E719426N65601J147518M71458r32516j521391j051040p94001j107508q00862
$$ plain form
36284 -2442684 -998536 -1154007 -1327916 -558130 303796 364508 -331577 -1393190 -2231127
36275 -2231127 -2026229 -740042 385323 361101 -227194 -378792 -220063 -305063 -370900 -51628
36265 -51628 41497 -750693 -1886329 -2527998 -2923801 -3638474 -4170670 -3660202 -2334166 -990821
36255 -990821 309270 1758241 2675223 2316959 1398594 1403557 2534884 3479153 3079660
36246 3079660 1387018 -666091 -1878737 -1498771 -49877 1038752 1160104 1109308 1464240
36237 1464240 1669118 1594697 2467646 4762336 6523748 5729829 3416474 2399983 3437246
36228 3437246 4716975 4937735 4835907 5418050 6395078 6905703 6666470 6042094 5719426
36219 5719426 6285027 7432545 7904003 6971487 5450096 4399056 3605055 2497547 1696685
36210A696685L93686Q80677j83964j353052j265012p10834q61296j095713k75261
36201b774084J057770J394636M44384o12728n92231N81713J688186J094818j270445
36192A012019l165928k591181n13443P48365R79733J379202J386685k63001j855882
36183b883431m36678K548850K281185j616080l542237m52577L263570K761984
36175A924586j65430j182135m35592n48531q80770P56066K840402K010441j026276
36166C292761k376724j019916M73179O99782O94746Q45288M86027K31002J011610
36157D337755J333362o96489l234914k753355J65130J464777R368j233277p90501
36148a398144o96554j765721j510279J195450L377962K434616J51145m40875K80299
$$ plain form
36210 1696685 2090371 2971048 2787084 1434032 169020 -541814 -1403110 -2498823 -2774084
36201 -2774084 -1716314 -321678 122706 -490022 -1082253 -500540 1187646 2282464 1012019
36192 1012019 -2153909 -4745090 -5258533 -4510168 -3530435 -2151233 -764548 -1027549 -2883431
36183 -2883431 -3320109 -771259 1509926 -106154 -3648391 -4100968 -837398 1924586
36175 1924586 1759156 577021 141429 -407102 -1287872 -531806 2308596 4319037 3292761
36166 3292761 916037 -103879 369300 1069082 1763828 2609116 3095143 3326145 4337755
36157 4337755 5671117 4974628 1739714 -1013641 -848511 616266 625634 -607643 -1398144
36148 -1398144 -2094698 -3860419 -5370698 -4175248 -797286 1637330 1788475 1347600 1627899
36139A627899j64571k012422k903006j321783J432801K764326J554997n78318
36131C99923j051638L53853J089487j78407j046596Q33678L257697K347428j112441
36122D892984k526082o18570Q49533n49865k285045j534732L92023Q66959J01113
36113d11682k31136j34910m15428n08805L92067J488653J640997J095040L34826
36104C249622j086542k859989k971540n75969J832304J492055o48953j452181
36096c021193j60643J042034O72027j94567L699J091990J668540R98219j41230
36087A958876m54980J05804J28512j045395j748600k82649J852023J544072j062530
36078I95133k271858k63680K238388K282456P07660l22208r73593k030715j969967
$$ plain form
36139 1627899 1463328 -549094 -3452100 -4773883 -3341082 -576756 978241 399923
36131 399923 -651715 -297862 791625 613218 -433378 400300 3657997 6005425 4892984
36122 4892984 2366902 1748332 2597865 2048000 -237045 -1771777 -1379754 -512795 -411682
36113 -411682 -642818 -777728 -1193156 -1701961 -1309894 178759 1819756 2914796 3249622
36104 3249622 2163080 -696909 -3668449 -4244418 -2412114 -920059 -1569012 -3021193
36096 -3021193 -3181836 -2139802 -1467775 -1662342 -1658643 -566653 1101887 2100106 1958876
36087 1958876 1503896 1609700 1738212 692817 -1055783 -1338432 513591 2057663 995133
36078 995133 -1276725 -1540405 697983 2980439 3688099 3365891 2392298 361583 -1608384
36069a608384O01197L209124K269607j113404k228415J69018J929172r9719l353173
36060b24977l481055m31284K099780J854479L0552j281438j306777j97240J521326
36051a416634K564865J596289q13321k203772j249727L44078L11792q00829o46808
36042b314067J057582K073059J280032K46654K07616K959j314483k181266j158532
36033b100446J56772l05473j284733k86174J769658J858653J98149L0111J892830
36024A929347K530544N45563j209574p13982j50869j594576k954697j543646J126452
36015b035438J742165L75097l50878R4121j04596j388530k069966j175255M50564
36006d462716J718116J956317N54652j968946l208402j426113J680502K983984
$$ plain form
36069 -1608384 -1007187 2201937 4471544 3358140 1129725 1298743 3227915 3128196 -224977
36060 -224977 -3706032 -4137316 -2037536 -183057 -152505 -1433943 -2740720 -2937960 -1416634
36051 -1416634 1148231 2744520 1931199 -272573 -1522300 -1178222 -866430 -1667259 -2314067
36042 -2314067 -1256485 816574 2096606 2343260 2550876 2553835 1239352 -941914 -2100446
36033 -2100446 -1943674 -2249147 -3533880 -3820054 -2050396 -191743 6406 36517 1929347
36024 1929347 4459891 5005454 3795880 3081898 2931029 1336453 -1618244 -3161890 -2035438
36015 -2035438 -293273 81824 -269054 -174933 -279529 -1668059 -3738025 -4913280 -4462716
36006 -4462716 -2744600 -788283 -233631 -2202577 -5410979 -6837092 -5156590 -2172606
35998b172606K082894J085319Q85080M64317k81840k1804J221672J432982l18453
35989D377561k282155k455388r15569R76412K085405J658289k89471k056861j455704
35980c57481J188016K793544J292678j695122k970673j418610J348257K978152
35972C158761K196394l43391k247749j463078J114698K310654P37549j316110
35964D147728j301587q0655j54122j431173j498521J54862J117261J5953j204451
35955b34705o21054K89084q88877l093409k942835P12K335564J910099P63911
35946b481510J332564K429708J646203k16416m64115O81767K61986k242314l455588
35937b507715j132797K236726K815855M35459j846329j928236m74661P38552O91305
$$ plain form
35998 -2172606 -89712 995607 1880687 2345004 2063164 2041360 3263032 4696014 4377561
35989 4377561 2095406 -359982 -1275551 -299139 1786266 3444555 3155084 1098223 -357481
35980 -357481 830535 3624079 4916757 3221635 250962 -1167648 180609 3158761
35972 3158761 5355155 5011764 2764015 1300937 2415635 4726289 5463838 4147728
35964 4147728 2846141 2765486 2611364 1180191 -318330 -163468 953793 969746 -234705
35955 -234705 -855759 -566675 -1455552 -4548961 -7491796 -7491084 -5155520 -3245421 -2481510
35946 -2481510 -1148946 1280762 2926965 2710549 2246434 2928201 3190187 947873 -2507715
35937 -2507715 -3640512 -1403786 1412069 1847528 1199 -1927037 -2401698 -1663146 -971841
35928i71841k99986q23233L30753K402711L024007J119357j512784k422990j354177
35919e08183P9631N90849J02437o67381o23704P22857J969617Q89867k279767
35910B76223m286104k960035j60159J155662J084215J607963K604370J989178
35902A311313n04683k424122j855779L53752K005379J788971Q6966j327344p68382
35893a333929J145627J714660q3260j578761k48681K079653J855060o47177k084061
35884H19131j628739j541412k127161q40096K426385L829861J569798q31225j53544
35875A522998J436932N64553j440664j239417M18638L00729j136776n36985J861023
35866A751031K019097q86743k581014o72548J380556J92378j940612j264136R13070
$$ plain form
35928 -971841 -1271827 -2095060 -1764307 638404 3662411 4781768 3268984 845994 -508183
35919 -508183 -428552 162297 264734 -402647 -1026351 -303494 1666123 2555990 276223
35910 276223 -4009881 -6969916 -7130075 -5974413 -4890198 -3282235 -677865 1311313
35902 1311313 806630 -1617492 -3473271 -3119519 -1114140 674831 761797 -565547 -1333929
35893 -1333929 -188302 1526358 1443098 -135663 -384344 1695309 3550369 2903192 819131
35884 819131 -809608 -2351020 -4478181 -5318277 -2891892 937969 2507767 1676542 1522998
35875 1522998 2959930 3524483 2083819 844402 1263040 1563769 426993 -109992 1751031
35866 1751031 3770128 2883385 302371 -370177 1010379 1202757 -737855 -2001991 -1088921
35857a088921O41241j741295k168822K77057J956173P37983q81490k34674J564006
35848i38742K143071J497612R16334N73023L05087P75524J746235J141847j846420
35839F313571m506016l961677j216000P32018J181223J261635Q43188n81319j256881
35830a190258N65629K581193J097920k570710l270857m503K405864R98800j171324
35821e58246q49719M18000K72418K5091J284356J998088J99163j632717n76827
35812E79607J317756O26906j084626j46945J995767Q36319k825510l311343O24638
35803a387431L416087J405382j879349j938697R5195N37900q48430j619471j023060
35794c241874l36302k12673q4637O75076K225470L706399K965739q83210m474783
$$ plain form
35857 -1088921 -447680 -2188975 -4357797 -4080740 -2124567 -1386584 -2268074 -2502748 -938742
35848 -938742 1204329 2701941 3618275 4191298 4496385 5271909 7018144 8159991 6313571
35839 6313571 1807555 -2154122 -3370122 -2638104 -1456881 -195246 647942 66623 -1190258
35830 -1190258 -624629 1956564 3054484 483774 -2787083 -2791586 -385722 613078 -558246
35821 -558246 -1407965 -989965 -717547 -692456 591900 2589988 2789151 1156434 579607
35812 579607 1897363 2524269 1439643 1292698 3288465 4124784 1299274 -2012069 -1387431
35803 -1387431 2028656 3434038 1554689 -384008 -288813 249087 -599343 -2218814 -3241874
35794 -3241874 -3578176 -3790849 -3875486 -3200410 -974940 2731459 5697198 4813988 339205
35785C39205l191961J957433M509364J438638k410353j783872J252910J416163
35777C527527j216390k122204j26790J288383K62055r06186l13379O88342N43118
35768A624476p8124m08232j137431k203429j773109O08592K233723R40945j244426
35759a437015q82941J618574K513710L33158j959433j452257M53411L42111j908474
35750b379156k785657l65848K574324K303390n23280j670103P99903L909876L892289
35741E755738R89212j461138j600970q06006j015799j977883j921283k56951J378989
35732i16091J116419n93859j386760k20202J031934L57241j191925j108864M24050
35723b488057P78509n39905p40026J516115L317848J873139q27159r65598J091666
$$ plain form
35785 339205 -2852756 -895323 3614041 5052679 2642326 858454 2111364 3527527
35777 3527527 2311137 188933 62143 1350526 1612581 706395 393016 1081358 1624476
35768 1624476 1546352 1138120 689 -2202740 -3975849 -3367257 -1133534 -192589 -1437015
35759 -1437015 -2319956 -701382 1812328 2145486 186053 -1266204 -812793 -470682 -2379156
35750 -2379156 -5164813 -5530661 -2956337 -652947 -1176227 -2846330 -2046427 1863449 5755738
35741 5755738 6744950 5283812 3682842 2876836 1861037 -116846 -2038129 -2295080 -916091
35732 -916091 200328 -393531 -1780291 -2000493 -968559 -611318 -1803243 -2912107 -2488057
35723 -2488057 -1709548 -2249453 -2989479 -1473364 1844484 3717623 2890464 1924866 3016532
35714C016532J505504q26390k634574j523739N78582Q15029m53032j083480r00332
35705a505900j416764k557276k180508P10246M045756M950923L027485M11412
35697E485374r92088j216052j093158o62418L09401R87494K08255j434998j856045
35688b64235m13228R29269M29200q22631o92108O16488R86162k00077j238291
35679f69451r86412n32001j032370j529798m45016J632813K359293Q33756j013463
35670a382649q63632J006562K147628J100195r31104j910365j490832q04535m50631
35661c579363o3858L46290K18449j34549M74985K007260K607221J149332r45480
35652B080287j664942j021618l48659m3015M00786R14028J025784Q72572N68278
$$ plain form
35714 3016532 4522036 3695646 1061072 -462667 115915 930944 477912 -605568 -1505900
35705 -1505900 -2922664 -5479940 -7660448 -6950202 -2904446 2046477 5073962 5485374
35697 5485374 4493286 3277234 2184076 1521658 1831059 2818553 3026808 1591810 -264235
35688 -264235 -677463 251806 681006 -141625 -833733 -217245 768917 568840 -669451
35679 -669451 -1655863 -2187864 -3220234 -4750032 -5195048 -3562235 -1202942 -369186 -1382649
35670 -1382649 -2246281 -1239719 907909 2008104 1077000 -833365 -2324197 -3128732 -3579363
35661 -3579363 -3643221 -3296931 -3078482 -3213031 -2738046 -730786 1876435 3025767 2080287
35652 2080287 415345 -606273 -954932 -997947 -597161 316867 1342651 2215223 2783501
35643B783501n77919k523380l215071j138197J631136J697426n75393j313633
35635c231530J122303L751193L477492J157686n66940j136458j622508k124457
35627H26781j870978r44473q0864N17088Q29781M70445k76934j51237R44521J008390
35617A272520j039015k941781k062787N13123J569195N79829j00112N05578Q08171
35608h95279J9965m76106K053J08399p31154q73140N67927J693862P33837r97018
35598h46654j173790P3934Q97281O47067K834o80592j148082n02238J217550J916192
35588D03502L11008j260147J33752K988385K918247p01717l371177j848952J414972
35579I87873K153319L6651j788528j305782M84537J508110P80705r40148j746530
$$ plain form
35643 2783501 2205582 -317798 -3532869 -4671066 -3039930 -1342504 -1917897 -3231530
35635 -3231530 -2109227 1641966 5119458 6277144 5710204 4573746 2951238 826781
35627 826781 -1044197 -1988670 -2069534 -1552446 -722665 -252220 -529154 -680391 264130 1272520
35617 1272520 233505 -2708276 -4771063 -4257940 -2688745 -2108916 -2209028 -1703450 -895279
35608 -895279 -875314 -1351420 -1349367 -1240968 -1972122 -2845262 -2277335 -583473 150364 -846654
35598 -846654 -2020444 -1946510 -1049229 -402162 -399328 -1079920 -2228002 -2730240 -1512690 403502
35588 403502 714510 -545637 -411885 2576500 5494747 4793030 1421853 -427099 987873
35579 987873 3141192 3177843 1389315 83533 568070 2076180 2856885 1916737 170207
35570A70207m97648J389275J311021q79221k389423j505461M8091K50715J10220
35561a992224J569445L752004M020604J919832m80886j724682k138905k145775
35553B779413j600746q33713n11206m30111O1606O96290P71068M97772M08321
35544A838694J91775k99096n7333J100851J120204j044225k466783k76965K735763
35535B842885J449864l043816m022792N40460M236980J811859k907009l272867
35527b364436J10981J310872j246697l042742j138913J709312J798381n21083
35519c384325k235183j536725J037364L546198L828492J280118j899590k596926
35511a960577l71209K123516K568452J400482L64170N9210j95808q79396j526391
$$ plain form
35570 170207 -327441 1061834 2372855 1493634 -895789 -2401250 -2353159 -2102444 -1992224
35561 -1992224 -422779 3329225 7349829 9269661 8788775 7064093 4925188 2779413
35553 2779413 1178667 344954 -166252 -596363 -534757 161533 932601 1430373 1838694
35544 1838694 2030469 1731373 1674040 2774891 3895095 2850870 384087 107122 2842885
35535 2842885 4292749 1248933 -2773859 -2233399 2003581 3815440 908431 -2364436
35527 -2364436 -2253455 -942583 -2189280 -5232022 -6370935 -4661623 -2863242 -3384325
35519 -3384325 -5619508 -7156233 -6118869 -2572671 1255821 2535939 636349 -1960577
35511 -1960577 -2331786 -208270 2360182 3760664 4124834 4184044 3988236 3108840 1582449
35502A582449j360589l52265N17847L39112n00015q61742n51394l02556n8386
35493a547539R81092K187543J642928m77424j183876Q01365K325126L46010k981042
35484B094183l280162n50849J167522Q7356j435500j435930q42710o62587k49590
35475e108267M00954j25227j655282j627848R03289L105324K266285l40877j650292
35466c831941j037072j08965L57880R71363J911247K476205K230364J427702N58279
35457D955062Q3404M5242l33711j658887k837657k064288L39932J894286J352794
35448A776177J49631l23311o46282j382518j442401j23778J196503J237162Q58523
35439A299706J070744R02972n36731j683771q29575O08349J950k210602l059480
$$ plain form
35502 1582449 221860 -130405 387442 726554 226539 -635203 -1186597 -1489153 -1547539
35493 -1547539 -566447 1621096 3264024 2786600 1602724 2404089 4729215 5075225 2094183
35484 2094183 -1185979 -1736828 -569306 -481950 -1917450 -3353380 -4196090 -4858677 -5108267
35475 -5108267 -4707313 -4832540 -6487822 -8115670 -7212381 -4107057 -1840772 -2181649 -3831941
35466 -3831941 -4869013 -4977978 -4620098 -3648735 -1737488 738717 2969081 4396783 4955062
35457 4955062 5038466 5083708 4749997 3091110 253453 -1810835 -1470903 423383 1776177
35448 1776177 1925808 1602497 956215 -426303 -1868704 -1992482 -795979 441183 1299706
35439 1299706 2370450 3273422 2736691 1052920 223345 831694 833644 -1376958 -4436438
35430d436438j477942M68337Q38800P3514k84202M92824J795603K076998L08632
35421a43874k129366k388228j59207J331133K34070o06659J652024M384330L175159
35412E349382p26113j978656L60699J679325k31390j958164j071264k25765j555280
35403c57226k152706N94650L408875J952851j801905k511646J58860J704073M82825
35394A478651l89041P39822J223655q22384k953771k330766j14327O58203m93393
35385c003351j556099j188681J42664J338253J517743M18547r85078j032613N74603
35376c774012K113744J984860N56467q62657j747755k111508j695664o27641O3727
35367f100439j14195r04J456507L032650K558444J89426j454153p33550R61222
$$ plain form
35430 -4436438 -5914380 -5446043 -4607243 -4533729 -4817931 -4325107 -2529504 -452506 -143874
35421 -143874 -2273240 -4661468 -4820675 -3489542 -3255472 -3862131 -2210107 2174223 5349382
35412 5349382 4623269 2644613 3005312 4684637 4453247 2495083 1423819 1198054 -357226
35403 -357226 -2509932 -1915282 1493593 3446444 1644539 -867107 -708247 995826 1478651
35394 1478651 1089610 1829432 3053087 2230703 -723068 -3053834 -3168161 -2509958 -3003351
35385 -3003351 -4559450 -5748131 -5605467 -4267214 -2749471 -2330924 -3316002 -4348615 -3774012
35376 -3774012 -1660268 324592 881059 18402 -1729353 -3840861 -5536525 -6164166 -6100439
35367 -6100439 -6214634 -6215538 -4759031 -1726381 832063 1021489 -432664 -1166214 -204992
35358b04992J338041K22799n88745O2067J300346J507860L29764j033832j371829
35349A561479q29800m45276o17100p06107k59531J63188m7938m06797p7083N20253
35339a144712r563j867307l159465j948953J208681L606482L353524J405175K15109
35330A658971O56038J036848m11573k699329k917278j69836K619845K073547j149434
35321F97799k982317j234207J653190K234209P95273L34801J576535J839493l90091
35312D524685k427189j110903K054017K475634r89609m108838l013173N94439
35304b000937K049115M358k425591k277077p306K125661K785524J853721j92061
35295A915407k010366j887937J38652J685614R61675o07832m21270J279364J651892
$$ plain form
35358 -204992 1133049 1355848 767103 829170 2129516 3637376 3967140 2933308 1561479
35349 1561479 731679 286403 -330697 -1036804 -1296335 -1133147 -1181085 -1587882 -1664965 -1144712
35339 -1144712 -1154275 -3021582 -6181047 -8130000 -6921319 -3314837 38687 1443862 1658971
35330 1658971 2315009 3351857 2940284 240955 -2676323 -2846159 -226314 1847233 697799
35321 697799 -2284518 -3518725 -1865535 368674 1163947 1498748 3075283 4914776 4524685
35312 4524685 2097496 986593 3040610 5516244 4526635 417797 -2595376 -2000937
35304 -2000937 48178 52536 -2373055 -4650132 -4657438 -2531777 253747 2107468 1915407
35295 1915407 -94959 -1982896 -1844244 -158630 803045 195213 -226057 1053307 2705199
35286B705199l39195k114170j256228P82317P70179j453278k614275o82310K249561
35277a952200K870182Q92553j222730j877059j720531j586970j053875K53283
35269e397347J472361J686084J249484R22129N87518r8470o53115n68478l84843
35260a184677o68803p26032J62418J046717O96424n8744L78950J294585O10390
35251A551228j211563j406565L92185J105740p68802k472641j506226L00294K16267
35242c800083n67723O78328K857456K380488p73105k582910j023189J146521Q10556
35233h73661j252344k136572p53706J523678K868837K534881J143278q2894q27974
35224B143523j902578l128342k422210J054777M284126L848220R81296l30051
$$ plain form
35286 2705199 2366004 251834 -1004394 -222077 548102 -905176 -3519451 -4201761 -1952200
35277 -1952200 917982 1810535 587805 -1289254 -3009785 -4596755 -5650630 -5397347
35269 -5397347 -3924986 -2238902 -989418 -67289 520229 421759 -231356 -799834 -1184677
35260 -1184677 -1853480 -2579512 -2417094 -1370377 -673953 -732697 -353747 940838 1551228
35251 1551228 339665 -1066900 -674715 431025 -337777 -2810418 -4316644 -4016350 -3800083
35242 -3800083 -4367806 -3689478 -832022 1548466 775361 -1807549 -2830738 -1684217 -873661
35233 -873661 -2126005 -4262577 -5016283 -3492605 -623768 1911113 3054391 2971497 2143523
35224 2143523 240945 -2887397 -5309607 -4254830 29296 3877516 4858812 4528761
35216D528761M07949P4625k012934k817862j331226n09242j497883j070179K116505
35207b111486L719511N11923l346256k269340J782664K445503r56682k998780
35199c222943j187580J081015J255131J245910K500739K747428L24696k416498
35191B327898k879328k028659j743178j402312N2641J317520J000734N05385J566495
35182a282804K718434J438513j436998k618773j016578J328444K490890K223192
35174C844320O72184j755851l283159k140032N93556J859403P86928k88947L64188
35165F52590J374018P77654r24542j824190j338381l01756O45874J189107O58913
35156I09287j051516k289681j136451J762497L404844K017114p51619j967516
$$ plain form
35216 4528761 4936710 5011335 2998401 180539 -1150687 -1659929 -3157812 -4227991 -2111486
35207 -2111486 1608025 2119948 -1226308 -3495648 -1712984 732519 -224163 -3222943
35199 -3222943 -4410523 -3329508 -2074377 -828467 1672272 4419700 4744396 2327898
35191 2327898 -551430 -2580089 -4323267 -5725579 -5672938 -4355418 -3354684 -2849299 -1282804
35182 -1282804 1435630 2874143 1437145 -1181628 -2198206 -869762 1621128 3844320
35174 3844320 4516504 2760653 -522506 -2662538 -2068982 -209579 577349 288402 652590
35165 652590 2026608 2804262 1879720 55530 -1282851 -1584607 -938733 250374 909287
35156 909287 -142229 -2431910 -3568361 -1805864 1598980 3616094 2864475 896959
35148H96959q68900P38093J043869J66004n29540k52548N01438P92006L64630
35139B852011j99282l10310l6313K02172K69297K46042K0697l71775j99484J103832
35129C576887K378264J481802j528374l364190j356951K508612L615318O99829
35121H011197k533083k520279l24459O19017m32977j088072R6207J488772R95996
35112D312319q59635j727394o45078P65314N16359j151874k164564j397207l9406
35103b391166L15697o0757J38368Q08742N35123q24989j439336l7024K271004
35094f84338L502561K959549J180327r90715k474332k386231j320216r48016j478560
35085b639971j072010J075331K845416K103039q6154j177905p69895k62769l1045
$$ plain form
35148 896959 28059 766152 1810021 1976025 1446485 1193937 1695375 2487381 2852011
35139 2852011 2652729 2342419 2306106 2508278 2777575 3023617 3044314 2672539 2473055 3576887
35129 3576887 5955151 7436953 5908579 2544389 1187438 3696050 7311368 8011197
35121 8011197 5478114 2957835 2633376 3252393 2819416 1731344 1827551 3316323 4312319
35112 4312319 3452684 1725290 1080212 1845526 2361885 1210011 -954553 -2351760 -2391166
35103 -2391166 -2075469 -2136226 -1997858 -1189116 -653993 -1478982 -2918318 -2955342 -684338
35094 -684338 2818223 5777772 6958099 5967384 3493052 1106821 -213395 -1161411 -2639971
35085 -2639971 -3711981 -2636650 208766 2311805 2225651 1047746 277851 15082 -15963
35076a5963N62088J091453N94988k60625k3891Q51146O53109m91731p96731l1157
35066B132686J60291o56582j029142m33514q0879l65270j86035N24274L27138
35057C92967q74841j307868n40468k60821p61685N1838K522588L526957J237747
35048C986414j518525j474371K71976P63828j9790l48200n15848j579100k074612
35039b508228j67100K151205J373506j682690k795472r10048P72282O25658P74175
35030b366712K252816K621426N06595j537750j326676o52962j588597k295757
35022d387617j13086L449088M538556K385093m69374k233153k896709k164690
35014a891892J93275K357282K098995K62904m43486J20193l04602j797806j724798
$$ plain form
35076 -15963 546125 1637578 2232566 1971941 1948050 2799196 3452305 2960574 2163843 2132686
35066 2132686 2292977 1636395 607253 173739 92860 -272410 -458445 65829 392967
35057 392967 -481874 -1789742 -2330210 -2591031 -3352716 -3300878 -778290 2748667 3986414
35048 3986414 2467889 993518 1265494 2029322 2009532 1661332 1145484 -433616 -2508228
35039 -2508228 -2675328 -524123 849383 -833307 -3628779 -4538827 -3766545 -3140887 -2366712
35030 -2366712 -113896 2507530 3014125 1476375 149699 -503263 -2091860 -4387617
35022 -4387617 -4500703 -1051615 3486941 5872034 5402660 3169507 272798 -1891892
35014 -1891892 -1698617 658665 2757660 3020564 2577078 2697271 2392669 594863 -1129935
35005a129935M65819J805733O75219n32406L25829J571483R59099m79157p70342
34996B891342n54364j103041j178872N70343K205653J406976j30936L61130J131430
34987E599661j356407n056381m061755J696720M976142J679462l152437l251963
34979b926958J17786J737417O78414j16926J94306j06098j200097j540785r33590
34970d096531l18263N02766J775942J880915j50254j802513m90342J740640J078967
34961A21327j743530k539592l12694J830406K125134J883417J687716L94044j575927
34952A870301k137715j219800o18203j70175J591273L158791J563903j677252
34944B361123j905054P14536R76682k136188l104979L93139K651090o11837m527811
$$ plain form
35005 -1129935 -664116 1141617 1816836 1284430 1610259 3181742 4140841 3661684 2891342
34996 2891342 2336978 1233937 55065 625408 2831061 4238037 4107101 4468231 5599661
34987 5599661 4243254 -813127 -4874882 -3178162 1797980 3477442 325005 -2926958
34979 -2926958 -2809172 -1071755 -393341 -510267 -315961 -422059 -1622156 -3162941 -4096531
34970 -4096531 -4414794 -3912028 -2136086 -255171 -405425 -2207938 -2698280 -957640 121327
34961 121327 -1622203 -4161795 -4474489 -2644083 -518949 1364468 3052184 3446228 1870301
34952 1870301 -267414 -1487214 -2105417 -2275592 -684319 2474472 4038375 2361123
34944 2361123 456069 1170605 2147287 11099 -3093880 -2700741 -49651 -661488 -5189299
34935e189299k774596K290950L894446J347614n84125j52219K29854l04596l41348
$$ plain form
34935 -5189299 -7963895 -5672945 -1778499 -430885 -1015010 -1167229 -937375 -1241971 -1583319
$$ [...]
##END NTUPLES=NMR SPECTRUM
##END=
