##TITLE=31Pdec_2SR47_k
 d2o, 24 sc
 2.06.2021
##JCAMPDX= 6.0         $$ Bruker NMR JCAMP-DX V2.0
##DATA TYPE= NMR SPECTRUM
##DATA CLASS= NTUPLES
##ORIGIN= UXNMR, Bruker Analytische Messtechnik GmbH
##OWNER= root
$$ XWIN-NMR		Version 3.5
$$ Wed Jun  2 13:18:30 2021 Russian Standard Time (UT+4h)  she@DPX200
##.OBSERVE FREQUENCY= 81.013821
##.OBSERVE NUCLEUS= ^31P
##.ACQUISITION MODE= SIMULTANEOUS
##.ACQUISITION SCHEME= undefined
##.AVERAGES= 24
##.DIGITISER RES= 16
##SPECTROMETER/DATA SYSTEM= spect
##.PULSE SEQUENCE= zgpg30
##.SOLVENT NAME= CDCl3
##.SHIFT REFERENCE= (INTERNAL, CDCl3, 0, 248.564)
##AUDIT TRAIL= $$ (NUMBER, WHEN, WHO, WHERE, WHAT)
$$ ##TITLE= Audit trail, XWIN-NMR		Version 3.5
$$ ##JCAMPDX= 5.01
$$ ##ORIGIN= Bruker BioSpin GmbH
$$ ##OWNER= she
$$ F:/spectra/data/she/nmr/P31/1/pdata/1/auditp.txt
$$ ##AUDIT TRAIL=  $$ (NUMBER, WHEN, WHO, WHERE, WHAT)
(   1,<2021-06-02 13:17:18.78 +0400>,<she>,<DPX200>,
      <created by zg, POWCHK disabled, PULCHK disabled
       configuration hash MD5:
       00 E9 B6 7A A2 85 ED C7 34 08 36 98 17 FE 4E 26
       data hash MD5: 32K
       AE DF 62 AA 2B 0E 3A 76 49 BA B9 EF 2D F6 0C 3E>)
(   2,<2021-06-02 13:17:22.48 +0400>,<she>,<DPX200>,
      <Start of raw data processing
       efp BC_mod = 2 LB = 1 FT_mod = 6 PKNL = 1 PHC0 = -6050.965 PHC1 = 406.07 SI = 64K 
       data hash MD5: 64K
       BA 62 A9 89 96 56 40 97 31 0A A0 D9 BD 6E 56 60>)
(   3,<2021-06-02 13:17:48.93 +0400>,<she>,<DPX200>,
      <pk PHC0 = 5.054917 PHC1 = 68.20004 
       data hash MD5: 64K
       32 CC 76 CC 23 0C 9C 65 AB D6 1C 2B D5 F1 BC A6>)
(   4,<2021-06-02 13:17:57.90 +0400>,<she>,<DPX200>,
      <abs ABSG = 5 
       data hash MD5: 64K
       A5 3A BA 7C 79 4D 1A B5 BE 88 4C 55 0C 30 A5 33>)
$$ ##END=
$$ 
$$ hash MD5
$$ 44 03 D7 63 BE 7B C5 15 C7 EF A0 9A 4C 0F 79 01
##$RELAX= 
##$RELAX= 
##$RELAX= 
##$RELAX= 
##$RELAX= 
##$RELAX= 
##$RELAX= 
##$RELAX= 
$$ Bruker specific parameters
$$ --------------------------
##$DU= <F:/spectra>
##$EXPNO= 1
##$NAME= <P31>
##$PROCNO= 1
##$TYPE= <nmr>
##$USER= <she>
##$AMP= (0..31)
100 100 100 100 100 100 100 100 100 100 100 100 100 100 100 100 100 100 
100 100 100 100 100 100 100 100 100 100 100 100 100 100 
##$AQSEQ= 0
##$AQ_mod= 1
##$AUNM= <au_zg>
##$AUTOPOS= <>
##$BF1= 81.014009
##$BF2= 200.13
##$BF3= 200.13
##$BF4= 200.13
##$BF5= 200.13
##$BF6= 200.13
##$BF7= 200.13
##$BF8= 200.13
##$BYTORDA= 1
##$CFDGTYP= 0
##$CFRGTYP= 5
##$CHEMSTR= <none>
##$CNST= (0..31)
1 1 145 1 1 1 1 1 1 1 1 1 1 1 1 1 1 1 1 1 1 1 1 1 1 1 1 1 1 1 1 1 
##$CPDPRG= <waltz16>
##$CPDPRG1= <>
##$CPDPRG2= <waltz16>
##$CPDPRG3= <>
##$CPDPRG4= <mlev>
##$CPDPRG5= <mlev>
##$CPDPRG6= <mlev>
##$CPDPRG7= <mlev>
##$CPDPRG8= <mlev>
##$CPDPRGB= <>
##$CPDPRGT= <>
##$D= (0..31)
0 1 0 0 0 0 0 0 0 0 0 0.03 2e-05 3e-06 0 0 0 0 0 0 0 0 0 0 0 0 0 0 0 0 
0 0 
##$DATE= 1622625438
##$DBL= (0..7)
120 120 120 11 120 120 24 19 
##$DBP= (0..7)
150 150 150 150 150 150 150 150 
##$DBP07= 0
##$DBPNAM0= <>
##$DBPNAM1= <>
##$DBPNAM2= <>
$$ [...]
##$SUBNAM3= <"">
##$SUBNAM4= <"">
##$SUBNAM5= <"">
##$SUBNAM6= <"">
##$SUBNAM7= <"">
##$SUBNAM8= <"">
##$SUBNAM9= <"">
##$SW= 501.771253377433
##$SWIBOX= (0..15)
0 1 3 0 0 0 0 0 0 0 0 0 0 0 0 0 
##$SW_h= 40650.406504065
##$TD= 32768
##$TD0= 1
##$TE= 0
##$TE2= 300
##$TE3= 300
##$TEG= 300
##$TL= (0..7)
0 120 53 12 22 120 120 120 
##$TP= (0..7)
150 150 150 150 150 150 150 150 
##$TP07= 0
##$TPNAME0= <>
##$TPNAME1= <>
##$TPNAME2= <>
##$TPNAME3= <>
##$TPNAME4= <>
##$TPNAME5= <>
##$TPNAME6= <>
##$TPNAME7= <>
##$TPOAL= (0..7)
0.5 0.5 0.5 0.5 0.5 0.5 0.5 0.5 
##$TPOFFS= (0..7)
0 0 0 0 0 0 0 0 
##$TUNHIN= 0
##$TUNHOUT= 0
##$TUNXOUT= 0
##$USERA1= <user>
##$USERA2= <user>
##$USERA3= <user>
##$USERA4= <user>
##$USERA5= <user>
##$V9= 5
##$VALIST= <valist>
##$VCLIST= <CCCCCCCCCCCCCCC>
##$VD= 0
##$VDLIST= <DDDDDDDDDDDDDDD>
##$VPLIST= <PPPPPPPPPPPPPPP>
##$VTLIST= <TTTTTTTTTTTTTTT>
##$WBST= 1024
##$WBSW= 4
##$XGAIN= (0..3)
0 0 0 0 
##$XL= 0
##$YL= 0
##$YMAX_a= 2930
##$YMIN_a= -3571
##$ZGOPTNS= <>
##$ZL1= 120
##$ZL2= 120
##$ZL3= 120
##$ZL4= 120
##$ABSF1= 248.5645
##$ABSF2= -253.2056
##$ABSG= 5
##$ABSL= 3
##$ALPHA= 0
##$AQORDER= 0
##$ASSFAC= 0
##$ASSFACI= 0
##$ASSFACX= 0
##$ASSWID= 0
##$AUNMP= <proc_1d>
##$AZFE= 0.1
##$AZFW= 0.5
##$BCFW= 0
##$BC_mod= 2
##$BYTORDP= 0
##$COROFFS= 0
##$CY= -3
##$DATMOD= 1
##$DC= 0
##$DFILT= <>
##$DTYPP= 0
##$F1P= 0
##$F2P= 0
##$FCOR= 1
##$FTSIZE= 65536
##$FT_mod= 6
##$GAMMA= 0
##$GB= 0
##$INTBC= 1
##$INTSCL= 5.30512e-09
##$ISEN= 30
##$LB= 1
##$LEV0= 0
##$LPBIN= 0
##$MAXI= 10000
##$MC2= 0
##$MEAN= 0
##$ME_mod= 0
##$MI= 50
##$NCOEF= 0
##$NC_proc= -7
##$NLEV= 6
##$NOISF1= 182.463
##$NOISF2= 159.3651
##$NSP= 0
##$NTH_PI= 0
##$NZP= 0
##$OFFSET= 248.5645
##$PC= 4
##$PHC0= -6045.91
##$PHC1= 474.2701
##$PH_mod= 1
##$PKNL= yes
##$PPARMOD= 0
##$PSCAL= 0
##$PSIGN= 0
##$REVERSE= no
##$SF= 81.014009
##$SI= 65536
##$SIGF1= 159.3651
##$SIGF2= -187.1042
##$SINO= 113.3802
##$SIOLD= 16384
##$SREGLST= <1H.CDCl3>
##$SSB= 0
##$STSI= 65536
##$STSR= 0
##$SW_p= 40650.406504065
##$SYMM= 0
##$S_DEV= 0
##$TDeff= 32768
##$TDoff= 0
##$TI= <>
##$TILT= no
##$TM1= 0
##$TM2= 0
##$TOPLEV= 0
##$USERP1= <user>
##$USERP2= <user>
##$USERP3= <user>
##$USERP4= <user>
##$USERP5= <user>
##$WDW= 1
##$XDIM= 65536
##$YMAX_p= 485406894
##$YMIN_p= -22340657
$$ End of Bruker specific parameters
$$ ---------------------------------
##NTUPLES= NMR SPECTRUM
##VAR_NAME=  FREQUENCY,     SPECTRUM/REAL,   SPECTRUM/IMAG
##SYMBOL=    X,             R,               I
##VAR_TYPE=  INDEPENDENT,   DEPENDENT,       DEPENDENT
##VAR_FORM=  AFFN,          ASDF,            ASDF
##VAR_DIM=   65536,         65536,           65536
##UNITS=     HZ,            ARBITRARY UNITS, ARBITRARY UNITS
##FACTOR=    0.620285442955139, 1,           1
##FIRST=     20137.2065510759, 0,            0
##LAST=      -20513.1999529892, 0,           0
##MIN=       -20513.1999529892, -22340657,   0
##MAX=       20137.2065510759, 485406894,    0
$$ Real data points
##PAGE= N=1
##DATA TABLE= (X++(R..R)), XYDATA
$$ [...]
15102 -3742260 -2126278 -1389671 -2621599 -3861802 -2669957 -189403 184541 -1880892
15094 -1880892 -2683510 155566 3930500 4298198 762870 -3372601 -5378962 -5065804 -2916140
15085 -2916140 998832 5506362 7913648 6713767 3734509 2240681 3357350 5330987
15077 5330987 5869659 4326763 2030247 1289387 3433916 6773576 7269211 2813046 -3630470
15068 -3630470 -7023104 -6218039 -4812014 -5928467 -8698820 -10683859 -10978992 -9335308
15060 -9335308 -5119790 92288 1372981 -4084687 -11437122 -12488845 -5735421 2012458
15052 2012458 5026905 5351729 7620660 11049341 10950858 6497237 2296438 1891793 3418991
15043 3418991 3096152 199562 -3424230 -6742020 -9800446 -11537271 -10163971 -6099076
15035 -6099076 -2193539 -21513 2024917 5317930 7594646 5814441 1530839 -158064
15027 -158064 2381696 4829626 3186106 -579333 -2006369 -891213 -840197 -3273642 -5776613
15018 -5776613 -6317504 -5557595 -4503768 -3090171 -1882913 -2215479 -3611540 -3811832 -2413181
15009 -2413181 -1780393 -3275192 -5434983 -7051328 -8776301 -10035019 -8055166 -2718052
15001 -2718052 977130 -1068192 -6032689 -7970832 -5675973 -2766618 -1460931 -706241
14993 -706241 49810 -419899 -2125269 -2974793 -1606238 1268079 4320169 6156705 5154011
14984 5154011 1587169 -873414 947478 5108499 7428601 8023183 10320826 13874126
14976 13874126 13676968 7877018 1126566 -1729782 -1002047 568275 1380566 -69867
14968 -69867 -4763112 -8985824 -5881511 4962328 14313725 14235654 7690922 2090811 -1818191
14959 -1818191 -7366256 -12015470 -9432089 -1123684 3036250 -1743323 -8438506 -8419216
14951 -8419216 -2658864 1533271 850784 -1643625 -2332946 -1058385 265557 420914 -35073
14942 -35073 306143 1488566 1433436 -1104671 -3613870 -2526337 1502515 4299364 4234391
14933 4234391 3778127 4456019 4710193 4308011 6058634 10237600 11753542 6997140 36117
14924 36117 -2716850 -1329977 -625568 -1509864 -76010 4727973 8383003 7407486 4124980
14915 4124980 2521002 2842525 2945701 2378769 2195782 2234065 1321649 -350021 -1188883
14906 -1188883 -518698 520426 542406 -529790 -1638205 -1824427 -1229657 -1012788 -2069428
14897 -2069428 -3761853 -4310924 -2635064 451628 2901317 3098720 1170436 -887474
14889 -887474 -691064 2306945 6305215 9280444 10844057 11138745 9202447 4608029 109371
14880 109371 -404207 2676748 4310516 1623288 -1705773 -912732 2101655 945845 -5554406
14871 -5554406 -10595936 -8235085 -1103259 3891106 4674167 4489259 4788582 2989876 -1732332
14862 -1732332 -5131884 -3186073 2237716 6031249 6181100 4477667 2501478 355090
14854 355090 -1322220 -1544816 -1251400 -2278393 -3766355 -2790957 616795 2368083 -103484
14845 -103484 -3992154 -5138148 -3740895 -3390369 -5680914 -8453630 -9022349 -7031044 -3997724
14836 -3997724 -1423718 403413 2250023 4309582 4836537 1939874 -2745651 -4387012
14828 -4387012 -640346 4787421 6487848 3873121 750879 -592349 -1608407 -3646182
14820 -3646182 -5088404 -3862121 -897547 807159 81767 -756712 1371878 6024483
14812 6024483 8379797 4048763 -4949374 -10896909 -8521870 -890267 4802670 5807584
14804 5807584 5277323 6069166 6993479 6054084 3969985 2468150 1450180 144014 -577513
14795 -577513 498622 2259468 2474368 1499513 2268000 5818038 8902221 7748093 3166882
14786 3166882 -107103 781625 3533113 4118315 1947678 -118234 -93741 1053496 1741731
14777 1741731 1873365 1677240 563854 -1245902 -1665256 425993 2295449 -27491 -6165801
14768 -6165801 -10826375 -9802886 -4874672 -1290758 -1364453 -2522242 -1970536 -1276920 -4157975
14759 -4157975 -10184752 -13659263 -10379368 -3293516 1188688 906837 -1295963 -3168585
14751 -3168585 -4832685 -5143281 -1707039 3799053 5465026 1247932 -3196497 -2308762
14743 -2308762 1817863 3762958 2776272 1494559 976 -3087034 -5979465 -6108286
14735 -6108286 -5407976 -7156293 -8989513 -5664290 1883619 7028127 7009834 5222315 3673755
14726 3673755 653593 -2718145 -1447813 4837206 9339483 7739530 4190794 3837453
14718 3837453 5390986 5474043 4508798 3411132 22880 -5723972 -8443946 -5158453 -1388975
14709 -1388975 -2544406 -4196845 692873 8763368 10204974 3781186 -2215182 -3806507
14701 -3806507 -5676891 -9771454 -10016718 -3342916 2726005 534796 -5721770 -6326252
14693 -6326252 -699121 2500486 -996609 -5123706 -3106155 2860094 5372141 1923125
14685 1923125 -3156794 -5869889 -7340828 -10059722 -12594343 -11406082 -6922784 -4057739
14677 -4057739 -5721544 -8890504 -9136541 -6623489 -4694162 -3980826 -1465904 4442243
14669 4442243 10762802 12978059 9670509 3320316 -2420832 -5439101 -5707939 -4060115
14661 -4060115 -1183373 1816778 2971411 1446526 -303961 1112333 5031387 6843623
14653 6843623 4253538 554936 -188133 1489757 2234775 559967 -2793264 -6772061
14645 -6772061 -9466931 -8085741 -2819291 1365292 330564 -3728665 -5939412 -5704190
14637 -5704190 -5745545 -6266102 -5253518 -3512104 -4035488 -6585524 -7764077 -6297805 -3514975
14628 -3514975 775894 7119440 11334697 7558365 -2054387 -7433117 -3405162 3520517
14620 3520517 4856235 1095048 -1765638 -1951908 -2199817 -3143895 -2565994 -412691 643620
14611 643620 -77444 -223339 938599 275796 -4806859 -11580065 -13971994 -9445205 -2233859
14602 -2233859 1781507 2628457 5669895 12570093 16943130 12855797 4408140 780586
14594 780586 3178071 3984953 -444387 -3990391 -879703 5417208 8286993 7378640 6233125
14585 6233125 5096936 2652359 1666308 5701763 11574333 11975574 5759717 -329707
14577 -329707 -1035453 1614133 3296017 3307226 3005268 2013048 -820327 -4383144 -5763809
14568 -5763809 -3423427 1111620 4428186 4026702 654543 -2347800 -2775898 -2014062 -2807808
14559 -2807808 -5614991 -8625776 -10330612 -10170245 -7598199 -2905240 1367676 2219337
14551 2219337 -287889 -2882522 -2517184 1249551 6684683 11032107 11857053 9272809
14543 9272809 6589127 6842129 8860431 8678548 4747204 -217220 -2667799 -1691722 1073305
14534 1073305 3134804 2412332 -1456317 -6388814 -9555667 -10118946 -9294425 -7911213 -5653231
14525 -5653231 -3118840 -2761490 -6322894 -12029239 -15625623 -14306156 -9083377 -3381893
14517 -3381893 -60320 -46520 -2710730 -6039172 -6961371 -4022693 -373952 -1137230 -6038040
14508 -6038040 -8138231 -3328853 2482757 1278507 -4643633 -5897259 -959480 1393619
14500 1393619 -3293745 -7832759 -5916994 -3110416 -7250392 -14582158 -15223433 -8385768
14492 -8385768 -2074865 305512 2922120 7283790 8843189 5669329 2204517 1752634
14484 1752634 2288311 2314221 4037768 7548318 8210029 3722484 -1590396 -3298616 -2683861
14475 -2683861 -2304370 -861689 2840388 5176349 2348563 -3050144 -5044753 -1944311
14467 -1944311 3077155 7143562 9386920 9032302 5791762 1604939 -929941 -1300924
14459 -1300924 -415870 1245955 2828802 2450461 -272550 -2903347 -3560221 -3454371 -3929983
14450 -3929983 -3827633 -2628971 -3071953 -6669709 -9272902 -5942943 1276540 5382962
14442 5382962 3608098 -51635 -1507206 -1340054 -2054773 -4257683 -6845124 -8360719
14434 -8360719 -7284054 -3200228 1727224 4376425 3984248 2169290 178433 -1649627
14426 -1649627 -2358853 -1195272 303013 -13020 -1271348 -842732 723757 -159345 -4071573
14417 -4071573 -6494920 -3870009 1247904 3690280 2257034 101755 -213350 537868
14409 537868 76580 -2758689 -7191969 -10890695 -11150785 -7010739 -731705 3464549 2863155
14400 2863155 -1237682 -4565799 -3774774 552348 5049342 7432227 8136102 8028053 6406448
14391 6406448 2653300 -1620775 -4181163 -5219739 -6713429 -8982587 -9921467 -7922898
14383 -7922898 -3999658 -619172 531971 -400220 -1733487 -1898812 -1516320 -2852858 -6150480
14374 -6150480 -8087244 -5873774 -1322991 1921331 3868860 7223049 11561499 12949440
14366 12949440 10266081 7724181 8952718 11822629 11829062 8331971 4644032 3291337
14358 3291337 3760490 4393988 4502475 4494594 4884011 5307453 4737414 3354736 3387202 6149055
14348 6149055 8782468 6807046 184419 -6203951 -8800953 -8741326 -7908123 -5666612 -1982006
14339 -1982006 -107992 -2564699 -6932489 -9217222 -9389793 -9976178 -10911292 -9817690 -6462510
14330 -6462510 -3171641 -1238206 -115733 399444 258209 643683 2189116 2719740 348518
14321 348518 -2281654 -1158603 2438365 3440522 1202424 797159 4944718 9865415
14313 9865415 11204942 9360181 6486904 2756053 -1416532 -3593514 -3198835 -3424917
14305 -3424917 -5676672 -5915706 -911280 5267299 6230586 2335607 -744938 -1013599 -1965146
14296 -1965146 -5719779 -9719405 -11034146 -9656559 -6744903 -3387978 -1701313 -3366924
14288 -3366924 -6355664 -6766562 -4692839 -4475075 -8015399 -11594847 -10974600 -6456447 -1272246
14279 -1272246 2153263 2938118 1660895 879700 2901679 6083843 6634921 4790697 4749886
14270 4749886 7010118 6174489 -417129 -7067329 -7497049 -4117540 -3900118 -7921550 -11101120
14261 -11101120 -10649392 -8657987 -6815447 -4303542 -1372651 -57738 -585467 -1188291
14253 -1188291 -1701072 -3046642 -3250923 750609 6596810 7509416 1849579 -3611607 -2808008
14244 -2808008 2038298 5349304 6090186 6201271 4905284 259712 -5494765 -7678936
14236 -7678936 -5872095 -4150421 -4470202 -4286244 -1785051 689125 724040 211716 2295692
14227 2295692 5393514 4115721 -2923820 -9273644 -7691108 -33676 4023942 -308871
14219 -308871 -5718883 -2698627 6043633 7989341 -1802578 -12923729 -13016847 -3254899
14211 -3254899 5195789 6243616 3521381 1690001 450014 -1668915 -3442602 -3425434
14203 -3425434 -2462721 -1571757 -341486 836535 -47611 -3316620 -6250768 -6991734 -7071844
14194 -7071844 -7830970 -7160782 -2970238 2249257 4070662 2315625 920676 1851709 2765790
14185 2765790 1458043 -642228 -1130884 -353658 -166369 -386727 937605 3944353 5920992
14176 5920992 4601834 1011280 -2030992 -3276433 -3707646 -4449624 -5519022 -6587824
14168 -6587824 -7400619 -6956305 -3892880 1106555 4515471 3353528 -999236 -4025233
14160 -4025233 -3228786 -716704 -265722 -2918646 -6056071 -6153785 -2023584 4202289 8948497
14151 8948497 10210518 8726006 6306872 3946189 2146412 1863602 3491467 5414382
14143 5414382 5282203 2689912 -780179 -3884552 -6384412 -7593523 -6404665 -3261267
14135 -3261267 -374888 559824 -461727 -2704050 -4845864 -4461801 -283400 4533277
14127 4533277 4661324 -597109 -5912151 -6924314 -5181162 -3863359 -2567861 -106039
14119 -106039 1084494 -1358986 -3809945 -470548 7544841 12973379 12754226 11580318
14111 11580318 13287135 14503053 10515621 3230756 -1087191 262887 4353667 7002485
14103 7002485 6393588 3574999 1554314 2688371 5487056 5839894 2602450 -887357
14095 -887357 -2458241 -4402921 -8248173 -10367093 -7271277 -1839838 1078686 2400995
14087 2400995 5888113 9734549 8608734 3464829 1357365 4489516 7219756 6043412
14079 6043412 4745627 6316913 7523919 6260310 6694112 10612084 10683250 1012616 -10940479
14070 -10940479 -13247787 -7236795 -5218238 -11190509 -15539130 -11452041 -5485224 -6067522
14062 -6067522 -10445661 -10863360 -7523773 -6659455 -9038555 -8982398 -4063101 1572290 4211088
14053 4211088 4792706 4810371 3440513 921416 147637 1962235 2523283 -1248504 -6399734
14044 -6399734 -7882666 -5730310 -4006910 -3656341 -1382869 3686674 7209697 6012274
14036 6012274 3140285 2695984 2857386 -717915 -6340238 -7625112 -3856303 -2372283
14028 -2372283 -7844366 -15026286 -16639623 -13703834 -12226238 -13074285 -12048758 -8410239
14020 -8410239 -6089246 -6200278 -5151678 -1657795 649901 31162 285680 4175544 8099454
14011 8099454 7464794 3592278 1020106 928837 1494956 2312094 3966729 4783307 2326673
14002 2326673 -2443645 -5947839 -6455743 -5077948 -3138347 -1221971 -13803 330696
13994 330696 724028 1145644 -24167 -2338055 -1708539 3658352 8159560 4873442 -4172644
13985 -4172644 -9361623 -5710741 1277412 3593210 275797 -3452836 -3514847 -633384
13977 -633384 1788692 1288014 -1663273 -4317093 -4531908 -2755778 -551506 1595789 3386760
13968 3386760 3154025 -56194 -3768005 -4559145 -2908079 -2518547 -4968645 -8039456 -9220564
13959 -9220564 -7779385 -3634702 2180761 5870504 3765280 -2234164 -5772438 -3651863
13951 -3651863 1116493 4726234 7066018 9282813 10794619 11026117 10977784 10875174 9043362
13942 9043362 5097508 1548231 377919 638073 957368 1448974 1674723 259439 -1647113
13933 -1647113 -473322 3769732 5680798 1876280 -3647134 -5334518 -3682397 -2665267
13925 -2665267 -2729081 -1472129 794413 1405766 257448 -320887 -222518 -2084397 -7083392
13916 -7083392 -13082284 -16691077 -15387238 -9293991 -2805804 -1542152 -4921295 -5455100
13908 -5455100 765828 7354818 7055365 3499593 5562245 12762635 15786707 11187161
13900 11187161 5965545 5857399 8076890 8829586 9622041 11479984 10176627 3057649
13892 3057649 -4817164 -7204370 -5287658 -4472544 -6115298 -7643407 -8049295 -8235719 -7912631
13883 -7912631 -6353063 -4408164 -2494534 944904 5947408 9244427 9176411 8356919 7727360
13874 7727360 3248340 -5818408 -10817113 -4235393 7302554 10249848 2858473 -3373540
13866 -3373540 -1385997 2603311 736984 -5471945 -10559574 -13619724 -15409551 -13286850
13858 -13286850 -5868556 1676320 3763480 2813305 5120683 10492129 12552499 8530810
13850 8530810 2533673 -1330025 -3598629 -5842969 -6982560 -5594309 -2970360 -1496542
13842 -1496542 -1511821 -1545382 -952389 -1061779 -3500455 -7533392 -9769085 -7961544 -4964600
13833 -4964600 -6162708 -11720659 -14533043 -8737017 2186569 9403568 8959136 3960051
13825 3960051 -1837747 -7250533 -10587997 -9240396 -4446988 -1837391 -4205209 -7137312
13817 -7137312 -5064401 885238 4521371 2591306 -2031850 -4570815 -3232048 56389
13809 56389 2092357 1492090 -4788 142499 1582486 1400161 -1369079 -3942605 -3778587
13800 -3778587 -1816732 170249 2741951 6356678 8037171 4393329 -2958959 -8629891
13792 -8629891 -9689834 -7397972 -3406419 1575708 5095098 3593968 -2291826 -6656939
13784 -6656939 -5122193 -154810 2884069 2710816 2089865 2318685 1314150 -2484111 -6815735
13775 -6815735 -7462138 -2729868 4425134 8811782 7977731 4724179 3684646 5547122
13767 5547122 6650943 4840679 2913077 4127529 6718456 6402406 3219472 1721158
13759 1721158 3859221 5672280 3104647 -1865106 -3936473 -1748472 768353 -52493
13751 -52493 -3611950 -7085641 -8857085 -8573429 -5834444 -1014189 3450807 4672860 2226362
13742 2226362 -1875156 -5717243 -8263125 -7985308 -3518673 3228508 7073000 4850758
13734 4850758 -582603 -3620558 -2114778 1641262 4869847 6476911 5879252 2879382
13726 2879382 -832918 -2739182 -2670320 -2443102 -1961150 1014228 5983648 8280870 5194219
13717 5194219 620456 207428 3880318 6921071 7091484 6455475 6456370 5596148 3085882
13708 3085882 1093207 1416532 2657368 2886763 3036431 5124354 8325624 9384702 6778638
13699 6778638 2524087 -458242 -1389692 -1504875 -1771966 -1548159 447440 4006748 6568842
13690 6568842 5129556 -415150 -6088633 -6972253 -2229624 3406198 4260452 57534
13682 57534 -3667723 -2410571 1611132 2781408 -26564 -2477384 -2025463 -1850045 -5122383
13673 -5122383 -9024681 -8527640 -3910959 28881 1233527 2211624 4765119 7515390
13665 7515390 9381299 11084149 11875046 9134057 3360795 -396752 1131289 4935168
13657 4935168 6313299 4792233 2411263 -607562 -4440742 -6555990 -4731259 -1602957
13649 -1602957 -1510616 -3765549 -3870015 -1102648 197560 -2314654 -5452747 -5828737 -4694088
13640 -4694088 -4886409 -5814046 -4286122 1058327 7973073 12334608 11070849 5050820
13632 5050820 -503277 -713721 3151161 4966142 1580320 -3497196 -5450741 -4027973
13624 -4027973 -2003093 -715310 -2397 -453236 -2605685 -5004311 -5504785 -3676661 -386695
13615 -386695 3311937 5336976 3352873 -1018810 -1753785 3912557 9878989 8210002
13607 8210002 212533 -5193600 -3696654 35654 1076833 770978 1713975 2115040 -213906
13598 -213906 -2517839 -1126212 1881569 1607002 -1427425 -1543290 3519785 9360933 11409604
13589 11409604 10297645 8780071 6983197 3661403 -136224 -1840654 -976727 387224
13581 387224 511372 -447187 -1586098 -2578235 -3770201 -5682164 -8029372 -8774369 -5419478
13572 -5419478 1459826 7295172 8260397 6020467 5061422 5828178 4264460 -999974 -5219148
13563 -5219148 -4113030 -590281 -751902 -5082209 -8383441 -7966465 -6879756 -7953417
13555 -7953417 -9249322 -7781074 -4196707 -978009 1258642 2839768 2858030 1031035
13547 1031035 -225933 1177724 3469870 3721565 2639922 3122080 5142782 5949254 4851567
13538 4851567 3988135 4345307 4635280 4320401 4267595 4133075 2556852 191113 -1099428
13529 -1099428 -2214772 -5776527 -10563943 -11789026 -8360516 -4960314 -4550598 -3650933
13521 -3650933 1467159 7984191 10161659 6982140 2239449 -912853 -2075415 -2122822
13513 -2122822 -2599971 -4795493 -7101231 -5856374 -1128968 1886637 343400 -1516684
13505 -1516684 607967 3597427 2390924 -596974 1049907 6676497 8790133 4354828
13497 4354828 -1355291 -3137072 -1534542 1239759 4726423 7468691 6610332 2830983
13489 2830983 722702 1850901 2285837 -476910 -3045538 -1570886 2728289 6406886
13481 6406886 7975552 6610505 1485537 -4348040 -4474198 2181784 7698438 5067168
13473 5067168 -2315844 -6257676 -4893559 -2186860 92092 2630569 3129275 -1406471
13465 -1406471 -7430486 -7669989 -2033337 1552099 -1012353 -4388279 -3120608 41233
13457 41233 -151925 -2730631 -3433139 -2874671 -5209874 -9918233 -11274426 -6836059 -1310966
13448 -1310966 88091 -1704140 -2284717 -374961 1485834 1450063 397814 -241125 21800
13439 21800 1610318 4634021 7037663 5591990 236531 -4715055 -5589887 -3715913 -2603420
13430 -2603420 -2608249 -1318503 1963303 5338272 7280852 7459661 5355734 1567633 -203517
13421 -203517 3094912 7960291 7037190 -996155 -8857416 -9888485 -5497243 -1129675
13413 -1129675 722278 500648 -1215527 -2872249 -1912240 891908 839045 -3157142 -4674687
13404 -4674687 1546307 10868599 14644468 11750265 7780470 5372616 2746348 299243
13396 299243 606014 1990419 6805 -3979124 -3716417 875630 2009941 -3515041 -8472532
13387 -8472532 -6643011 -2453345 -2619359 -4582449 -1665607 4312345 4855020 -1803615
13379 -1803615 -7510320 -5589633 1340722 7173957 10379908 12900817 14756667 13817531
13371 13817531 9822677 5700873 4392954 5325064 4704846 -47107 -6243883 -8084981
13363 -8084981 -3932293 850575 803921 -2060931 -1698569 2054225 2498189 -3653820 -10271384
13354 -10271384 -9708798 -3125088 1825392 1841552 1318338 4570829 9517720 11415577 9677265
13345 9677265 7749272 7586472 7389911 5002520 1269916 -1046406 -726887 541281 347837
13336 347837 -1166938 -865061 3649110 10091061 13094784 10535784 6357030 5373918 6928898
13327 6928898 6375868 2060658 -2262197 -2324582 1822317 6547246 8364338 6553348 3773871
13318 3773871 4049831 8247345 11974556 10431725 4755023 335400 -566426 -244107 271018
13309 271018 2894433 6953737 7775347 3687507 -791996 -2148824 -2933644 -5465034 -6100359
13300 -6100359 -1625899 3468447 3101967 -607110 -997285 2526182 5168222 5655750 6227120
13291 6227120 5530682 723878 -4056477 -1364943 6435248 7939315 -712675 -9834376
13283 -9834376 -10805680 -7172744 -5569737 -4514556 115991 5516346 6508383 4813462
13275 4813462 5323287 6503958 2810527 -5156654 -10479070 -9378994 -4808088 -1051297
13267 -1051297 162883 -1043943 -2649972 -1098084 3986143 7299459 4752007 380055
13259 380055 603976 3973168 3844303 46945 -303461 5587823 11562733 11808407 8149434
13250 8149434 5179268 4008685 4151636 6265548 9131619 8418582 2521424 -4067901
13242 -4067901 -6846119 -6801727 -5897878 -1690052 7520143 15522961 13824693 3772414
13234 3772414 -4159441 -4192918 -1562459 -2613650 -5333061 -4680115 -2197759 -3314564 -7364868
13225 -7364868 -7711137 -2180759 3281963 3431456 370253 -1721149 -3047643 -4849637
13217 -4849637 -4432028 197024 4138971 1497329 -4307396 -4286482 2152936 5726643 1552376
13208 1552376 -4110503 -5427042 -6464774 -12359408 -18355745 -16679397 -9602957 -5825399
13200 -5825399 -6241968 -3480035 4403370 9575191 6185317 -1641095 -6922144 -8074108
13192 -8074108 -6391955 -1910670 3203555 2741222 -5704690 -14594500 -14685125 -7393195 -2540645
13183 -2540645 -4641637 -8125441 -7217885 -4134953 -3981108 -6143176 -5794485 -1945599 1086215
13174 1086215 415411 -1473067 -1123337 852373 1755272 1614381 2695386 5038813 5806087
13165 5806087 3376233 -569667 -3590035 -4762617 -4027843 -1913282 -603978 -2386444
13157 -2386444 -5888393 -6825811 -3868241 -416490 1340321 4091476 9656979 13224170
13149 13224170 8531747 -2872936 -12721374 -16013630 -15317500 -14762673 -14141851 -10648367
13141 -10648367 -3650729 3951525 7874268 5709915 -518739 -5372896 -5148829 -1359944
13133 -1359944 2396944 5280219 8166098 9500392 6371425 -291457 -5212285 -4281869
13125 -4281869 1627531 8222101 10976913 7695647 880235 -3140181 -609169 4750545
13117 4750545 6354778 3160716 -361825 -1396017 -998238 269664 3318648 6630263
13109 6630263 6933050 4955266 5026801 7383362 6767701 1314379 -3125334 -1605728 2092262
13100 2092262 1412098 -3070699 -5504874 -4218973 -3311882 -5201574 -6875523 -4877341
13092 -4877341 -437692 2381803 1901826 281437 -24146 191984 -1716160 -5544644 -7464049
13083 -7464049 -5483460 -2892435 -3049664 -3410251 240643 5428962 5518255 501351 -2047771
13074 -2047771 1528621 5825461 5798587 4193783 5047139 6392468 5299690 4388265 6309129
13065 6309129 6481866 -475268 -10067309 -12391520 -6408934 -1522455 -4017895 -9137749
13057 -9137749 -9030108 -3118293 2526295 2958586 -797246 -3157872 259595 7117799
13049 7117799 9943868 5224909 -1595035 -3562496 -1627368 -1529117 -3950740 -4598170 -2826521
13040 -2826521 -2430669 -3464418 -1403651 3388694 3393117 -4703371 -13235433 -13653738 -8009818
13031 -8009818 -4167247 -3693362 -1620166 3815900 8241944 7978404 4127718 -904838
13023 -904838 -6108304 -9740847 -8840470 -3333630 2093320 2700088 -1103764 -4873824 -5248365
13014 -5248365 -2509345 1006453 3472288 4671433 5426531 6053255 5417935 2223254 -2666215
13005 -2666215 -6461396 -7872207 -9048684 -12381640 -16028227 -15149215 -8378201 -777635
12997 -777635 1669403 -788288 -2558157 -385540 2725458 2296702 -1230513 -3036863
12989 -3036863 -95491 5097575 7353618 4536424 -138548 -1812100 277782 2036201
12981 2036201 248305 -2807564 -2942955 -859998 -1329506 -5371608 -7859495 -5012976
12973 -5012976 -305001 386122 -3420948 -7514128 -9263705 -9304458 -8576921 -7728523 -8380462
12964 -8380462 -10914287 -11736691 -7071969 726368 5128878 4069165 2037220 2513763
12956 2513763 3186404 1057634 -2080207 -2896485 -2098432 -2602116 -4035137 -3442419 -870522
12947 -870522 121254 -1514331 -1506761 3958003 11772702 14593274 9952300 3639876 2392112
12938 2392112 5510551 6794612 3788347 871995 1905583 3822236 970896 -6465258
12930 -6465258 -12450118 -12826003 -9435010 -6327905 -4982795 -4087921 -1768189 2763037
12922 2763037 8206482 11714735 11888560 10545411 9493563 6921228 511870 -6649172
12914 -6649172 -8077842 -2710712 2938077 3584339 1960362 3606647 8271779 10718110
12906 10718110 8356182 3938563 957414 -321877 -1695171 -4051073 -6296927 -6411090
12898 -6411090 -3729122 -633846 -726321 -4194741 -6523133 -3720951 2309879 6000214
12890 6000214 5167156 3255140 4168333 7194666 8474501 6345288 3540057 3755314 6881542
12881 6881542 8840509 6752440 3188074 3328315 7873853 11328513 8912973 3183462
12873 3183462 1059528 4987071 10047146 10501087 6664645 3492329 3901020 6067492
12865 6067492 7284357 7851109 9441059 11199159 10288572 6436844 3114872 2677107 2638736
12856 2638736 -571830 -5510433 -6753561 -2156586 4051466 6604988 5167483 3190146
12848 3190146 2602899 2068617 201765 -1476402 170901 5873836 11886749 12906164
12840 12906164 7612782 411298 -3443112 -3467239 -2874273 -2754904 -451296 5466977 11427815
12831 11427815 12252515 7117370 243054 -3905957 -4586532 -3852013 -2925972 -795147 3100994
12822 3100994 6007540 4188133 -1298002 -4161769 -583046 5215660 6598303 3616952
12814 3616952 1767677 2914683 3441050 1903924 2101645 6065929 9755887 9438984 7484111
12805 7484111 7388554 7321304 3882102 -1129108 -3586285 -4159836 -6162172 -7896554 -4391257
12796 -4391257 3121958 6832379 3533451 -369765 1468698 6261020 7515228 5233722
12788 5233722 4529632 6217450 5494807 498050 -3769027 -2680369 1132819 1892012 -1047348
12779 -1047348 -3439746 -3471264 -3855643 -5900827 -6388101 -3099996 502739 306089 -1471349
12770 -1471349 473056 5542263 7418832 3842740 393476 2103314 6203611 6828064
12762 6828064 3356633 71410 -204367 1498917 2661925 1122423 -3747112 -9095586
12754 -9095586 -9891457 -4939501 658186 1984949 571185 724495 2770654 4637304
12746 4637304 7177599 11770521 14535851 10042790 476390 -5933806 -6293308 -5784751
12738 -5784751 -7618846 -7954499 -4196510 -1035112 -2828276 -5736964 -3909907 625283
12730 625283 1240083 -2671740 -5581883 -5516612 -6747207 -11640890 -15920655 -14809945 -9622736
12721 -9622736 -5033217 -2620563 -491033 2118455 3168400 1097726 -2228831 -3070599
12713 -3070599 -11432 4177970 5446739 2977056 -275491 -1774988 -2452138 -4157531
12705 -4157531 -5545537 -3200105 3082531 8696621 9163295 5119080 991631 -255986
12697 -255986 537853 1146894 853139 416710 543574 1569399 4016082 7972084 11714240
12688 11714240 12299420 8523575 2656094 -1804182 -3795765 -5033596 -6729787 -7351880
12680 -7351880 -4603148 921061 5284786 4998053 849350 -2766885 -2413705 1228541
12672 1228541 4940828 6375656 4853549 348003 -5814171 -9910988 -8743485 -4164481
12664 -4164481 -1617804 -3156182 -5216895 -4804984 -3874936 -4748220 -5221760 -2578532 875378
12655 875378 1685236 2054908 6246496 11635754 11048149 4603608 1314161 6048893 12015509
12646 12015509 10833875 4418171 1026267 3309699 6541241 6900052 5686399 5306179
12638 5306179 5490363 4403120 958841 -4288994 -8904687 -9725093 -5990150 -810392
12630 -810392 1810105 741986 -2059152 -3452694 -664988 6303287 12433432 11017805
12622 11017805 1642105 -7847743 -9906775 -5240606 207552 2883494 2862964 867796
12614 867796 -1336338 -10773 6058662 11649310 10524205 3707692 -2241901 -4115485
12606 -4115485 -4241722 -4536288 -3847018 -1754552 -242151 -478665 -1550136 -2864806 -4446963
12597 -4446963 -4961699 -3114080 -707334 -428209 -1100743 628011 4496853 7072997 7086659
12588 7086659 5234801 129168 -8769635 -15035446 -10621487 1557203 9161885 7059002
12580 7059002 3357510 4868041 6238949 599395 -7277923 -7908891 -1899711 1909111
12572 1909111 184115 -2141629 -1500942 322812 1727223 3367134 4084012 1264939
12564 1264939 -3735707 -6176103 -4863717 -3289188 -3030071 -1495361 2213611 4435339
12556 4435339 2536027 -682955 -1083205 1054108 2051903 31593 -2988203 -3690785 -1293903
12547 -1293903 1331206 1122812 -591823 521066 4790710 6753276 3249823 -955866
12539 -955866 -472646 1850927 218861 -2974241 -170079 7918222 11628183 7066511
12531 7066511 2254024 4449986 9490586 9507165 4578648 -78041 -3229335 -6264430
12523 -6264430 -6431882 -15835 8891473 11039614 4690393 -1192751 836482 6722215
12515 6722215 7319666 1412199 -2936926 204421 6498250 7267607 1199757 -4076562
12507 -4076562 -2542646 2393844 3618485 464189 -1837249 -1165584 -817845 -2416194
12499 -2416194 -2841010 -558537 703947 -1719915 -4227557 -2565214 1256807 2785125
12491 2785125 2738358 4883006 8078941 6815841 -123267 -7061927 -8896333 -6890625
12483 -6890625 -5195146 -4946614 -4166294 -1568969 1633168 3132066 1855291 -717539
12475 -717539 -1631293 430365 3515266 4811366 4007252 3012224 3035679 3491861 3420815
12466 3420815 2550320 1088602 -498982 -1732458 -2738754 -3983592 -4969938 -4356725 -1842167
12457 -1842167 1585785 5665050 10892325 15785214 16989196 13759318 9543654 7061856
12449 7061856 4723188 517904 -3533390 -4231804 -2081567 222648 1997690 3647041
12441 3647041 3845867 1760269 -22085 834422 1947091 322079 -1385437 1100696
12433 1100696 5023977 3444445 -3224125 -6440788 -2265725 2601716 1143666 -4040421
12425 -4040421 -5994833 -3593768 -791494 999666 3831837 7844087 10179691 9478653
12417 9478653 7651962 6484379 5283950 3015589 902954 1291224 4278475 6921909
12409 6921909 6927699 6400995 9420381 15256035 17451985 12263047 4651384 1582290 2178131
12400 2178131 450474 -4009677 -5580812 -2950853 -1723431 -4308272 -5052182 113250
12392 113250 5833449 4962271 -895993 -4562306 -3333304 82580 3636363 6750159
12384 6750159 7203523 3481211 -859552 -989459 1634969 1191346 -3132600 -5523601 -2410224
12375 -2410224 2299754 3043072 -269501 -3398539 -3331531 -522650 2508721 3012496 -234453
12366 -234453 -5517594 -9170480 -8772407 -5081822 -843589 1727344 2438249 2541146 2410404
12357 2410404 244891 -5248162 -11103369 -12126527 -7781273 -3662729 -3966652 -5945880
12349 -5945880 -4980395 -1770981 -144029 -349284 322127 1921531 2264470 2033981 3804622
12340 3804622 6184181 4972901 1055847 912735 6754199 11690855 8686409 296326
12332 296326 -5093715 -4280511 -1740271 -1818837 -2781416 -74954 6855178 13227925 14385810
12323 14385810 11129885 8218371 8035878 8216688 6423478 4359538 4293325 4372887 1800013
12314 1800013 -991570 1103391 7077241 9496817 4941541 -547048 535 4509058
12306 4509058 5039253 -1130259 -8256731 -9861384 -6130906 -2514376 -3000860 -6301836
12298 -6301836 -8223041 -6612848 -3136015 -533717 194953 -755289 -3192885 -5737143
12290 -5737143 -5557745 -2220069 -50103 -2940577 -8067276 -9205439 -5591431 -2345168
12282 -2345168 -1995783 -1442144 1167849 2377947 -811816 -5932147 -9091235 -9882453 -9021412
12273 -9021412 -5315175 1135042 6418396 7608171 6878507 7043678 6609001 3640663 832161
12264 832161 1356314 2827473 1336713 -1096505 355267 4561274 5748012 2805858
12256 2805858 342142 438368 275286 -1257356 -1411901 459402 1393147 1281724 4204532
12247 4204532 10377869 13230837 8558129 999536 -3053739 -3838241 -4505081 -3985155 75184
12238 75184 4709367 4804634 1211505 -418617 2051288 5643343 8223560 10387060 11448768
12229 11448768 9170892 4406791 1136971 690137 336094 -1205279 -1446972 835478
12221 835478 2539606 733645 -3179423 -6160831 -7202799 -5954855 -1171743 6210373
12213 6210373 11323163 10517883 6356753 3750551 2744702 -509808 -6150751 -8714823
12205 -8714823 -4449029 2676358 4842688 -662851 -8184831 -9767280 -3891996 2775683
12197 2775683 3029028 -2566717 -7056907 -6121016 -2155529 1254451 4218338 7007135
12189 7007135 6173443 -529181 -7998069 -8550779 -1942979 4913460 7678601 8018199 7243891
12180 7243891 3516063 -2576809 -6172761 -5220172 -3843927 -5021258 -5494660 -2487874
12172 -2487874 122486 -1659838 -4127457 -1901625 1922631 127787 -6210223 -8813033
12164 -8813033 -5498151 -3060219 -5189409 -6659934 -3298651 539384 -29771 -1826562
12156 -1826562 172697 3231492 1226691 -4478609 -6428532 -2302802 2390684 3153763
12148 3153763 1750654 1374155 1912807 1979441 1479679 284472 -2145346 -4263703 -3126084
12139 -3126084 722638 2709068 828149 -822634 1785403 6013969 6206016 2048943
12131 2048943 -1151480 -100474 2740333 3790961 3210428 3243888 4047217 3740336 2104754
12122 2104754 2058413 6296817 12949296 16059397 11690337 3094726 -2158299 -722363
12114 -722363 3035377 3412198 757212 -380591 1208570 1765959 -1477648 -6537864 -9993033
12105 -9993033 -10788723 -9165186 -5025851 83904 2033221 -1361951 -6125480 -5854964
12097 -5854964 461054 7037669 7950110 3138801 -2472973 -4125540 -1227966 2417697
12089 2417697 2270171 -2170276 -6751109 -7716360 -5907131 -4172920 -2549382 620429
12081 620429 3880340 3429227 -713096 -3459200 -1342538 2822725 4079079 1408993
12073 1408993 -2622541 -5961604 -8058445 -8246064 -5844771 -1568381 2648581 4807129
12065 4807129 3450817 -1199318 -5953475 -6741686 -3455892 -627356 -1637383 -4379766
12057 -4379766 -4586392 -1361664 2752750 5238764 4867667 1497846 -2982418 -5405136
12049 -5405136 -5260692 -5554218 -7354338 -6767697 -1057324 5527093 7218294 5554027 6524443
12040 6524443 10246604 10525284 5148565 -317976 -1111674 313962 -645196 -4236798 -8023420
12031 -8023420 -10651016 -10697286 -6005254 1956875 6774281 4543167 -202514 -502394 3550758
12022 3550758 6336090 5986707 6384866 9746477 12498807 10411372 4257231 -1752136
12014 -1752136 -4846279 -5195445 -4278492 -3584857 -4070712 -5534203 -6819115 -7167112 -6781148
12005 -6781148 -5713321 -3199723 985989 5119984 6675693 5072786 2443754 1120706
11997 1120706 937672 -54573 -2459499 -4543228 -4858985 -4352147 -4548111 -4864117 -3709400
11988 -3709400 -1676920 -1329749 -3594267 -6417601 -7558593 -6850631 -5045230 -2487168
11980 -2487168 -206513 -384833 -3597077 -6597212 -5267711 47787 4094507 2572850
11972 2572850 -2705262 -5936761 -4200287 -423253 1139871 457443 678993 2759328
11964 2759328 4270823 3640072 2178404 945657 -805874 -2324302 -542233 4348735
11956 4348735 6486420 2098324 -3619990 -3273950 1358182 1863145 -3444159 -6550488
11948 -6550488 -1997731 5103798 7105722 4135081 1562929 1352724 1361820 931139 1862146
11939 1862146 4243097 5387996 3589574 470129 -1109024 -205180 1595078 2373369
11931 2373369 2501389 4235570 7876475 9888095 7185649 2073580 -388612 706987
11923 706987 1643351 270923 -1663893 -2801137 -4172109 -5708443 -5060298 -1474204 2912690
11914 2912690 6617887 9438398 9023777 2508411 -6819143 -10630790 -6172210 -24642
11906 -24642 1793805 1334435 2480748 3743886 2701636 1884768 3959293 5815632 3961739
11897 3961739 1545371 3149833 6317189 5479166 1335752 -966899 -570448 -600919 -1288753
11888 -1288753 -722878 -652410 -4009574 -8038821 -7514498 -3684048 -2116165 -2545549 451440
11879 451440 6608175 9053958 5909973 3904125 7271684 10904173 8614436 1721379
11871 1721379 -4750827 -8792344 -10176822 -7600137 -1663779 2991973 2693228 -705129
11863 -705129 -3105461 -3237381 -2080402 -246030 1594974 2243895 1917544 2312843 3602472
11854 3602472 4270372 4747197 7513784 12316106 15133176 13647382 10261796 8060134
11846 8060134 7175352 6662581 6513982 6315067 5205833 4293331 5552010 7519590 6279317
11837 6279317 1775535 -1426398 -1107264 -367260 -1792161 -3349990 -2317057 1020284
11829 1020284 5505826 10432836 12985793 9573225 2073899 -2511100 -1377892 375782
11821 375782 -1737305 -5002615 -4965642 -1887828 2285996 7772865 13086244 12937684 5716831
11812 5716831 -1655955 -2247656 1737485 4157503 4754045 6758757 8377276 4742940
11804 4742940 -3164630 -8747231 -8482556 -4682858 -464456 2585656 2749467 -320935
11796 -320935 -3132558 -2306682 104921 186263 -662197 1941382 6939082 8259359 3757957
11787 3757957 -2290454 -6171378 -8424916 -9596844 -8006515 -3811522 -748344 -1471663
11779 -1471663 -4309521 -6230001 -6379065 -5742374 -5754678 -7654520 -10889119 -12386235 -9932567
11770 -9932567 -5578682 -2851781 -1686689 437536 3405169 4459343 2682675 -169587
11762 -169587 -2518275 -3193268 -467805 4912958 7723143 4556954 333581 2220414
11754 2220414 8389174 10202708 5313437 395766 -370838 -1036691 -5064066 -8658224
11746 -8658224 -7563665 -4184683 -2787009 -2632279 -942739 1497327 2572000 3066275
11738 3066275 4141648 4007855 1617416 366256 3296144 7442919 7843804 4725850
11730 4725850 1793188 -344784 -3539218 -6380445 -5007132 216727 3820886 2103959
11722 2103959 -2675382 -5888015 -5497892 -2716291 11735 935847 232989 -609516 -1169853
11713 -1169853 -2475019 -4161902 -3812704 -1010200 1003754 689802 1836756 7227616
11705 7227616 11586844 7314382 -3622609 -10416276 -7196476 55676 2650972 -282111
11697 -282111 -3774662 -4831173 -3829302 -1242820 2393847 4875925 4673160 3956886 5991036
11688 5991036 10378503 13940278 15247767 14890519 12284968 6527953 396908 -1176041
11680 -1176041 2068042 4687625 3470685 2255657 5452156 10310127 10550503 5807103
11672 5807103 1940547 2022023 2413266 -514195 -4392356 -4626834 -968659 3073117 5254702
11663 5254702 5552187 3506629 -1552766 -7757813 -11532734 -11898265 -11376417 -11682701 -10783889
11654 -10783889 -5754418 2810154 10748275 14229584 12892749 9547041 7404503 7384539
11646 7384539 7695296 5920117 1387539 -4354614 -8661156 -9204032 -5486095 140120
11638 140120 3913627 4201262 2801771 1887063 1127922 -555274 -2009277 -1245161 1045035
11629 1045035 2285721 2070493 2375115 3444627 2664257 -1312439 -6041123 -8495679 -8634411
11620 -8634411 -8101188 -7294672 -5686764 -3681334 -2217284 -1344096 -665802 -350529 -384903
11611 -384903 176202 1694997 2486446 451838 -4291333 -9692863 -14043469 -16508055 -15985037
11602 -15985037 -11410474 -3639743 4189915 8825474 9195420 6848028 4694676 4822344
11594 4822344 6569028 7022478 4385778 498780 -1286778 -573751 -453777 -2933396 -5648039
11585 -5648039 -4855165 -653742 3122013 4256907 4938367 7964921 12194719 13972330
11577 13972330 11982701 8146237 4135781 -83955 -3851844 -5026895 -3126953 -863632
11569 -863632 -799189 -2546850 -4902282 -7992293 -10708731 -9073938 -1645716 5260295 3378090
11560 3378090 -6238944 -13156321 -10494782 -3098574 158478 -1899310 -3071325 564994
11552 564994 6178236 9079349 8120337 5257327 2453326 485653 -476898 -201671 1957566
11543 1957566 6481454 11988203 14941317 12959371 8333554 6014035 7375167 8248971
11535 8248971 4801954 -649495 -2493893 539033 4168585 5284704 5857552 8072096
11527 8072096 9358154 6321371 1179036 -951249 -274547 -1872524 -6268842 -6938463
11519 -6938463 -446985 6652958 6301903 332054 -2803276 -465765 1624479 -994774
11511 -994774 -5545215 -7089418 -4835328 -1297640 1438239 2625107 2355198 1651237 1600317
11502 1600317 1983625 2071019 1981959 1333977 -1745638 -7097532 -9998400 -6778936 -1558824
11493 -1558824 -1664901 -6896926 -9923471 -7866407 -6125971 -8472579 -10751326 -8514723
11485 -8514723 -4432624 -2816376 -1971885 2098460 8116521 11234734 9515715 4108658
11477 4108658 -3701749 -10815964 -11503866 -4202950 3958787 5621764 3245088 3891904
11469 3891904 6913543 5494245 -650700 -3679755 -198549 3357925 1249860 -3095714
11461 -3095714 -3620803 -732814 1176982 892152 -38798 -1639103 -4400635 -5885385 -3144778
11452 -3144778 2257492 5354937 3638866 -883313 -4990752 -7083951 -6936061 -4884117
11444 -4884117 -1745663 1520491 4151909 5260854 4008641 767831 -2677961 -4640666
11436 -4640666 -4532593 -2441202 878130 3556292 4054671 3413454 4040657 5837685 5934179
11427 5934179 3067771 -405384 -2132398 -2740634 -3525702 -3833426 -3003899 -2588240 -4028909
11418 -4028909 -6098039 -7310759 -8859024 -11873794 -13489947 -9749949 -1919703 4078553
11410 4078553 4936001 3204556 2547945 3064786 2790081 1178929 -732085 -1859788 -1359797
11401 -1359797 987773 3452838 3200697 -33089 -2767274 -2035561 626180 1459101 -499207
11392 -499207 -3050006 -4587619 -5359381 -5188071 -3208437 -845451 -1932501 -7564692 -12982814
11383 -12982814 -12592812 -7110098 -2584795 -2453413 -3866802 -2824239 369678 3086747
11375 3086747 5224890 8556640 12249435 12761191 8702317 2839432 -1709971 -4687745
11367 -4687745 -6881896 -7768964 -6983153 -5914931 -5324019 -3245354 1548368 5420931 3435711
11358 3435711 -2872894 -5678482 -567541 7487379 10543052 7385649 3431685 2637286
11350 2637286 3557856 3445903 2501961 2426094 3051402 2531101 159054 -2441907 -3013376
11341 -3013376 -1027895 1781158 3391581 3866489 4828356 6265259 5597631 1401545 -3630140
11332 -3630140 -5891665 -5717558 -5843052 -5969588 -3173839 2030742 4907028 3457775 1469901
11323 1469901 1836318 1518018 -2532556 -6440701 -4318587 2129011 5315854 2594268
11315 2594268 -803806 -488991 1143816 -71538 -3581846 -5494239 -3618739 979773
11307 979773 5226748 5650677 1400003 -3356083 -3028334 2390370 7159721 7440642 5066234
11298 5066234 2574297 -293000 -2601104 -419844 6476370 10928533 7234785 122171
11290 122171 -1507981 2816845 5849850 4415778 2651042 3151933 2824971 34939 -1028292
11281 -1028292 2858604 8072980 9575569 8189033 7670904 7571311 4337450 -1825137 -6144664
11272 -6144664 -5446546 -1497979 2127682 3658247 3348443 2635366 3306330 5259210 5193230
11263 5193230 242683 -6919437 -9859639 -6385569 -1620371 -1110171 -3774375 -4741581
11255 -4741581 -2962268 -1890241 -3346404 -5039775 -4888723 -3959983 -3594136 -3063627 -2231041
11246 -2231041 -3286652 -6826983 -8906555 -5738618 533125 4703019 5688347 6462459
11238 6462459 7759607 6916567 3245618 -335715 -2022430 -2978222 -3506855 -2217818 -290799
11229 -290799 -1047263 -3163595 -538013 7439729 11918464 6594786 -1798966 -2444011 3917080
11220 3917080 6736301 1391970 -5452304 -6730384 -3452451 -209930 1429629 2085519
11212 2085519 1848002 1333808 2184006 4390619 5659661 4486652 1413637 -2670158 -6213825
11203 -6213825 -5654139 1083125 9842576 13922187 12516106 10061715 7482095 1470712
11195 1470712 -6297416 -7944876 -1378989 4409109 1804531 -4377857 -5093418 -511140
11187 -511140 2794954 3704307 6462721 10908922 11894022 8403951 5267661 4859689 4245246
11178 4245246 2040285 1346534 3515349 5034299 3634127 2227357 3228702 3510050
11170 3510050 -700960 -7148535 -10237165 -8519712 -5501427 -3974362 -3191532 -1611558
11162 -1611558 533473 2116738 2649334 2184784 947054 -234333 -54451 1660851 2790492
11153 2790492 677151 -4292156 -8003529 -7044912 -3126149 -866765 -1418195 -1381475 1203638
11144 1203638 3540638 2978250 1688730 2885796 5100868 4568699 1493377 -759328
11136 -759328 -1623463 -3464641 -5967523 -5506104 -1025999 3844456 5794313 5128388 3049357
11127 3049357 -376115 -4072645 -5421419 -3550684 -249020 3214571 6788725 8813130
11119 8813130 7062399 3606300 3434661 6433135 6376741 806815 -3894877 -1585106 4615854
11110 4615854 7485273 5521244 2124542 -995967 -3330225 -1846508 5167142 12618578
11102 12618578 13936196 10481329 8775284 9647185 7951951 2853427 -132061 1103175
11094 1103175 1741148 -620196 -849483 4677839 10306946 8517352 946658 -4126810
11086 -4126810 -2962590 474239 1487259 174643 -232174 2245542 5877031 6249173
11078 6249173 1000014 -5944593 -7548290 -2279219 3691038 4588955 1464845 -1979909
11070 -1979909 -5438621 -9545949 -11236615 -7331517 -653088 3164354 3814472 5650913
11062 5650913 9470315 10990096 8303720 5187400 4952848 5688455 4271012 1405583
11054 1405583 -316644 -709251 -1424078 -2879060 -4256624 -5322597 -6242639 -6703847 -6898680
11045 -6898680 -8012222 -9672781 -8175417 -223818 11379383 18545030 16029103 7288547
11037 7288547 321848 -1446522 -1442287 -2961586 -3753387 -549901 3820887 3085799 -2995722
11028 -2995722 -7334998 -5388033 -1177338 -297505 -1534108 -105553 4065885 6631535
11020 6631535 5437389 1952019 -2304176 -5768881 -4880989 2026281 9528922 9946956
11012 9946956 3708005 -1032076 186964 3382832 4334209 4820182 7404201 9826277
11004 9826277 8995153 6234833 4236657 2382764 -666684 -2917860 -1980572 441142
10996 441142 1187652 688459 1467881 3595781 5424837 6845460 7926278 6544505 1906983
10987 1906983 -1563430 774035 6012361 6712274 1580641 -2872874 -2445666 -918822
10979 -918822 -2820466 -5869832 -5189911 -1535806 -15053 -2085049 -3984028 -3308903 -2432482
10970 -2432482 -3627732 -4682749 -2599438 719450 535213 -3548081 -6462745 -4600131
10962 -4600131 -347397 2095035 2334887 2512677 2821938 1690123 -994729 -4110496 -7585936
10953 -7585936 -11026377 -11149181 -4816710 5365790 12432758 12643992 8488712 4108867
10945 4108867 1475152 1292743 3342657 4802906 2214185 -3411735 -6873958 -5346195
10937 -5346195 -1364665 1457570 2073480 938893 -497750 1080411 7371362 13753247
10929 13753247 13794045 8921413 6604042 7818243 5062830 -3978479 -10240930 -6603250
10921 -6603250 987556 3154364 649740 -193494 524715 -1692473 -5992901 -7844442
10913 -7844442 -7431483 -7846146 -7923212 -5298905 -3190016 -4906833 -5064999 3074363 14026935
10904 14026935 15756017 8094556 3088087 5984568 8486392 4073364 -1916830 -2707570
10896 -2707570 -407845 115295 -723325 -1259206 -3275350 -6908357 -7590528 -3656462 -510361
10887 -510361 -1521033 -1280429 5487278 14059548 16054174 11265661 5996154 2938917
10879 2938917 -134615 -3656082 -4858106 -2593449 1097778 3694810 3523613 300771
10871 300771 -2849371 -819831 6614242 12307261 9839888 1330620 -6390654 -10185444
10863 -10185444 -11082015 -9621208 -5824000 -1835065 -1801 336148 626223 -201245 -3086259
10854 -3086259 -5226222 -3325274 1305886 4682313 5317556 4020272 1041375 -2598014
10846 -2598014 -3502618 -67217 4070304 5130532 4964609 6594508 7045610 1506868 -6982392
10837 -6982392 -9573881 -3610873 4242366 7872154 8163457 7789657 6054888 2349365
10829 2349365 -359134 390778 2406460 2406714 909332 49146 -978331 -4227400 -8148599
10820 -8148599 -8598200 -4754058 -579488 554044 59145 1410342 5063493 8115901
10812 8115901 8227949 5873931 2823379 383442 -492325 457925 1334209 -703817 -4899450
10803 -4899450 -6018773 -990152 5647928 7046110 3487430 1425079 3207707 3720199
10795 3720199 -834845 -6423462 -7151539 -3580850 -734085 -643506 -1259949 -899064 428964
10786 428964 2943665 6364789 7891730 4791533 -829077 -3284679 -260852 4128760
10778 4128760 4507239 547311 -3527375 -4752780 -4679309 -6226773 -8922545 -9493484 -6944877
10769 -6944877 -3976170 -2101056 1018451 6216732 8309471 2381530 -7228848 -10727186
10761 -10727186 -5752528 -117687 -423352 -4215084 -5905573 -4563464 -2166607 949141
10753 949141 4598279 6335530 4625537 1868660 1155081 2473558 4482305 6969349
10745 6969349 9146367 8780772 5609989 2628278 1961365 2767669 4553066 7924956 10325960
10736 10325960 6848970 -1648752 -7220709 -5673567 -2880202 -5328996 -10057875 -10154383
10728 -10154383 -5634555 -2180678 -2402794 -4548496 -7153286 -9421994 -9622735 -7910773
10720 -7910773 -7519936 -8760698 -6478525 1187238 7064036 5053123 627445 2398092
10712 2398092 7476997 5537880 -4754612 -13850259 -15491661 -13065400 -11014621 -8870386
10704 -8870386 -5656784 -2673530 -5770 3422322 5472800 2997226 -1175433 -684113
10696 -684113 4074028 5676391 1251920 -3339781 -3319964 -1552119 -2001470 -3504392 -4106821
10687 -4106821 -5490384 -8313823 -8170376 -1434985 8267894 14158201 14474744 12631105
10679 12631105 11334388 10523616 10025576 10584622 11933783 12003434 8841802 2887203 -2760642
10670 -2760642 -4642852 -2196837 1426333 2319982 -648712 -5155977 -7158256 -3666866
10662 -3666866 4007204 9896874 9296472 5082536 4167626 7520046 9226865 6477900
10654 6477900 3402370 2220659 -1408609 -9134492 -13855001 -10118005 -3864777 -3388921
10646 -3388921 -6323294 -5072773 -512278 188203 -3630155 -6030391 -5514276 -5950544 -7252146
10637 -7252146 -4989913 569296 4182680 4825112 6587888 9945430 10582162 7746972
10629 7746972 5691984 5676710 4036627 -627945 -5075963 -6910299 -6355649 -3073958 2371213
10620 2371213 5271891 2296617 -1465277 869511 6200491 5684137 -538899 -3272036
10612 -3272036 924527 5108424 3488358 -1538661 -5242341 -5384031 -893820 6237397
10604 6237397 8603860 1812513 -6273658 -4827831 3246401 5680429 508998 -2195693
10596 -2195693 1504216 3964212 1013662 -1556018 -232530 651183 -238681 2451547
10588 2451547 8971447 11290970 6748642 3081484 4671417 5325038 285219 -5508495
10580 -5508495 -6667804 -4716320 -1620773 3742119 8744877 7523859 2009997 1137355
10572 1137355 5861535 7274115 2661792 -274909 1257344 611913 -3047375 -1017376
10564 -1017376 7517460 10811234 4566190 75351 4099277 7426901 3066125 -1126771
10556 -1126771 948565 1193523 -5832904 -9699523 -2090484 6544602 3560377 -5416932
10548 -5416932 -7751378 -4044698 -2211397 -1632382 2349123 7025323 8123756 8338307
10540 8338307 9524281 6506834 -1753856 -6716072 -5243143 -6261983 -13029926 -14792230
10532 -14792230 -6761201 -555409 -2490982 -1011870 9805640 15141562 5332132 -4030837
10524 -4030837 1886402 11129539 7004777 -3193259 -5061019 -3908172 -9777619 -13969520
10516 -13969520 -6733550 -447346 -7829324 -15162922 -6132816 6051914 1343199 -10558838
10508 -10558838 -9162464 -719058 -2256983 -6406093 1235526 8562216 -214575 -8508439
10500 -8508439 3613684 16755179 5837335 -8384230 3808790 19662485 4820471
10493 4820471 -12456445 11193260 39388917 14717077 42705 125018568 360334479
10486 360334479 485406894 360828613 120540415 -8775377 10449432 44140288
10480 44140288 17671448 -13100444 -1435937 15725865 4749222 -6838581 5382316
10473 5382316 17163750 8082674 -1219014 5527081 9080296 -3749473 -12960755 -5096967
10465 -5096967 1123182 -6999931 -10519860 4432610 19134255 15799555 7401779 10146475
10457 10146475 14592125 8137688 860351 4919746 10124989 3243830 -7043291 -6256652
10449 -6256652 902965 1698727 -2443079 -2892259 -641893 -383641 698271 4535495 4245076
10440 4245076 -3123574 -7995576 -4004730 142574 -4015197 -10007989 -8705190 -3429883
10432 -3429883 -1447023 -1501600 -504334 -1764185 -6518816 -7963389 -2984961 930669 -1316394
10423 -1316394 -4330462 -4674649 -7846858 -14292000 -13250071 -953973 9685714 9113773
10415 9113773 6203668 10542064 14584708 8840606 1274002 3926634 11021375 8890813
10407 8890813 -206476 -2461751 4540185 10215876 9057513 5317659 2132703 -666457
10399 -666457 -206798 5797121 11394039 9403445 3277983 1637061 4511793 5476492 3638553
10390 3638553 2793972 2421631 258809 -126880 4540873 7662663 1321658 -9009940
10382 -9009940 -10959340 -4073515 600558 -1679095 -4794041 -4759552 -4724353 -5931168 -5234527
10373 -5234527 -3351032 -5057128 -9350966 -9364021 -3971756 94935 -273614 -459379 2105835
10364 2105835 3414642 1389350 221702 2258508 3218419 -156519 -4080163 -3522056
10356 -3522056 1087240 6041299 8396449 5746318 -2379771 -10528952 -10703587 -2807495
10348 -2807495 3837257 2735232 -1508960 -1252990 2855478 3972250 -528250 -5977195
10340 -5977195 -6864866 -2741678 2233860 3615601 620224 -3453713 -5062672 -4211961
10332 -4211961 -3257589 -3103924 -2899079 -2412558 -1766736 164829 3593109 5069303 1227129
10323 1227129 -5179532 -7720455 -4896914 -1344209 67637 1671245 4807505 5958083
10315 5958083 2544826 -1854978 -2219144 1019675 3698820 4337062 5022268 7180385 9769723
10306 9769723 11179728 10612742 8133131 5018994 3166305 2706634 1471016 -1711247
10298 -1711247 -4766466 -5269478 -4037478 -3673592 -4881755 -6621124 -8670199 -11120649
10290 -11120649 -12076228 -9250951 -4137204 -1408265 -3104225 -6055667 -6476895 -4683370
10282 -4683370 -3319120 -2986041 -2249506 -811593 -9829 -567010 -2029022 -3973043 -5580459
10273 -5580459 -4752957 -619907 3388740 2556320 -2587689 -6593435 -6947673 -7082395 -9286356
10264 -9286356 -9561134 -3957467 3750481 6435634 3603770 1217228 2559745 5183172
10256 5183172 6870889 8476473 9517443 6776236 45089 -5353652 -5175420 -2099199
10248 -2099199 -1639023 -4506526 -6235980 -3328395 2556505 6287431 4413811 -789334
10240 -789334 -3010346 724118 5662990 5439947 1246814 1864 3468003 5200377
10232 5200377 295464 -7355425 -10838868 -8801957 -4706464 -1385909 -193174 -2225954
10224 -2225954 -6299022 -8338073 -6609910 -4957110 -6900569 -9280599 -6685796 -416281
10216 -416281 2408090 -1441376 -7147833 -8320312 -4211452 754202 2443139 845779
10208 845779 -661233 428730 2310193 1037842 -3583370 -6892962 -5615689 -2343651
10200 -2343651 -1280379 -2139386 -1716677 346559 1337911 153365 -1701814 -3847338 -8140498
10191 -8140498 -14895001 -20533111 -20761471 -15209243 -7908969 -3387466 -2677039 -3295497 -2881767
10182 -2881767 -1697451 -833621 187153 1733408 1718439 -1308618 -3712287 -433301 6472461
10173 6472461 8505952 1988431 -6437321 -8521693 -4016103 1891401 6180098 8374013
10165 8374013 6918572 766341 -6835640 -10477356 -7931934 -1113805 6225466 9630711
10157 9630711 6167639 -1298539 -5429340 -3455850 -1041941 -3172242 -6020080 -3817553
10149 -3817553 594902 16729 -4874513 -6183933 -1169984 4350322 5817421 5302792
10141 5302792 5022175 2876251 -1845224 -4252119 -128182 7250724 10946934 8923262
10133 8923262 5294351 4252685 5634499 6428258 4936154 2591832 1480452 886124
10125 886124 -1427856 -4143826 -2410694 4536039 9738563 6990585 -162950 -3449456
10117 -3449456 -1518157 -69656 -1800405 -3603918 -3803559 -4610790 -6068472 -4874017
10109 -4874017 -1481290 -1223377 -5193182 -7001436 -2918675 1368119 -263235 -4410851
10101 -4410851 -4123888 -600385 -979284 -6409203 -10161719 -7928635 -3318293 -1356931
10093 -1356931 -1765271 -1398483 143253 385081 -2034749 -5408776 -6788749 -5064887 -2221638
10084 -2221638 -1088088 -1602910 -802394 2333514 4057675 548174 -5817931 -8423435
10076 -8423435 -4812453 172073 754250 -3076758 -6969497 -8052257 -7031764 -5797762
10068 -5797762 -5393750 -5901652 -6260244 -4432777 177013 4487871 4239523 -684899 -5704609
10059 -5704609 -7308791 -6957266 -7553481 -8603870 -7781816 -5357824 -3267975 -771418 4560335
10050 4560335 11305985 14176115 11099802 6517904 5483930 7763919 10167023 11537355
10042 11537355 12317248 11737732 9098718 6330006 5882534 6901942 6341098 3234963 -546373
10033 -546373 -3120899 -4004214 -3428385 -2193601 -1455461 -1176509 13733 2151623 3046935
10024 3046935 1599731 -320188 -1027582 -1093209 -200341 3988880 10249866 11471826 3557299
10015 3557299 -6562426 -8487274 -2035069 3665459 3680264 1947400 1956894 1234587 -1813236
10006 -1813236 -2903739 1365100 6970905 7891441 4443526 1206718 -613399 -3434359
9998 -3434359 -7273229 -8721037 -6433026 -3657518 -3805622 -6038488 -7013293 -5585613 -3825677
9989 -3825677 -3606100 -4104756 -3791367 -3469269 -4946120 -6948369 -5566245 -184116 3939425
9980 3939425 1671490 -5287042 -10475475 -10122945 -5874982 -1362190 1027183 748344 -813373
9971 -813373 -1327429 -505794 -887974 -3696287 -5876998 -3966484 941090 4921978 6019507
9962 6019507 4654330 1846953 70311 2530106 7694633 8387746 1405609 -5929072
9954 -5929072 -5122320 1346165 4667870 2971137 1108991 105619 -2757181 -4898687
9946 -4898687 -1137270 4410777 1469309 -9340197 -15143990 -10241482 -4152630 -4703609
9938 -4703609 -6053393 -1866134 1714225 -2653267 -9037434 -7608807 -1184407 632932
9930 632932 -1571416 461092 6446890 7720279 2775621 -577328 362614 -789390 -6095508
9921 -6095508 -7678991 -850299 6810885 6347122 423315 -1754970 2022947 5492442
9913 5492442 3870238 -535496 -2558472 -260031 3843989 5911600 4716394 2590206
9905 2590206 1983818 1979327 78427 -3297478 -4897982 -3221820 -94985 2798935 6054287
9896 6054287 10126960 13304096 13700837 11677879 8852944 5839022 2373231 -820000
9888 -820000 -1816739 44 1878649 188853 -4014410 -4481509 2071601 9495752 9106509
9879 9106509 2126276 -1456311 3094915 10719282 18491293 31669703 50663078 61489082
9871 61489082 51152840 27510073 11214846 9970203 13283279 12306284 10862508 13284414
9863 13284414 14604681 10359647 6158658 8476571 12805700 10150927 942184 -6063267
9855 -6063267 -6057791 -1736630 3484062 8320717 10346850 6879940 60196 -4342703 -4293279
9846 -4293279 -3326352 -4290044 -5637035 -5363828 -4806119 -6287105 -9296793 -10794569 -8108077
9837 -8108077 -1122838 6770463 10074989 6135096 -858123 -3541784 -19001 3907947
9829 3907947 2618457 -1996307 -3652553 -205835 4116711 4425204 283635 -5005716
9821 -5005716 -7844161 -6597939 -2574729 438264 -553586 -4017120 -5187509 -2135698
9813 -2135698 1454817 1187047 -2318541 -4867164 -4296955 -1938197 332647 1457804 554913
9804 554913 -1630554 -1361596 3789806 9446439 8293408 395674 -5893832 -5572351 -3601734
9795 -3601734 -5816704 -8954079 -6262999 844186 4686139 3410460 3082784 6883701
9787 6883701 9866310 7523404 3419911 3707636 7963301 10324615 7809130 3250108
9779 3250108 469326 -158830 -820320 -2880199 -5210831 -5525672 -3324509 -1065465 -1251135
9770 -1251135 -2599221 -1193048 3809869 7700771 5306307 -2303390 -7968733 -5621190
9762 -5621190 3326280 11151489 11547025 5906328 963972 282981 490014 -2473072 -6178100
9753 -6178100 -4741223 2091764 7677619 7140168 3017498 322856 -230198 -1073394 -2723937
9744 -2723937 -3574268 -3229605 -2556367 -1095813 2350968 6724995 9313228 9620373 9759415
9735 9759415 10318354 8873748 4235442 -540879 -2022789 -1476048 -2818337 -6288183 -7873550
9726 -7873550 -5632726 -2899212 -3136755 -4575786 -3156868 984950 3699494 2979417 1333988
9717 1333988 1472771 2697235 2780834 1146655 -1082836 -2598616 -2705056 -1994478 -2251739
9708 -2251739 -3911892 -4246095 -978820 2857153 1876832 -3442699 -6359953 -3260299 1509163
9699 1509163 2700641 1019089 -628062 -2757116 -6304706 -8190251 -5646699 -1874547
9691 -1874547 -1435536 -2609426 -734157 2860737 2342823 -2984967 -7521401 -8002712 -6714826
9682 -6714826 -5493174 -3048545 540955 2948653 4627138 8338060 11958679 8868784
9674 8868784 -1293814 -9082680 -7033722 677169 5371652 5485575 5238110 6107393 6472921
9665 6472921 6925773 8846705 9055441 2947421 -6788122 -11112350 -6120001 1588538 3542249
9656 3542249 -583153 -4521983 -4041987 -577392 2362822 3203382 2558942 1487563 226053
9647 226053 -1941679 -5596382 -9578486 -11069082 -8399586 -3641436 -1016550 -2226658
9639 -2226658 -4576563 -4583098 -2214429 -155140 60472 -755677 -1346678 -818349 1838366
9630 1838366 6196891 8718956 6124073 582978 -2459706 -2110829 -2645541 -4978921 -3871355
9621 -3871355 2764988 8102195 5869234 633517 1360573 7966115 11974550 8832762
9613 8832762 2166066 -3306569 -5962581 -4854383 -151746 3896540 2965322 -500055
9605 -500055 -862801 1206312 480686 -2385307 -1467494 2901296 3466059 -982443 -2690964
9596 -2690964 1107994 2214691 -4336628 -10062985 -5434109 5232572 10362977 7013738
9588 7013738 1570150 -933232 26811 4209799 9545528 10338125 3978323 -3271644 -4204047
9579 -4204047 -1375640 -2405993 -7217751 -8208162 -2058944 6221707 10955758 11229727 8890268
9570 8890268 6478769 6524685 8276638 6841297 221068 -5707333 -4899580 -423337 843761
9561 843761 -639587 370106 2851269 812462 -5135860 -7382077 -3345985 1124220
9553 1124220 1828997 1192533 1512117 1672622 2658859 7850567 15080090 16714294 11005902
9544 11005902 5370448 4775787 5156736 2759565 1357115 4001744 5535292 1105980
9536 1105980 -4127780 -2390093 4052759 6353081 2577801 -578334 1404302 5703721
9528 5703721 8001338 7460777 5073414 1746369 -1004962 -1796064 -1241672 -807683 -598241
9519 -598241 -590390 -2284660 -6002594 -8442405 -6742502 -3386550 -2838074 -4579552 -4269774
9510 -4269774 -1207776 596703 -637638 -1565077 429410 2850884 2378325 241862 -155806
9501 -155806 943672 39015 -3648273 -6049776 -3657645 1149690 2877867 470354 -1141711
9492 -1141711 1530567 4569371 1709343 -6078761 -10846370 -8221099 -3047474 -2068560
9484 -2068560 -4941766 -6374934 -4522832 -2516383 -2441206 -2328664 -14871 3345053 5226588
9475 5226588 5192537 4840140 5314288 6101873 6056820 5008770 4148168 4614564 5818355 5938792
9465 5938792 4350020 2632454 2674235 4637691 7226268 8880539 8295844 5281005 1967839
9456 1967839 1578717 4690225 8056769 8513701 6708618 5386711 5362188 5322897 4758771
9447 4758771 4705923 5625638 6443292 6037597 4511079 2849124 2020762 2031700 1285173 -1999793
9437 -1999793 -6613986 -8138995 -4103799 1679672 2902589 -1115518 -4170451 -1120465
9429 -1120465 5628851 9618943 8380366 5264646 4074029 4889324 5793310 6065683 5895181
9420 5895181 4684897 2117263 178858 1340274 4358467 4568541 -346403 -7076055
9412 -7076055 -10875552 -11012117 -9796741 -8117685 -5175476 -1650910 460195 1098447 1859431
9403 1859431 2267382 -17723 -4444632 -6877583 -5411409 -3243683 -3185177 -2676995 2024528
9394 2024528 9008582 12373479 9935349 5434888 3109154 3513762 5163171 7022377
9386 7022377 8176269 7682233 6259564 6019381 7020747 6237708 2057651 -2067697 -1505275
9377 -1505275 2896568 5613120 4331978 3200353 6034540 9636282 7948042 1322364
9369 1322364 -3144558 -898492 4906741 8998173 10421385 10644497 9122375 5033696
9361 5033696 1109411 1106819 4396903 7081727 7832250 8610554 9966879 9916787 7958225
9352 7958225 6314687 6338937 7018274 7610728 8293414 7728672 4016688 -864095 -1721265
9343 -1721265 2922406 8237152 9491276 7729465 6890691 8343054 10608632 11908598
9335 11908598 10970651 7797721 5115228 6014224 8715947 7454656 587801 -6305174
9327 -6305174 -8142946 -6910467 -6978379 -8000649 -7066991 -4653321 -3412244 -3370474 -3047158
9318 -3047158 -3168021 -4431052 -3726599 1884824 8805800 10303058 5806580 1224802 -62611
9309 -62611 -757864 -3175709 -4919200 -3621165 -1634055 -2550651 -5552205 -6406629 -3198976
9300 -3198976 1083786 1764786 -2443364 -7768072 -9215702 -6064382 -2111162 -143714
9292 -143714 1205679 3618585 5211690 3389441 -892295 -4911350 -7865261 -9354838
9284 -9354838 -7039665 -428052 5407695 5358801 1797661 774503 2296310 1343929 -2067977
9275 -2067977 -1928020 3320190 7297903 5760311 3010387 3949703 6055475 4893036 2636902
9266 2636902 4392680 8894501 9704101 5113646 1031784 2812059 8260209 10864159
9258 10864159 7960763 3506523 2639516 4888707 4843962 88338 -4639584 -4281458 -1696626
9249 -1696626 -3548490 -9049902 -9922930 -3106873 3589824 2337931 -4146564 -7977520
9241 -7977520 -7406407 -6817835 -8412446 -9869760 -8958444 -5653851 -768180 3456344 2974050
9232 2974050 -3458432 -10646705 -12320540 -8907992 -5586331 -4133690 -2053643 1072271
9224 1072271 2400054 1455974 1238507 2399529 1690501 -1789323 -3808403 -1258481 3075580
9215 3075580 5150831 5294949 5609680 5104964 1900619 -1891799 -2342483 27876 767115
9206 767115 -1487346 -3000673 -1467211 -383108 -3592718 -8245541 -7982142 -2796426 -565087
9197 -565087 -6222301 -13380017 -11568238 -336250 9427683 9144505 2250246 -2479977
9189 -2479977 -2604175 -2224326 -3522992 -4092238 -2258643 277104 2093014 4067411 6374617
9180 6374617 7086610 5350821 2843635 633254 -2173175 -5005348 -4589882 243665 5398035
9171 5398035 6155734 2872124 -690946 -2561427 -3135561 -2658948 -1543349 -1502586 -2809283
9162 -2809283 -2086108 2985642 8146801 6923475 224586 -4089652 -2300729 289915
9154 289915 -1767861 -5692782 -5457483 -1362960 880486 -1008282 -3220137 -2087516 1259995
9145 1259995 3476516 3304201 2166464 2226223 4334652 6640366 5726867 916540 -3406325
9136 -3406325 -2373096 2910733 6478710 5135206 1726565 37743 -264663 -1741388
9128 -1741388 -4652701 -6690969 -6345010 -5011204 -5772533 -9876767 -13834579 -11667346 -2545634
9119 -2545634 5435885 3512475 -6026436 -11630300 -7100873 1243244 4542952 2670836
9111 2670836 1005535 989380 302149 -494839 1594898 5674989 7153833 4748154 2364692
9102 2364692 3079769 5210435 5384618 2512647 -1823616 -4561036 -3202198 754843 1694397
9093 1694397 -3534258 -10513142 -12755229 -10409339 -8272667 -6948819 -3006154 2418904
9085 2418904 3274914 -1295775 -4208621 -1162920 2978404 3073383 2332829 5806206 10374354
9076 10374354 8848270 1517641 -3683128 -2104048 2546072 4706545 3723140 2556612
9068 2556612 2926260 3566921 2179382 -1594024 -5086075 -5358209 -3106337 -1830182 -2699993
9059 -2699993 -3197274 -2048730 -1986828 -5235692 -9403250 -10805750 -9314017 -7075607 -4967912
9050 -4967912 -3186975 -2746709 -3419307 -2867083 -714076 -176797 -2252135 -2278960 2924769
9041 2924769 8244966 6724398 196520 -3224656 -709987 3112164 4830595 5946571
9033 5946571 7366637 7053698 4900617 4120130 5718456 6577914 4915609 2929010 2237210
9024 2237210 1409227 -130277 -578535 -185461 -2048427 -5751413 -5544686 1086994 7598113
9015 7598113 6149891 -1863197 -8022524 -7558976 -3064779 1122185 3452977 4186651 3930521
9006 3930521 3937372 5047036 5647114 2917933 -3197922 -9005357 -10715656 -7856042 -2625164
8997 -2625164 2746583 6949162 8754501 7045677 2671583 -623427 920698 6692617
8989 6692617 11772108 12300808 9172036 5291924 1565196 -2094386 -4125169 -3281469 -1754146
8980 -1754146 -2327531 -3439610 -1700903 1065483 -1130558 -9051289 -15190668 -13020997
8972 -13020997 -5283229 311839 701935 -795070 -522262 1363356 2635505 2583316 2987098
8963 2987098 5532887 8406205 7227893 1169153 -3949811 -2178375 4538431 9419834
8955 9419834 10564547 11456537 12217358 8327974 127334 -4608894 -1993624 1357013 -1112736
8946 -1112736 -5278252 -3756275 1345231 2132181 -1734924 -3083737 61884 1213385
8938 1213385 -3451886 -8790401 -8890274 -5322148 -3068343 -2721149 -1309635 1560844 2651892
8929 2651892 -129916 -4514271 -6229703 -3996408 -1341924 -2260938 -5293066 -4732831 1038646
8920 1038646 6210380 5775583 3443854 6103804 12931408 16591932 14403061 11157640
8912 11157640 9986912 7551547 1060649 -5989157 -8855148 -7653213 -4774709 -556389
8904 -556389 4373747 6378767 3332865 -956173 -1712057 -370760 -1755910 -5688417 -6940520
8895 -6940520 -3255207 1805018 4655066 5631866 5944478 5146218 3715273 4258877 7286836
8886 7286836 8789938 5331574 -478778 -2925476 -296097 4108318 7028736 7840259
8878 7840259 6627793 3644769 1258576 2564140 6559443 8230827 5560251 3006921
8870 3006921 4980368 8991839 9460360 6017849 3003628 1942658 211393 -2679907
8862 -2679907 -3418825 -1209583 -275462 -3107840 -5944797 -4795301 -2038768 -2442820 -5430664
8853 -5430664 -6199493 -2868612 2055650 6189615 8793441 8614084 4963057 1013374 1380632
8844 1380632 5379619 6747444 1828573 -5156980 -7069679 -1880104 5981803 10545962
8836 10545962 8993823 2891324 -3442274 -6136632 -4399221 -340173 3236111 4328288
8828 4328288 2144947 -2213948 -5753343 -5994870 -3648260 -1761188 -2254725 -4311385 -5928122
8819 -5928122 -5984930 -4974007 -4460825 -5413171 -6663022 -6096422 -3814539 -2389648 -3184148
8810 -3184148 -4564170 -4898225 -4713401 -4280235 -2191663 1242870 2527443 203822 -1675073
8801 -1675073 664676 4507408 5014181 2962780 2396198 2792096 265201 -4428595 -5985561
8792 -5985561 -2808610 1198359 3537735 5533901 7188120 6185387 3320365 2438607
8784 2438607 3373741 1566903 -3336859 -5573266 -2658316 545285 770940 1920405 6715701
8775 6715701 9836268 5884626 -1507144 -5517942 -6311653 -7995844 -9518947 -6977375
8767 -6977375 -2546784 -2421087 -6325763 -7133194 -2003869 3069665 2112810 -2929960 -6027471
8758 -6027471 -4892510 -1941385 268513 1691645 3264708 4412302 3300961 230958
8750 230958 -603555 4243925 11141861 11965265 4681309 -2975097 -3224164 2476493 7432203
8741 7432203 8899129 8609313 7514053 5397873 3586052 3149188 2302228 -30124 -615423
8732 -615423 3151035 7391094 6580873 1963960 -1094022 -2134853 -4949332 -9080100 -9616585
8723 -9616585 -5763817 -2532213 -2860887 -4447738 -5466697 -7026045 -8390634 -5987755
8715 -5987755 526959 6409993 8043543 6428974 3318229 -1065652 -5257783 -6705033
8707 -6705033 -5845641 -4997339 -3017788 2532427 7787398 5488061 -2739994 -6121507 -319181
8698 -319181 5846321 4460993 303750 1376477 5677980 6452806 4494604 5292226 8040823
8689 8040823 7488905 4230610 3464049 4828335 2975210 -1911522 -3444216 -3702 2266804
8680 2266804 -251731 -3085430 -1613390 1909492 2952669 1133811 -1437431 -3820886
8672 -3820886 -5033128 -3127001 1457470 5104746 6125606 6924674 8654558 8202030 4001322
8663 4001322 419200 1553899 4193952 2595168 -2109473 -3505876 39072 3293463
8655 3293463 2754684 1263463 1944157 2900377 1353649 -1180151 -2077467 -2784159 -5929321
8646 -5929321 -9404828 -8927628 -5758108 -5772888 -9914370 -11724019 -7183165 -1385507 -855437
8637 -855437 -3727905 -3534944 172079 1805243 -782468 -3706420 -4385118 -4924651 -6546797
8628 -6546797 -6692621 -4304685 -2708541 -4170082 -6301640 -6962101 -7824551 -9416144 -7788094
8619 -7788094 -1103829 5017598 4694774 697473 -279057 1751699 1516630 -1226914 -959038
8610 -959038 3774774 7336994 5586443 1229676 -1641405 -2892047 -3686189 -3324242 -1678954
8601 -1678954 -954684 -2283188 -3658967 -3365748 -2467931 -2262786 -2450026 -3174327 -5260431
8592 -5260431 -7149043 -5845512 -2398313 -1400229 -2930570 -1025005 6087673 10562928
8584 10562928 5798354 -2450678 -3566202 2533529 6034827 2115933 -3526979 -4990367
8576 -4990367 -3692089 -2569891 17209 5647616 10270835 9135410 4458870 2641611
8568 2641611 5069815 6767520 4253072 165712 -1372018 -514084 -406809 -2197207 -4080271
8559 -4080271 -4717456 -5042538 -6046343 -6682399 -5361906 -2404711 601023 3083500 5077629
8550 5077629 5017621 995846 -4823426 -6213135 23329 8875484 12195306 8085933 2147026
8541 2147026 -263476 450321 938963 -229483 -2507435 -5699291 -9581868 -12115837 -10590239
8532 -10590239 -5026320 886136 3012198 718608 -2679023 -3518016 -1628674 105252
8524 105252 44503 17550 1955497 4001100 2767665 -1093388 -2971367 -713766 2186654
8515 2186654 1615416 -1447802 -2665403 -244355 3331686 4664568 2519642 -1838048
8507 -1838048 -5584365 -6161670 -3869576 -2137589 -3599507 -6566264 -7396140 -5894371 -5773296
8498 -5773296 -9130753 -12710366 -11356515 -4442435 2620221 3772950 -1126983 -5879064
8490 -5879064 -4733137 1017861 4857317 3299514 -316737 -1402622 -467005 -980419 -2949059
8481 -2949059 -2648207 1487023 6311962 8071815 6363814 3214707 553807 -507253
8473 -507253 58932 663256 -527519 -2956509 -3942651 -2175644 429266 786440 -2467855
8464 -2467855 -7746757 -10919148 -8314136 -1743404 1127740 -4675657 -13616110 -15415347
8456 -15415347 -8457742 -1392213 -303341 -1311986 802335 3675304 2864338 705974
8448 705974 2176304 5297813 3727722 -2404623 -6075496 -4101593 -1069800 -962109 -1480329
8439 -1480329 356058 2536066 2060110 666024 1984794 5123689 5508460 1784853 -1641251
8430 -1641251 -76302 5355917 8819725 6783588 2234886 477342 1894656 1915045 -1602560
8421 -1602560 -4891003 -4269238 -1916194 -2182407 -4999277 -6949441 -6572211 -4475811 -619942
8412 -619942 3716921 3763499 -2988847 -10656590 -11273472 -6126483 -3445118 -5239435 -5005214
8403 -5005214 101846 3708474 447527 -5876576 -8879557 -7948140 -5402589 -1402306
8395 -1402306 3087728 3639610 -1620463 -7614364 -9079547 -7515691 -6431108 -4466224
8387 -4466224 728847 6028523 6936465 4879544 3913595 3198755 -520051 -5645254 -7936523
8378 -7936523 -7699042 -7705191 -6286686 -456567 5784285 5163350 -1094156 -4186237 -1302240
8369 -1302240 863723 -1530306 -2779505 2175680 8675256 9577929 5883890 3529480
8361 3529480 3411150 1443656 -3095994 -5616772 -3215278 880035 1649920 -1332969 -3794132
8352 -3794132 -2385865 1227207 2908407 1825768 1271340 3084737 4417099 2539770
8344 2539770 56407 1396727 5848140 8419781 6717489 2659433 -1932228 -6742256
8336 -6742256 -10094024 -9498835 -5749240 -2351709 -499464 1241730 2213701 -353933 -5820598
8327 -5820598 -9575194 -9433466 -8075895 -7696603 -6774675 -3878537 -418270 2099199 3631781
8318 3631781 3316340 26197 -3847637 -4186263 -1688528 -839192 -1209337 2918603 11564052
8309 11564052 15756250 10241313 2122657 62458 1128343 -3139838 -11795005 -15071698
8301 -15071698 -8632700 1171749 6755693 7031698 4451874 411176 -3883033 -6053099
8293 -6053099 -4743053 -1338874 1556372 2050565 -342569 -4091479 -6225202 -5424698 -3875895
8284 -3875895 -4248137 -5914824 -6302937 -4897677 -3471604 -2999912 -2582007 -1174539 1104240
8275 1104240 3022228 2893267 297976 -2472125 -2521807 -184915 1751299 2769193 4948487
8266 4948487 7976263 8342761 5040855 1371437 -819609 -3478224 -6631006 -6556952 -3210138
8257 -3210138 -2815199 -8082016 -12428524 -10106271 -5410147 -4169356 -2753727 4510733
8249 4510733 12500685 11932194 5634703 5108421 11560509 13891678 7576667 2369044 6277378
8240 6277378 13268005 13723653 8065939 2559922 -1173471 -4785848 -6996277 -6354436 -6072923
8231 -6072923 -9041962 -11293664 -7351065 149630 2952161 -1468669 -6851522 -6771882 -1959777
8222 -1959777 1733593 -181871 -6837959 -12794111 -13039776 -8140752 -3317970 -1957771
8214 -1957771 -2391830 -2024885 -1466247 -2565353 -5193675 -8270537 -11424738 -13451770 -11886510
8205 -11886510 -6649347 -1596906 22475 -868077 -2323001 -4677718 -7588685 -7329276
8197 -7329276 -1572431 5500844 7756591 5525343 4769428 8211740 11701766 10173312
8189 10173312 4016809 -1514603 -1482920 4226717 10163801 9930694 3292114 -2678964 -1860583
8180 -1860583 3129685 4667333 472922 -3966676 -3552149 46743 1952717 909345
8172 909345 -178942 919988 3053466 3824498 2563549 268716 -2404617 -5567740 -8460435
8163 -8460435 -9208030 -7542273 -6291900 -7879293 -10216611 -9079162 -4422489 -829009
8155 -829009 -851403 -1624329 -16236 2358100 2340983 755394 812165 2281835 1263661
8146 1263661 -3890029 -9349757 -9636074 -3332456 5585923 11400882 11554610 8416260 6144344
8137 6144344 6059250 6108879 4658660 2861568 2608972 3876871 5108130 4994808 3336253
8128 3336253 1430940 1639706 4681244 7511058 6473955 2569245 383494 1549796
8120 1549796 3180748 3493529 4179982 5371802 3553560 -2073133 -5969262 -3667692 1048107
8111 1048107 1690736 -1165251 -1560338 2170861 5511914 5290563 3611809 3446811 4602668
8102 4602668 5227708 4125484 709310 -4805788 -10636492 -14761386 -16826927 -17103852 -14819307
8093 -14819307 -9913068 -5027539 -2846383 -2686211 -2556972 -2792241 -4004221 -3327748 2443363
8084 2443363 10750656 15274428 14104513 11213175 9402537 6774182 1697193 -3210858
8076 -3210858 -4601563 -2927123 -1215286 -1303467 -2819440 -4282655 -4252814 -2780462 -1976727
8067 -1976727 -3536824 -5871771 -5679565 -2165568 2301252 5297377 5992312 4386633 1278325
8058 1278325 -1668679 -3942466 -6937898 -10328567 -9982135 -3269839 5506173 9560992
8050 9560992 8110450 5689792 4527938 3234247 2069703 3095102 4989779 4039115
8042 4039115 805109 -467554 417969 -500363 -2729505 -610998 6254518 10000776 6013950
8033 6013950 -14578 -1591069 -954646 -2960003 -5702258 -4648591 -1479681 -1146788 -3323952
8024 -3323952 -4052867 -3323328 -3750005 -3653670 921659 7969600 10659753 7309105 3698928
8015 3698928 4035838 5294171 2793031 -2951431 -7436316 -7470959 -3550801 1133800 3231756
8006 3231756 2361233 1710455 3986077 7638537 9136300 7666351 4953439 1907614 -1176673
7997 -1176673 -2274989 518073 5039842 6608676 3785131 -256155 -1927967 -122782
7989 -122782 4323624 8818265 9310529 3984663 -3519325 -7708414 -7448891 -5364661 -2522161
7980 -2522161 1556187 4484952 2580415 -2439578 -4180455 -881038 1500124 -1662888
7972 -1662888 -6594391 -7027654 -3108635 267484 1222638 2045360 3943768 5336773 5359192
7963 5359192 5296244 5868591 5954930 4890250 3746280 3228665 2174313 -275619 -2205273
7954 -2205273 -807149 3125871 4783914 1194883 -3730205 -2971790 4353065 10738407
7946 10738407 9392495 2985721 -28376 3697730 9173528 10477081 7402002 3747191
7938 3747191 2365950 3660949 6545081 8944653 8830955 6226998 3177363 1039447
7930 1039447 -767664 -2719684 -3719744 -2779493 -735440 802958 1142323 472760 -570509
7921 -570509 -683891 1280038 4334897 5439400 2529223 -3318320 -9154207 -12544428 -12551018
7912 -12551018 -9995556 -7450196 -7437886 -9542154 -10278395 -6820315 -392198 4474011 3759474
7903 3759474 -2545233 -9768518 -11836481 -6681554 1653936 7267969 7949075 5137117
7895 5137117 43832 -6954969 -13515843 -15705616 -12414989 -6926407 -3106014 -2117723
7887 -2117723 -3348302 -5875154 -8021311 -8039693 -6589696 -6398851 -8338539 -10042554 -9594066
7878 -9594066 -8253635 -7947219 -8002510 -6157798 -1702857 3377256 5478249 1864017 -5806918
7869 -5806918 -10758482 -7150457 2550695 9556935 9017920 4711529 2200996 1540107 -403298
7860 -403298 -3796700 -5729910 -4527763 -1316831 1625557 2425637 1087744 475787 3399699
7851 3399699 7643877 7233991 553650 -6280521 -6813749 -2068640 1706970 426036 -5047815
7842 -5047815 -10599894 -11254793 -5291069 2056146 3335398 -587456 -720848 5815237 9145598
7833 9145598 761159 -12510450 -17706974 -13764833 -9649455 -7901581 -2738110 5484897
7825 5484897 7029312 -1928542 -11341150 -10494236 -1370537 6791024 9569045 8161156
7817 8161156 3971835 -1058286 -2758245 569560 4476353 4190017 1228739 -247263
7809 -247263 -375157 -1708157 -3223553 -2058585 350448 -372969 -4419009 -7083503 -5561073
7800 -5561073 -2256489 -662435 -1459349 -3495356 -5556153 -6095295 -3724366 653486 3797672
7791 3797672 3429704 770401 -984618 -331900 945995 64897 -3103270 -5744640 -6183511
7782 -6183511 -6515041 -8919665 -10931899 -8231085 -1665068 3182712 4058412 4433465 6071850
7773 6071850 5171324 -105501 -3711781 458344 8250627 9818907 3230714 -3388255
7765 -3388255 -3674369 -432228 948489 899789 3396703 8395854 11191413 9143682 5786024
7756 5786024 6515025 11158603 13060674 7091283 -2631101 -6202903 110459 8760232
7748 8760232 10197228 4493844 -4170 1943949 6818921 8245460 4730420 -67402
7740 -67402 -2456253 -2112484 -960599 -22911 1624867 4268048 5293505 2270156 -1793737
7731 -1793737 -311392 7819072 14924957 13904794 7846948 5760328 10524445 16063351
7723 16063351 16085144 11004706 5446589 2466347 1567096 457964 -1926517 -3573866 -1858375
7714 -1858375 1411930 847454 -4070848 -5729295 1452238 11333605 13385732 7283197
7706 7283197 2122250 2047513 1831146 -1931984 -4561354 -2025737 2075052 3387191 3923325
7697 3923325 6380022 7115524 1902683 -5246082 -6395925 -782475 5123989 7547365
7689 7547365 8882898 11030419 11315449 7229677 1342596 -1131784 1842500 7124964
7681 7124964 9721284 7837990 4524775 3406539 3422117 643047 -4540280 -6518299 -2858198
7672 -2858198 1037934 -438134 -4785254 -5827441 -3388283 -2334305 -3577755 -2742253
7664 -2742253 1988548 6831300 8594625 8642416 8699516 7368372 3532157 -437651 -1886983
7655 -1886983 -1758821 -2608049 -4657623 -6142396 -6023098 -4335705 -1237863 2319720 4069038
7646 4069038 2484397 -1218223 -4505522 -6252617 -6761383 -5865844 -2855230 1526230 4408792
7637 4408792 3192635 -1426112 -5495116 -5505495 -1921639 1767521 3407177 4094307 5284769
7628 5284769 6108833 5324473 4199435 4764818 6081327 5250137 2069218 -353260 -304614
7619 -304614 100788 -1323089 -3037318 -1993990 1670227 4578527 4571872 3218394 3226973
7610 3226973 4758990 5665200 4915210 4045527 4490420 5047543 3730169 1092712 -748469
7601 -748469 -1954002 -4692314 -8597311 -9936526 -6756591 -1704116 2049104 4415127
7593 4415127 5881658 5320194 3380054 3937574 7906493 9713178 5493461 812835 2789308
7584 2789308 7536033 4829407 -5554692 -12555630 -10567963 -6987134 -8762772 -11287271
7576 -11287271 -7654772 -1031957 844647 -2032754 -4047166 -4329010 -5774627 -6361671
7568 -6361671 -1381305 6173476 7245630 362244 -5138417 -2552060 3349023 5161464
7560 5161464 3614108 3679701 5095721 3686223 -441699 -2613254 -965686 1314182 1633565
7551 1633565 1343074 2110424 2631620 1198364 -778156 -341331 2824681 5927645 6820997
7542 6820997 6596975 7646420 10002451 10847881 7872278 2336855 -1851330 -1997055 749389
7533 749389 2540898 620327 -3780261 -6584188 -5507234 -2914375 -2529597 -3885652 -3010889
7524 -3010889 721549 2304501 -1662836 -6975057 -7568058 -4824319 -5148624 -8965031 -9136231
7515 -9136231 -2218388 5292251 6036731 2036661 673083 4014765 7881022 9305212
7507 9305212 9027521 7613438 4866178 2852324 3820524 4842363 616704 -7187980 -9945083
7498 -9945083 -4207709 2513632 2525956 -1187658 -916245 3539017 6227375 6075664 7922404
7489 7922404 12498252 13788473 8832408 2981218 1506933 1881138 -725970 -4999445
7481 -4999445 -6277253 -4487842 -3129456 -2285417 889394 5225695 5594413 1081995 -2720678
7472 -2720678 -2001167 -214416 -1787760 -4550941 -3277179 1645629 4403587 2231943
7464 2231943 -1054177 -1101175 1217172 2165115 579651 -1756362 -3703614 -5821797 -7970723
7455 -7970723 -8324916 -5695456 -1443392 1839793 2757268 1681421 -70484 -858296 404325
7446 404325 2738148 3244736 351664 -3464095 -4038037 -848223 1799226 -174841 -5655208
7437 -5655208 -9647297 -8948617 -5308387 -2842851 -3165028 -4012402 -2981030 -1348002 -2036765
7428 -2036765 -3996725 -2261708 4268634 8788074 4842090 -3670511 -6690667 -1619088
7420 -1619088 3860786 3631956 743618 76473 220099 -2069636 -4656649 -3703499 -968522
7411 -968522 -927871 -3078847 -3396440 -1538392 -343991 203532 1958350 2874077 -544416
7402 -544416 -5498841 -5073251 1258632 6558158 7011814 6277551 7390875 7816368 5633941
7393 5633941 3687275 3630538 2038727 -3168127 -7927334 -8240541 -6262414 -5593457 -5109923
7384 -5109923 -2341681 1071181 2174348 1507967 837814 -352928 -2131239 -1927027 789683
7375 789683 2102262 303358 -206572 3069601 4608902 -189958 -5257272 -1849024 7394193
7366 7394193 11867592 8400679 3744429 2529013 2212015 600295 -488886 -814449 -3241926
7357 -3241926 -7617885 -9665974 -7530835 -3322118 2321552 9967165 15113365 10957920
7349 10957920 -78920 -6245320 -1926442 4552293 3485236 -3017655 -6414224 -4308461
7341 -4308461 -697477 2195149 5235747 7550486 6412247 1591667 -3933733 -7069963
7333 -7069963 -6321108 -2184239 2330626 3877196 2995938 3328057 5555791 6205797 4059447
7324 4059447 2824780 4851959 7180211 7008840 6062379 5919162 4382260 929112 212500
7315 212500 4477284 7618716 3562709 -3667180 -5708236 -2356676 -270218 -1434369
7307 -1434369 -1574140 469520 334629 -3493490 -6112621 -3398854 2676282 8003085 10975102
7298 10975102 11442215 9409906 6732144 6437638 8586311 9781780 7963957 4759097
7290 4759097 2286555 777983 268247 1589485 4519486 7289376 8567629 7958891 4971789
7281 4971789 239331 -2881634 -1457269 2479269 4196819 3017214 2788782 5267067
7273 5267067 7315924 5938849 2292970 -981617 -3279475 -5094683 -6012291 -5273165 -2822378
7264 -2822378 887674 4792826 7149555 7167597 5852645 3580973 -1039362 -7251574 -10208115
7255 -10208115 -7428461 -4217303 -6548190 -10987410 -9455393 -2771516 -196179 -4576727
7247 -4576727 -7684541 -3597796 2410672 3408771 1192231 828457 1545913 234681 -1207805
7238 -1207805 489693 2835903 1338116 -2409702 -3262907 -1025712 60845 -1308377
7230 -1308377 -2725530 -3249032 -3450299 -1521908 4622186 11942916 14638973 11774892 7668819
7221 7668819 5292937 4286497 4668912 6851042 8165286 5117405 -484840 -3001418
7213 -3001418 -1118349 691118 -380506 -1768044 -487809 2935116 6659335 9193119
7205 9193119 8067134 1676150 -6508695 -10417540 -9118127 -7103149 -6172727 -3240578
7197 -3240578 2126828 4926211 2767802 253209 1053355 1655093 -1757476 -5646036 -4618045
7188 -4618045 -287730 1955244 1517788 1017072 -834646 -6758021 -12856502 -11588344 -3393382
7179 -3393382 2435241 446030 -4229333 -4526722 -661203 2894027 4328312 4081736 1776477
7170 1776477 -1707464 -2347682 1864748 6236332 4943293 -306584 -2631805 -328102
7162 -328102 1135925 -1530651 -4070229 -1767306 2840138 3912273 989868 -1388633
7154 -1388633 -1273072 -1084687 -1788481 -796088 2549695 4350296 2195972 -210083 1318581
7145 1318581 4363693 3740613 543988 1143700 7085505 12203948 11658916 8257225 6532256
7136 6532256 5345811 1115691 -4736974 -6947798 -3922128 531509 2891968 3514622
7128 3514622 4133050 5009321 5418366 4672283 2137807 -1850437 -4995782 -4969305 -2343064
7119 -2343064 384097 2353210 4442787 6034154 4877157 971841 -2240751 -1848672
7111 -1848672 1474319 5205578 7372152 6298658 885573 -6847463 -11692164 -10120651
7103 -10120651 -4151880 1130377 2622914 629756 -2802338 -5190517 -4877973 -2787039
7095 -2787039 -1502413 -1313526 558050 4987293 8199667 7151556 4923757 6387074
7087 6387074 10407054 11572886 8822347 6564111 6812166 6209017 2694906 -585287 -1040857
7078 -1040857 -1074259 -2745832 -2687735 2448293 9069226 11140862 9245907 8850079 10844213
7069 10844213 10463615 5618407 -210367 -4344644 -7841478 -10356333 -8587461 -2844306
7061 -2844306 990677 160531 -38343 4799181 9722547 7825369 2025932 1085210 5790042
7052 5790042 8035545 4112968 304737 2604978 8261021 11621825 12375414 12866426 11742738
7043 11742738 6204084 -1694116 -6334172 -5527477 -2424011 -884055 -1838421 -3607227
7035 -3607227 -3374684 739406 6828073 9808022 7449167 4130199 5244722 9230907
7027 9230907 9401282 3538999 -2677859 -3080772 1612183 5805366 6070934 3928005 2656145
7018 2656145 3303334 4107160 3151415 886529 -750298 -1523216 -3388776 -6886406 -9102368
7009 -9102368 -7225134 -2480348 1909572 5170057 8330243 10352895 8782970 4152996
7001 4152996 -17278 -2152939 -4038065 -6529035 -7642522 -6593128 -6228235 -8819273
6993 -8819273 -11981538 -11725003 -8013939 -4518270 -3609376 -4001025 -3251838 -872584 1363460
6984 1363460 1456877 -537673 -2289485 -1880468 -418590 -535507 -2338488 -2925616 -580805
6975 -580805 2653816 3844238 2813333 1341329 152979 -1327871 -2812146 -2571716 494706
6966 494706 4823427 6730647 3683758 -2480897 -6566353 -5478095 -1728225 222737
6958 222737 -131805 101939 1637779 1895357 -62892 -1434528 -194066 1455831 233627
6949 233627 -3880851 -8111756 -9732244 -7471969 -2543032 915702 -496717 -4249160
6941 -4249160 -3893080 2271850 8535707 9757117 7514209 5412480 3104051 -609871
6933 -609871 -2931909 -903815 2790348 3499152 1914235 2021646 3576526 2887105 194325
6924 194325 -325749 1730686 1643177 -2549653 -6434706 -5885687 -2763800 -1184549 -1660899
6915 -1660899 -1914068 -1064531 -239467 -213739 -336966 555389 2639031 4171627 3003088
6906 3003088 115970 -221271 3801374 7666889 5899241 -381020 -5540318 -7753246
6898 -7753246 -10020531 -13197755 -13768681 -9828905 -4302965 -327926 2351456 4411915
6890 4411915 4210405 462339 -4862502 -8086751 -6822548 -1689105 2755419 577381
6882 577381 -7880844 -12887782 -6027965 7110950 12614422 6687463 -526580 -1333684
6874 -1333684 -458950 -3801605 -7095499 -3878595 2561945 4520220 2194281 1326097 1954432
6865 1954432 -828613 -6419611 -8304831 -4418923 143451 1829904 2807173 4706521
6857 4706521 4830286 1504339 -1874807 -1450794 1696244 3389047 1472996 -2562633 -5551747
6848 -5551747 -5474216 -3404860 -2267578 -2630539 -1587430 2317797 5950123 6622974 6971130
6839 6971130 9884037 11720924 7529736 1308014 2579723 11890501 18118880 13377549
6831 13377549 3255305 -2429299 -2857632 -3998103 -7492365 -9093026 -6916179 -4631706
6823 -4631706 -5288160 -6746671 -5566986 -2445689 -901189 -1708181 -1578164 1885855 6108011
6814 6108011 6554334 2870961 -785770 -1599745 -1013092 -832895 -218885 1127976 561503
6805 561503 -3043056 -5552466 -2773981 3042821 6649055 7454586 8355006 9040908 7023331
6796 7023331 4135897 4749925 7625625 7215209 3901936 4527534 10175438 12029630 4332433
6787 4332433 -5775761 -7749287 -1669928 3843866 3850064 455774 -3456581 -7125199 -9277325
6778 -9277325 -8194348 -4804197 -2042227 -1145738 -1139892 -1062741 -290292 1881439 4555886
6769 4555886 4966973 2308303 -436936 -1043133 -1530169 -3888356 -5485390 -2966884 1939373
6760 1939373 5205717 6817419 9233826 11363448 9600503 4042067 -1359373 -4186359
6752 -4186359 -4504946 -1802664 3523100 6778791 3547460 -2524980 -3261540 2162220 6000833
6743 6000833 4092849 1557292 3143703 5322136 3098032 -1417786 -3437435 -3789564
6735 -3789564 -6032604 -8665708 -7431966 -3541493 -2372507 -4397590 -4357831 -300928 3218819
6726 3218819 3179413 3269642 7279083 12098176 12294745 8726660 7086407 8841364 9069969
6717 9069969 4445426 -1131333 -1801028 1912937 3629992 -446560 -6678655 -8661557
6709 -8661557 -4818183 453672 2541404 1656207 1531749 4202055 7372690 7272165 3437183
6700 3437183 -301556 -59092 3479699 5865079 4580332 2564744 4592353 10652110
6692 10652110 14935082 12303160 4516302 -1430676 -884395 3827037 6609141 4479125
6684 4479125 382874 -694226 2389081 5720565 5199448 1734305 113244 2501419
6676 2501419 5138602 3429758 -1183201 -2929121 -381392 973720 -2619375 -5956452
6668 -5956452 -1390817 9248242 15519913 11949298 4848705 2925069 6217283 8532734
6660 8532734 6813967 2708244 -2614206 -9156743 -14319023 -14106433 -8937620 -3924565
6652 -3924565 -2493211 -3308627 -3832997 -2995176 -27667 4894552 8171720 5825909 292561
6643 292561 -1173524 2893733 4765603 -1562090 -11067362 -14347175 -9904667 -4358095
6635 -4358095 -2813058 -4507555 -6855225 -8822536 -10343474 -11845940 -13915960 -15057201
6627 -15057201 -11904317 -4833481 -269908 -2489548 -5881641 -1904027 7812217 12979839
6619 12979839 9505126 4640603 4861389 6536962 3744309 -875240 -144752 5878483
6611 5878483 9198123 4667551 -3792410 -8513081 -5864559 2004249 9909539 12846116
6603 12846116 9077994 1950016 -2569552 -1549788 2298270 4417681 3800788 3266409
6595 3266409 4991456 7820986 9638442 10434649 11149995 10735304 7159466 1223932 -3615049
6586 -3615049 -5929350 -7754707 -10067607 -10355421 -7234594 -4122727 -4477485 -5922097 -3690576
6577 -3690576 1747181 5503487 5807134 5361367 5262487 3311917 -458427 -2159073 -215432
6568 -215432 1715428 761214 -746367 -180893 290160 -2206367 -5344536 -4569079 -14796
6559 -14796 3924438 4562569 2409802 -1942526 -7792022 -11581766 -9047290 -1418418 4093791
6550 4093791 1981177 -5341367 -10364648 -8272601 -1217512 4001188 2141051 -5440763
6542 -5440763 -11652432 -10528040 -3244449 3553846 4915128 1671855 -2186377 -4221062
6534 -4221062 -4971466 -5854985 -6560612 -4776029 898787 7765425 10574741 7634313 3590454
6525 3590454 3675443 6527561 6233672 1234941 -3063422 -2163311 872013 -73606 -5437484
6516 -5437484 -9976161 -10709664 -10234440 -10975913 -10574182 -6356100 -1410030 -1326172 -5748645
6507 -5748645 -8483948 -7053828 -6673960 -11464067 -16569631 -14697425 -7584616 -3916919
6499 -3916919 -6282014 -7548219 -2224117 5246206 7482111 4191303 196037 -2560688
6491 -2560688 -5186278 -6587407 -4496269 -1062604 -1340159 -5470534 -7766304 -5244772
6483 -5244772 -2233361 -3689114 -7742555 -8635506 -4978359 -1246546 -1383636 -3907542 -4287038
6474 -4287038 -552138 4848335 8523268 10077903 11338452 12293733 10363736 4826576
6466 4826576 -580551 -2061513 -971810 -1326561 -3243429 -2917065 899992 4627851 5185050
6457 5185050 3798339 2731833 1564859 -960010 -4043496 -6156665 -7134370 -6978254 -4906608
6448 -4906608 -1591972 369086 663695 2936567 9019252 14530431 14584054 11294727 10131848
6439 10131848 10586357 7258227 236343 -3113471 695734 5020598 2607004 -3674346
6431 -3674346 -5404738 -770311 4146163 4973186 3768621 3515572 3309216 1336249 -987067
6422 -987067 -668478 2825935 7093167 9187460 7444593 2447383 -2540798 -3370159 1279337
6413 1279337 8350446 13101582 12756309 7694363 814289 -3659132 -2626145 3044541
6405 3044541 8826736 10527100 7355731 1142489 -5541793 -9831863 -9599488 -5962992
6397 -5962992 -3140967 -3784162 -5727011 -5372575 -2937224 -1776650 -3403933 -6059472 -7966569
6388 -7966569 -9019213 -8749918 -5509822 730194 6481266 7434666 2788738 -3700112 -6784815
6379 -6784815 -4188054 1152219 3744956 1573293 -1266076 352302 5642389 8650844
6371 8650844 5838107 -155818 -5128151 -8451320 -11526658 -13745749 -13193576 -10294330
6363 -10294330 -7637816 -6081443 -3608488 1050791 5599006 6559936 3687995 415766
6355 415766 -131692 1861831 4536332 7377893 10527478 11881250 8303149 947288 -3867923
6346 -3867923 -1872247 3436708 5744725 4605192 4565669 6682951 6738835 2871328 -791332
6337 -791332 -802179 301986 -875851 -2431526 -867029 2334149 3341908 2971882 4872501
6328 4872501 7613182 5371313 -2262151 -7518380 -4735665 1445795 2539148 -2356505
6320 -2356505 -6567964 -5882078 -3447371 -3927415 -6896618 -8377388 -6588791 -3426605 -1066488
6311 -1066488 330307 1209804 1117673 -58483 -751386 396908 1767419 96811 -4884849
6302 -4884849 -9086303 -8591093 -4257167 -428206 -111160 -2869029 -6405692 -8305049 -7000513
6293 -7000513 -3435089 -1479941 -3895449 -7457882 -5338803 3950772 12982515 13789845
6285 13789845 7655525 2485494 1664467 1059130 -1940490 -2788341 2312425 7712077 4750641
6276 4750641 -4854763 -10112835 -6356106 -1725910 -4241749 -9641212 -8680912 -1349715
6268 -1349715 4426616 5440644 5648696 6560223 4337979 -1586298 -5266196 -3330993 -544402
6259 -544402 -1915278 -5163197 -5992326 -5565861 -6930643 -8347286 -6598360 -3768522 -4169478
6250 -4169478 -6659014 -6370963 -2542788 1497095 4616294 7524621 7336249 203595 -10150765
6241 -10150765 -14143921 -8471443 102279 5026989 7018398 8031803 5828954 -291815
6233 -291815 -4715181 -3024723 266001 -1663946 -7081205 -8817847 -5940882 -4275667
6225 -4275667 -5798445 -5699290 -1627766 1608890 20517 -2932650 -2166410 1141647 2540498
6216 2540498 1889735 2471156 4421943 4659952 2858133 2195904 3599540 4156978 2675500
6207 2675500 2156426 4317411 5785970 3156509 -1329250 -3007086 -1387133 403363
6199 403363 890540 751745 -404101 -2939810 -3797808 337761 6378645 7153738 1773337
6190 1773337 -2076305 1146423 7074808 8126826 3570614 -1520421 -3908625 -3941595 -2102187
6181 -2102187 1219973 3707832 3089519 497308 -1223873 -1290720 -275270 2183626 5475423
6172 5475423 6242899 2747112 -1264818 -1803778 -1375201 -4654120 -9404047 -8923830 -3088889
6163 -3088889 825398 -397052 -1303278 2374425 6177797 4014875 -2157425 -5083511
6155 -5083511 -1962353 2917856 3868936 -803763 -7872914 -11879983 -10207056 -6128480
6147 -6128480 -4482016 -4491268 -1119081 5975181 10588964 9316928 6722239 7290310 7963050
6138 7963050 4334734 -364877 441847 6054787 9425563 7781865 5383417 5218431 4523655
6129 4523655 775533 -3111261 -3004761 180357 1821950 -259234 -3729670 -5562194
6121 -5562194 -5917858 -7270409 -10279291 -12117956 -10135306 -6086854 -4229388 -5459777
6113 -5459777 -6651683 -6410990 -7331674 -10457656 -11837269 -8353011 -3450051 -2278390 -3707993
6104 -3707993 -2616327 1486749 4128248 3811073 4047128 6227750 6280611 1298992 -4882952
6095 -4882952 -6276879 -2097547 3677058 8005963 10746194 12036955 11005263 7547794
6087 7547794 3538056 1449304 2320684 5265975 8603156 11159450 12343566 11409356 7892122
6078 7892122 3170895 35913 -512832 -634607 -2276171 -4061145 -3898618 -3196765 -5001789
6069 -5001789 -8346743 -8345704 -2951703 3643392 6226322 4888896 4063020 6653674 11126564
6060 11126564 13895837 13125239 10015738 6839698 4056680 238323 -4621079 -7439537
6052 -7439537 -5928395 -2972375 -3694110 -8059263 -10236929 -6712463 -1335410 362453
6044 362453 -1212835 -1549259 465996 1380652 -799768 -3803136 -5335251 -6259024 -7446140
6035 -7446140 -6744245 -2337712 2953611 4565728 2575359 1339240 2702904 3675561 2059875
6026 2059875 226285 694525 1646981 637595 -199300 2368300 5744830 3965855 -2880670
6017 -2880670 -7593345 -5863080 -2038718 -2088004 -5315230 -6880540 -5276165 -3124789 -2479459
6008 -2479459 -3084330 -4241370 -5415496 -5688623 -4647472 -2775224 303164 5774167 12225097
5999 12225097 15204538 12639061 7825245 4352741 1385499 -2598529 -5082059 -3303805
5991 -3303805 245701 1553153 1874190 4906750 9229078 10243153 8431022 8381923 9824959
5982 9824959 7451594 818336 -3499879 -2314386 -890055 -3580777 -6216791 -3415238
5974 -3415238 1848082 2613330 -1282746 -3321873 60502 5577819 8808325 9238533 8684497
5965 8684497 7924996 6417124 3942767 1490436 450310 705395 62654 -3015277 -6575876
5956 -6575876 -7321167 -5401953 -4222327 -5342565 -6959812 -7923037 -9256939 -10569397 -9324126
5947 -9324126 -5611840 -3250580 -3705842 -3543588 -1029621 -144811 -3406958 -5489818 -357115
5938 -357115 8509433 12095147 8368121 3628691 1787426 -285175 -5244189 -9816078
5930 -9816078 -10037784 -7061866 -4202970 -1771110 1531280 4522777 4514138 1384783 -2037243
5921 -2037243 -3376173 -2769919 -1783495 -1424734 -1159326 432273 3562959 6035856 5385488
5912 5385488 2141450 -808961 -2402398 -4765238 -9325504 -13652307 -14197652 -11021350
5904 -11021350 -7592370 -6269419 -6050884 -5041975 -3213919 -1725500 -908363 -375412 -362163
5895 -362163 -1374041 -2874221 -4108264 -6123430 -10572925 -15814016 -17052912 -12470556
5887 -12470556 -6776126 -5578250 -8027872 -8891104 -6708804 -5071077 -5785859 -6166553 -4706649
5878 -4706649 -4247809 -6466205 -7700771 -4396231 755944 2805832 2121506 2758361 4701988
5869 4701988 3453208 -2219232 -7100474 -5958963 136165 5757262 7105084 4549231
5861 4549231 969553 -957031 -771244 -420871 -1897613 -4651154 -6236311 -5327620 -2955798
5852 -2955798 -932724 -205424 -558032 -827554 259974 2356107 3105980 805171 -3036320
5843 -3036320 -5212624 -4598742 -3073632 -2881956 -4251286 -5521910 -4856169 -2092114 786614
5834 786614 1880079 2138411 4108575 7487666 8521409 5126242 -233706 -4747424 -9123602
5825 -9123602 -14149569 -16508663 -12720637 -5585476 -1661832 -2665583 -4013324 -2227063
5817 -2227063 713768 1606676 706249 204756 695829 1014893 11018 -2566414 -5598614
5808 -5598614 -6619332 -3845969 1489987 6071583 7599731 5956844 2366564 -982469
5800 -982469 -1884083 -798087 -1027241 -3847277 -5548271 -2524006 2875710 5590879 4909075
5791 4909075 3580925 1855884 -1813482 -5373931 -5006139 -2061718 -1494543 -3228164 -2327765
5782 -2327765 1453191 2420936 -633654 -1259463 3573037 7411359 4705219 -259236 -1505182
5773 -1505182 -1805892 -6788220 -13503158 -13962661 -7648176 -2207576 -2724049 -7356594 -12750896
$$ [...]
##END NTUPLES=NMR SPECTRUM
##END=
