##TITLE=31Pdec_2PPA1911
 CDCl3, 48 sc
 20.11.2019
##JCAMPDX= 6.0         $$ Bruker NMR JCAMP-DX V2.0
##DATA TYPE= NMR SPECTRUM
##DATA CLASS= NTUPLES
##ORIGIN= UXNMR, Bruker Analytische Messtechnik GmbH
##OWNER= root
$$ XWIN-NMR		Version 3.5
$$ Wed Nov 20 14:19:09 2019 Russian Standard Time (UT+4h)  she@DPX200
##.OBSERVE FREQUENCY= 81.013821
##.OBSERVE NUCLEUS= ^31P
##.ACQUISITION MODE= SIMULTANEOUS
##.ACQUISITION SCHEME= undefined
##.AVERAGES= 48
##.DIGITISER RES= 17
##SPECTROMETER/DATA SYSTEM= spect
##.PULSE SEQUENCE= zgpg30
##.SOLVENT NAME= THF
##.SHIFT REFERENCE= (INTERNAL, THF, 0, 182.463)
##AUDIT TRAIL= $$ (NUMBER, WHEN, WHO, WHERE, WHAT)
$$ ##TITLE= Audit trail, XWIN-NMR		Version 3.5
$$ ##JCAMPDX= 5.01
$$ ##ORIGIN= Bruker BioSpin GmbH
$$ ##OWNER= she
$$ F:/spectra/data/she/nmr/P31/1/pdata/1/auditp.txt
$$ ##AUDIT TRAIL=  $$ (NUMBER, WHEN, WHO, WHERE, WHAT)
(   1,<2019-11-20 14:18:01.12 +0400>,<she>,<DPX200>,
      <continue with go, POWCHK disabled, PULCHK disabled
       configuration hash MD5:
       00 E9 B6 7A A2 85 ED C7 34 08 36 98 17 FE 4E 26
       data hash MD5: 32K
       88 AA FF B3 EC B7 C4 3F 33 1D 8D 96 E0 03 A4 73>)
(   2,<2019-11-20 14:18:03.18 +0400>,<she>,<DPX200>,
      <Start of raw data processing
       efp BC_mod = 2 LB = 1 FT_mod = 6 PKNL = 1 PHC0 = -1271.492 PHC1 = -23.19901 SI = 64K 
       data hash MD5: 64K
       45 28 C8 22 AE CD FD 55 F0 B4 79 6E 84 B8 2B AF>)
(   3,<2019-11-20 14:18:39.26 +0400>,<she>,<DPX200>,
      <pk PHC0 = -14.77776 PHC1 = 32.59999 
       data hash MD5: 64K
       7E A5 AF 19 A3 C5 D2 52 0D 0A D7 67 FD 3C 13 2E>)
(   4,<2019-11-20 14:18:42.75 +0400>,<she>,<DPX200>,
      <abs ABSG = 5 
       data hash MD5: 64K
       F5 21 AB 10 15 A4 91 4F 97 47 C9 95 7A B4 E2 81>)
$$ ##END=
$$ 
$$ hash MD5
$$ 27 E5 2F 83 E5 AF 33 0B C6 DB 1B E8 76 94 FD 89
##$RELAX= 
##$RELAX= 
##$RELAX= 
##$RELAX= 
##$RELAX= 
##$RELAX= 
##$RELAX= 
##$RELAX= 
$$ Bruker specific parameters
$$ --------------------------
##$DU= <F:/spectra>
##$EXPNO= 1
##$NAME= <P31>
##$PROCNO= 1
##$TYPE= <nmr>
##$USER= <she>
##$AMP= (0..31)
100 100 100 100 100 100 100 100 100 100 100 100 100 100 100 100 100 100 
100 100 100 100 100 100 100 100 100 100 100 100 100 100 
##$AQSEQ= 0
##$AQ_mod= 1
##$AUNM= <au_zg>
##$AUTOPOS= <>
##$BF1= 81.014009
##$BF2= 200.13
##$BF3= 200.13
##$BF4= 200.13
##$BF5= 200.13
##$BF6= 200.13
##$BF7= 200.13
##$BF8= 200.13
##$BYTORDA= 1
##$CFDGTYP= 0
##$CFRGTYP= 5
##$CHEMSTR= <none>
##$CNST= (0..31)
1 1 145 1 1 1 1 1 1 1 1 1 1 1 1 1 1 1 1 1 1 1 1 1 1 1 1 1 1 1 1 1 
##$CPDPRG= <waltz16>
##$CPDPRG1= <>
##$CPDPRG2= <waltz16>
##$CPDPRG3= <>
##$CPDPRG4= <mlev>
##$CPDPRG5= <mlev>
##$CPDPRG6= <mlev>
##$CPDPRG7= <mlev>
##$CPDPRG8= <mlev>
##$CPDPRGB= <>
##$CPDPRGT= <>
##$D= (0..31)
0 1 0 0 0 0 0 0 0 0 0 0.03 2e-05 3e-06 0 0 0 0 0 0 0 0 0 0 0 0 0 0 0 0 
0 0 
##$DATE= 1574245001
##$DBL= (0..7)
120 120 120 11 120 120 24 19 
##$DBP= (0..7)
150 150 150 150 150 150 150 150 
##$DBP07= 0
##$DBPNAM0= <>
##$DBPNAM1= <>
$$ [...]
##$SUBNAM3= <"">
##$SUBNAM4= <"">
##$SUBNAM5= <"">
##$SUBNAM6= <"">
##$SUBNAM7= <"">
##$SUBNAM8= <"">
##$SUBNAM9= <"">
##$SW= 369.568048894756
##$SWIBOX= (0..15)
0 1 3 0 0 0 0 0 0 0 0 0 0 0 0 0 
##$SW_h= 29940.119760479
##$TD= 32768
##$TD0= 1
##$TE= 0
##$TE2= 300
##$TE3= 300
##$TEG= 300
##$TL= (0..7)
0 120 53 12 22 120 120 120 
##$TP= (0..7)
150 150 150 150 150 150 150 150 
##$TP07= 0
##$TPNAME0= <>
##$TPNAME1= <>
##$TPNAME2= <>
##$TPNAME3= <>
##$TPNAME4= <>
##$TPNAME5= <>
##$TPNAME6= <>
##$TPNAME7= <>
##$TPOAL= (0..7)
0.5 0.5 0.5 0.5 0.5 0.5 0.5 0.5 
##$TPOFFS= (0..7)
0 0 0 0 0 0 0 0 
##$TUNHIN= 0
##$TUNHOUT= 0
##$TUNXOUT= 0
##$USERA1= <user>
##$USERA2= <user>
##$USERA3= <user>
##$USERA4= <user>
##$USERA5= <user>
##$V9= 5
##$VALIST= <valist>
##$VCLIST= <CCCCCCCCCCCCCCC>
##$VD= 0
##$VDLIST= <DDDDDDDDDDDDDDD>
##$VPLIST= <PPPPPPPPPPPPPPP>
##$VTLIST= <TTTTTTTTTTTTTTT>
##$WBST= 1024
##$WBSW= 4
##$XGAIN= (0..3)
0 0 0 0 
##$XL= 0
##$YL= 0
##$YMAX_a= 26814
##$YMIN_a= -23592
##$ZGOPTNS= <>
##$ZL1= 120
##$ZL2= 120
##$ZL3= 120
##$ZL4= 120
##$ABSF1= 182.463
##$ABSF2= -187.1042
##$ABSG= 5
##$ABSL= 3
##$ALPHA= 0
##$AQORDER= 0
##$ASSFAC= 0
##$ASSFACI= 0
##$ASSFACX= 0
##$ASSWID= 0
##$AUNMP= <proc_1d>
##$AZFE= 0.1
##$AZFW= 0.5
##$BCFW= 0
##$BC_mod= 2
##$BYTORDP= 0
##$COROFFS= 0
##$CY= -3
##$DATMOD= 1
##$DC= 0
##$DFILT= <>
##$DTYPP= 0
##$F1P= 0
##$F2P= 0
##$FCOR= 1
##$FTSIZE= 65536
##$FT_mod= 6
##$GAMMA= 0
##$GB= 0
##$INTBC= 1
##$INTSCL= 5.30512e-09
##$ISEN= 30
##$LB= 1
##$LEV0= 0
##$LPBIN= 0
##$MAXI= 10000
##$MC2= 0
##$MEAN= 0
##$ME_mod= 0
##$MI= 50
##$NCOEF= 0
##$NC_proc= -8
##$NLEV= 6
##$NOISF1= 182.463
##$NOISF2= 159.3651
##$NSP= 0
##$NTH_PI= 0
##$NZP= 0
##$OFFSET= 182.463
##$PC= 4
##$PHC0= -1286.27
##$PHC1= 9.40098
##$PH_mod= 1
##$PKNL= yes
##$PPARMOD= 0
##$PSCAL= 0
##$PSIGN= 0
##$REVERSE= no
##$SF= 81.0140089999434
##$SI= 65536
##$SIGF1= 159.3651
##$SIGF2= -187.1042
##$SINO= 113.3802
##$SIOLD= 16384
##$SREGLST= <1H.CDCl3>
##$SSB= 0
##$STSI= 65536
##$STSR= 0
##$SW_p= 29940.119760479
##$SYMM= 0
##$S_DEV= 0
##$TDeff= 32768
##$TDoff= 0
##$TI= <>
##$TILT= no
##$TM1= 0
##$TM2= 0
##$TOPLEV= 0
##$USERP1= <user>
##$USERP2= <user>
##$USERP3= <user>
##$USERP4= <user>
##$USERP5= <user>
##$WDW= 1
##$XDIM= 65536
##$YMAX_p= 385088270
##$YMIN_p= -54619587
$$ End of Bruker specific parameters
$$ ---------------------------------
##NTUPLES= NMR SPECTRUM
##VAR_NAME=  FREQUENCY,     SPECTRUM/REAL,   SPECTRUM/IMAG
##SYMBOL=    X,             R,               I
##VAR_TYPE=  INDEPENDENT,   DEPENDENT,       DEPENDENT
##VAR_FORM=  AFFN,          ASDF,            ASDF
##VAR_DIM=   65536,         65536,           65536
##UNITS=     HZ,            ARBITRARY UNITS, ARBITRARY UNITS
##FACTOR=    0.456856943014862, 1,           1
##FIRST=     14782.0589164792, 0,            0
##LAST=      -15158.0608439998, 0,           0
##MIN=       -15158.0608439998, -54619587,   0
##MAX=       14782.0589164792, 385088270,    0
$$ Real data points
##PAGE= N=1
##DATA TABLE= (X++(R..R)), XYDATA
$$ [...]
44574a4882409K91145L325559q30719l814050j288022P32304j198582q23393M531806
44565a3956361N619652l003791r650181j727469J2611450J4618249K184826q845074
44557b148699q727298l601747n67357K002439N652666O223809K230283j129690
44549f5594r44602q56352k640094k440262N74235Q37325l420899n277458l32380
44540a4566081N064533L639108j488348k726042K47888K397302K603771K937533
44532a890336J803506l547671q941426o499760K899393Q333526L445117m172633
44524h570284l806472K690121M116775k098197m928322K647178R930740K894804
44516B876343j2283176j4415865K197417J7196810J1603043o896216j7502338
$$ y = [-14882409, -14591264, -11265705, -12096424, -15910474, -17198496, -16466192, -17664774, -18488167, -13956361, -8336709, -11340500, -20990681, -22718150, -10106700, 4511549, 6696375, -2148699, -10875997, -14477744, -15045101, -13042662, -7389996, -1166187, 1064096, -65594, -1010196, -1866548, -4506642, -6946904, -6372669, -5535344, -8956243, -14233701, -14566081, -9501548, -5862440, -7350788, -10076830, -9828942, -7431640, -4827869, -1890336, -86830, -3634501, -12575927, -19075687, -16176294, -7842768, -4397651, -8570284, -12376756, -9686635, -5569860, -7668057, -12596379, -9949201, -18461, 2876343, -9406833, -23822698, -21625281, -4428471, 7174572, 278356, -17223982]
44509a7223982j4663004q043837j721369Q330122J8231410J6500904L399483o175359
44501a365632m194740M25773q28774k739654J372105O534856N396962P63319j165242
44492D198973j651367l714922l522633K048042O173135J430575p121355q992499
44484a1152051l670308J545142M457704P430113P895155J774650n842285n854848
44476c416728j45327R07598l808513l733950N303507J2845077R060164j424227
44468A5587601p466951o183414l404996m133845q012461j1362772j0092146l124889
44460c8193873M909753P432757L838887K52664J325045N220211P737061O979373
44452d98122K793131l560404p596052m630421L064653P046456L469902j518546
$$ y = [-17223982, -31886986, -39930823, -41652192, -33322070, -15090660, 1410244, 4809727, -1365632, -5560372, -5134599, -5963373, -8703027, -7330922, -796066, 4600896, 5364215, 4198973, 2547606, -1167316, -4689949, -2641907, 3531228, 4961803, -2159552, -11152051, -14822359, -13277217, -8819513, -1389400, 6505755, 8280405, 2438120, -3416728, -3562055, -2654457, -6462970, -10196920, -4893413, 7951664, 17011828, 15587601, 8120650, 1937236, -1467760, -5601605, -13614066, -24976838, -35068984, -38193873, -33284120, -25851363, -22012476, -21759812, -20434767, -15214556, -7477495, -498122, 2295009, -1265395, -8861447, -13491868, -10427215, -3380759, 89143, -1429403]
44444a429403m76415N414849R127873P402342L427606J534032K409307K878454
44436C0288645r89224r121467j5337885j2951381l457587M029399L805171J37697
44428c596632J43166M024900O470091M934351J659626j363502m615422p793498
44420a36920q376560n269843j395123l19857j360983m91372L568398O562560M020665
44411c199035k089887n256371k822510J302114L276841M164967N510991M702689
44403E589799m87221n912782n251531J254054P171263P859718L745623k539202
44395A1429721p380218o644167o50985L312141k17702n858410m815697R08305
44387i917012J590907l625059m772969K169280Q029312M595547l951274r122466
$$ y = [-1429403, -1905818, 3509031, 12636904, 20039246, 23466852, 25000884, 27410191, 30288645, 29299421, 20177954, 4840069, -8111312, -11568899, -7539500, -3734329, -3596632, -3453466, 571434, 7041525, 11975876, 13635502, 12272000, 7656578, -136920, -8513480, -13783323, -15178446, -15498303, -16859286, -17350658, -13782260, -7219700, -3199035, -5288922, -10545293, -13367803, -12065689, -8788848, -4623881, 887110, 5589799, 5102578, -810204, -6061735, -4807681, 2363582, 10223300, 13968923, 11429721, 4049503, -2594664, -3245649, 66492, -151210, -6009620, -10825317, -9917012, -8326105, -11951164, -16724133, -14554853, -6525541, -1929994, -5881268, -15003734]
44379a5003734q543490l030105P000639J5809820J3299914O3543q366538k280849
44371a050800O834909L981871n302242m483379O166320R718871L7259q666806
44363G236003l848142Q336089J4144316R155577j977894j3161586j8320372j3463769
44355a1899778l030041K663570N41489k071775q44303j276355o534854q767495
44347c1219542j317463Q914796J1543505Q251937P087564O939037Q57664q140016
44339B917482q852532j17695O218671L841156Q32228M079331O504467n01301j0407342
44330D514465r535145K055927R984074O162353j195524j884094J535867M38114
44322A2076037m715054n402922M24457M191931l13877o956498n626162L270126
$$ y = [-15003734, -23547224, -26577329, -19576690, -3766870, 9533044, 9596587, 1230049, -1050800, 5784109, 9765980, 4463738, -19641, 6146679, 15865550, 15902809, 7236003, 3387861, 11723950, 25868266, 35023843, 33045949, 19884363, 1563991, -11899778, -14929819, -12266249, -11724760, -13796535, -14640838, -15917193, -22452047, -31219542, -32537005, -23622209, -12078704, -3826767, 3260797, 10199834, 11057498, 2917482, -5935050, -6052745, 165926, 4007082, 4839310, 8918641, 15423108, 14921807, 4514465, -5020680, -2964753, 7019321, 13181674, 11986150, 10102056, 11637923, 12076037, 7360983, 1958061, 2382518, 6574449, 6260572, -695926, -6322088, -3051962]
44314c051962Q848822L643705p464357j3265982q023566L862779J2723224J2118234
44306I390897M050024l527943n019261k246062j20932L59688J301530K009001
44298F196942m42404m558066m612361K92594L312717j29305m747553l225594K534013
44289e379017M698355J545171j225762p86420j376364o330611j1848783j1839452
44281c2542883n203089M096592J1051596J2009213O670390k18465k565042l21578
44273g023266O06621j987563k176414M416382J1234650Q334550k618726q850364
44265A935870l051973P476600J1232838O365809l59103m275428o469138q041758
44257D813717o749187j283287M664049N663652J120018l544029l018175J445471
$$ y = [-3051962, 5796860, 9440565, 1976208, -11289774, -19313340, -15450561, -2727337, 9390897, 13440921, 9912978, 4893717, 2647655, 2526723, 2886411, 4187941, 6196942, 5754538, 1196472, -3415889, -3123295, 189422, 60117, -4687436, -7913030, -5379017, -680662, 864509, -361253, -1147673, -2524037, -8854648, -20703431, -32542883, -37745972, -33649380, -22597784, -10588571, -3918181, -4136646, -6701688, -7023266, -6416645, -8404208, -10580622, -6164240, 5070410, 13404960, 10786234, 1935870, -1116103, 6360497, 17593335, 23959144, 23600041, 19324613, 12855475, 4813717, -1935470, -3218757, 1445292, 7108944, 8228962, 4684933, 1666758, 3112229]
44249C112229L318448p55150n678290l912069L950955Q972517N580984j245115
44241A3344509l986423l249432m476876p156386n567152k3229J649739l349902
44233a2815152p222772l649508K082919K306999k8055K720101Q017371N848711
44225b739386m146343r984478m772626L564769N213032K169960J847391L996797
44217d850884K841725j750881l985254j657209J236290J151558j346663m264144
44209a2625462n785090l920757J101980N262149N612933M507391M347219J716874
44201B17237o219732j2697433q358191L554079R475850M453086j704314o21117
44193a1900535K668884o5153o835987r844709o961035j504615M180595P989454
$$ y = [3112229, 6430677, 5675527, -2763, -3914832, 36123, 9008640, 14589624, 13344509, 9358086, 6108654, 1631778, -5524608, -11091760, -11114989, -9465250, -12815152, -20037924, -23687432, -21604513, -19297514, -19325569, -16605468, -8588097, -2739386, -6885729, -16870207, -21642833, -18078064, -12865032, -10695072, -8847681, -4850884, -2009159, -3760040, -7745294, -9402503, -8166213, -7014655, -8361318, -12625462, -18410552, -22331309, -21229329, -15967180, -10354247, -5846856, -1499637, 217237, -6002495, -18699928, -27058119, -23504040, -14028190, -9575104, -11279418, -11900535, -9231651, -9296804, -16132791, -25977500, -32938535, -34443150, -30262555, -22273101]
44185b2273101N960564j669534o686321k723882N027470P536671N218719M653584
44177d955830N503064J327184p373624j1431653o164777K051755M845938J194835
44169a5003108m041053n604312j012142O874270J0667378O698204P62234j73344
44161h31873J143776k079246p259843n820861J212142L684844m80847j775315
44153a2207223L937180Q216246N139452Q47359J050010J178127k583212m132424
44145A445515N25377K883195m416813j2537101q355313N118771J3411178J0891560
44137H966369L970138j905167o039564o395889j805355J820414j543280p177352
44129a0109686o135415N88446N267185O823120Q790145Q022359m05765r910067
$$ y = [-22273101, -16312537, -17982071, -24668392, -27392274, -22364804, -14828133, -9609414, -4955830, 547234, 1874418, -5499206, -16930859, -23095636, -21043881, -16197943, -15003108, -19044161, -24648473, -25660615, -18786345, -8118967, -1420763, -658529, -831873, 311903, -1767343, -9027186, -14848047, -13635905, -9951061, -10431908, -12207223, -8270043, -53797, 5085655, 5933014, 6983024, 8161151, 5577939, 1445515, 1970892, 4854087, 437274, -12099827, -20455140, -15336369, -1925191, 8966369, 12936507, 11031340, 4991776, -1404113, -3209468, -1389054, -2932334, -10109686, -16245101, -15656655, -10389470, -3566350, 5223795, 13246154, 12840389, 2930322]
44121B930322r184224o64169L283159J279777K996697Q494905O519754l809636
44113A1846585q770937k774769K937167P66884k226361j378673l762995j0747295
44105a4110394r895660L522495J4604744J1989620N566758N885207M076227q672338
44097A2966659j8832526j1021290L344173L959111k902459L895929J9912181J8769634
44089C0091412l202681j7802330p884504Q855636J0850026K726630q85509j069974
44081B1678706n975634j1442418q910785k973374m105300j0207983j0318647k647453
44073c4902888M052432M666240K425585J124085J561716M195251P870131P824135
44065a183313J600748n352587o289038k779830j365256l093636l135766P31073
$$ y = [2930322, -6253902, -6918071, -3634912, -2355135, 641562, 9136467, 15656221, 11846585, 3075648, 300879, 3238046, 4004930, 1778569, 399896, -3363099, -14110394, -24006054, -20483559, -5878815, 6110805, 11677563, 17562770, 21638997, 12966659, -5865867, -16887157, -13542984, -9583873, -12486332, -8590403, 11321778, 30091412, 26888731, 9086401, 1201897, 10057533, 20907559, 23634189, 22748680, 21678706, 15703072, 4260654, -4650131, -7623505, -11728805, -21936788, -32255435, -34902888, -30850456, -26184216, -23758631, -22634546, -21072830, -16877579, -9007448, -1183313, 417435, -4935152, -11224190, -14004020, -15369276, -18462912, -21598678, -20867605]
44057b0867605N618806Q761706R763363Q063658L050567l189892o980196p053515
44049b833108m985481k303093O03340L430701N523449N975949M117370J457036
44041A0986163J849376O021059P478212P3210j0700160j2044229j350905R125295
44033A1438021Q797106J598856k904759l117780l018418l009971j373332Q7372
44025H497095m79470k58439K334236K111148m493939j0674983q393799j884254
44017a3242405j302962o088994o480457j54619N079177N601879O357145Q617323
44009a613913O153896j607391m761190J375987O346388k1319j0664363j1334311
44001a6126216k212533L217307q87440n664216l437746Q83941J9411k839777L62653
$$ y = [-20867605, -15248799, -6487093, 3276270, 11339928, 14390495, 11200603, 4220407, -2833108, -7818589, -10121682, -9518342, -6087641, -564192, 5411757, 9529127, 10986163, 12835539, 18856598, 26334810, 26408020, 15707860, 3663631, 2312726, 11438021, 20235127, 21833983, 18929224, 15811444, 12793026, 9783055, 8409723, 8497095, 8017625, 7759186, 10093422, 12204570, 7710631, -2964352, -11358151, -13242405, -14545367, -20634361, -27114818, -27269437, -22190260, -16588381, -10231236, -1613913, 4539983, 2932592, -1828598, -452611, 5893777, 5872458, -4791905, -16126216, -18338749, -15121442, -16008882, -21673098, -25110844, -24226903, -24207492, -27047269, -26684616]
43992b6684616Q971044J4307675J2238550P083779K797334j937186p455631r292142
43984B8807n412383j669386l939433q774108q598882l345151N82940J206521K579376
43975b7341699N832383P320762O824362Q698823J2481310J1553169M957540R87109
43967C1313759L327480L348762n466883j4215521j0818514O97890N837184J115043
43959A5139200l378506k258898k056186o975545r543132k276890R294283J2887008
43951A0831334M876181o346910j0597457n674067K126828N168617K447549N5743
43943B887818K510000O092223M584316r14007m012671l671861n262187j0035233
43935g821602j1298236m444914N467741J0461261R260702O014178L386599J385693
$$ y = [-26684616, -17713572, -3405897, 8832653, 15916432, 18713766, 16776580, 9320949, 28807, -5383576, -7052962, -10992395, -19766503, -28365385, -31710536, -31127596, -29921075, -27341699, -21509316, -14188554, -7364192, 1334631, 13815941, 25369110, 30326650, 31313759, 34641239, 37990001, 32523118, 18307597, 7489083, 8186973, 14024157, 15139200, 11760694, 9501796, 7445610, 470065, -9073067, -11349957, -2055674, 10831334, 15707515, 9360605, -1236852, -6910919, -4784091, 384526, 2832075, 2887818, 5397818, 11490041, 16074357, 15160350, 11147679, 7475818, 2213631, -7821602, -19119838, -23564752, -18097011, -7635750, 1624952, 7639130, 11025729, 12411422]
43927A2411422J83405k09646j388256m315362o971016o719093l616433M01908
43919a0223071L710674M900130L150701M36312K08185J800740J28889n741825
43911a629265q261971j352946Q647337R812226J605397l801613N01260N845670
43903A1366095J829412o850248p345425J140679O065302J433203l156045J221522
43895E704495Q115823O331448k558416q240028p878336o458509m582038R30011
43887h635550O005333L196681l127505p06091R249994J1121262K44925q244613
43879I104436m189539J718343j293847m868325Q85755O396510o98030j0674064
43871c618761o569487N337776N124079o037430p509810N084821J2658129N227909
$$ y = [12411422, 12594827, 12385181, 10996925, 6681563, -289453, -7008546, -10624979, -10223071, -6512397, -1612267, 1538434, 1974746, 2182931, 3983671, 4112560, -1629265, -9891236, -11244182, -2596845, 7215381, 8820778, 5019165, 5520425, 11366095, 13195507, 6345259, -1000166, 140513, 6205815, 7639018, 4482973, 5704495, 13820318, 20151766, 17593350, 9353322, 1474986, -4983523, -9565561, -8635550, -2630217, 566464, -2561041, -3267132, 5982862, 17104124, 17349049, 9104436, 4914897, 6633240, 5339393, 471068, 1356823, 7753333, 7055303, -3618761, -10188248, -4850472, 273607, -5763823, -13273633, -8188812, 4469317, 9697226]
43863I697226l586795k281349J247101j861453o075089n738404o426688j0523352
43855b5548803q676877K214298R076367L804654j693822L983887J1552298P737668
43847B449670j607184l139041O47944j317076o956714n684750J454168M362348
43839i790635K047260J496792K470799n09444m677776l315094j00500l264342
43831a5642940q292170k897376J1943081K1415274J7085217M156859r813553j9729229
43823a774837j9156945o834725N148505M858216q12104K460206J0594197P464992
43815A947505n066739p927900K022700N565745m738119r883359K926140J6374048
43807A220021J0066385p000054j1902076k649505L898200R19861k266481K50440
$$ y = [9697226, 6110431, 3829082, 5076183, 3214730, -2860359, -8598763, -15025451, -25548803, -34225680, -32011382, -22935015, -19130361, -20824183, -16840296, -5287998, 2449670, 842486, -2296555, -1648611, -2965687, -9922401, -15607151, -14152983, -9790635, -7743375, -6246583, -3775784, -4285228, -8963004, -12278098, -12378598, -15642940, -23935110, -26832486, -14889405, 6525869, 23611086, 27767945, 17954392, -1774837, -20931782, -27766507, -22618002, -17759786, -18571890, -16111684, -5517487, 1947505, -3119234, -11047134, -9024434, -3458689, -8196808, -18080167, -15154027, 1220021, 11286406, 4286352, -7615724, -10265229, -6367029, -5447168, -7713649, -7463209]
43799g463209L331576K826604J229433K38609j648110l629189l370568k840245
43791a1325099n618874r280670p594669M52151R566873J4518289J3034455N649409
43783I401865k515478m200611M49107K093042m027742r026119l224163Q100684
43775b949415J1911876N734288k009098o455765r357348r513190k724057P484510
43767g878199J0384338K682220o131311o730221j189037K317960L28571l958063
43759a0173742n544591j813351N368403J0440598R258558L307089l047802p402344
43751C92818q643305n129903J688996N556227L309551P77319L656749O676784
43743H285236J418292q155804r820856k174659L097093R6036k964217Q83986N794962
$$ y = [-7463209, -4131633, -1305029, -75596, 163013, -1485097, -5114286, -8484854, -11325099, -16943973, -26224643, -33819312, -33367161, -23800288, -9281999, 3752456, 9401865, 6886387, 2685776, 3134883, 5227925, 1200183, -7825936, -11050099, -2949415, 8962461, 14696749, 12687651, 6231886, -3125462, -12638652, -15362709, -7878199, 2506139, 5188359, -942952, -7673173, -8862210, -6544250, -6215679, -10173742, -15718333, -17531684, -12163281, -1722683, 7535875, 10842964, 7795162, 392818, -8250487, -13380390, -11691394, -6135167, -2825616, -2048297, 1608452, 8285236, 9703528, 1547724, -8273132, -10447791, -7350698, -7254662, -10218879, -9334893, -3539931]
43734c539931M502885J063535K597080O039714L938874j547580j731286L586946
43726A4910237M994887j734826q885609p951732q51793M149484L419576L80277
43718H430501j071015j255381k177645l145428j558222K229364L844796O12969
43710E909939m077361n383540l967635l576808l057123K347952J0912431J3548228
43702A2656083O729118j001029j296585J611341j214644p981663q670219j242186
43694d09784N057633L754870r77030l399555m375461n717906m171258K239823
43686g998668P570915N292456j322208l646260k56348K419043P53923k351614
43678D61239m202217n118740l884052J447461O290613K095549r490714j3975712
$$ y = [-3539931, 962954, 2026489, 4623569, 10663283, 14602157, 13054577, 11323291, 14910237, 19905124, 18170298, 9284689, 1332957, 481164, 4630648, 8050224, 8430501, 7359486, 6104105, 3926460, 781032, -777190, 1452174, 5296970, 5909939, 1832578, -3550962, -7518597, -11095405, -14152528, -11804576, -892145, 12656083, 19385201, 18384172, 17087587, 18698928, 17484284, 9502621, 832402, -409784, 4647849, 8402719, 7425689, 4026134, -349327, -6067233, -10238491, -7998668, -427753, 4864703, 3542495, -103765, -360113, 2058930, 2812853, 461239, -3740978, -8859718, -12743770, -11296309, -5005696, -2910147, -12400861, -26376573]
43670b6376573k874788J2194028J4033642L385262l724375m7488M475987N83773
43662A649468o287304o243038q6695M091081L696895K488313J988127L16291j649362
43653c6224m73240L040294L523091j097319o367129p523783m850544j269595J636118
43644a3418331L282112K994813J464910Q78719J790970K160946J045051L97030
43636E96220J050240K03010l530519n604591j545765M194046K702549n100899
43628g035709p134001J969578R756772K432277j2619263j4412875J121991J3260480
43620a2660750N919379q626494q191961O544293J4404855N436543p306888r886062
43612a4367085n107258j440508J872155Q455060J3243159Q713647k535304j0892255
$$ y = [-26376573, -29251361, -17057333, -3023691, 361571, -3362804, -3410292, 1065695, 1649468, -4637836, -10880874, -10967569, -6876488, -3179593, -691280, 1296847, 1613138, -36224, -509464, 2530830, 6053921, 4956602, -1410527, -8934310, -13784854, -15054449, -13418331, -10136219, -7141406, -5676496, -4797777, -3006807, -845861, 199190, 596220, 1646460, 1849470, -1681049, -7285640, -8831405, -4637359, -1934810, -7035709, -14169710, -12200132, -2443360, -11083, -12630346, -27043221, -25921230, -12660750, -6741371, -15367865, -23559826, -17015533, -2610678, 2825865, -4481023, -14367085, -19474343, -20914851, -19042696, -10587636, 2655523, 11369170, 8833866, -2058389]
43604b058389j1817446p379521m7343P329077R499028M951880N95023K398315
43596C470624N333443J601915n035941m173533M001942Q295954L797947j957676
43588A5334675k564323j717963m224949p031171m806742J850822Q362782J1154640
43580A6357771P773024j898325j1452283j1590096j943381O804518O664281J919142
43572A2634651K79036J063373j181541o198130q409813n122191J493469Q183152
43564B742006J1346602P082954l631031j2146259j0632758k060431L835746L310495
43556a52676J420973K564747M500384L261426q96406m738465o026488m411220
43548d477725q78341K004313J356263k493925m876753j361797O195970J0029325
$$ y = [-2058389, -13875835, -21255356, -21302699, -13973622, -4474594, 477286, 1072309, 3470624, 8804067, 10405982, 5370041, 1196508, 5198450, 13494404, 17292351, 15334675, 12770352, 11052389, 6827440, -203731, -5010473, -3159651, 5203131, 16357771, 24130795, 22232470, 10780187, -809909, -2753290, 4051228, 10715509, 12634651, 12913687, 13977060, 12795519, 6597389, -1812424, -6934615, -5441146, 2742006, 14088608, 21171562, 17540531, 5394272, -5238486, -7298917, -3463171, -152676, 1268297, 3833044, 8333428, 11594854, 10698448, 5959983, -66505, -4477725, -5356066, -3351753, -1995490, -4489415, -9366168, -10727965, -4531995, 5497330]
43540E497330N064273l233919l431099O948424J4971024O784200j2964345k4138380
43532d502492j5508536J494854Q209625J678645n006332j922031O199359Q362232
43524i94676J520774o293861n384797M393509J2587706R824835n93000p010976
43516H049514n105273k404439m823182p028166k541488L770057K767130l741814
43508a1057661n465963J85984M876631K984271j374904l326316m110617n038964
43500b2327539k673384M401798J0136505Q484077K217163j305373q1015K093601
43492I45833K697808K568134K037032R4580k290229k005640J867632O102689O982991
43483A9000830M502804J829393J175185J260025n92447m348790o756773n483007
$$ y = [5497330, 10561603, 7327684, 3896585, 10845009, 25816033, 32600233, 19635888, -4502492, -20011028, -18516174, -10306549, -8627904, -13634236, -15556267, -9356908, -994676, 526098, -5767763, -11152560, -6759051, 5828655, 15653490, 15060490, 8049514, 2944241, 539802, -4283380, -11311546, -13853034, -10082977, -7315847, -11057661, -16523624, -16337640, -11461009, -8476738, -9851642, -13177958, -17288575, -22327539, -25000923, -20599125, -10462620, -1978543, 238620, -1066753, -1147768, 945833, 3643641, 6211775, 8248807, 8343387, 6053158, 4047518, 5915150, 12017839, 19000830, 23503634, 25333027, 26508212, 27768237, 27175790, 22827000, 16070227, 10587220]
43475A0587220k002045Q88383K355936K366146j80368m734039o751298k665001
43467a35066M059601O741881M510006K202801J992868J522869N68527K255189
43459B3718676N915190N986348Q93862l763902m039157k550049j074649L422917
43451B8509236R977067R727744r01153j0788749q196411J523403L799755l567380
43443C0083512r168333o492636q60368K495674M864093O532665M475590N50504
43435C2480701Q83926L807821L52915q695407r547660K954800J3369374O920192
43427D2526662p671460j0808235m89321P355552L957699k298491k050812K139131
43419C2660725K967578j162979o976590j0817976r673875l451051K480155K619724
$$ y = [10587220, 8585175, 9473558, 11829494, 14195640, 14015272, 9281233, 2529935, -135066, 3924535, 10666416, 15176422, 17379223, 19372091, 20894960, 21463487, 23718676, 29633866, 35620214, 36514076, 32750174, 28711017, 26160968, 25086319, 28509236, 38486303, 48214047, 47312894, 36524145, 28327734, 29851137, 33650892, 30083512, 20915179, 14422543, 13562175, 16057849, 20921942, 27454607, 31930197, 32480701, 33364627, 37172448, 37525363, 28829956, 19282296, 22237096, 35606470, 42526662, 34855202, 24046967, 23557646, 30913198, 34870897, 32572406, 30521594, 32660725, 35628303, 34465324, 27488734, 16670758, 6996883, 3545832, 6025987, 8645711]
43411H645711p19003j046460J554912J164873k902485m814465k636234n44630
43403a297781N41753M192120Q326633N443679l217118n951500J073010O083381
43395A5194177M25089p090138n305511Q92310O96379l192784p84509N928795O652755
43386A3416563K099752K169360N858914J306431j1536671j6481036o045991N505936
43378c706742M087391l056859j076107P789663Q526122k417508j2019120r956026
43370a1829186r34046N210176O493381O788856O625256K322876o613841j3668605
43362e605133j1211894K97524J1149630J2152559M459974k886514m395316l190362
43354G70468m136819o487086o154479k302142J707456K751169R14100j498837
$$ y = [8645711, 7926708, 6880248, 8435160, 9600033, 6697548, 1883083, -753151, -1297781, -756028, 3436092, 11762725, 17206404, 13989286, 8037786, 9110796, 15194177, 15619266, 8529128, 3223617, 4115927, 4812306, 1619522, 835013, 6763808, 13416563, 15516315, 17685675, 23544589, 24851020, 13314349, -3166687, -9212678, -3706742, 380649, -2676210, -3752317, 4037346, 12563468, 10145960, -1873160, -11829186, -12763232, -7553056, -1059675, 5729181, 12354437, 14677313, 8063472, -5605133, -16817027, -16519503, -5369873, 6782686, 11242660, 8356146, 3960830, 770468, -3366351, -9853437, -16007916, -18310058, -16602602, -13851433, -12937333, -14436170]
43346a4436170k483393k010064j437308r35719J468132O796828J2307235J4023503
43338A3293044J1053486N200596j866501q017817r599092n419057r1530J371747
43330E924876N73067K126560N329387O113222N308119O728722Q097609L531241
43322D3732803m309435m954349M144824J2209864R427244j797479j3377287k0322985
43314B4753200j9207446q164168N755572R159516n15683r463700o623128J283626
43306c022211K869045L00332K277991O733454M910061j555434j964481N947290
43298A6496047J2234651R323261M57582p341315j0510470q654379m102340j631807
43290F271230k820344k596673K657491P392852M974459o65137q77314L554617
$$ y = [-14436170, -16919563, -18929627, -20366935, -21302654, -19834522, -13037694, -730459, 13293044, 24346530, 29547126, 27680625, 19662808, 10063716, 4644659, 4553129, 5924876, 6497943, 8624503, 13953890, 20067112, 25375231, 32103953, 40201562, 43732803, 39423368, 34469019, 38613843, 50823707, 60250951, 58453472, 45076185, 24753200, 5545754, -2618414, 3137158, 12296674, 11780991, 2317291, -4305837, -3022211, -153166, 147166, 2425157, 9158611, 14068672, 12513238, 10548757, 16496047, 28730698, 38053959, 38511541, 31170226, 20659756, 12005377, 7903037, 6271230, 3450886, 854213, 3511704, 10904556, 15879015, 15213878, 14336564, 17891181]
43282A7891181M473745K17471l169824l040391k119908q86592J709757J983823
43274A7059262k808210n034674L865741J6205883J5562339J894062p103203k509227
43266C7131973M710000M479948K730171O928610J1475308Q954831L999734L693442
43258H4104017L767206k872108j1107240j0067792l08226P020515N677624p10279
43250G5503717p157176j1768393j2628548q211208j420795K275107J128515j826947
43242C5894272l054839j298042K090801L539942L53477n244021q256580p625087
43234A6399923o493951n842140l859338j832633l037981m761058k41719R183555
43226d85342J3238541P380326r59662m508061m753927m297090j267158L355572
$$ y = [17891181, 22364926, 22582397, 19412573, 16372182, 14252274, 13365682, 15075439, 17059262, 14251052, 9216378, 13082119, 29288002, 44850341, 46744403, 39641200, 37131973, 41841973, 46321921, 49052092, 55980702, 67456010, 76410841, 80410575, 84104017, 87871223, 84999115, 73891875, 63824083, 63515857, 70536372, 76213996, 75503717, 68346541, 56578148, 43949600, 35738392, 34317597, 36592704, 37721219, 35894272, 32839433, 31541391, 33632192, 37172134, 37525611, 32281590, 24025010, 16399923, 9905972, 4063832, 204494, -1628139, -4666120, -9427178, -9668897, -485342, 12753199, 20133525, 19173863, 14665802, 9911875, 5614785, 4347627, 7703199]
43218G703199L737563K86965J103428O107411L473055r324768j5915700n229722
43210h058569Q705588P224887m577049q439722k662945n45015m594149l824650
43202a6771624M138171Q146702K950596l388902m611214l979057l650474J10944
43194a7054858P323541J1528935R873329N964262J425802m880699q892511m357984
43186I29817N239523R396694O016333K429452J057763k676582p585205o401688
43178H406107k27663J343181k708057k567749M222316P980144M862304L457138
43170B4767721P340557P451153l00643n967891l496292j983832q094340j2434243
43162G282190o202400K629428L720244J838614M850093O714078l70004p634349
$$ y = [7703199, 11440762, 11727727, 12831155, 18938566, 22411621, 13086853, -2828847, -8058569, 647019, 7871906, 3294857, -5144865, -7807810, -8352825, -12946974, -16771624, -12633453, -4486751, -1536155, -4925057, -9536271, -13515328, -17165802, -17054858, -9731317, 1797618, 11670947, 17635209, 19061011, 14180312, 5287801, 929817, 6169340, 15566034, 21582367, 24011819, 25069582, 22393000, 14807795, 8406107, 8178444, 9521625, 6813568, 4245819, 8468135, 16448279, 21310583, 24767721, 32108278, 39559431, 39258788, 33290897, 29794605, 27810773, 19716433, 7282190, 1079790, 3709218, 7429462, 9268076, 14118169, 20832247, 20462243, 12827894]
43154A2827894k547931Q238334Q453560j152418n847925k779869k861968p760011
43146F569666o291296L347890P822252J198212m616822l53365N348835J774771
43138A4800143n518886m739993K500819M688573q20477m582549l47757N916720
43130A1896593N172378k023158o270605j732894N801826O138885j301922o210810
43122A1470293k173372L961599L268023r65403M20455N788746M480174m874057
43114B1376458j0295341m328845M932560O594060J750104j780484k354125l435764
43106A2458623m163785l11781O421690Q167883J521450p080425r155588m141533
43098C716534J090929J241459j620129j894770J880177N719688O181573M170468
$$ y = [12827894, 10279963, 18518297, 26971857, 25819439, 19971514, 17191645, 14329677, 6569666, 278370, 3626260, 11448512, 12646724, 8029902, 7676537, 13025372, 14800143, 9281257, 4541264, 7042083, 11730656, 10910179, 6327630, 5979873, 11896593, 17068971, 15045813, 8775208, 7042314, 12844140, 18983025, 17681103, 11470293, 9296921, 13258520, 16526543, 15561140, 15981595, 21770341, 26250515, 21376458, 11081117, 6752272, 11684832, 18278892, 20028996, 18248512, 15894387, 12458623, 8294838, 7983057, 14404747, 22572630, 24094080, 17013655, 7858067, 3716534, 4807463, 6048922, 4428793, 2534023, 4414200, 10133888, 16315461, 20485929]
43090B0485929J442498k614801p329803p645320j99506R472457J2041619O549119
43082C2202192J793446M750587J2481990J6695062J2271529N60779j1844990j7208376
43074E1702219j3439633o768831l834642k706065K419900R311079R098253L63493
43066D6145773p301037o863748k522778o60238m98157M56852n59504n508309q684082
43057A4004772m426550K664322L772816j019121m170905k934489j345280j131464
43049E414101K69650K252538N04364m175838m771800J010417O037264M284117
43041A0824813k66728n94818K601453L445881Q77353o83369N18187J176991n16492
43032A7383271j321264J557273N004975L441590l568408j0115883j0696391o110300
$$ y = [20485929, 21928427, 19313626, 11983823, 4338503, 4138997, 13611454, 25653073, 32202192, 33995638, 38746225, 51228215, 67923277, 80194806, 80755585, 68910595, 51702219, 38262586, 31493755, 27659113, 24953048, 27372948, 36684027, 45782280, 46145773, 38844736, 31980988, 29458210, 28797972, 28299815, 28756667, 28197163, 22688854, 14004772, 9578222, 12242544, 16015360, 14996239, 10825334, 7890845, 6545565, 5414101, 5683751, 7936289, 8440653, 4264815, -506985, 503432, 6540696, 10824813, 10558085, 9963267, 12564720, 16010601, 16887954, 16204585, 16722772, 17899763, 17383271, 16062007, 17619280, 22624255, 26065845, 22497437, 12381554, 1685163, -4425137]
43024d425137j206800K099302O622113J3401680J6477492Q993455n433452j3344087
43016B3184566p264774L509005M221585n567918j1755684o083842K494232K111110
43008D848280m187961m118982M515021J1129786Q951052L741875K883315N040501
43000C2802887N826050N683344N452952J162567q335073j4180453q079496L418063
42992B3750841O206374j169928o202177k237782K437372n78926o856617p731826
42984G617331l205968J469054N152436Q380932P195254j250831j0462375j1325762
42976C570071n205417j539604l435529m691259j428758K486716L832378N461871
42968i49531R518962J2063578R263486L986768J616693L042790N744907Q208522
$$ y = [-4425137, -5631937, -3532635, 3089478, 16491158, 32968650, 41962105, 36528653, 23184566, 15919792, 19428797, 23650382, 18082464, 6326780, 242938, 2737170, 4848280, 660319, -3458663, 1056358, 12186144, 21137196, 24879071, 27762386, 32802887, 38628937, 44312281, 49765233, 50927800, 42592727, 28412274, 20332778, 23750841, 29957215, 28787287, 22585110, 20347328, 22784700, 22205774, 15349157, 7617331, 4411363, 5880417, 11032853, 19413785, 26609039, 25358208, 14895833, 3570071, -1635346, -3174950, -6610479, -11301738, -12730496, -10243780, -6411402, -949531, 8569431, 20633009, 29896495, 33883263, 35499956, 38542746, 44287653, 52496175]
42960E2496175R226186O351453j94990m848333l200234M87910k146569j1585113
42952D6586485j8248279j3946836j787409P761940Q539973L842767O06146J134060
42944C4488847K242436J358184j6100m43914k340030o946745q138924J089984
42936B1293738J5452170J9669742Q245364n337307o141770K845733Q306187P079658
42928G1413515O067541N404217j894685j2111000j0182499N741962J4881669J317326
42920H0638046k1162427k6953759j3200359L30879J282751l440706n392248o116612
42912E985565p140373m459197Q31711O33563m472200k083338J0354851J5741163
42904A5391745K631019j3026132r378621P722632J3752366L338401m206260J673761
$$ y = [52496175, 61722361, 68073814, 67878824, 63030491, 59830257, 60318167, 58171598, 46586485, 28338206, 14391370, 12603961, 20365901, 28905874, 32748641, 33354787, 34488847, 36731283, 38089467, 38073367, 37629453, 35289423, 28342678, 20203754, 21293738, 36745908, 56415650, 64661014, 59323707, 53181937, 56027670, 64333857, 71413515, 77481056, 82885273, 80990588, 68879588, 58697089, 64439051, 79320720, 80638046, 59475619, 32521860, 19321501, 19652380, 20935131, 17494425, 12102177, 5985565, -1154808, -5614005, -4782294, -4148731, -8620931, -10704269, -349418, 15391745, 18022764, 4996632, -4381989, 3340643, 17093009, 20431410, 16225150, 17898911]
42896A7898911P475844J735665m834380Q34323J0698506R438615O97233K71690
42888D4216407Q683711J0049340j632143j2709013j0876366j705079K667054L96570
42880C9090481k448820k998370k099623M63647L510153J794371o412139j2706128
42872A8193572p978835L561305Q640428L085436l173642j383589M217532M665600
42864B9827807k94078l849536l382036k623736l459947k488978K453356P293474
42856B3476326O400775q4069o146392o204647k37363O473246P900314K574981
42848C4153171m944960q571565o573195j827897K955064P321341J0119906Q488102
42840D1119967K394821k814380k272958J578557K245674j252701k897918J003861
$$ y = [17898911, 25374755, 27110420, 22276040, 23110363, 33808869, 43247484, 43944717, 44216407, 52900118, 62949458, 61317315, 48608302, 37731936, 36026857, 38693911, 39090481, 36641661, 33643291, 31543668, 32007315, 35517468, 37311839, 30899700, 18193572, 10214737, 13776042, 22416470, 25501906, 22328264, 20944675, 25162207, 29827807, 29533729, 25684193, 22302157, 19678421, 16218474, 13729496, 16182852, 23476326, 29877101, 29793032, 23646640, 17441993, 17204630, 23677876, 31578190, 34153171, 29208211, 20636646, 14063451, 12235554, 15190618, 22511959, 32631865, 41119967, 43514788, 40700408, 38427450, 40006007, 42251681, 40998980, 38101062, 39104923]
42832C9104923N880804N929514L591897O302599J4617926K0263783J8637696J7084639
42824A31413781K4126294L3565321K8488353L121819k7201487m2882770m0774001
42817A09857310l1612674k2500103j2244784k152387Q58502m435524q958003o079617
42809B2732720j436376k903107p079460m902832K892267O009109J07123o937630
42801H481814o584620k99878M928127O352069O081876N093694J760469l764119
42793B2049432p445627n654999k89185K841231J351183o26779Q85040K801568
42785A5911864k5512m502277j919372P711904J2975386P583137J213964O071042
42777D5020136J9052940K6373681K1172356P283463r693706k3917000k5843130
$$ y = [39104923, 44985727, 50915241, 54507138, 60809737, 75427663, 95691446, 114329142, 131413781, 155540075, 189105396, 217593749, 220715568, 193514081, 150631311, 109857310, 78244636, 55744533, 43499749, 41347362, 42205864, 37770340, 28812337, 22732720, 21296344, 18393237, 11313777, 6410945, 9303212, 15312321, 15419444, 8481814, 1897194, 1597316, 6525443, 12877512, 18959388, 24053082, 25813551, 22049432, 14603805, 8948806, 8659621, 11500852, 12852035, 12225256, 13110296, 15911864, 15886352, 11384075, 9464703, 17176607, 30151993, 37735130, 38949094, 45020136, 64073076, 90446757, 111619113, 118902576, 109208870, 85291870, 59448740]
42770E9448740j1151819P275979J0235498k779231j2571181p527758J984129K483113
42762D7397470l194401n179106m101242o936487j2348262j2544823o328115N9785
42754c175181L043370L970841L025379j095929o188957p661546m011747L093090
42746i000680J1425224J6447384J1718488k205089j3429565j1275252l18268N990208
42738I352450L099584j723196k240876J99706K474394L331485R38274n195252
42730A0236569r585023o179912J238484K798567k265120l772404L100233R255263
42722D826657M991712n585940j0315064m500893N447688J0957077Q704481J056946
42714A5582664o466223q815782n284960L09687L797552L734019R40576k161758
$$ y = [59448740, 48296921, 55572900, 65808398, 63029167, 50457986, 42930228, 44914357, 47397470, 44203069, 39023963, 34922721, 27986234, 15637972, 3093149, -3234966, -3175181, -131811, 3839030, 6864409, 5768480, -420477, -8082023, -12093770, -9000680, 2424544, 18871928, 30590416, 28385327, 14955762, 3680510, 3362242, 9352450, 12452034, 10728838, 8487962, 8687668, 11162062, 14493547, 15431821, 10236569, 651546, -5528366, -4289882, -1491315, -3756435, -7528839, -4428606, 4826657, 9818369, 4232429, -6082635, -10583528, -5135840, 5821237, 14525718, 15582664, 9116441, 300659, -4984301, -4674614, -877062, 2856957, 3797533, 1635775]
42706A635775k240025J280914L725528P45418m283233m253567M00024J830499
42698a158667k286247m363306M40722N312783K416411l814786k784636O153339
42690h4387J2703810J0222212L216115j142215k005487k146998j654569Q10205
42682A9918686L134004J307786m113164p338593m944871r85380j298156m822933
42674H57379n311586j135301K642824L482675N595767J0632461J1438011L090206
42666C1292436n507729k104609R454130J2855622L074538o633801n586802p80850
42658C6062935l443131j1225339j4230412j1182551q245133o628935k759719J976491
42650a9675794K698227J133681L782427R920599J1679102P326422M218991N650936
$$ y = [1635775, -604250, 676664, 4402192, 5147610, 864377, -3389190, -2989166, -1158667, -3444914, -7808220, -7367498, -2054715, 361696, -3453090, -6237726, -84387, 12619423, 22841635, 26057750, 24915535, 22910048, 20763050, 19108481, 19918686, 23052690, 24360476, 20247312, 12908719, 7963848, 6978468, 5680312, 857379, -4454207, -5589508, -2946684, 535991, 6131758, 16764219, 28202230, 31292436, 25784707, 23680098, 33134228, 45989850, 49064388, 42430587, 36843785, 36062935, 32619804, 21394465, 7164053, -4018498, -12263631, -18892566, -21652285, -19675794, -16977567, -15843886, -12061459, -2140860, 9538242, 16864664, 21083655, 26734591]
42642B6734591M904461k378905q871971o171702J646445L707734j978764p044756
42634A0547133n782049j633032L91259Q87756K527431M207813L067358O2773n38911
42625A3737531L030715P551176Q480956M259920l081778r413062j0199480l631073
42617A0734905N936050J0030446M760538l827721o678893l128395o67660l161746
42609A3997524n478902k715651J329240O09309k752163k254226J042080l63034
42601C414177o544752p235603K589438J2690517J1001856J247155k839082J941066
42593A6264772M989390K26881m293086q36271M195012Q21388o790344n745719
42585H832023M374857Q911277l50722j2537565j3035531k862326N536489N950322
$$ y = [26734591, 31639052, 29260147, 20388176, 14216474, 15862919, 19570653, 17591889, 10547133, 4765084, 3132052, 3523311, 4411067, 6938498, 11146311, 14213669, 14276442, 13737531, 16768246, 24319422, 32800378, 37060298, 33978520, 24565458, 14365978, 10734905, 16670955, 26701401, 31461939, 27634218, 20955325, 17826930, 17159270, 13997524, 8518622, 5802971, 7132211, 7741520, 4989357, 2735131, 3777211, 3414177, -3130575, -10366178, -7776740, 4913777, 15915633, 17162788, 14323706, 16264772, 21254162, 21481043, 17187957, 16351686, 20546698, 21368086, 14577742, 8832023, 13206880, 22118157, 21767435, 9229870, -3805661, -6667987, -1131498, 4818824]
42577D818824K755871Q87377O42861J763390M516031N875983J598874o208231
42569A6650980r492027m490783L139583N697260K105166k833066m593323k332243
42561C851547J586702M024875M221162M246708N111339M660809J863738l18326
42553B9248554o03943l446195j0519276j2734814j299906J5485727J9299209O774522
42545D2203878n811801o485588k465235m227072q095895n658920M8064Q69281
42537A0376712j267261R59042N175194K655015n570164r091979m375320J244417
42529A05656K561185K452590L266623K604812J22175p52280k85676k626884o207084
42520A241117l743706M514930P557956n36595j0219229r272720P54331Q760499
$$ y = [4818824, 7574695, 8462072, 9104933, 10868323, 15384354, 21260337, 22859211, 16650980, 7158953, 2668170, 5807753, 11505013, 13610179, 10777113, 6183790, 3851547, 5438249, 9463124, 13684286, 17930994, 23042333, 27703142, 29566880, 29248554, 28644611, 25198416, 14679140, 1944326, 644420, 16130147, 35429356, 42203878, 36392077, 29906489, 27441254, 23214182, 15118287, 9459367, 9507431, 10376712, 9109451, 10068493, 15243687, 17898702, 12328538, 3236559, -1138761, 105656, 2666841, 5119431, 8386054, 10990866, 11113041, 10360761, 10075085, 7448201, 1241117, -2502589, 2012341, 9570297, 9033702, -1185527, -10458247, -9703916, -943417]
42512i43417R635980P363450N751438M259515K316261J104075M36371j343798
42504B8579875l621011l305659P64470N670263P316686M154105j886594p134858
42496C0537277r216190q825838p737359n509149n27641N553278P843315M420334
42488A6538027k00620q8408N286241J1018222J2172319Q015448K301960N3518
42480E5096707K360314M336645Q96733n587854p631070l630748j286339o791106
42472C7763282j5191170j6593466r284661j055293J772903J313053K983859P379268
42464I087775R725297O009285k085233q394721q142901k528380K826346L677660
42456A0175128N66514k791012k527078L269419J2157876J6958767J2154160K124579
$$ y = [-943417, 8692563, 16056013, 21807451, 26066966, 28383227, 29487302, 29923673, 28579875, 24958864, 21653205, 22417675, 28087938, 35404624, 39558729, 37672135, 30537277, 21321087, 12495249, 4757890, -751259, -1278900, 4274378, 12117693, 16538027, 16337407, 16248999, 21535240, 32553462, 44725781, 52741229, 55043189, 55096707, 57457021, 61793666, 62690399, 57102545, 49471475, 45840727, 44554388, 37763282, 22572112, 5978646, -3306015, -4361308, -2588405, -1275352, 1708507, 9087775, 18813072, 24822357, 22737124, 14342403, 6199502, 3671122, 6497468, 10175128, 10741642, 7950630, 5423552, 8692971, 20850847, 37809614, 49963774, 52088353]
42448E2088353k056519K837937O412393p91476j1766898j1194407K379418J3181907
42440E1090708R827681K34210j804883L060817L192954m196187q775780l986468
42432D8643052K646369J392789n311457p491800j934109N249149P754063M511716
42424E5459772k155726p974511p959100j833134L787788M499105O053190J4844455
42416F4721839K3709793J9324846L597698o277186k612000K379360k062956q119939
42408I4661455n158798K04455m318131j3843964j3213353k461219L119254k047726
42400E6941973o795859l956543r09887l412481m563008J106846N722368J345366
42392D5478775n090207k480085N965462P880684J581017j893842L722571J1272050
$$ y = [52088353, 50031834, 52869771, 59282164, 58490688, 46723790, 35529383, 37908801, 51090708, 60918389, 61152599, 59347716, 62408533, 65601487, 61405300, 52629520, 48643052, 51289421, 52682210, 47370753, 39878953, 37944844, 43193993, 50948056, 55459772, 53304046, 45329535, 37370435, 35537301, 39325089, 43824194, 49877384, 64721839, 88431632, 107756478, 111354176, 105076990, 102464990, 104844350, 102781394, 94661455, 89502657, 89707112, 85388981, 71545017, 58331664, 55870445, 58989699, 56941973, 50146114, 46189571, 45279684, 41867203, 37304195, 38411041, 44133409, 45478775, 40388568, 37908483, 43873945, 51754629, 53335646, 51441804, 55164375, 66436425]
42384F6436425J1414834M341424l388099p899195r466654q383705m417517k1298
42376D8616215K24103m345924p664856m092232K838927M411104o5409j517604
42368C8404324M076479P847457K287764m867756k164840O263965O909582q38742
42360E7918233m464345k34721J692470k544492k728424N422391Q783523k855365
42352F0989270j7876772j8140713m424029P048000P403388J577521l790279o499861
42344B6286525m730012K346559R878790J1026192N112928k934507q828293j0023351
42336B8134831m931148L377361P108173K977975k979270m451341k616809l13687
42328B6306085L359447O750913L702027m411736n529318M220065J0167408Q46601
$$ y = [66436425, 77851259, 82192683, 78804584, 70905389, 61438735, 53055030, 48637513, 48616215, 48840318, 44494394, 36829538, 32737306, 35576233, 39987337, 39921928, 38404324, 42480803, 50328260, 52616024, 47748268, 45583428, 51847393, 58756975, 57918233, 53453888, 53219167, 54911637, 52367145, 49638721, 55061112, 63844635, 60989270, 43112498, 24971785, 20547756, 27595756, 34999144, 36576665, 32786386, 26286525, 21556513, 23903072, 33781862, 44808054, 49920982, 46986475, 38158182, 28134831, 23203683, 26581044, 33689217, 36667192, 33687922, 29236581, 26619772, 26306085, 29665532, 36416445, 40118472, 35706736, 30177418, 34397483, 44564891, 45411492]
42320D5411492j1299602p948400N584785Q854367j319158q332837m029460J591191
42312B8512378P13688j536219o71901j56219n33286L377754J0121388J1354508
42304E1182091Q217237J2736093K7454893L8087531L2524456J4201157p876511
42297A76526947k7918189l7632700k8767578r301506q71176j0193374j8308731
42290D3533693r288518N800433P674508j970428o857731k211582K754380K756849
42282D2191604R90619j305919n948155r558167n828159L822625J0557713R076630
42274D3998791K160097m323597o153455k967622P04488K34948j504553K298443
42266C4447540R944497J2034567P331093N553751R776048J0507466M802137N255517
$$ y = [45411492, 34111890, 26163490, 31748275, 40602642, 39283484, 30950647, 26921187, 28512378, 29226066, 27689847, 27017946, 26861727, 26328441, 29706195, 39827583, 51182091, 59399328, 72135421, 99590314, 137677845, 170202301, 184403458, 176526947, 148608758, 110976058, 82208480, 72906974, 72035798, 61842424, 43533693, 34245175, 40045608, 47720116, 45749688, 38891957, 36680375, 39434755, 42191604, 43182223, 41876304, 35928149, 26369982, 20541823, 24364448, 34922161, 43998791, 46158888, 41835291, 35681836, 32714214, 33418702, 33653650, 32149097, 34447540, 44392037, 56426604, 63757697, 69311448, 79087496, 89594962, 94397099, 99652616]
42258I9652616J8458832L0102849K6372298J5606245J1054979N982766j2087860
42251A95142725l2942878l4697986j8104303n088726m710555m629544K615276
42244I7584009Q857324J0203586J5250881K6211016L1621956K6206094K0041204
42237B35976070J9003413J3277453l880148k1320652k6313049k3261316k3733917
42230A69747854k7854383k7760033k1959876j5194941r567513m673991j629813
42223F1107304k02136K603635N873727L669663m316001r156680n663948n42981
42215E3372583j030505l859172k854516N79399K371702L630031N692574M557445
42207F2459541j707318o715968m762554L42770K629187L199290N001441O057716
$$ y = [99652616, 118111448, 148214297, 174586595, 190192840, 201247819, 207230585, 195142725, 162199847, 127501861, 109397558, 104308832, 99598277, 94968733, 97584009, 106441333, 116644919, 131895800, 158106816, 189728772, 215934866, 235976070, 254979483, 268256936, 264376788, 243056136, 216743087, 193481771, 169747854, 141893471, 114133438, 92173562, 76978621, 67411108, 62737117, 61107304, 60905168, 63508803, 69382530, 73052193, 68736192, 59579512, 53915564, 53372583, 52342078, 48482906, 45628390, 46207789, 48579491, 52209522, 57902096, 62459541, 60752223, 54036255, 49273701, 49616471, 52245658, 55444948, 60446389, 66504105]
42199F6504105N408844P577074J3271153J4929082J0235889R329820J7602905
42192A44858872K2847297J3667355j99415l194210j46173o625072j9475197k0317979
42184A31415478p065592J631845l484201r832907o818677j357655o45860J440231
42176A05282662Q986157J1954872L559726m090341L035724J9435010L1351481
42169A79515291L9579718N2303071O1180361M6114843O394986l0366696l7866733
42162C16854841j8984082K562757J0056568N566505j117103o337368j3477958
42155B95124160k4061692l2444166l1898315k4423802j9442182k1072749k2131396
42148A19649858j5049224l998938M95144l472000p035378l496697L168114M909139
$$ y = [66504105, 71912949, 79490023, 92761176, 107690258, 117926147, 127255967, 144858872, 167706169, 181373524, 181174109, 177979899, 177833726, 171208654, 151733457, 131415478, 124349886, 125981731, 122497530, 112664623, 105845946, 104488291, 103842431, 105282662, 114268819, 126223691, 129783417, 125693076, 128728800, 148163810, 179515291, 219095009, 271398080, 332578441, 378693284, 385088270, 354721574, 316854841, 297870759, 300433516, 310490084, 316056589, 314939486, 308602118, 295124160, 271062468, 238618302, 206719987, 182296185, 162854003, 141781254, 119649858, 104600634, 100601696, 101096840, 97624840, 90589462, 87092765, 90260879, 95170018]
42140I5170018K22307m766881m006286J582831M991298J337919n250886n952183
42132H3328137P66616O234074L762979j522498r06544M068152M090288l178445
42124I6642759r445233p918195j753234J953248P53448l178241o988142q651568
42116F1414842q053022p738734r197053q858372k866626M865975O346903J550053
42108C7463966j369253P25878K039034K50202J973650R492852J2825455M931617
42100F8333401m182301j357879P992539P087471n676158j3336929n883161N553391
42092E8530374O577005o2452j488547N073094R703482N554349j534263j584490
42084H0768552N913140J1383831Q858427O309632J5748174L2455629L4015271
$$ y = [95170018, 95392325, 90625444, 86619158, 88201989, 93193287, 94531206, 89280320, 83328137, 84094753, 90328827, 94091806, 92569308, 91662764, 95730916, 99821204, 96642759, 87197526, 79279331, 77526097, 79479345, 80232793, 77054552, 70066410, 61414842, 53361820, 45623086, 36426033, 27567661, 24701035, 29567010, 35913913, 37463966, 36094713, 36820591, 38859625, 39109827, 41083477, 50576329, 63401784, 68333401, 64151100, 62793221, 70785760, 77873231, 72197073, 58860144, 52976983, 58530374, 65107379, 65044927, 63556380, 68629474, 78332956, 83887305, 82353042, 80768552, 86681692, 98065523, 106923950, 113233582, 128981756, 161437385, 195452656]
42077A95452656P919967k7509414m2007011k9219097r971127j680520j341271
42070I1644183j641791n616451j5481203k1294773j3882166q8866O648112M024919
42062D4311964j087750n087433p369236m481307L924285R170922N001970j000038
42054D3383377N92003M201811j293961j1704941j2626478k663299N305699N361237
42046C0555448M208422M888396K063376l643953l490152K728725L996474k596946
42038C8709790n993638j085426K175512j914568l262819M751363J0280000J999494
42030D5659708r909761q440759M002852J0894157O654750J50533k861866n321010
42022D0828604q266097p852909l199509K365509O758991Q299269L411278o433954
$$ y = [195452656, 203372623, 175863209, 133856198, 104637101, 94665974, 92985454, 91644183, 90002392, 84385941, 68904738, 47609965, 33727799, 33638933, 40287045, 44311964, 43224214, 38136781, 30767545, 26286238, 30210523, 39381445, 44383415, 43383377, 43975380, 48177191, 46883230, 35178289, 22551811, 19888512, 25194211, 30555448, 34763870, 39652266, 41715642, 38071689, 34581537, 37310262, 41306736, 38709790, 32716152, 31630726, 33806238, 31891670, 28628851, 33380214, 43660214, 45659708, 35749947, 27309188, 31312040, 42206197, 48860947, 49011480, 46149614, 40828604, 32562507, 24709598, 21510089, 23875598, 30634589, 38933858, 42345136, 35911182]
42014C5911182j0879931l626846O394903P534633K948794L241649P736404P716285
42006E6977073L644976L154621M848761Q05902o279436n843148M93708n36101
41998E7266356j0977165j6851065j0332879j67476M994554P440333Q936109M988818
41990D5297585k159674j028121R736640J4867944N238490p723147j1105799r037141
41982D4086777r648479q342499O34746Q751793O201917k37762N22580L652691
41974D5621764j059882p552199l524601M518362j85661j3864416j4894467O73173
41966I732073J1026966L233096o917889j782328J0547875J1339760K50335p676740
41958B9753148n731663l97326L049692N593857O484319K049239o478073j2334909
$$ y = [35911182, 25031251, 21404405, 27799308, 35333941, 38282735, 41524384, 49260788, 56977073, 60622049, 63776670, 68625431, 69431333, 63151897, 57308749, 57802457, 57266356, 46289191, 29438126, 19105247, 18937771, 23932325, 31372658, 40308767, 45297585, 43137911, 42109790, 51846430, 66714374, 71952864, 64229717, 53123918, 44086777, 34438298, 26095799, 26730545, 35482338, 41684255, 41446493, 41969073, 45621764, 44561882, 37009683, 33485082, 38003444, 37817783, 23953367, 9058900, 9732073, 20759039, 23992135, 17074246, 15291918, 25839793, 37179553, 37429888, 29753148, 24021485, 23624159, 26673851, 32267708, 38752027, 40801266, 34323193, 21988284]
41950B1988284j1536213o151991J28130M313160L425070k305713o265751j765982
41942A828994Q149988J2899930P315757k686125q679540r011106p208444n459189
41934b849735l351392p56320J547488L219984L824203J953628k364741n236980
41926d013865k590877L349067N596714K295908J48441L638789N843596j797858
41918A2469915j3118024j2117099L484810J5617078R982024l659656o499981J912173
41910H071240N966119n6238n139047k306823J81982m920502j0290839o726255
41902a5220363J085893L025810K04823Q49245M596953L951767p56289q38720N662349
41893B561468J0228395P764748L419021J588148j448782p827681j0453074l731586
$$ y = [21988284, 10452071, 4300080, 4428210, 8741370, 12166440, 9860727, 3594976, 1828994, 9978982, 22878912, 30194669, 27508544, 18829004, 9817898, 2609454, -2849735, -6201127, -6957447, -5409959, -2189975, 1634228, 3587856, 1223115, -4013865, -6604742, -3255675, 2341039, 4636947, 4785388, 8424177, 14267773, 12469915, -648109, -12765208, -9280398, 6336680, 16318704, 12659048, 6159067, 8071240, 14037359, 13981121, 8842074, 6535251, 6717233, 1796731, -8494108, -15220363, -14134470, -11108660, -10903837, -10054592, -5457639, -1505872, -2262161, -3100881, 2561468, 12789863, 20554611, 23973632, 25561780, 24112998, 16285317, 5832243, 2100657]
41885B100657M874990M000152m962765j0452690p915087l859334k605763O7303
41877a8752537O641047J1053749Q313439L284259K357386K335828l242173j0533741
41869A457257q903957K197136J0274244O803509j274564k064797N516856J2192324
41861B6198008J0415986P64570j0635802j6118903j0581529L093291J4029465
41854A7165086J3358770L578929n400998p886758o095298l880466j862622Q76340
41846I852983M082551O329246O027040K945825j89203p034J888326m23163p574553
41837B2932018j0900852l971644O030342O544403k934417j0543989q905662l211556
41829d961357p78474j088468L8411L041023N776945P498332Q102584O783236L666198
$$ y = [2100657, 6975647, 10975799, 6013034, -4439656, -12354743, -16214077, -18819840, -18752537, -12111490, -1057741, 7255698, 10539957, 12897343, 15233171, 11990998, 1457257, -7446700, -5249564, 5024680, 11828189, 10553625, 8488828, 14005684, 26198008, 36613994, 37378564, 26742762, 10623859, 42330, 3135621, 17165086, 30523856, 34102785, 28701787, 20815029, 14719731, 10839265, 8976643, 9852983, 13935534, 20264780, 26291820, 29237645, 29048442, 29041408, 30929734, 30506571, 22932018, 12031166, 8059522, 14089864, 20634267, 17699850, 7155861, -1749801, -4961357, -5739831, -6828299, -6789888, -3748865, 2028080, 9526412, 17628996, 24412232, 28078430]
41820B8078430q5328m180432p565796o258756J101680O972903K846340o503665
41812A4405376p173281L234727J0590955M817435n902396r162351o136113n045721
41804c71369n244600l23180P632855R329383K523805n056000o849703l632635
41796a991444Q67033L689968K969813L66498J087486O047959P970286K052094
41788B3059693m505987k656227L512238L168584l154102m840906K53066K229696
41780A7066055l768737r718861q282938l193417p74381m60460O10001J504210
41772g018528J378971K529222M922598M421087M97333j515650J18968M0872l293542
41763B081331k228132P230542J5306230J0808016j873743q231126l287212L735640
$$ y = [28078430, 27993102, 23812670, 16246874, 9988118, 11089798, 18062701, 20909041, 14405376, 7232095, 10466822, 21057777, 25875212, 19972816, 10810465, 4674352, -371369, -5615969, -5939149, 1693706, 11023089, 13546894, 8490894, 1641191, -1991444, -1124411, 2565557, 5535370, 5901868, 6989354, 13037313, 21007599, 23059693, 18553706, 15897479, 19409717, 22578301, 19424199, 14583293, 14836359, 17066055, 13297318, 3578457, -4704481, -7897898, -8672279, -9132739, -8522738, -7018528, -5639557, -3110335, 1812263, 6233350, 6730683, 5215033, 5334001, 5374873, 2081331, -146801, 7083741, 22389971, 33197987, 31324244, 23093118, 19805906, 23541546]
41755B3541546L939211k89541r37947L942530P177148Q53290j2365291j8648429
41747G212517q317243R546662J5721194N368425n632229l133179O681604Q999395
41739C6447146J857443m821372n817284m536256l209097l48294K521675J205216
41731B3299177l464405n955176m345391j662601L93059K255707K229033j092423
41723A1656980l275215Q08807O916305N595037l039932q085132l442939M280329
41715A1414240O642336L960700R79027q73675k166103k171605j394543k676958
41707A3713419o057095p021642l087514K504124O502840R804152J2723327J1873521
41699D0955132N976733m63220l771393o188069r543826r631817l493101K606659
$$ y = [23541546, 27480757, 27191216, 26253269, 30195799, 37372947, 38226237, 25860946, 7212517, -1104726, 8441936, 24163130, 29531555, 23899326, 20766147, 27447751, 36447146, 38304589, 33483217, 27665933, 23129677, 19920580, 19572286, 22093961, 23299177, 19834772, 13879596, 9534205, 7871604, 8264663, 10520370, 12749403, 11656980, 8381765, 9190572, 16106877, 21701914, 18661982, 10576850, 7133911, 11414240, 18056576, 22017276, 22996303, 22122628, 19956525, 17784920, 16390377, 13713419, 7656324, 634682, -2452832, 51292, 6554132, 16358284, 29081611, 40955132, 46931865, 46468645, 42697252, 36509183, 26965357, 17333540, 13840439, 16447098]
41691A6447098O66901o498339q695656l171174K385066K084457r60384j833000
41683D24969j063978j051650r69301K45922J81877k690825m069022J015356R449009
41674A472357J2321645O403410j867174n356162m237329k332193l07928K725669
41666H822295M316830J558310k578747k195774K305885M414603J871950o3732
41658A8451620J871340L237659l9093m207140l911406p52659M75184k33878k18551
41649A4673076l06341k181742l274536j225567L17966k087839l861094K80367
41641B334290N323916L161072k539944j495588M949224N460906q35446j858201
41633A4500229N445047P424817l569184j3969988q555048O358182J2737744N679070
$$ y = [16447098, 17113999, 10615660, 1920004, -1251170, 1133896, 3218353, 2257969, 424969, -639009, -1690659, -2659960, -2414038, -2232161, -4922986, -8992008, -7976652, 1472357, 13794002, 20197412, 18330238, 12974076, 8736747, 6404554, 6096626, 8822295, 13139125, 14697435, 12118688, 9922914, 12228799, 16643402, 18515352, 18451620, 20322960, 23560619, 23521526, 19314386, 15402980, 14650321, 15125505, 14891627, 14673076, 14366735, 12184993, 8910457, 7684890, 8002856, 5915017, 2053923, 2334290, 7658206, 10819278, 8279334, 6783746, 11732970, 17193876, 16358430, 14500229, 19945276, 27370093, 23800909, 9830921, 1275873, 7634055, 20371799, 26050869]
41625B6050869m673944r770417q336521l66376J1351749J6696159Q061469o493253
41617C2519735j1751244o232276k579137o659924r132981j762942Q864572J0725182
41609A3990985K651194n434885n377131J003717N678222L931137n39112j014318
41601A4889809K228065J927935m078979p504442k055939N261024M101351k935780
41593A1833044m864013j80894K048724j569885m111761j823093p4213j986606
41585g28697k448537J153561K610101k031144o266256l714398J072079R18110
41577i435181j546287Q02656O750603Q942272N821454K074848p64915m677037
41569G968413o977880j965096P497669R665100j28208j0689166q840895K592065
$$ y = [26050869, 21376925, 11606508, 3269987, 2903611, 14255360, 30951519, 39012988, 32519735, 20768491, 14536215, 11957078, 5297154, -3835827, -5598769, 3265803, 13990985, 16642179, 11207294, 5830163, 6833880, 12512102, 16443239, 15904127, 14889809, 17117874, 19045809, 14966830, 7462388, 5406449, 10667473, 14768824, 11833044, 6969031, 6788137, 8836861, 7266976, 3155215, 1332122, 1257909, -728697, -3177234, -2023673, 586428, -1444716, -7710972, -11425370, -10353291, -9435181, -10981468, -10178812, -3428209, 5514063, 11335517, 13410365, 12645450, 7968413, 990533, -974563, 6523106, 16188206, 16059998, 5370832, -3470063, -877998]
41561h77998Q446999J560580q213834p641048K906917J0924870P805683j880309
41553A3031860p608737n207829L66384K317130o21032m029979l907907k106637
41545g766747m006288r835692j1621802l066117R852658J4572748P690710k189276
41537f369806p494554q668273o564499J078827J0798369J2488463M917663R39523
41529A125713P390648J1614904J708836j0956692p908558N572775P618754n331565
41521A0834815j4112144q932039k330648l508550k172089J0307722K2259112J8789412
41513C1135591L888686q208854j2460366j1240880m159908O859775J1679459M719753
41505B2213256l964383k829119L614967L923169j415468l852182k811162l768757
$$ y = [-877998, 7569001, 9129581, 915747, -6725301, -3818384, 7106486, 14912169, 13031860, 5423123, 215294, 581678, 2898808, 2277776, -1752203, -5660110, -7766747, -11773035, -21608727, -33230529, -36296646, -26443988, -11871240, -4180530, -6369806, -13864360, -22532633, -29097132, -28018305, -17219936, -4731473, 186190, 1125713, 8516361, 20131265, 21840101, 10883409, 2974851, 8547626, 16166380, 10834815, -3277329, -12209368, -14540016, -18048566, -20220655, -9912933, 12346179, 31135591, 35024277, 26815423, 14355057, 3114177, -1045731, 5814044, 17493503, 22213256, 18248873, 15419754, 19034721, 22957890, 21542422, 17690240, 14879078, 11110321]
41497A1110321n706261m209580k313982m927018p353836k957880L021872J924812
41489a1411552j502242K723244R429386N046785p277928r705788J689332J0473061
41481e35702O539180R9600J652516N400820K622414k800694l179245q8615J575817
41472A1286091L058930N862978N297948p42348m694175n32836N150548L010148
41464B7697284m299255p258431m552755k723122l651305k470549K321315N132392
41456A0195574J590784m841673p110406l057527K256662K843286m99209j360915
41448A6576K362857M484457N55680l782387k003754J181319k141905p078682k286649
41439h692488Q887976J0221744j788042j1080138o817702J348841J592265k000844
$$ y = [11110321, 5404060, 1194480, -1119502, -6046520, -13400356, -16358236, -13336364, -11411552, -12913794, -10190550, -761164, 4285621, -2992307, -12698095, -11008763, -535702, 6003478, 6103078, 7755594, 13156414, 15778828, 12978134, 9798889, 9710274, 11286091, 14345021, 20207999, 25505947, 24763599, 20069424, 19536588, 24687136, 27697284, 23398029, 16139598, 11586843, 8863721, 5212416, 2741867, 5063182, 10195574, 11786358, 6944685, -165721, -3223248, -966586, 1876700, 1377491, 16576, 2379433, 6863890, 7419570, 3637183, 1633429, 2814748, 672843, -6405839, -8692488, 195488, 10417232, 8629190, -2450948, -9268650, -7919809, -6327544, -8328388]
41431h328388j007574J675458J118169K840461J0868920J4211913K557566j2843188
41423A1093337j2778443O65224P861518K463697j558882M311276R523494L503447
41415B5084668p004691r313603l308478J032070j298201n732892n863192n75653
41407f979972N429443O287480J488459k696177r38456L695322M249043M3988l133764
41398G445366k069217L12439L56413k067334m603340m189766P97392P095936Q429876
41389A1507765M347630K078590M648839M228887m617433j2546631q120479K864275
41381D391443N302202j047693j891643O532367J0146063R5539j2430572j3253762
41373b156056m916291Q77513J416720K623359O250940P944734N870393L163795
$$ y = [-8328388, -9335962, -7660504, -6542335, -3701874, 7167046, 21378959, 23936525, 11093337, -1685106, -1019882, 6841636, 9305333, 7746451, 12057727, 21581221, 25084668, 18079977, 8766374, 5457896, 6489966, 5191765, -541127, -6404319, -6979972, -1550529, 4736951, 6225410, 3529233, 2590777, 6286099, 10535142, 10579130, 7445366, 5376149, 5688588, 6045001, 3977667, -625673, -4815439, -4018047, 3077889, 11507765, 15855395, 17933985, 22582824, 26811711, 22194278, 9647647, 1527168, 4391443, 9693645, 8645952, 6754309, 13286676, 23432739, 23528278, 11097706, -2156056, -7072347, -6194834, -4778114, -2154755, 4096185, 12040919, 17911312, 21075107]
41365B1075107K191843J773315O0219l097436o455421q453091q449054o838981
41357h193499l265736K913672Q382859O701915j967008p524666l565066J853375
41349d664154n99073m088611L558488J5807343J3498115m209416j5587586q730350
41341e015244J922369J174771l893557n40821O202771M084778l963275n761875
41333e790083m52206L214168L029561K630591M63011n428828p118751K662155
41325f790382J4092770J1207644l290470j1044683m936443L644084M889607J698960
41317I471087j152116l541088l083438L539624R614497L968284r030328j1202542
41309a416020K245071J3629951Q898103k847644o517592l574623m094329p380388
$$ y = [21075107, 23266950, 25040265, 25100484, 22003048, 15547627, 7094536, -1354518, -8193499, -11459235, -8545563, -162704, 6539211, 4572203, -2952463, -6517529, -4664154, -5263227, -9351838, -5793350, 10013993, 23512108, 19302692, 3715106, -5015244, -3092875, -1918104, -5811661, -6352482, -149711, 3935067, -28208, -5790083, -6242289, -3028121, 1440, 2632031, 3095042, -2333786, -9452537, -6790382, 7302388, 18510032, 15219562, 4174879, -761564, 2882520, 7772127, 9471087, 8318971, 4777883, 1694445, 5234069, 14848566, 18816850, 9786522, -1416020, 829051, 14459002, 23357105, 20509461, 13991869, 10417246, 6322917, -1057471]
41301a057471n442344R40165L581467P64628j671391p03905J618034L807590N157842
41292F994615L443564r27123k733634k02209N96785l245646m017865L225319Q377876
41283A1511682J058611r373449n899557P635171R942141m345237j5242518q444612
41275a3157768L107683J134436r498443j0549430O31903R442199P727004K825157
41267h337259K179076K937817Q51454j355777r463K761802L493663K778768J686253
41258F986334j707978p209369q852358k429631O661949R351415M705204j31947
41250G373619m66567J720194L649937N101356M804201K98935n753518n539986
41242A1188171K805543R279974L820129q947947j4170791n479102P798843J3490497
$$ y = [-1057471, -6499815, -5559650, -1978183, -1213555, -2884946, -3588851, -1970817, 1836773, 6994615, 10438179, 9511056, 6777422, 6575213, 7171998, 3926352, -91513, 3133806, 11511682, 12570293, 3196844, -2702713, 4932458, 14874599, 10529362, -4713156, -13157768, -10050085, -8915649, -18414092, -28963522, -28331619, -18889420, -11162416, -8337259, -6158183, -3220366, -2368912, -3724689, -3734152, -972350, 2521313, 5300081, 6986334, 5278356, -1931013, -10783371, -13213002, -6551053, 2800362, 7505566, 7373619, 6907052, 8627246, 12277183, 17378539, 22182740, 22481675, 16728157, 11188171, 13993714, 23273688, 27093817, 18145870, 3975079, -1504023, 6294820, 19785317]
41234A9785317J0086704M072979o11242m659883p763235p545246m715596l835561
41226D814237o284022o477363N13712R711016J0523184J279096o513503k710825
41218D855532P179321R174762K92908p895065o687947k066677l539990q666903
41210g354059p545465J126577Q123797P281817K392915p42043j573603j669161
41202D0775q09372O04587M68014p79611L07132L732839M510362Q06274k129797
41193F751203o23389O90392k922294o377938j521369Q690432J2035897L860203
41185B0583137o052169o548463R49302N741503J316338q639774j5711979j4673806
41177b3035911o655448K796698Q325425Q534611N627792J942145j632041l792308
$$ y = [19785317, 29872021, 33945000, 33333758, 28673875, 20910640, 13365394, 8649798, 4814237, -1469785, -7947148, -7433436, 2277580, 12800764, 14079860, 7566357, 4855532, 12034853, 21209615, 21502523, 13607458, 6919511, 4852834, 1312844, -7354059, -14899524, -13772947, -5649150, 1632667, 4025582, 3283539, 1709936, 40775, -768597, -164010, 304004, -475607, -168475, 3564364, 8074726, 8881000, 6751203, 6127814, 6818206, 3895912, -2482026, -4003395, 4687037, 16722934, 20583137, 14530968, 7982505, 8931807, 14673310, 15989648, 7349874, -8362105, -23035911, -29691359, -26894661, -18569236, -10034625, -4406833, -2464688, -4096729, -7889037]
41169g889037k146781L426190Q288561P024745K14218n350713m464837N15662
41161c81992L338462J570961k312248o044195r077911q882958j788430R450223
41153a4128088J4579554P884790k812243o027120k365686j715185n972749n325910
41145a5882637N393404J6589536J6329829N788188m685129r591401j0856330j0069383
41137f983923o306596q25176K632270K689356J291560K40219K47639K154781N420857
41128E60987O801771M113134j80705k317727k068045j154757L1248N13368k429717
41119C869557p684365q102152l76945P136818M686505l965160o349508N47525
41111a0237725O989759N609998J4824l463958l644866j610554J975824M024867
$$ y = [-7889037, -10035818, -6609628, 1678933, 8703678, 8917896, 3567183, -897654, -381992, 2956470, 4527431, 2215183, -3829012, -12906923, -21789881, -23578311, -14128088, 451466, 8336256, 5524013, -503107, -2868793, -4583978, -10556727, -15882637, -10489233, 6100303, 22430132, 28218320, 23533191, 13941790, 3085460, -6983923, -13290519, -14115695, -11483425, -8794069, -7502509, -7262290, -7014651, -4859870, 560987, 7362758, 11475892, 11295187, 8977460, 6909415, 5754658, 5785906, 6299274, 3869557, -3814808, -11916960, -12293905, -5157087, -470582, -4435742, -10785250, -10237725, -3247966, 2362032, 2376856, -1087102, -4731968, -6342522, -4366698, -341831]
41103c41831R74352m139652m180560O01195K189046j684968l424731J100982N351204
41094c554963M036116K262169N052007O834679J035883o981691p141188k4689
41086A518323N098834M281670J459526n31033k426584l439032j799403M18656
41078D580957k83496k978078m672185n627652o046611j779949Q281394J4701299
41070F175679P998816n673680j0788304l797370L509945K985432J56082J572705
41062B139305L558488K38232n490101o389509j361053M363360O262520L774695
41054G095937p52082l871321m244082m438432o123668n035326K950324J1891657
41046b526993J0753433o45528r861351q530254j694298K897046M995562O301420
$$ y = [-341831, 632521, -3507131, -7687691, -7086496, -4897450, -6582418, -10007149, -8906167, -3554963, 481153, 2743322, 7795329, 14630008, 15665891, 8684200, 1543012, 1518323, 6617157, 10898827, 12358353, 11827320, 9400736, 5961704, 4162301, 4580957, 4297461, 1319383, -3352802, -8980454, -15027065, -16807014, -8525620, 6175679, 14174495, 8500815, -2287489, -6084859, -2574914, 410518, 566600, 2139305, 5697793, 5936025, 445924, -5943585, -7304638, -2941278, 3321242, 7095937, 6343855, 2472534, -1771548, -6209980, -12333648, -17368974, -14418650, -2526993, 8226440, 7580912, -2280439, -10810693, -12504991, -9607945, -4612383, 1689037]
41038A689037M451543l42928j160472M941310R401718M158786n171849p692564
41030A0274581l526053j288656k923924k145055L066525O628161M102503j630255
41022A2557827n851595p048044n573356k385245K82821P85427M1209j169426l955149
41013a2315531o655688l270802P233526J4818130R963729k062440p826167m176571
41005d291814L3958o26228j950897J04404L816372P424417J0696535R465295o50406
40996B4021636j2901148j3698280k415329N328630M45496o064948j736839O834934
40988a85848N487787l657109n763318K434595P868597K368429n367608m635266
40980a449741J122775J182731n720421j0191552n855342K784408P303824N700556
$$ y = [1689037, 6140580, 5797652, 4637180, 9578490, 18980208, 23138994, 17967145, 10274581, 6748528, 5459872, 2535948, 390893, 3457418, 10085579, 14188082, 12557827, 6706232, -341812, -5915168, -8300413, -8017592, -7232165, -7190956, -8360382, -12315531, -18971219, -22242021, -15008495, -190365, 9773364, 7710924, -115243, -4291814, -4257856, -4884084, -6834981, -6730577, -2914205, 4510212, 15206747, 24672042, 24021636, 11120488, -2577792, -4993121, 335509, 781005, -5283943, -7020782, -185848, 5301939, 1644830, -4118488, -1683893, 6184704, 8553133, 3185525, -1449741, -326966, 855765, -4864656, -15056208, -20911550, -18127142, -10823318, -5122762]
40972e122762L068641L679234N553527M107687p03084l839339k067017J450312
40964F127199J267020l372734p824975p611835k972844K108791M409094M441235
40956c429049M508181M250698P52161n381643p724857k359062M216933K308798
40948b857840o580798j0543729l885522N344892P945097N534161M319697M196701
40940C472659J718772j404889j222555N43489l06087k023020j42096K811934J77290
40931C625497o461157p303741J031184R297864Q078855J45723m367215j081361
40923B965649M870866O435359K787972l03986J927566N646984J871331j0003588
40915A6198153j7330166r493375N892775J1659779M404461k327094L33017M383659
$$ y = [-5122762, -2054121, 1625113, 7178640, 11286327, 10583243, 6743904, 4676887, 6127199, 7394219, 4021485, -3803490, -11415325, -14388169, -12279378, -7870284, -3429049, 1079132, 5329830, 6081991, 700348, -7024509, -9383571, -5166638, -2857840, -9438638, -19982367, -23867889, -18522997, -10577900, -5043739, -724042, 3472659, 5191431, 3786542, 2563987, 3107476, 2801389, 778369, 636273, 3448207, 3625497, -2835660, -10139401, -9108217, 189647, 8268502, 8414225, 4047010, 2965649, 7836515, 14271874, 17059846, 16755860, 18683426, 24330410, 26201741, 16198153, -1132013, -10625388, -4732613, 6927166, 11331627, 9004533, 9337550, 13721209]
40907A3721209K94479o771891n935157J778354O017038L382928K00079K09804
40899A2896843k87233l608295n588389k633327K188144L921895K654764J975046
40891A1519448K634991J094613n410792j3769719j6486877r899601k14210K528826
40883b8003321k282123l815907N101672J6317027J6921116P813756K031916M972419
40875A9056555P032061k23922r976368r744859M85841Q157806M553076n488074
40867A3852116j0758397o058082L568324Q362683L312856o500784j0896932n939195
40859a1057411K040768N248290L517269J548653J293647K057048M470008P916094
40851A7034366P069927r94075q315702m507617O375409Q641700k565397j3103429
$$ y = [13721209, 14015688, 7243797, 1308640, 3086994, 9104032, 12486960, 12687039, 12896843, 12609610, 9001315, 3412926, 779599, 2967743, 6889638, 9544402, 11519448, 14154439, 15249052, 9838260, -3931459, -20418336, -30317937, -30532147, -28003321, -30285444, -34101351, -28999679, -12682652, 4238464, 12052220, 14084136, 19056555, 26088616, 25864694, 15888326, 6143467, 6629308, 14787114, 19340190, 13852116, 3093719, -2964363, 603961, 8966644, 12279500, 5778716, -5118216, -11057411, -9016643, -3768353, -251084, 1297569, 2591216, 4648264, 9118272, 17034366, 24104293, 23110218, 14794516, 10286899, 16662308, 25304008, 22738611, 9635182]
40843I635182r955811J186522O796202M529057R62452j760032m760143l977160
40835B656269L438709Q510941J129573j1052653j0808445J697347Q063651Q25401
40827D460793n580974k54265O706023M036201n62432L820683R461423L145226
40819B5232678q799536r571527k49108K433878n153867q359047j4693Q531153
40811D049931P696979L509155L570635M031639p07861p150316r561674p744574
40803b306086k227870P289379J3733671O454177r951218j5593283l653242O928143
40795F73671L46824j0132479l699498J2981224J5389456l69049j2857461r100039
40787f767351l91379O43991j239207K611513Q065234O478505l36732l836902j300132
$$ y = [9635182, -320629, 865893, 7662095, 12191152, 13153604, 11393572, 6633429, 2656269, 6094978, 14605919, 15735492, 4682839, -6125606, -4428259, 3635392, 4460793, -1120181, -1374446, 5331577, 9367778, 8805346, 12626029, 22087452, 25232678, 16433142, 6861615, 6612507, 9046385, 3892518, -4466529, -4481222, 4049931, 11746910, 15256065, 18826700, 22858339, 22150478, 15000162, 5438488, -2306086, -4533956, 2755423, 16489094, 22943271, 12992053, -2601230, -6254472, 673671, 1020495, -9111984, -12811482, 169742, 15559198, 15190149, 2332688, -6767351, -7158730, -6514739, -7753946, -5142433, 2922801, 9401306, 9064574, 5227672, 3927540]
40778C927540L142889N331637L305077k821452q998373r808168n835855l196172
40770a4952877l607967j867183L971287P894198N845536K563510K886308L531969
40762F264781L49494k715993L8451N527827O095807J414527j724288r0402K495381
40753A7655585K044163q25680l154208k704528Q40384M741958M573100n13629
40745B2657145n756442o516283l471705J39986K628919K467656k059151p658776
40737B431349o244928L634211J1123896O634783l584124n805973J585611P528973
40729A7303798N753321J195727j806248n688686j0293940q514325J992604J1270886
40721A1213137R218578l98856n692736k455443K976359M105504Q00278l480435
$$ y = [3927540, 7070429, 12402066, 15707143, 12885691, 3887318, -5920850, -11756705, -14952877, -18560844, -20428027, -16456740, -8562542, -2717006, -153496, 2732812, 6264781, 6614275, 3898282, 3936733, 9464560, 15560367, 16974894, 15250606, 15160204, 17655585, 19699748, 18874068, 15719860, 13015332, 13855716, 18597674, 23170774, 22657145, 16900703, 10384420, 6912715, 7052701, 9681620, 12149276, 10090125, 2431349, -3813579, -179368, 10944528, 17579311, 13995187, 8189214, 9774825, 17303798, 23057119, 24252846, 22446598, 16757912, 6463972, -2050353, -57749, 11213137, 20431715, 20032859, 14340123, 11884680, 14861039, 18966543, 19766821, 16286386]
40713A6286386n476639l480140J024034L567913J540177k563972n417942p746248
40705b266431j1110240j2606462q054443R87763Q611765J2028678J2521012J0060368
40697A0172010L403157m246130o669137l678527k048191m250152l189130O147929
40689d358171J5561879J2625606j404574j1473760p701869L003869P605150L201559
40681A7059689k574576l772029k383594k752935n010810o044679m141524o28108
40673a0248566J778581J035051k619524n989208m942013J425130Q971711J2003619
40665A414781Q715224K704695p57077M76711M131715O331315N256523J969080
40657C0242967j673366m465569m889635j057925N835784R452911L916926p652870
$$ y = [16286386, 10809747, 7329607, 8353641, 11921554, 13461731, 10897759, 5479817, -2266431, -13376671, -25983133, -34037576, -33049813, -24438048, -12409370, 111642, 10172010, 13575167, 9329037, 2659900, -1018627, -3066818, -7316970, -10506100, -4358171, 11203708, 23829314, 22424740, 10950980, 3249111, 6252980, 13858130, 17059689, 14485113, 10713084, 8329490, 5576555, 565745, -5478934, -9620458, -10248566, -8469985, -7434934, -10054458, -16043666, -20985679, -19560549, -10588838, 1414781, 10130005, 12834700, 12077623, 12554334, 16686049, 23017364, 28273887, 30242967, 28569601, 24104032, 19214397, 18156472, 23992256, 33445167, 37362093, 29709223]
40649B9709223j4163058q585182L805942J1888208J0703319L695124m224880j0550833
40641B2277863j3106170j0140527m119142q14008k213681l822996j487065K290044
40633a1135682K069328k534545n899960k833692N991599J4322109J5043479O389735
40625B1412371n145033j0089639n842672Q20360K505433o41711l845397m900829
40617e727117m276707j283848M175816P918534N865891J513864K328865Q044069
40609A8559367R619574K307637o978187r566000o601464m970922n657846l114946
40601f402787M835415J2550361J3062535N405504n193875j1817795j0609257l774427
40593a944326J957341K046603r38325j320342J566095K574613j655756p648334
$$ y = [29709223, 15546165, 6960983, 10766925, 22655133, 33358452, 37053576, 32828696, 22277863, 9171693, -968834, -5087976, -5901984, -8115665, -11938661, -13425726, -11135682, -9066354, -11600899, -17500859, -20334551, -14342952, -20843, 15022636, 21412371, 16267338, 6177699, 335027, 1155387, 3660820, 3019109, -826288, -5727117, -10003824, -11287672, -7111856, 806678, 6672569, 8186433, 10515298, 18559367, 28178941, 30486578, 23508391, 13942391, 7340927, 2370005, -3287841, -6402787, -1567372, 10982989, 24045524, 29451028, 24257153, 12439358, 1830101, -1944326, 13015, 2059618, 1121293, -199049, 1367046, 3941659, 2285903, -5362431]
40585e362431r189235m386352K873734P124340N718153K17526n055780o170463
40577a4230508k573879K503797M933202L386468J05038k302284m086213o666095
40569a8930474q081487l976338M790455J0012775O581771J188034L032673Q694973
40561C312382P024708j175904k266853O951074J0293845k815245j7066519j2400308
40553h142820M121934Q125152m336375j1607087j723036R590187N685057n442359
40545c729347o832767L50204K425477k919314n711410k592949m98264j925864
40537b1434234p35287N197318Q931751N910673J298971J378692M385095M547950
40529I480929P72238k877100l089906r29707j33315k434888m687695k491908K812030
$$ y = [-5362431, -14551666, -18938018, -16064284, -8939944, -3221791, -3004265, -8060045, -14230508, -16804387, -14300590, -9367388, -5980920, -5875882, -8178166, -12264379, -18930474, -27011961, -30988299, -26197844, -16185069, -9603298, -8415264, -5382591, 3312382, 10337090, 9161186, 6894333, 13845407, 24139252, 21324007, 4257488, -8142820, -4020886, 4104266, -232109, -11839196, -13562232, -3972045, 1713012, -3729347, -10562114, -10211910, -7786433, -10705747, -16417157, -19010106, -19508370, -21434234, -22169521, -16972203, -8040452, -2129779, -830808, 547884, 4932979, 9480929, 10253167, 7376067, 4286161, 3356454, 3223139, 788251, -3899444, -6391352, -3579322]
40520c579322M653267P67211k767827q95163K330741P85527l335341l428569O45496
40511d823980L302523K496104P82437q68591k974191l238522J80868L157580R58187
40502a027585l327618l784904j870474k154675j552978N353969J2995386J0705449
40494A5336570R81838l219745J16928J52415m811958k382922J0101897J5965259
40486C2240282M920871q574262p384670K234970L512866l627387o970345m955847
40478A1396478n347710o522383n65743P382223L564105r796091j4523801m929023
40470a9341945L331710k47171m461159K493164J1590539Q026854l500404n853668
40462g962080L650518J0228585N129054k711517k397812L118198L964559j064146
$$ y = [-3579322, 1073945, 1841156, -926671, -1821834, 508907, 1294434, -2040907, -5469476, -4823980, -1521457, 974647, 1757084, 888493, -2085698, -5324220, -5143352, -1985772, -1027585, -4355203, -8140107, -10010581, -12165256, -13718234, -8364265, 4631121, 15336570, 16318408, 13098663, 13215591, 13368006, 8556048, 6173126, 16275023, 32240282, 37161153, 28586891, 21202221, 23437191, 26950057, 23322670, 16352325, 11396478, 6048768, -473615, -1039358, 6342865, 9906970, 110879, -14412922, -19341945, -16010235, -16257406, -20718565, -18225401, -6634862, 1391992, -2108412, -7962080, -4311562, 5917023, 11046077, 8334560, 5936748, 9054946, 13019505, 11955359]
40454A1955359m094590r46143L020057J282043m426214o656676k379478L345887
40446A100245M364039Q26310k396413k412791n55097J109366K618422M958234
40438I612315P495881P261302J430822q096743j3525880q450809K774906P743970
40430F245764R86587q352100q323191L98718O980949N623334J114585l21182J100735
40421E454199J615331k15224k608007k903811j73843K662679O43887o554060j1951935
40412a4030784r280712j484565L478126L081930J045987O9653K99627L011399
40404a3809339Q244901J0301348M233096m063028m127985K620328M239430k083690
40396E555061n032048R00367M439446l489593j2064465o270960P966719J1531037
$$ y = [11955359, 7860769, 6914626, 9934683, 11216726, 6790512, 133836, -2245642, 1100245, 5464284, 6290594, 3894181, 1481390, 926293, 2035659, 4654081, 9612315, 17108196, 24369498, 25800320, 17703577, 4177697, -4273112, -1498206, 6245764, 7232351, -1119749, -9442940, -9044222, -2063273, 3560061, 4674646, 4353464, 5454199, 7069530, 6854306, 4246299, 1342488, 1168645, 3831324, 4475211, -2078849, -14030784, -23311496, -24796061, -21317935, -18236005, -17190018, -17120365, -16820738, -13809339, -5564438, 4736910, 8970006, 4906978, 778993, 3399321, 7638751, 5555061, 523013, 1423380, 5862826, 2373233, -9691232, -15962192, -7995473, 3535564]
40388C535564J809450l386297O057684J7299210J4733244J816629p879191j1194676
40380B2791617j3841388j4746611p229695N135434Q777256J34058p352499l023809
40372i355637N350208N290690m85043p31832M287904M851408Q68299J682245N931170
40363A7689412N05108j4382265j8312630j048713J6985576J2029624p634662j4390440
40355h558990j921100R566307O906822l6187J21963L137901J605992j688985k356429
40346F777294l463036o897033o840666o81719L850643J303626j531688K432335
40338e050244P900691O563305R79122j398879r51285k079104l147471j015479
40330A800656M13424k589634l600480M121889J2511450P770198p215499j4140942
$$ y = [3535564, 5345014, 1958717, 8016401, 25315611, 40048855, 41865484, 33986293, 22791617, 8950229, -5796382, -13026077, -7890643, 886613, 1020671, -6331828, -9355637, -4005429, 1285261, 800218, 68386, 4356290, 9207698, 10075997, 11758242, 17689412, 18194520, 3812255, -14500375, -15549088, 1436488, 13466112, 5831450, -8558990, -10480090, -913783, 5993039, 5956852, 6078815, 9216716, 10822708, 9133723, 6777294, 3314258, -3582775, -10423441, -11105160, -7254517, -5950891, -7482579, -5050244, 2850447, 9413752, 10392874, 8993995, 8042710, 5963606, 2816135, 1800656, 2214080, -375554, -3976034, 145855, 12657305, 20427503, 13212004, -928938]
40322i28938m572250Q944499J0936046J645225p464040q917146m409546K79188
40314d486962R53953k123268m924151m437345j952558L44868L027000N906620
40306g691843M883981j640614o671325k534435P269953J2045541Q287775K031547
40298A5980580j952277m360900m993170j720921K744134K047017l393960n357577
40290a007074r3515O036396O437488K595332j025970l547012n243294m905861
40282g53510l575843m735897o838217k537975R202098J6925710J0268956m582507
40274A3372815j1352982l997271O948480Q738385R28693o602886o074337P26842
40266B687739N970224M442078j972983p606027q945800o247282j296617L431466
$$ y = [-928938, -5501188, 3443311, 14379357, 16024582, 8560542, -356604, -4766150, -4486962, -3533009, -5656277, -10580428, -15017773, -16970331, -16625463, -13598463, -7691843, -2807862, -4448476, -11119801, -13654236, -6384283, 5661258, 13949033, 15980580, 14028303, 9667403, 4674233, 2953312, 5697446, 7744463, 4350503, -1007074, -1100589, 4935807, 11373295, 13968627, 12942657, 9395645, 4152351, -753510, -4329353, -9065250, -15903467, -18441442, -9239344, 7686366, 17955322, 13372815, 2019833, -1977438, 4971042, 13709427, 14638120, 8035234, 1960897, 2687739, 8657963, 13100041, 11127058, 3521031, -5424769, -11672051, -12968668, -9537202]
40258i537202M451298K03245n124752m654694K473640Q501326N707440l945742
40250a925441j0231780n720059N632125J1776942N424776o883698j1368104l461188
40242a6756427O524838P044445n4214m028448p45488L859074M569537L129469
40234C542786K535579J981748l6677k644652m656200n563418l642609J986992
40226f496451O756746M222039l946924p918510k795346M174657L857871k291291
40218d437209n571264k665753J112212N83116k339401k137449K342687N896130
40210g216931L454962k914551o029505k719700K526385M429485L145458R62347
40202d362050k014686m406578j577537O133683Q882981K64246j0049187q372245
$$ y = [-9537202, -5085904, -4882659, -10007411, -14662105, -12188465, -3687139, 2020301, -1925441, -12157221, -17877280, -12245155, -468213, 4956563, -1927135, -13295239, -16756427, -10231589, -3187144, -3241358, -7269806, -8015294, -4156220, 413317, 3542786, 6078365, 8060113, 8023436, 5378784, 722584, -4840834, -8483443, -6496451, 260295, 4482334, 535410, -7383100, -10178446, -6003789, -2145918, -4437209, -10008473, -12674226, -11562014, -10978898, -13318299, -15455748, -13113061, -7216931, -3761969, -6676520, -12706025, -15425725, -12899340, -8469855, -5324397, -4362050, -6376736, -10783314, -12360851, -6227168, 2655813, 2920059, -7129128, -15501373]
40194a5501373J454554K946146o649174j0949547j74636J2886000J1849502L6216
40186d102312o508603j701249O108775Q195758M205752j445965m541000l017010
40178b805854J302237L720585J814665k428503o309221q254240n951218J184523
40170a7727026P384842O228512J544406K672691P521865L415197j0667276j7522139
40162a7148928o610142Q234131R041547L77736l29645Q298802J0243436k116962
40154I989975j6735057j8839176p948620M907472R593920M971352q68791M89245
40146a4439680O226953N451285k610711m184500P061399J6009604Q249611m676126
40138A7087835j597524J3507068J5863226j800404j8292346j6015359l391727
$$ y = [-15501373, -14046819, -11100673, -17749847, -28699394, -28874030, -15988030, -4138528, -4102312, -10610915, -12312164, -6203389, 1992369, 6198121, 4752156, 211156, -2805854, -1503617, 2216968, 4031633, 1603130, -4706091, -12960331, -18911549, -17727026, -10342184, -4113672, -2569266, 103425, 7625290, 11040487, 373211, -17148928, -23759070, -15524939, -6483392, -6105656, -6435301, 1863501, 12106937, 9989975, -6745082, -25584258, -33532878, -28625406, -19031486, -14060134, -14928925, -14439680, -8212727, -2761442, -5372153, -9556653, -2495254, 13514350, 21763961, 17087835, 15490311, 28997379, 44860605, 43060201, 24767855, 8752496, 5360769]
40131E360769K952090O71641m002940r527052j4610805j2108640L78440J2127610
40123a8758887J2437438N289285J179778J170813m61238l224577j373644M783713
40115A042681Q621060P588092N754908N813327N171905J013593n458309j0859312
40107A8687945j2773662j0671533n668919K69766N250392P182445M030145l007556
40099C299023p915586n639331J134052N447313N564138N573060P053129O623859
40091B1139657K380107l430081q700016j2282725j0890185k825060N336156M916354
40083d355793j339165k334383L127231L574866n131673j0183385q78323J3491593
40075d029032J5775087L685404j0142207j5293575j0797221P2128J1702082J5478979
$$ y = [5360769, 8312859, 8984500, 4981560, -4545492, -19156297, -31264937, -30886497, -18758887, -6321449, -1032164, 147614, 1318427, 857189, -2367388, -3741032, 1042681, 9663741, 17251833, 23006741, 28820068, 33991973, 35005566, 29547257, 18687945, 5914283, -4757250, -10426169, -10156403, -4906011, 2276434, 6306579, 3299023, -4616563, -10255894, -9121842, -3674529, 1889609, 7462669, 14515798, 21139657, 23519764, 20089683, 11389667, -893058, -11783243, -14608303, -9272147, -4355793, -5694958, -8029341, -4902110, -1327244, -6458917, -16642302, -17520625, -4029032, 11746055, 15431459, 5289252, -10004323, -20801544, -20729416, -9027334, 6451645]
40067F451645P071728n998335j1345063n897949K219138M419142o09059p830549
40059a1519302j0196652m505186L836326N876611J626687Q68575P374101J1208169
40051D569329M321519n015068m327664L258285M378312l188644q136667l963498
40043h104096K977164N385841M193979L027356K174584J079839L22277p47915
40035A0309029l007790m189257k110519J09891j289457l058733j47772L786538
40027D01930J269552m996559m896615K010190N205961J525041P45968P077682
40019H343150Q909434k785641j6777881j5562559p83688R030948M323263m544962
40011i847936m227894M063941R283743O356329M73147k313478k477707l381805
$$ y = [6451645, 13523373, 7525038, -3820025, -9717974, -7498836, -3079694, -3688753, -11519302, -21715954, -26221140, -22384814, -16508203, -14881516, -14012941, -6638840, 4569329, 8890848, 3875780, -451884, 2806401, 7184713, 3996069, -4140598, -8104096, -5126932, 258909, 4452888, 7480244, 9654828, 10734667, 11056944, 10309029, 7301239, 3111982, 1001463, 1111354, -178103, -3236836, -3384608, 401930, 1671482, -3325077, -8221692, -6211502, -1005541, 519500, 1265468, 8343150, 17252584, 14466943, -2310938, -17873497, -18657185, -9626237, -5302974, -9847936, -14075830, -10011889, -728146, 5628183, 6101330, 3787852, 1310145, -2071660]
40003b071660m731704l892638j701880j333077j279526L564399J1148846J0634442
39995A0337202j961268j3597159r701232M620326J0715437K180789q022374p538451
39987a2966730N83760O925840Q483524O783703K476002j916884j418730L452698
39979A2403183N135737N33488l492675j549962J636404N68187j484934l15371
39971A3434057Q631m571471p840135k589029N338155M416869m624526j0333758
39963f761207q006465l743072j873572k05451J565136J36812k868954j298452
39955b3055225M259427N972269K382332J595736O387194P242477k390310j3286685
39947a0892785j2408525j415770O678879N770756J914635J318562K028721j85343
$$ y = [-2071660, -6803364, -10696002, -12397882, -13730959, -15010485, -11446086, -297240, 10337202, 8375934, -5221225, -14922457, -10302131, 413306, 2594095, -5428279, -12966730, -12382970, -5457130, 3026394, 9810097, 12286099, 10369215, 8950485, 12403183, 17538920, 18072408, 14579733, 13029771, 14666175, 15234362, 13749428, 13434057, 13442688, 8871217, 1031082, -1557947, 3780208, 8197077, 3572551, -6761207, -14767672, -18510744, -20384316, -20589767, -19024631, -18887819, -21756773, -23055225, -18795798, -12823529, -10441197, -8845461, -2458267, 4784210, 2393900, -10892785, -23301310, -24717080, -18038201, -12267445, -10352810, -9034248, -7005527, -7190870]
39939g190870l754191l183413K809534Q048980N304263m113750r858128m755661
39931a6693236M670522N578380l847077j1849433r623737k100846K200180L840931
39923b7824316P324748R741941M889709m029820o492014j02691N295535J837849
39915i359059n555820p070793j447252L824305L328177j93048q25555K633246
39907a4665799N861085N581041M354767O288381R449948P514281k10718o395591
39899A7777395o481750n536269q737987j1119002n302109M796193Q385057M068913
39891b149559O32095J500139L46967n054003o635543K36940O957403L722694n881822
39882f324689j0487994n837643L099529J0032978J0647512L024339q110216j2284810
$$ y = [-7190870, -10945061, -14128474, -11318940, -3269960, 2034303, -2079447, -11937575, -16693236, -12022714, -6444334, -10291411, -22140844, -31764581, -33865427, -31665247, -27824316, -20499568, -10757627, -5867918, -9897738, -16389752, -16492443, -11196908, -9359059, -14914879, -21985672, -23432924, -19608619, -16280442, -16473490, -17299045, -14665799, -8804714, -3223673, 1131094, 7419475, 16869423, 24383704, 24172986, 17777395, 11295645, 5759376, -2978611, -14097613, -19399722, -14603529, -6218472, -2149559, -1517464, -17325, 329642, -4724361, -11359904, -11122964, -4165561, -442867, -6324689, -16812683, -22650326, -19550797, -9517819, 1129693, 4154032, -3956184, -16240994]
39874a6240994n682257K148864J507058l097910j104732O779426J0904587Q987873
39866D201915P439699P484345L048656o037766j1045257p836169k529162l3623
39858e307362K457829N970135M541281l649896r211505m042040N850447Q655270
39850E264159L242013r48520K049556P965413R013482K749462n625196p985487
39842A5724882j922097N180047M524887j935155m063280J001578M223574j325357
39834B1409079j0004331j2104754o098642K314921P141685M383036n149151j1836325
39826i944482n469334Q227675J0976188j640132j1004325l337598P842919L366302
39818i82787r832430r946316L899137J0961727K924521m961747j014966O069473
$$ y = [-16240994, -21923251, -19774387, -18267329, -21365239, -22469971, -15690545, -4785958, 4201915, 11641614, 19125959, 22174615, 16136849, 5091592, -2744577, -5273739, -5307362, -2849533, 3120602, 7661883, 4011987, -5199518, -9241558, -3391111, 5264159, 8506172, 7557652, 9607208, 17572621, 26586103, 29335565, 23710369, 15724882, 13802785, 18982832, 23507719, 21572564, 17509284, 18510862, 22734436, 21409079, 11404748, -700006, -6798648, -4483727, 2657958, 7040994, 1891843, -9944482, -15413816, -7186141, 3790047, 2149915, -8854410, -12192008, -4349089, -982787, -10815217, -20761533, -16862396, -5900669, -2976148, -7937895, -8952861, -2883388]
39810b883388N720530K274817K419215J182182o892507j4287897j1274994j669811
39802b5411853M385435O666605J1648096J7609255J5329132K791802j0510641
39795B2507831j4884195r805786j917706J693717j116597n273721l089755N929287
39787e956925J2665084R242095q31385p505699o381221j560719J582186J836815
39779C090231J071900J221876K466450L046928J672084R8790Q09124K169084j96236
39770A5450231o389737j0745826q687184j481365O364463J0381784P230915j783223
39762A0340058q415919n600024J808481K391902m964447r221401m345262K691359
39754a5315253N328307P094149J0930040J0318148R11578q581257q474451l327689
$$ y = [-2883388, 2837142, 5111959, 7531174, 8713356, 1820849, -12467048, -23742042, -25411853, -21026418, -14359813, -2711717, 14897538, 30226670, 33018472, 22507831, 7623636, -2182150, -4099856, -2406139, -3522736, -8796457, -11886212, -5956925, 6708159, 15950254, 15118869, 7613170, 1231949, -328770, 1253416, 3090231, 4162131, 5384007, 7850457, 10897385, 12569469, 12668259, 13477383, 15646467, 15450231, 9060494, -1685332, -10372516, -11853881, -5489418, 4892366, 12123281, 10340058, 1924139, -3675885, -1867404, 524498, -4439949, -13661350, -18006612, -15315253, -9986946, -2892797, 8037243, 18355391, 19266969, 10685712, 2211261, -1116428]
39746a116428l132022n920425k542648N618888P698141O43842p048472q736004
39738a4535128n838828r64227M623668O930773L177299l98560M337210J2530152
39730I862359J0865287j569376j0132094o227693R71622Q92038k462820l54804
39722A844519M455695L045819l604312n671014O0753N883510N007583l56496m757767
$$ y = [-1116428, -4248450, -10168875, -12711523, -7092635, 605506, 1249348, -5799124, -14535128, -20373956, -21338183, -16714515, -9783742, -6606443, -7005003, -2667793, 9862359, 20727646, 19158270, 9026176, 2798483, 3770105, 4662143, 2199323, 1844519, 6300214, 9346033, 5741721, 70707, 131460, 6014970, 11022553, 10666057, 5908290]
$$ [...]
##END NTUPLES=NMR SPECTRUM
##END=
