##TITLE=31Pdec_2PM1003
 CDCl3, 24 sc
 12.3.2019
##JCAMPDX= 6.0         $$ Bruker NMR JCAMP-DX V2.0
##DATA TYPE= NMR SPECTRUM
##DATA CLASS= NTUPLES
##ORIGIN= UXNMR, Bruker Analytische Messtechnik GmbH
##OWNER= root
$$ XWIN-NMR		Version 3.5
$$ Tue Mar 12 14:35:51 2019 Russian Standard Time (UT+4h)  she@DPX200
##.OBSERVE FREQUENCY= 81.013821
##.OBSERVE NUCLEUS= ^31P
##.ACQUISITION MODE= SIMULTANEOUS
##.ACQUISITION SCHEME= undefined
##.AVERAGES= 24
##.DIGITISER RES= 17
##SPECTROMETER/DATA SYSTEM= spect
##.PULSE SEQUENCE= zgpg30
##.SOLVENT NAME= CDCl3
##.SHIFT REFERENCE= (INTERNAL, CDCl3, 0, 182.463)
##AUDIT TRAIL= $$ (NUMBER, WHEN, WHO, WHERE, WHAT)
$$ ##TITLE= Audit trail, XWIN-NMR		Version 3.5
$$ ##JCAMPDX= 5.01
$$ ##ORIGIN= Bruker BioSpin GmbH
$$ ##OWNER= she
$$ F:/spectra/data/she/nmr/P31/1/pdata/1/auditp.txt
$$ ##AUDIT TRAIL=  $$ (NUMBER, WHEN, WHO, WHERE, WHAT)
(   1,<2019-03-12 14:34:53.28 +0400>,<she>,<DPX200>,
      <created by zg, POWCHK disabled, PULCHK disabled
       configuration hash MD5:
       00 E9 B6 7A A2 85 ED C7 34 08 36 98 17 FE 4E 26
       data hash MD5: 32K
       84 03 2C 11 53 4C 8C 71 B1 B6 BF 2F F3 0E DB B9>)
(   2,<2019-03-12 14:34:56.64 +0400>,<she>,<DPX200>,
      <Start of raw data processing
       efp BC_mod = 2 LB = 1 FT_mod = 6 PKNL = 1 PHC0 = -1936.563 PHC1 = 518.599 SI = 64K 
       data hash MD5: 64K
       39 C9 61 F4 D2 AA EC 8E 60 4F 0E DE EE AA 17 86>)
(   3,<2019-03-12 14:35:13.67 +0400>,<she>,<DPX200>,
      <pk PHC0 = -48.53181 PHC1 = 0 
       data hash MD5: 64K
       6C 17 9D 99 CE 32 A1 3F FC CD 40 33 FB 6B 1A 60>)
(   4,<2019-03-12 14:35:19.20 +0400>,<she>,<DPX200>,
      <abs ABSG = 5 
       data hash MD5: 64K
       9D F7 BF 1C 09 28 AC 62 5E 48 85 16 94 9E 44 7A>)
$$ ##END=
$$ 
$$ hash MD5
$$ A2 F6 C8 05 90 69 E3 96 74 F5 8E 10 81 EC A1 5D
##$RELAX= 
##$RELAX= 
##$RELAX= 
##$RELAX= 
##$RELAX= 
##$RELAX= 
##$RELAX= 
##$RELAX= 
$$ Bruker specific parameters
$$ --------------------------
##$DU= <F:/spectra>
##$EXPNO= 1
##$NAME= <P31>
##$PROCNO= 1
##$TYPE= <nmr>
##$USER= <she>
##$AMP= (0..31)
100 100 100 100 100 100 100 100 100 100 100 100 100 100 100 100 100 100 
100 100 100 100 100 100 100 100 100 100 100 100 100 100 
##$AQSEQ= 0
##$AQ_mod= 1
##$AUNM= <au_zg>
##$AUTOPOS= <>
##$BF1= 81.014009
##$BF2= 200.13
##$BF3= 200.13
##$BF4= 200.13
##$BF5= 200.13
##$BF6= 200.13
##$BF7= 200.13
##$BF8= 200.13
##$BYTORDA= 1
##$CFDGTYP= 0
##$CFRGTYP= 5
##$CHEMSTR= <none>
##$CNST= (0..31)
1 1 145 1 1 1 1 1 1 1 1 1 1 1 1 1 1 1 1 1 1 1 1 1 1 1 1 1 1 1 1 1 
##$CPDPRG= <waltz16>
##$CPDPRG1= <>
##$CPDPRG2= <waltz16>
##$CPDPRG3= <>
##$CPDPRG4= <mlev>
##$CPDPRG5= <mlev>
##$CPDPRG6= <mlev>
##$CPDPRG7= <mlev>
##$CPDPRG8= <mlev>
##$CPDPRGB= <>
##$CPDPRGT= <>
##$D= (0..31)
0 1 0 0 0 0 0 0 0 0 0 0.03 2e-05 3e-06 0 0 0 0 0 0 0 0 0 0 0 0 0 0 0 0 
0 0 
##$DATE= 1552386892
##$DBL= (0..7)
120 120 120 11 120 120 24 19 
##$DBP= (0..7)
150 150 150 150 150 150 150 150 
##$DBP07= 0
##$DBPNAM0= <>
##$DBPNAM1= <>
##$DBPNAM2= <>
$$ [...]
##$SUBNAM3= <"">
##$SUBNAM4= <"">
##$SUBNAM5= <"">
##$SUBNAM6= <"">
##$SUBNAM7= <"">
##$SUBNAM8= <"">
##$SUBNAM9= <"">
##$SW= 369.568048894756
##$SWIBOX= (0..15)
0 1 3 0 0 0 0 0 0 0 0 0 0 0 0 0 
##$SW_h= 29940.119760479
##$TD= 32768
##$TD0= 1
##$TE= 0
##$TE2= 300
##$TE3= 300
##$TEG= 300
##$TL= (0..7)
0 120 53 12 22 120 120 120 
##$TP= (0..7)
150 150 150 150 150 150 150 150 
##$TP07= 0
##$TPNAME0= <>
##$TPNAME1= <>
##$TPNAME2= <>
##$TPNAME3= <>
##$TPNAME4= <>
##$TPNAME5= <>
##$TPNAME6= <>
##$TPNAME7= <>
##$TPOAL= (0..7)
0.5 0.5 0.5 0.5 0.5 0.5 0.5 0.5 
##$TPOFFS= (0..7)
0 0 0 0 0 0 0 0 
##$TUNHIN= 0
##$TUNHOUT= 0
##$TUNXOUT= 0
##$USERA1= <user>
##$USERA2= <user>
##$USERA3= <user>
##$USERA4= <user>
##$USERA5= <user>
##$V9= 5
##$VALIST= <valist>
##$VCLIST= <CCCCCCCCCCCCCCC>
##$VD= 0
##$VDLIST= <DDDDDDDDDDDDDDD>
##$VPLIST= <PPPPPPPPPPPPPPP>
##$VTLIST= <TTTTTTTTTTTTTTT>
##$WBST= 1024
##$WBSW= 4
##$XGAIN= (0..3)
0 0 0 0 
##$XL= 0
##$YL= 0
##$YMAX_a= 58370
##$YMIN_a= -62596
##$ZGOPTNS= <>
##$ZL1= 120
##$ZL2= 120
##$ZL3= 120
##$ZL4= 120
##$ABSF1= 182.463
##$ABSF2= -187.1042
##$ABSG= 5
##$ABSL= 3
##$ALPHA= 0
##$AQORDER= 0
##$ASSFAC= 0
##$ASSFACI= 0
##$ASSFACX= 0
##$ASSWID= 0
##$AUNMP= <proc_1d>
##$AZFE= 0.1
##$AZFW= 0.5
##$BCFW= 0
##$BC_mod= 2
##$BYTORDP= 0
##$COROFFS= 0
##$CY= -3
##$DATMOD= 1
##$DC= 0
##$DFILT= <>
##$DTYPP= 0
##$F1P= 0
##$F2P= 0
##$FCOR= 1
##$FTSIZE= 65536
##$FT_mod= 6
##$GAMMA= 0
##$GB= 0
##$INTBC= 1
##$INTSCL= 5.30512e-09
##$ISEN= 30
##$LB= 1
##$LEV0= 0
##$LPBIN= 0
##$MAXI= 10000
##$MC2= 0
##$MEAN= 0
##$ME_mod= 0
##$MI= 50
##$NCOEF= 0
##$NC_proc= -4
##$NLEV= 6
##$NOISF1= 182.463
##$NOISF2= 159.3651
##$NSP= 0
##$NTH_PI= 0
##$NZP= 0
##$OFFSET= 182.463
##$PC= 4
##$PHC0= -1985.095
##$PHC1= 518.599
##$PH_mod= 1
##$PKNL= yes
##$PPARMOD= 0
##$PSCAL= 0
##$PSIGN= 0
##$REVERSE= no
##$SF= 81.0140089999434
##$SI= 65536
##$SIGF1= 159.3651
##$SIGF2= -187.1042
##$SINO= 113.3802
##$SIOLD= 16384
##$SREGLST= <1H.CDCl3>
##$SSB= 0
##$STSI= 65536
##$STSR= 0
##$SW_p= 29940.119760479
##$SYMM= 0
##$S_DEV= 0
##$TDeff= 32768
##$TDoff= 0
##$TI= <>
##$TILT= no
##$TM1= 0
##$TM2= 0
##$TOPLEV= 0
##$USERP1= <user>
##$USERP2= <user>
##$USERP3= <user>
##$USERP4= <user>
##$USERP5= <user>
##$WDW= 1
##$XDIM= 65536
##$YMAX_p= 346013537
##$YMIN_p= -3065792
$$ End of Bruker specific parameters
$$ ---------------------------------
##NTUPLES= NMR SPECTRUM
##VAR_NAME=  FREQUENCY,     SPECTRUM/REAL,   SPECTRUM/IMAG
##SYMBOL=    X,             R,               I
##VAR_TYPE=  INDEPENDENT,   DEPENDENT,       DEPENDENT
##VAR_FORM=  AFFN,          ASDF,            ASDF
##VAR_DIM=   65536,         65536,           65536
##UNITS=     HZ,            ARBITRARY UNITS, ARBITRARY UNITS
##FACTOR=    0.456856943014862, 1,           1
##FIRST=     14782.0589164792, 0,            0
##LAST=      -15158.0608439998, 0,           0
##MIN=       -15158.0608439998, -3065792,    0
##MAX=       14782.0589164792, 346013537,    0
$$ Real data points
##PAGE= N=1
##DATA TABLE= (X++(R..R)), XYDATA
$$ [...]
43615 56854 -258608 -428820 -502421 -713295 -829820 -400218 361431 661665 245103 -260956
43605 -260956 -352037 -314930 -529241 -739243 -548344 -167262 -89681 -322781 -473393 -391968
43595 -391968 -248960 -134551 -44993 -148041 -597902 -1117423 -1181796 -669169 -22745 276720
43585 276720 160766 -110268 -248288 -126620 149021 323990 251320 37617 -138670 -249611
43575 -249611 -354708 -447666 -499446 -528497 -506750 -345831 -90597 74906 151043 394513
43565 394513 866432 1194756 1075007 736310 551222 439494 119847 -234283 -152451 344734
43555 344734 658004 419375 -57067 -281475 -159002 111242 355928 442100 256321 -125482
43545 -125482 -458614 -653565 -843608 -1026079 -954975 -579610 -270279 -324580 -503944 -392234
43535 -392234 -35853 128018 -109327 -512406 -776352 -826731 -743427 -642570 -647639 -744187
43525 -744187 -666201 -194147 413298 604067 261588 -65484 124857 607312 751655 347349
43515 347349 -230211 -583583 -654525 -515022 -176919 247897 491305 427296 223276 37873
43505 37873 -207832 -571984 -849672 -851841 -719687 -659435 -558846 -235486 103983 116248
43495 116248 -55850 56068 442926 543435 114076 -393364 -575617 -636719 -822765 -831853
43485 -831853 -336500 308024 519397 399305 519214 930800 1095514 817024 543397 556718
43475 556718 494556 21102 -506990 -476352 150877 803613 945472 495634 -237706 -804586
43465 -804586 -908450 -656089 -442626 -482592 -586226 -488594 -203238 92727 325119 481144
43455 481144 461691 195933 -176202 -400988 -334331 10750 499079 845682 729978 126857
43445 126857 -571559 -907275 -748841 -275306 236142 492089 304466 -147884 -384883 -200161
43435 -200161 32245 -78151 -276588 18158 829240 1511453 1560985 1128611 632140 248741
43425 248741 -30888 -182910 -234009 -328725 -480830 -455802 -136400 173327 88656 -310850
43415 -310850 -546690 -319249 204427 665803 867304 833623 710145 655380 707928 726108
43405 726108 560570 286573 145951 257126 502103 687598 677152 395287 -83261 -423127
43395 -423127 -268526 274735 621929 371560 -181777 -419987 -156893 239346 403340 359737
43385 359737 336757 449906 646034 777273 679088 344493 42188 61635 322197 478510
43375 478510 444691 496238 746102 889536 701860 437139 384696 332305 -65367 -585078
43365 -585078 -656647 -246778 35677 -181169 -560309 -664996 -576385 -601004 -740082 -817867
43355 -817867 -858563 -945215 -906085 -546330 -60837 191431 248789 455019 808197 853941
43345 853941 363377 -267991 -517688 -341538 -48140 174461 310018 271652 -41954 -486610
43335 -486610 -755914 -736103 -548424 -254840 185035 607081 629848 168609 -273925 -128792
43325 -128792 531628 1083477 1094641 692145 197480 -259086 -623369 -717831 -435530 -4091
43315 -4091 203403 102009 -36322 64650 408792 791368 996630 913512 572208 125235
43305 125235 -232368 -335065 -84900 456231 988133 1167227 990729 813745 837678 791337
43295 791337 365269 -232528 -516673 -421997 -346208 -485599 -565461 -378092 -196180 -374268
43285 -374268 -785926 -948698 -600835 45768 550169 614243 303992 -15456 -70862 -23708
43275 -23708 -231080 -661575 -873764 -689802 -516208 -733850 -1091427 -1063289 -581654 -28220
43265 -28220 337236 534733 563199 376814 136994 68602 31111 -354725 -1051042 -1469317
43255 -1469317 -1185705 -478557 62891 203667 99162 -99081 -352576 -548264 -505524 -205141
43245 -205141 170537 459078 647483 755078 718577 480657 139974 -78229 -28030 217561
43235 217561 468714 628643 728311 770791 686998 523785 534779 907913 1450898 1725917
43225 1725917 1517088 1034902 638095 480678 477888 505294 536050 608013 716573 779149
43215 779149 736063 658638 659891 686623 541701 179412 -178372 -335091 -365140 -405311 -371429
43204 -371429 -124101 200899 307634 138231 -96344 -243255 -312369 -299364 -190228 -123012
43194 -123012 -245561 -415083 -356643 -124553 -45235 -169834 -201129 -57046 -38585 -248407
43184 -248407 -337366 -146424 -123150 -633678 -1243639 -1258998 -737596 -341914 -306616 -215217
43174 -215217 151180 390139 137960 -348364 -577142 -431680 -114289 197607 337052 80437
43164 80437 -533913 -1009583 -895138 -385466 -69359 -139572 -230632 -57398 188447 238308
43154 238308 203292 345042 584164 563827 163031 -333255 -618911 -685312 -656463 -524641
43144 -524641 -253110 -11128 -31659 -222578 -176612 299074 844814 941521 559799 200116
43134 200116 278940 674077 962026 945921 792730 717412 707786 606787 362224 108644
43124 108644 24477 170100 471071 799763 1026329 1035041 797613 461924 266681 279949
43114 279949 298523 132031 -76428 -11612 322062 515277 292917 -80812 -177928 -39378
43104 -39378 -96531 -476027 -750504 -531174 -14789 305899 285858 203755 297885 505613
43094 505613 637825 564600 220436 -348064 -910489 -1232011 -1345991 -1438666 -1462385 -1155313
43084 -1155313 -528114 -17516 35155 -191306 -313100 -256339 -193242 -156556 -49800 53682
43074 53682 -38963 -286751 -389805 -164970 254210 613331 755169 650768 404010 220415
43064 220415 187861 115560 -201540 -600965 -703606 -448091 -178436 -137730 -171159 -56458
43054 -56458 134302 171421 -31277 -395578 -773999 -939902 -695525 -160741 226664 172661
43044 172661 -169852 -497987 -729615 -860992 -700978 -113786 574983 803612 454519 10879
43034 10879 -59273 175559 344879 324274 318822 461472 553602 301991 -282574 -855049 -1111695
43023 -1111695 -1084648 -1004707 -987760 -990840 -990106 -994373 -894832 -534740 -977 355368 310327
43012 310327 36190 -127950 -49166 148028 268959 185705 -86066 -346236 -368313 -190351
43002 -190351 -118788 -351347 -725130 -912971 -727109 -192881 458062 807940 561001 -26106
42992 -26106 -317606 -76767 256409 277674 193269 319922 437406 201505 -111690 25245
42982 25245 428223 387341 -142233 -338346 237883 932468 999310 693042 732097 1096577
42972 1096577 1114563 599671 168892 310290 710098 764865 363382 -142605 -477026 -618795
42962 -618795 -582278 -349265 -23900 201211 308182 491322 823658 1051432 896760 465701
42952 465701 141413 104124 192669 265467 415902 684638 817735 579903 164397 -1570
42942 -1570 194706 473106 622348 757176 1039210 1377583 1550119 1491958 1345183 1283216
42932 1283216 1337433 1342702 1057630 430945 -255552 -614066 -527068 -217674 19238 51677
42922 51677 -68252 -174099 -108474 90975 179585 12826 -232186 -324652 -341393 -488538
42912 -488538 -669341 -597796 -322889 -224965 -404872 -492069 -248923 11373 -110220 -507461
42902 -507461 -760571 -712734 -531934 -331835 -49417 346855 775086 1134368 1292444 1061373
42892 1061373 420953 -277663 -580650 -423546 -149350 -13287 102303 380820 686660
42883 686660 705936 413039 164977 237145 432544 361657 47367 -47463 301657 672245
42873 672245 530041 -32394 -444476 -439336 -290387 -273369 -304401 -220484 -63147 72794
42863 72794 175539 160382 -118813 -542608 -715765 -468579 -71597 231901 557396 985582
42853 985582 1198281 881603 229428 -339178 -743028 -1116911 -1325737 -1079093 -469483 27954
42843 27954 107312 -126767 -418418 -541240 -297884 286404 801226 855255 628487 632307
42833 632307 920073 992563 594531 148729 156654 520512 758882 657017 400504 206808
42823 206808 116250 113496 222052 415218 544047 439824 108939 -200728 -215834 37240
42813 37240 232787 157294 -16234 -4560 192935 389721 550436 742730 850807 681361
42803 681361 333817 124800 125768 116470 35692 96235 339429 461941 287970 73056 77829
42792 77829 131671 -59007 -379917 -443947 -159434 163959 262151 192152 117344 39936 -145026
42781 -145026 -440521 -688970 -703650 -431987 4275 421692 697107 751661 494879 -71983
42771 -71983 -695939 -974296 -706681 -85669 496760 778912 784260 751352 907496 1208888
42761 1208888 1325615 1015265 487502 224633 424967 793950 919396 691205 315970
42752 315970 86902 190205 577341 966772 1102936 1038396 1016586 1089158 1059192 820225
42742 820225 508472 253039 12854 -241043 -401644 -398777 -307039 -190722 -35022 99388
42732 99388 84916 -30766 -53145 -3643 -139359 -459589 -541576 -122612 462378 738568
42722 738568 723619 742338 825921 724223 417661 198439 233418 382596 483188 525580
42712 525580 508470 381832 193678 76266 33394 -69664 -266371 -422869 -455650 -448240
42702 -448240 -499783 -596313 -677629 -721498 -737411 -763888 -848964 -929816 -796191 -346150 152924
42691 152924 270494 -74618 -486245 -559218 -339091 -205372 -382723 -700180 -836542 -698847
42681 -698847 -473438 -337215 -259416 -154056 -67615 -37099 95205 425525 624726 251302
42671 251302 -502109 -842413 -397720 218151 227220 -288045 -654223 -623915 -537839 -589800
42661 -589800 -562415 -372541 -301348 -442805 -379604 244990 1104871 1483589 1087592 340818
42651 340818 -79681 133597 699607 1049091 877298 430095 195738 355353 658222 789127
42641 789127 667621 387370 74002 -134498 -134183 44577 286611 540490 785251 890952
42631 890952 721410 382776 154493 137754 178133 172633 220970 385944 514126 422534 124531
42620 124531 -225022 -498381 -653295 -730927 -820492 -924426 -891660 -628602 -315146 -214011
42610 -214011 -326985 -471432 -612849 -808146 -881104 -559821 26473 398972 373873 256399
42600 256399 281933 314735 282776 415051 734391 783109 289703 -272127 -300181 48057
42590 48057 150414 -74182 -71441 438911 1022807 1144759 799079 356250 104174 117949
42580 117949 332506 559882 585921 373724 77331 -165132 -309838 -293174 -48141 326841
42570 326841 610332 725721 791261 849922 741608 353438 -138056 -397359 -256942 125943
42560 125943 391427 271518 -150645 -494723 -488400 -275836 -202196 -347476 -448147 -270791
42550 -270791 110575 432371 494190 279465 -45429 -246013 -247902 -221492 -312530 -366153 -127377
42539 -127377 329096 627451 569274 332232 136977 -27197 -234884 -412075 -448656 -371964
42529 -371964 -281778 -234179 -268546 -400476 -512348 -422053 -149834 61121 85049 81851 219267
42518 219267 441888 647743 853071 1002785 879303 460611 136497 245935 587222 751125
42508 751125 773760 1001175 1381269 1426919 983741 538782 531232 753574 735552 414410
42498 414410 91443 -53826 -69150 -5037 96557 101280 -38959 -117719 23554 158417
42488 158417 -4198 -277344 -215783 159484 367484 277757 359637 870302 1310674 1112098
42478 1112098 478813 42959 -56446 -199123 -535871 -803670 -890884 -1025707 -1272596 -1340809
42468 -1340809 -1113780 -945809 -1152710 -1544001 -1750785 -1724326 -1598734 -1328646 -833560 -306506
42458 -306506 8741 207612 487251 625670 189075 -695684 -1260961 -1001997 -294052 160734
42448 160734 199624 157980 171710 417 -414489 -647652 -308761 368621 772785 667768
42438 667768 383420 226798 53075 -372962 -866024 -1023712 -826891 -660825 -729963 -814478
42428 -814478 -700736 -502630 -378177 -242295 -6317 162048 105194 -16298 5287 36549
42418 36549 -154184 -408704 -345378 36870 328031 300355 150740 90990 71505 27733 47745
42407 47745 125266 55975 -219348 -433900 -373789 -212851 -244145 -462737 -636242 -637739 -508983
42396 -508983 -339811 -268736 -434747 -728360 -784767 -482001 -254800 -567134 -1192836 -1427440
42386 -1427440 -1012484 -443707 -250221 -334423 -253259 112763 470562 568911 450226 248305
42376 248305 -28663 -410760 -786930 -943574 -775716 -393469 -8569 233605 285980 136451
42366 136451 -184056 -535279 -726054 -694681 -547234 -362049 -66257 382952 791209 881296
42356 881296 645464 376395 300893 321851 210512 -50910 -255050 -279046 -275202 -460241
42346 -460241 -750059 -745315 -201921 537465 782026 250922 -572318 -1009848 -985371 -999889
42336 -999889 -1360563 -1756652 -1721657 -1254301 -757984 -517069 -476898 -472593 -434719 -360488 -275355
42325 -275355 -257786 -350382 -432049 -345070 -168222 -164713 -402465 -644441 -713492 -713150 -705051 -444919
42313 -444919 214761 836475 780488 99780 -397311 -157202 423508 597411 265249 -19795
42303 -19795 95388 344935 332715 86328 -65058 32655 214138 260182 140271 -26788
42293 -26788 -142506 -179225 -99778 143991 451767 520447 138194 -478384 -849137 -776915
42283 -776915 -512547 -309828 -104727 195410 414749 400793 361938 538575 731306 593903
42273 593903 254410 133281 213134 86031 -224931 -163507 406068 806534 537591 80025
42263 80025 121035 434220 279327 -332810 -606219 -199503 283747 269002 12335 53356
42253 53356 378325 598122 618755 634663 640571 439301 90781 -80892 14946 94668 -25310
42242 -25310 -131717 10138 235387 223320 42649 128569 669381 1277354 1427299 1068155
42232 1068155 608157 371976 294347 169654 -6963 -65164 101521 446538 832317 1060967
42222 1060967 933811 456878 -39311 -173756 43598 199114 -9432 -377275 -456514 -142052
42212 -142052 202223 245023 133874 265867 681605 928089 624448 -20654 -461677 -494864
42202 -494864 -422539 -523462 -648677 -512276 -169610 61709 75045 89710 255753 382154
42192 382154 202867 -215216 -506764 -443947 -210252 -173568 -441684 -738105 -738523 -441575
42182 -441575 -125861 -6188 -69037 -224300 -426508 -573511 -473261 -87932 286788 285415
42172 285415 -94848 -488097 -610532 -576070 -699945 -1096931 -1577495 -1895242 -1976997 -1874088
42162 -1874088 -1593175 -1118010 -593842 -301330 -314240 -325917 -36004 374485 453609 175709
42152 175709 72272 494620 1050500 1067543 434249 -333393 -759267 -815988 -690688 -471751
42142 -471751 -177381 115960 310270 365259 290556 134776 -9967 -76740 -87516 -70506
42132 -70506 35061 273877 523635 597590 479460 319082 213108 131745 49516 -1932
42122 -1932 -21578 -51599 -93630 -118095 -140755 -180002 -169940 -39849 150836 276798 297840
42111 297840 219168 -21853 -453250 -900236 -1099018 -958757 -582582 -119102 237865 236197
42101 236197 -180336 -674899 -842757 -681618 -485121 -373659 -265614 -217704 -360391 -509614
42091 -509614 -317690 118362 279673 -6876 -305672 -275600 -149392 -231553 -387967 -398428
42081 -398428 -391532 -503958 -491651 -169118 98502 -99473 -478418 -429906 35871 366191
42071 366191 405325 553577 904371 919813 253195 -650224 -1132860 -1101875 -882858 -655473
42061 -655473 -437517 -373510 -596775 -905027 -942373 -678666 -420435 -364370 -408079 -415086 -406867
42050 -406867 -413660 -345195 -146100 38992 224 -263924 -514074 -547042 -453079 -516413 -834718
42039 -834718 -1126966 -1036838 -592033 -193156 -107394 -162774 -73899 102571 73782 -206353
42029 -206353 -447103 -466643 -468625 -713289 -1090288 -1235532 -997914 -586800 -271125 -108704
42019 -108704 10260 203065 504161 804645 880501 637765 323259 276743 444664 410755
42009 410755 14353 -358027 -298247 78876 386310 517531 612183 668112 585790 471631
41999 471631 479265 435275 67513 -447900 -655987 -527010 -446244 -451836 -117740 597997 1032134
41988 1032134 726835 124354 -109435 -5339 -22315 -235032 -360095 -338932 -345045 -384825
41978 -384825 -376975 -445107 -658484 -710537 -393037 -147606 -484008 -1019162 -870004 6105
41968 6105 658034 465438 -144462 -550613 -759237 -967970 -978952 -612633 -234127 -276521
41958 -276521 -553588 -591210 -395678 -341070 -455183 -391529 -94200 34731 -246662 -634166
41948 -634166 -700272 -444334 -226492 -302994 -608733 -948830 -1239550 -1478900 -1551165 -1242920
41938 -1242920 -558565 127112 447817 501140 660131 967979 1068374 804369 504924 473954
41928 473954 523099 310581 -83551 -255056 -37037 328078 535297 506673 351950 216998
41918 216998 173764 165851 103164 51046 186606 477655 582102 240395 -347879 -715177
41908 -715177 -630265 -281556 -14348 13323 -52055 40103 269689 256596 -250743 -880586
41898 -880586 -982720 -486184 3696 76496 11470 158469 312212 125324 -232287 -338540
41888 -338540 -204501 -181657 -324135 -331473 -68795 278341 531341 641654 560771 334807
41878 334807 211898 286610 212861 -264942 -683735 -384612 414758 789159 437190 98476
41868 98476 362043 763391 556796 -158590 -695511 -819593 -884740 -1053333 -990932 -442646
41858 -442646 307974 744815 664172 281506 -64391 -198455 -166779 -104688 -80197 -62030
41848 -62030 4296 136203 288996 338693 175044 -93448 -153867 118185 405862 335587
41838 335587 5531 -182338 -138366 -141237 -287013 -334946 -208131 -196842 -455982 -704651
41828 -704651 -690660 -589171 -627679 -644727 -392723 -19173 152331 137213 201580 399349
41818 399349 570402 685546 809484 797412 436441 -104362 -345274 -99563 293717 430577
41808 430577 278564 50879 -128333 -283109 -435763 -527453 -473834 -288374 -152479 -262830
41798 -262830 -545615 -678996 -540159 -452759 -751658 -1231635 -1333668 -853143 -189630 134488
41788 134488 -8383 -332175 -455670 -238010 62420 25776 -382679 -651550 -358711 195580
41778 195580 368200 96067 -27356 354152 859651 945645 586251 133494 -185346 -351940
41768 -351940 -374941 -306153 -289723 -376056 -420449 -334782 -265093 -333961 -397649 -289561 -142531
41757 -142531 -211120 -481437 -698451 -702506 -525489 -231996 120686 418673 570921 600523
41747 600523 527541 288680 -66111 -277577 -214879 -129396 -264011 -377343 -70777 487506
41737 487506 644144 135202 -560909 -901847 -915354 -922581 -973341 -884419 -632021 -380322
41727 -380322 -201723 -4780 301487 705793 1067847 1110667 629091 -153121 -656572 -586347
41717 -586347 -289057 -228178 -347657 -317069 -203386 -393807 -879581 -1133980 -846037 -356302
41707 -356302 -148142 -239350 -326548 -267521 -141144 -1226 170673 358193 525629 641276
41697 641276 589050 246796 -220432 -396281 -151713 100714 -34384 -359554 -417282 -194218
41687 -194218 -54294 -88221 -33436 147068 113585 -276828 -674751 -726989 -516766 -306408
41677 -306408 -161722 -64548 -94209 -226184 -225201 -34823 -4488 -367291 -728781 -533933 82795
41666 82795 418477 188781 -94905 103571 605012 818297 510545 -34992 -478855 -726547
41656 -726547 -795514 -668386 -396217 -188019 -225989 -409931 -419869 -93870 340902 514722
41646 514722 347941 111719 72794 233976 449636 610094 622698 394212 -12260 -328775
41636 -328775 -344003 -119372 163770 421413 588780 516886 180411 -153697 -221653 -114088
41626 -114088 -75825 -86867 39560 245197 282576 133887 -8604 -154718 -479395 -847369
41616 -847369 -853902 -468620 -173203 -259021 -436804 -396114 -289925 -308941 -213312 225490 642435
41605 642435 496202 -104371 -518202 -430284 -105703 164687 377148 539813 543628 417894
41595 417894 352216 378588 365118 370129 613736 1009087 1137227 853169 525209 456505 446513
41584 446513 213660 -85697 -131731 6862 5195 -153384 -140810 187584 547928 591683
41574 591683 320054 58393 106605 425874 633707 385796 -188762 -579212 -516027 -311420
41564 -311420 -402373 -746972 -947437 -849230 -692764 -684900 -716287 -569536 -200001 247693
41554 247693 553044 551031 314683 177501 378399 722989 831522 676295 561042 572105
41544 572105 451767 138901 17098 350385 810078 923591 742539 644396 639145 374413
41534 374413 -179686 -554800 -451002 -165603 -102472 -180566 -68857 205574 281310 27981
41524 27981 -290520 -466264 -619266 -869019 -1018037 -815748 -370767 -18532 146482 311588
41514 311588 515426 500626 144477 -223446 -193500 160967 363397 153713 -207184 -287727
41504 -287727 51672 601198 1032705 1108313 813587 395285 161109 147701 85474 -224518
41494 -224518 -623169 -807647 -728113 -606338 -607280 -657924 -606776 -438501 -272973 -193530 -118564
41483 -118564 108979 452047 576289 207943 -398883 -623893 -244828 232475 252252 -36576
41473 -36576 -74274 239804 459900 350165 196271 218063 178641 -113029 -323323 -51069
41463 -51069 492246 721376 475701 144391 41193 88470 162798 322718 535830 552602
41453 552602 300475 117869 289125 544361 387525 -145313 -436286 -89735 516495 695120
41443 695120 287026 -226765 -394720 -291925 -254464 -354076 -373970 -217866 -71751 -105387
41433 -105387 -230282 -278501 -260365 -283194 -328539 -296835 -208083 -165312 -148794 -48252 94173
41422 94173 87716 -97893 -227744 -122808 76125 112751 -39749 -205061 -286990 -336921 -379487
41411 -379487 -377628 -396730 -601826 -983000 -1228282 -1032955 -485365 1396 146141 69478
41401 69478 79767 300717 582707 707312 589317 321770 118362 181943 506832 793881
41391 793881 683066 139724 -465234 -724480 -584218 -312987 -165708 -181864 -268927 -352723
41381 -352723 -413070 -449774 -468644 -486815 -522930 -558117 -494592 -201929 313927 810553 1007664
41370 1007664 917024 839367 972590 1172104 1196304 1024633 778856 486880 139904 -135304
41360 -135304 -213935 -204747 -274194 -301109 -34846 401583 541468 220231 -156429 -180500 30676
41349 30676 126558 72569 73883 131398 57111 -120012 -125410 128752 370924 340814 123004
41338 123004 -21543 -17231 -24870 -179481 -374562 -334892 78110 630608 878081 652833
41328 652833 308740 338986 802264 1298332 1485819 1412484 1294032 1191064 1041569 852371
41318 852371 673452 459847 145047 -157552 -198531 96051 466542 569103 337229 8799
41308 8799 -180550 -219463 -213404 -185259 -102954 -41909 -157462 -464134 -757337 -805623 -547998
41297 -547998 -91767 369543 610940 504994 187631 -28191 -2826 81469 12352 -169346
41287 -169346 -318790 -444162 -589857 -601895 -308267 121504 317055 230464 201444 407578
41277 407578 563209 357570 -59724 -296109 -270269 -266747 -477490 -735056 -749031 -452676
41267 -452676 -61963 115792 -87871 -565336 -985279 -1048789 -739094 -299542 28105 196750
41257 196750 292971 363773 369841 296168 232944 279143 379954 350250 103325 -226302 -462802
41246 -462802 -597733 -689495 -650030 -359766 21588 141177 -54654 -187714 2595 224294
41236 224294 41819 -450797 -743645 -646124 -494342 -539942 -539342 -192823 320441 584022
41226 584022 534716 449848 436449 316064 36953 -164234 -127362 10165 104137 221413
41216 221413 368431 299240 -99097 -462302 -376613 -9936 119694 -40736 18529 552120
41206 552120 1107674 1136557 699581 266698 88386 88025 162197 231867 132051 -194655 -461184
41195 -461184 -313428 186874 633791 779654 679834 417563 63843 -95799 266086 978114
41185 978114 1375558 1068795 429827 90866 205108 463689 640912 792696 979513 1087493
41175 1087493 984481 696386 371026 132480 -11745 -136300 -254621 -252764 -74917 62361
41165 62361 -153561 -686949 -1097476 -1058581 -765395 -668156 -921815 -1261116 -1337475 -1036092
41155 -1036092 -525207 -122934 -72190 -336715 -626937 -663128 -383574 63728 405257 363013
41145 363013 -75377 -477886 -326460 341831 902857 883222 471466 139104 45848 58169
41135 58169 88052 105982 15517 -179518 -248242 -61659 128117 45459 -153922 -131051 101185
41124 101185 264694 276521 208621 -53445 -612999 -1113299 -1033710 -446229 40201 118867
41114 118867 28073 -86560 -406428 -846667 -885342 -351632 157184 78283 -337400 -484159
41104 -484159 -239202 119125 451646 693307 572976 -11122 -559278 -514466 -93011 22286
41094 22286 -289058 -499305 -345584 -154144 -155935 -135920 21754 45870 -161486 -225697 59392
41083 59392 284444 85213 -168730 86208 664164 856292 494651 184448 425355 1015961
41073 1015961 1459397 1521096 1215392 643457 87182 -71292 181276 349341 57318 -395893
41063 -395893 -458417 -139530 30372 -168861 -317892 -27986 437497 528855 183842 -135817
41053 -135817 -138537 -75810 -300644 -722586 -946973 -839059 -668658 -664976 -696012 -569762 -461736
41042 -461736 -721963 -1270243 -1535332 -1174030 -583588 -410602 -712901 -956115 -780624 -388695
41032 -388695 -117095 -2196 68655 96566 87842 171887 357131 392744 131972 -176507 -240982
41021 -240982 -164092 -209127 -332624 -331534 -278296 -358519 -408128 -137783 236365 172141 -335909
41010 -335909 -680419 -578985 -456978 -616289 -661090 -212818 346188 438162 202680 190169
41000 190169 405217 355109 -39216 -255876 33393 533030 808907 746975 413280 -111389
40990 -111389 -607135 -802271 -737161 -712140 -768860 -605479 -158369 142273 -42583 -450732
40980 -450732 -589441 -370672 -99398 -37137 -247944 -695506 -1209080 -1482285 -1368543 -1085140
40970 -1085140 -908427 -789215 -515425 -146111 11996 -156950 -417805 -497284 -367597 -180014
40960 -180014 -68664 -72341 -152343 -239880 -292211 -290842 -197701 -19347 71363 -138362 -558468
40949 -558468 -780577 -575896 -224182 -117255 -201128 -120967 178742 369140 272251 129298
40939 129298 215562 478990 735455 983859 1292193 1517981 1405012 944173 455559 275986
40929 275986 453454 748483 856418 637655 222026 -85198 -63171 212819 442698 420613
40919 420613 266934 281164 540922 736217 524661 16674 -285959 -102065 285226 463938
40909 463938 471819 631483 914259 899197 461640 78377 159564 400297 224451 -296195
40899 -296195 -481066 -37186 480777 441920 -17530 -283206 -142378 60820 48387 -73718
40889 -73718 -176699 -363824 -675347 -875413 -794587 -630984 -614554 -579061 -230180 282969
40879 282969 474390 199417 -160323 -270833 -242388 -300244 -395362 -383710 -329851 -342052 -290107
40868 -290107 859 385533 540607 429701 327026 362731 335866 76949 -241372 -321499
40858 -321499 -137422 45414 103 -229316 -427568 -463522 -394694 -324006 -234357 -74579
40848 -74579 18275 -217076 -769166 -1187482 -1016516 -333860 321272 521030 300362 -5252
40838 -5252 -89080 123369 401374 348230 -192484 -866945 -1137880 -882384 -465420 -234050
40828 -234050 -195389 -214227 -215270 -80179 344635 939856 1265918 1057115 568274 208878
40818 208878 42007 -80781 -94766 177548 580091 684078 357218 -47013 -167210 -34613
40808 -34613 113140 163260 113810 -59058 -318625 -487643 -435799 -249759 -57292 202527
40798 202527 626310 1045385 1138630 862326 528236 378034 303670 130088 -29384 62240
40788 62240 357089 558239 559608 581268 791741 1044467 1134693 1101017 1065622 954415 648628
40777 648628 304919 211877 352245 417374 287423 181787 242694 293037 184074 90502
40767 90502 202584 348291 225459 -126669 -387571 -409636 -334120 -302595 -326791 -427018
40757 -427018 -626073 -784179 -697064 -408680 -194939 -181001 -203436 -119710 -12111 25409
40747 25409 68423 169869 183249 -24469 -315942 -433104 -318298 -116074 71950 254191
40737 254191 403235 415254 241851 -48343 -366875 -683543 -971739 -1125637 -998129 -573357
40727 -573357 -100801 50566 -216156 -549682 -530470 -192184 39745 -73705 -323944 -430276
40717 -430276 -388036 -296220 -122249 127368 243009 113466 5318 209775 550647 616295
40707 616295 399579 296586 469967 638875 591603 495748 520346 516860 327184 112875
40697 112875 93475 188432 206769 187509 233713 181501 -191370 -711852 -942687 -761252 -469024
40686 -469024 -308166 -221188 -159282 -258781 -540048 -744443 -693664 -555817 -517664 -441741 -153753
40675 -153753 135312 75727 -258436 -451692 -364049 -252962 -233583 -66623 333946 602735
40665 602735 448796 154223 153224 341503 258493 -156524 -470438 -426441 -253007 -204022 -206670
40654 -206670 -133648 -53894 -9956 106321 235667 89989 -290041 -320624 323481 1017927
40644 1017927 888880 35153 -577013 -405058 117221 390662 366009 233082 8866 -211875
40634 -211875 -121020 254917 322489 -259098 -901540 -806521 -85152 461264 491461 377661
40624 377661 377665 283156 18949 -76320 162893 411738 437313 505585 833107 1074700 827641
40613 827641 321802 95831 187157 153871 -192161 -562879 -712743 -754023 -870537 -1046523
40603 -1046523 -1173740 -1174244 -964367 -542047 -145000 -66370 -271902 -453940 -490763 -555247
40593 -555247 -721259 -817146 -796507 -883166 -1123293 -1139445 -655290 -271 284740 162366
40583 162366 27366 57966 89139 91300 276536 609061 663105 223900 -306576 -411160
40573 -411160 -125684 119000 149461 174180 317314 398701 248652 -40368 -289161 -445169
40563 -445169 -503746 -403666 -146477 122017 296862 458165 670422 758293 511490 69805
40553 69805 -153158 6857 237369 181370 -69784 -119914 172055 509857 568969 375458
40543 375458 154522 -29747 -266453 -498212 -498232 -224814 23726 -19644 -212130 -210902 25416
40532 25416 207887 186237 156667 287399 389049 174131 -302362 -692923 -780414 -647126
40522 -647126 -464305 -324212 -284964 -376235 -497877 -471885 -281435 -150337 -299127 -677562
40512 -677562 -989852 -959471 -577132 -129747 60754 -4796 13670 340667 729466 773221
40502 773221 491629 312754 464095 710242 798040 836424 1027135 1276684 1334939 1148641
40492 1148641 844280 515242 256063 239938 480334 647378 435533 28306 -135339 -11695
40482 -11695 -4253 -335916 -743791 -932655 -999103 -1168436 -1334155 -1149818 -522560 197554
40472 197554 551956 403211 12957 -259846 -299963 -250507 -228249 -168210 -15357 101983
40462 101983 55251 -63842 -106419 -119150 -188201 -164735 124848 479186 520351 277825 159569
40451 159569 293591 344374 119456 -85463 29262 333180 575382 757372 901235 807074
40441 807074 404140 38532 27210 197381 263525 373457 790925 1259872 1248972 737728
40431 737728 228016 3290 -116239 -274100 -347828 -299985 -291393 -325558 -197783 85007
40421 85007 240653 191013 195467 359262 419844 209552 -57680 -165904 -190662 -210879 -128303
40410 -128303 -21130 -254088 -892505 -1380595 -1211243 -620340 -196882 -67219 64645 263133
40400 263133 271821 24950 -218947 -297896 -336918 -455727 -571855 -555834 -380411 -113746
40390 -113746 68106 -56360 -467857 -789756 -711621 -418508 -302463 -353269 -203461 250766
40380 250766 653043 669011 353872 -31231 -302799 -393197 -343541 -309958 -384529 -430134 -308799
40369 -308799 -188317 -314139 -551826 -541195 -276140 -93556 -61997 122813 514350 704765
40359 704765 475612 186403 193608 298068 157711 -96784 -101188 133973 298203 301131 298140
40348 298140 301389 159416 -122213 -372703 -525112 -606785 -545745 -301237 -105296 -221745
40338 -221745 -505741 -571934 -409495 -452241 -947012 -1580735 -1878872 -1728898 -1371057 -1061117
40328 -1061117 -869446 -690523 -385584 -7043 158637 -65620 -433304 -550725 -421809
40319 -421809 -408564 -642020 -825305 -712476 -435335 -199482 10886 205741 176714 -183769
40309 -183769 -572766 -622877 -426303 -381593 -580084 -676156 -401124 74840 399317 457660
40299 457660 396462 336231 214392 -71746 -449296 -686289 -659356 -530255 -535230 -625479 -497818
40288 -497818 -42464 420458 492612 170088 -185097 -269043 -86082 171242 342939 407874
40278 407874 469636 629253 819492 829719 571071 230477 47534 17514 -36881 -149421
40268 -149421 -139440 127056 537741 837136 852803 599728 221959 -144127 -453538 -676502
40258 -676502 -680583 -347206 137793 308567 -81767 -708424 -1028385 -904750 -660047 -574982
40248 -574982 -602317 -580991 -464609 -270123 -30395 119003 20743 -243680 -389376 -329840
40238 -329840 -302937 -435791 -440242 -13895 630831 964897 801726 451916 239091 176851
40228 176851 175693 251888 385646 438406 411201 561798 1007229 1383864 1239368 700826
40218 700826 392039 628026 1026628 1069642 744525 383975 124255 -119480 -276871 -145631
40208 -145631 181233 301756 71372 -125858 108937 628945 936266 777896 306796 -220976
40198 -220976 -632297 -781145 -592781 -202623 143883 351208 466664 438868 128596 -375959
40188 -375959 -683228 -492406 42826 456547 422351 20968 -368202 -417967 -172204 -2861
40178 -2861 -145393 -334065 -105588 540631 1062979 1062332 772185 652316 717515 596230 171541
40167 171541 -199371 -200803 -19077 -75952 -428017 -673534 -480263 -7597 328273 382139
40157 382139 359892 409119 414659 310820 310102 556064 750233 483165 -152629 -660798 -826261
40146 -826261 -884139 -962699 -848086 -504158 -354395 -690547 -1164866 -1288949 -1148750 -1144803
40136 -1144803 -1237341 -1018828 -478339 -114327 -178664 -313280 -160616 70325 -45613 -494114
40126 -494114 -834350 -757011 -388545 -69523 19251 -1631 96036 307006 330941 -15008
40116 -15008 -419187 -367415 202474 825221 1122680 1168944 1137822 956645 573615 288154
40106 288154 454362 965786 1339871 1283825 949956 658765 576567 667002 789839 818936
40096 818936 754847 705520 699572 605319 326103 -23880 -247135 -266645 -111965 141437 289051
40085 289051 60084 -505796 -919286 -776876 -314227 -90372 -204203 -228264 66922 360285
40075 360285 294194 -48614 -408182 -743192 -1049131 -1059628 -558314 122393 356426 32448
40065 32448 -268260 -66421 349711 342382 -157126 -514279 -224651 424461 730872 434951
40055 434951 -78440 -366025 -372057 -206407 163085 708011 1059291 825823 146253 -435322
40045 -435322 -668280 -814969 -1082083 -1213560 -891204 -263704 221677 351608 248522 86890
40035 86890 -9194 103068 439386 706520 558376 45994 -435869 -646713 -679658 -646767
40025 -646767 -510923 -311069 -236397 -328947 -390687 -346876 -404865 -627395 -653350 -189347 436988
40014 436988 623323 285473 -105212 -235823 -267828 -386145 -477045 -439043 -434938 -565363
40004 -565363 -591515 -308855 17170 -45232 -459492 -742419 -602064 -236144 46843 214636
39994 214636 403156 629325 755328 638414 244437 -296127 -719883 -840759 -754994 -703046
39984 -703046 -713981 -574083 -212722 89253 30130 -312689 -584076 -575494 -399470 -288388
39974 -288388 -346086 -472211 -445527 -133021 299510 466262 179847 -263431 -364704 26237
39964 26237 579575 907549 961716 937894 911274 734161 327014 -60837 -59659 314127 546721
39953 546721 214448 -424978 -712012 -443817 -102498 -110242 -242901 -83624 255519 315860
39943 315860 42345 -146044 -45813 37808 -177005 -513884 -646850 -547592 -397924 -286239
39933 -286239 -213900 -215930 -263035 -209264 -39394 1553 -249103 -557569 -577798 -323813 -84655
39922 -84655 28341 133411 223321 109276 -212239 -436748 -337773 -65672 81836 27395
39912 27395 -85594 -126798 -58794 131877 422176 681763 734256 535742 261459 179785
39902 179785 400701 725359 796987 470755 -2670 -245500 -165363 10615 79630 84111
39892 84111 164915 339846 496160 511833 342920 73150 -114489 -125177 -104845 -247444
39882 -247444 -446809 -372955 19753 320166 194508 -118044 -127091 214463 465252 333770
39872 333770 45254 -22794 177701 392122 393832 135560 -294908 -701811 -844679 -638957
39862 -638957 -267595 28560 238134 523843 893926 1094212 910560 484392 206042 281719
39852 281719 473933 339712 -249672 -878057 -976454 -475878 54260 45178 -381264 -576411
39842 -576411 -227726 214042 148656 -344159 -608974 -293332 238206 473861 407049 369531
39832 369531 458520 497933 475993 615127 937548 1115687 926600 576259 355206 211154
39822 211154 -55447 -351479 -395621 -194042 -61010 -135959 -195102 -34201 240472 438351
39812 438351 554168 630845 559307 249166 -117590 -228371 5366 388659 677879 728934
39802 728934 492152 56587 -317778 -389650 -185446 53637 165526 198876 281667 488509
39792 488509 810482 1114859 1168570 882599 530489 519073 890035 1238643 1210828 901690
39782 901690 636523 513350 348218 10757 -360382 -507430 -344982 -75683 -9380 -229478
39772 -229478 -459977 -358708 57036 405654 394801 138300 -43559 11204 245477 539616
39762 539616 772008 825215 706124 606082 682864 823775 789787 575671 449884 605946
39752 605946 927949 1167348 1232294 1211289 1187989 1144229 1041715 916670 844518 835122 819905
39741 819905 750523 634835 428999 9854 -586474 -967579 -689520 154797 873408 881487
39731 881487 347642 -37526 145172 658248 977330 869933 557753 389570 430818 437245
39721 437245 255385 101680 242113 498419 429264 36957 -128193 244023 745534 870825
39711 870825 730846 711715 743992 480713 29957 -105262 193450 499518 523249 439936
39701 439936 429787 378989 199141 10266 -153461 -399880 -591157 -363920 244705 643417
39691 643417 446330 -457 -139309 108617 445200 619298 467762 -78492 -715016 -888074
39681 -888074 -541800 -317922 -617240 -937240 -670972 -108544 44272 -191947 -196472 157846
39671 157846 351185 151667 -69927 -92079 -216808 -661313 -1157580 -1432331 -1600443 -1792719
39661 -1792719 -1802703 -1418429 -819429 -380201 -263280 -341777 -335364 12665 642385 1074219
39651 1074219 921852 474375 356433 624632 710184 324803 -140856 -297543 -275724 -290806
39641 -290806 -206023 120487 482012 669380 787663 899611 762135 294137 -94827 -82873
39631 -82873 12915 -254420 -701930 -787012 -420360 10146 280238 486273 636261 560572
39621 560572 246645 -99593 -336327 -456820 -433840 -254387 -33189 131014 280275 381690
39611 381690 230139 -160366 -356612 -63312 393163 551372 501282 597576 769357 713832
39601 713832 566706 704976 994890 940685 551243 331805 367035 177179 -346649 -632309
39591 -632309 -367521 -62247 -246762 -676165 -803262 -588798 -368910 -277352 -244604 -276728
39581 -276728 -335911 -212456 122956 314013 119536 -158726 -111844 185679 392310 429553
39571 429553 399138 252178 -5189 -30385 411305 903313 837760 333099 133751 581213
39561 581213 1203995 1419462 1183092 804194 516331 400813 411703 312121 -140379 -800418
39551 -800418 -1178645 -1017216 -588717 -289402 -171577 -47159 153766 342130 468122 568249
39541 568249 653785 667475 532747 210120 -236078 -612723 -734107 -618003 -469493 -450664
39531 -450664 -534788 -580537 -473587 -224858 -14983 -74445 -386941 -584077 -319321 290457
39521 290457 786027 892412 710796 421310 80176 -239440 -392097 -375640 -378673 -478437
39511 -478437 -496002 -301067 -65713 -30464 -171343 -288375 -296559 -233743 -90147 148909
39501 148909 351088 346850 185189 99735 206967 384351 456569 365158 145498 -118741
39491 -118741 -284811 -228122 11412 254207 387791 448466 466339 361235 74784 -297762
39481 -297762 -599838 -748884 -697524 -395423 47182 275303 27783 -450743 -604502 -240946
39471 -240946 244842 434989 399520 430839 536760 539542 503180 638280 833510 728990
39461 728990 323386 80389 267744 572455 596810 391779 222719 120405 2400 -20863
39451 -20863 155209 320329 237298 90036 226195 555058 643967 376787 79543 -8274
39441 -8274 59229 278904 740017 1187862 1069633 308071 -390041 -361864 183219 536016
39431 536016 437100 226845 183727 167674 -29476 -319238 -449325 -332644 -127021 -46802
39421 -46802 -140272 -238045 -138035 154424 425161 480447 287100 -86387 -508322 -765956
39411 -765956 -713891 -483651 -341555 -299627 -120427 224295 411750 238872 -64340 -197884
39401 -197884 -184764 -163698 -81179 108079 205866 96454 68041 390482 764497 669782 156057
39390 156057 -201908 -99696 226976 515646 737122 777861 418905 -172460 -436346 -184151
39380 -184151 79086 -73147 -321076 -144128 309905 456457 202523 58477 303667 569614
39370 569614 440637 70782 -78199 132707 457680 720193 1016021 1412750 1681637 1512432
39360 1512432 937347 376786 213122 409420 606871 514762 122732 -380385 -754063 -820881
39350 -820881 -606524 -372110 -350969 -437432 -310014 93305 419175 331393 -57528 -338550
39340 -338550 -291695 -71456 37351 -83842 -315726 -429498 -293376 -6067 200279 225676
39330 225676 216274 360256 624717 771265 620977 257094 -42327 -69585 118114 302313
39320 302313 391970 487922 602626 507144 63632 -427550 -506727 -134648 302390 538767
39310 538767 632386 608351 332054 -112735 -335054 -180536 -11620 -148360 -355003 -243549
39300 -243549 86708 231734 118730 40848 171867 428497 719075 964882 975625 677510
39290 677510 362431 319573 340409 46425 -395660 -436243 -9389 345525 314956 184701
39280 184701 221470 266695 211335 323399 740617 1110561 1138238 1070358 1194272 1241052 804679
39269 804679 73818 -383756 -381439 -177424 45528 262326 304398 12982 -349336 -342421
39259 -342421 -8244 183237 67680 -17857 149762 350461 371322 359482 493541 634311
39249 634311 552450 276715 11229 -134013 -204608 -339515 -689648 -1215427 -1580079 -1495894
39239 -1495894 -1134703 -855325 -576621 80117 958600 1285146 723886 -3367 4486 702576
39229 702576 1319309 1407654 1173637 944646 819000 777923 723610 451997 -46687 -342125
39219 -342125 -14090 706522 1150083 1036249 691196 459295 339864 252817 219770 163936
39209 163936 -75980 -408383 -540094 -471519 -522327 -725818 -680340 -248033 92546 -35203
39199 -35203 -278742 -129955 241160 320564 183882 419102 1141380 1719898 1629107 1060892
39189 1060892 497672 124474 -86947 -99219 59441 144961 -17219 -273722 -407706 -462788
39179 -462788 -544880 -502127 -131089 418004 770878 801425 671861 465536 129898 -218282
39169 -218282 -313461 -168494 -142061 -421545 -735018 -767248 -586661 -431918 -339511 -273138
39159 -273138 -384033 -763376 -1083708 -907566 -311333 198293 389598 505066 697586 743819
39149 743819 526786 366016 525797 727369 562297 166979 35925 273995 484443 391005
39139 391005 140332 -95928 -417133 -896171 -1283874 -1263355 -849214 -344449 -1612 135544
39129 135544 152734 165950 250205 379115 468864 496501 492063 425231 243952 32368 -50329
39118 -50329 -18084 -32653 -74107 99570 522870 816037 643286 181360 -139098 -211285
39108 -211285 -262396 -366824 -292234 114466 641288 909542 717325 158623 -453884 -777315
39098 -777315 -710528 -497900 -427018 -449932 -286562 127440 546953 794719 948583 1055032
39088 1055032 951029 571836 196371 116756 219759 184658 -524 -34508 205044 477631
39078 477631 546238 440137 243679 -83870 -467095 -544248 -68830 631540 953262 779999
39068 779999 603985 783125 1017638 816482 246474 -122876 59145 565533 952084 1005343
39058 1005343 783644 454345 190884 66161 -21154 -176249 -270206 -94456 242043 388132
39048 388132 316967 446675 967973 1409648 1244806 667445 315352 380396 498829 479915
39038 479915 592783 994184 1354132 1320942 1021054 812900 796699 850812 951391 1145278
39028 1145278 1318796 1286730 1082949 938402 970933 1057303 999038 686367 136919 -490368
39018 -490368 -946665 -1084986 -986847 -813518 -599379 -321431 -108019 -185304 -579217 -1006437
39008 -1006437 -1141294 -945076 -682545 -608453 -647472 -442187 196723 934546 1187677 797668
38998 797668 231522 361 87581 140311 21520 -130427 -269925 -493901 -704433 -587949
38988 -587949 -82953 406537 466298 144550 -238351 -577830 -998954 -1454891 -1632720 -1357338
38978 -1357338 -873569 -565205 -503003 -435761 -191870 78200 115931 -93456 -283777 -206546
38968 -206546 100677 363813 363640 153468 -31645 -83357 -173888 -510394 -964717 -1116803
38958 -1116803 -746986 -135647 267608 343946 283046 182071 -35205 -309210 -382046 -164280
38948 -164280 91379 140620 61838 50453 98750 98898 116982 321571 704775 1058048 1169460
38937 1169460 929173 384504 -143547 -187770 351285 950575 1021791 617134 244482 80585
38927 80585 -174536 -625431 -872233 -615797 -176706 -59991 -254352 -344543 -185797 -70349
38917 -70349 -216555 -441975 -479517 -383201 -422704 -678959 -934714 -963405 -773146 -499055
38907 -499055 -176246 230980 615873 742036 544199 260260 136041 117480 -8555 -264123
38897 -264123 -461673 -485204 -397231 -282823 -173732 -137591 -273884 -584179 -944683 -1177675
38887 -1177675 -1065093 -443524 494045 1139135 1058258 596455 515558 1014109 1512138 1491780
38877 1491780 1110214 790731 639642 573200 657864 935860 1157754 1070448 806920 659233
38867 659233 625912 507888 285176 54023 -238646 -608394 -742505 -364806 192159 289302
38857 289302 -127364 -435137 -215254 281234 707067 1122954 1599157 1765959 1254212 357628
38847 357628 -215921 -177707 145262 407709 637037 939015 1160244 1071964 723676 402198
38837 402198 293951 340284 403099 426590 405553 324381 216411 193863 293140 345842 172229
38826 172229 -98092 -96760 317847 847008 1118310 1092859 960762 822873 707693 753159
38816 753159 1069289 1473978 1648441 1541189 1359171 1185287 905995 527075 226283 23012
38806 23012 -258615 -563303 -493030 136223 897608 1205476 996778 696069 629317 741169
38796 741169 830805 821838 781674 813454 932054 1004168 909602 795844 959488 1353175 1473678
38785 1473678 992595 282448 -20413 165171 367629 321066 288935 553623 976265 1256552
38775 1256552 1341476 1355943 1351092 1368458 1595480 2179304 2935728 3476861 3642311 3641307 3764716
38764 3764716 4116025 4638989 5216785 5644375 5662032 5199747 4536923 4043613 3755879 3378936
38754 3378936 2763911 2184384 1973628 2024382 1895888 1393060 794275 453287 403981 471472
38744 471472 565754 680143 741793 686006 624926 746468 1046422 1306825 1345865 1175084
38734 1175084 919318 700874 603703 634757 696155 677412 581195 482839 384495 222362 30614
38723 30614 -31940 95511 197682 -43309 -650980 -1206944 -1221632 -675758 -65485 180785
38713 180785 190103 372449 790310 1095110 1053309 787033 449216 54492 -232728 -83501
38703 -83501 442509 735650 415264 -84588 -172102 -4606 -138254 -521697 -580741 -235965
38693 -235965 -41948 -198728 -208912 204831 588176 588380 616553 1094695 1606153 1505767
38683 1505767 975890 708111 787095 697594 341697 217291 492071 677084 472325 254236
38673 254236 355464 446889 120512 -351531 -390948 9938 304414 159500 -239674 -589880
38663 -589880 -771383 -758068 -571979 -348111 -173735 93710 542391 818630 459312 -352578
38653 -352578 -841146 -613444 -129045 58669 54668 191542 273174 -103205 -673159 -690813
38643 -690813 -41543 515301 433587 86343 37397 189135 173218 112140 313935 515254
38633 515254 214662 -331353 -267942 561942 1249156 1081208 504131 327609 517420 442338
38623 442338 -3375 -260466 -24446 354000 505052 536401 663913 764125 622642 391092
38613 391092 463214 950541 1502485 1663810 1303078 686008 196605 4448 -11968 -43604
38603 -43604 -122972 -156488 -95218 37930 242703 529580 819377 977692 973630 917002 922106
38592 922106 1006815 1125688 1216876 1196552 983661 590136 185641 34593 283668 742642
38582 742642 966064 724590 352571 384295 830204 1129418 934461 583756 537903 672074
38572 672074 516933 -5239 -508798 -700598 -610937 -341302 25669 302346 357671 366722
38562 366722 536204 675169 494325 243456 461697 1072081 1383275 1144814 911007 1059849
38552 1059849 1147193 720235 165017 109770 430873 536161 322786 154927 102973 -73527
38542 -73527 -280900 -143095 273924 432196 101308 -409544 -868096 -1343279 -1678105 -1419740
38532 -1419740 -588339 82981 93894 -130866 43270 494527 660754 502545 494521 765710
38522 765710 880150 554791 84867 -123539 -54441 97600 292012 550559 704615 554080
38512 554080 235617 153907 457955 774060 639336 136836 -122226 264726 952950 1246432
38502 1246432 934308 463064 274585 291579 209707 22272 -19736 186320 520276 889427
38492 889427 1253734 1425478 1183417 689040 484880 853409 1369431 1366526 775402 214396
38482 214396 201664 533052 615290 265300 -72280 90029 697429 1268344 1459861 1351825
38472 1351825 1216789 1187713 1203024 1160030 1034059 886170 802054 804378 822394 793775 787808
38461 787808 946910 1290277 1660635 1896117 1970669 1931545 1805599 1640341 1540537 1555552
38451 1555552 1589177 1529948 1431204 1444863 1585247 1671253 1535264 1221812 952079 929764
38441 929764 1176394 1500283 1627586 1434262 1076804 847359 877228 1029121 1108244 1123351
38431 1123351 1267475 1643226 2074569 2249722 2058170 1750455 1718900 2104070 2646562 2964488
38421 2964488 2964138 2912100 3070852 3338985 3367607 3025976 2597725 2422129 2468752 2438642 2210357
38410 2210357 1949075 1768069 1561435 1298345 1226560 1547854 2061650 2407394 2559994 2785014
38400 2785014 3139492 3338707 3172154 2768335 2353910 2013599 1814319 1899156 2245485 2523419
38390 2523419 2436830 2094451 1833887 1776936 1783098 1774405 1851350 2073150 2348712 2618769 2968754
38379 2968754 3445505 3879713 4039949 3941053 3876361 4094828 4514140 4832707 4892110 4805179
38369 4805179 4703478 4532592 4238872 4011028 4082533 4335572 4380368 4077223 3717581 3579908
38359 3579908 3551528 3359865 2984230 2640220 2483210 2494416 2553242 2498872 2266374 2083060
38349 2083060 2319548 2954548 3417016 3254753 2785908 2718727 3203034 3659727 3601450 3264380
38339 3264380 3260480 3827687 4595931 4985965 4737818 4116183 3643294 3592427 3781379 3915306
38329 3915306 3990981 4190991 4511316 4761469 4877556 4953641 4981443 4865961 4735399 4916133
38319 4916133 5482531 6097419 6437081 6541949 6605694 6656248 6643909 6654525 6799525 7002651
38309 7002651 7114269 7189841 7466719 8050734 8745229 9232086 9393516 9447639 9739905 10353453
38299 10353453 10967847 11195866 11027078 10830607 10959911 11478884 12215248 12913325 13385670
38290 13385670 13709489 14225988 15133471 16153490 16872618 17343637 17997077 18995258 20112418
38281 20112418 21297134 22840215 24795766 26733566 28374243 30029928 32035994 34160175
38273 34160175 36075279 38102253 40889179 44506477 48469136 52665203 57708731 64237876
38265 64237876 72339106 81931111 93401005 107533943 124941646 145900977 170880355
38258 170880355 200892997 236483508 275450243 311555896 336734254 346013537 340688237
38251 340688237 326327516 307671830 285735191 259413179 228768041 196240144 165289790
38244 165289790 138508937 116775256 99550787 85780311 74714177 66065875 59568262
38237 59568262 54658650 50695006 47286231 44314103 41826488 40006424 39014944 38693323
38229 38693323 38585909 38406138 38323673 38655509 39455774 40597929 42118570 44261374 47238084
38220 47238084 51107366 55847417 61419981 67807151 75133545 83809678 94522140 108012255
38212 108012255 124767864 144954766 168839749 197168276 230283435 265949161 298259719
38205 298259719 320059412 327537503 322474512 309763105 293048908 272952787 248712272
38198 248712272 220493187 190120657 160399159 134002464 112423444 95491298 81987140
38191 81987140 70865814 61796784 54668903 49063441 44430163 40473276 37117026 34281553
38183 34281553 31900210 30020730 28714951 27973426 27774190 28118136 28913014 29986849 31312532
38174 31312532 33034617 35146749 37325865 39233133 40785108 41940165 42424859 41962117
38166 41962117 40659442 38875898 36757861 34196609 31222263 28117087 25083420 22112665
38158 22112665 19302229 16988366 15335291 14028918 12670151 11332001 10421051 10055152
38150 10055152 9902225 9659850 9388779 9262703 9246777 9199686 9111352 9043150 8948895 8744711
38140 8744711 8486988 8311968 8247450 8241815 8338186 8642922 9109729 9505301 9647284 9610815
38130 9610815 9685886 10166345 11131601 12366292 13548362 14584160 15681827 17039958 18627631
38121 18627631 20401991 22520591 25042947 27549558 29422284 30496721 31101735 31428067
38113 31428067 31222309 30214654 28507199 26368152 23945535 21392919 19001636 16940285
38105 16940285 15052114 13155758 11389978 10027344 9080760 8319664 7569919 6805053 6054322
38096 6054322 5404886 4982044 4762027 4536891 4219634 4011026 4084673 4302805 4451428 4536582
38086 4536582 4597696 4475249 4101766 3808993 3937955 4278831 4306200 3876031 3294201 2797907
38076 2797907 2408321 2214637 2305903 2430661 2227783 1831447 1738459 2010234 2150399 1900902
38066 1900902 1593834 1512300 1475336 1336851 1321825 1491582 1430006 943947 576383 842338
38056 842338 1367906 1444283 1120752 1025873 1296979 1449958 1270484 1093985 1114860 1103286
38046 1103286 983912 1063697 1429090 1682994 1591079 1479876 1639044 1806807 1686314 1563482
38036 1563482 1883888 2486809 2800208 2648186 2359239 2151968 1910647 1581040 1328401
38027 1328401 1207894 1055906 816118 640155 564436 428659 243969 281755 592962 781986
38017 781986 549023 180371 158222 493677 822351 1000191 1162570 1260446 1043425 606930
38007 606930 489375 969289 1607140 1795818 1525194 1267537 1270216 1328559 1202663 908198
37997 908198 555050 194173 -76703 -88400 181563 506578 626661 466484 104034 -321799
37987 -321799 -605635 -551317 -191067 171850 261311 102810 -85626 -190142 -279794 -448877
37977 -448877 -690675 -910710 -1003253 -938253 -795726 -656700 -460691 -96843 333503 531822
37967 531822 401270 252526 404722 704712 711584 322085 -79131 -155172 -32107 -24552
37957 -24552 -161136 -219787 -124363 -37547 -52672 -36061 120081 262944 154753 -208024 -600938
37946 -600938 -837369 -871425 -685743 -296096 94660 171127 -129347 -471268 -481799 -145682
37936 -145682 281608 608482 777844 744124 533639 366381 462386 733854 892573 850389
37926 850389 777829 775334 759697 711394 757740 939448 1149747 1358525 1602022 1688659 1297409
37915 1297409 540486 39243 154427 474182 421917 89991 29602 385994 721279 673094
37905 673094 378485 185438 259674 552307 916104 1183635 1283819 1276951 1162913 796921
37895 796921 207789 -185997 -24880 440804 643263 481278 372641 518992 618215 458729
37885 458729 334378 581824 1034700 1245777 1037872 577785 86203 -280033 -399614 -274715
37875 -274715 -70279 82041 212550 331659 286048 -25779 -417855 -586285 -458039 -240973
37865 -240973 -175845 -320328 -516853 -530094 -295979 -32889 17821 -79996 -90012 -12784 -53613
37854 -53613 -172583 -55173 348658 651947 601967 441161 423831 348384 -56544 -595108
37844 -595108 -892284 -983998 -1152378 -1343450 -1257041 -941483 -778841 -834843 -697952 -113542
37834 -113542 590124 899687 699687 307642 88158 125294 180473 -20649 -381576 -455885
37824 -455885 -40249 470102 608792 487069 493717 565172 353098 28411 181929 783015
37814 783015 979749 309633 -523603 -612994 -106478 129301 -202454 -569184 -559799 -439795
37804 -439795 -593564 -876155 -810356 -242236 414616 588703 169913 -320231 -302070 122796
37794 122796 264115 -225095 -850214 -965362 -626527 -346663 -262777 -92920 183078 205179
37784 205179 -108513 -309101 -33680 530467 1017079 1344868 1550237 1497421 1100391 608174
37774 608174 328432 215508 42589 -150693 -128686 84732 177783 18650 -151565 -95139
37764 -95139 96485 193171 157048 108884 72054 -63482 -328726 -557714 -533843 -219697 178596
37753 178596 375253 252945 -37206 -242917 -286623 -332474 -543612 -821740 -882025 -601251
37743 -601251 -192437 47603 98861 197519 465679 722386 740034 555698 391301 342467
37733 342467 301346 159856 -51589 -215708 -192294 128956 658128 1001869 773797 91793
37723 91793 -454622 -474184 -223668 -215624 -556322 -919780 -1056855 -1018519 -887673 -613143
37713 -613143 -228195 16751 -60176 -286645 -330404 -119150 109711 164541 128308 172082
37703 172082 278882 284340 142743 13749 58325 254755 470378 616191 643818 491535
37693 491535 183683 -79779 -122476 -57837 -136069 -314514 -264412 89097 345905 185635
37683 185635 -123368 -114058 162102 239368 11712 -61701 351384 943462 1170539 902750
37673 902750 440807 84803 -69068 -39707 78368 113765 -28125 -218423 -236648 -30575
37663 -30575 240967 384901 328247 156978 57702 145933 308769 312956 96238 -182028 -397589
37652 -397589 -566232 -640512 -472385 -126966 40589 -140938 -342868 -187254 183924 339864
37642 339864 224041 193216 443584 788890 1031775 1181766 1221876 1011801 581377 240207
37632 240207 206573 321183 291155 67517 -152934 -177340 33898 358427 584345 594500
37622 594500 505410 506356 580860 561198 433143 352996 352227 285365 119437 10015 12985 -17289
37610 -17289 -145776 -222453 -125204 107098 446266 875959 1143102 888067 199588 -326721
37600 -326721 -315900 -58003 20196 -46228 -13415 81420 92561 132635 325500 440374 238977
37589 238977 -19610 88148 478658 727623 763607 844820 941144 748668 328107 122824
37579 122824 242541 296152 80960 -117456 -113456 -165688 -452663 -691804 -618575 -431747
37569 -431747 -408497 -438787 -305161 -100037 12834 160958 488426 765453 688931 389623
37559 389623 237859 288542 308246 232943 204366 232062 204894 192919 366922 637795 735481
37548 735481 647636 625191 734167 776261 720398 820506 1141988 1320597 1043123 521084
37538 521084 213678 239621 337013 320898 300696 415009 565173 521759 202859 -236109
37528 -236109 -542470 -540337 -223289 223011 498613 420201 145455 62369 340395 676545
37518 676545 642197 219207 -201595 -314443 -151627 146826 505476 764195 674186 241360
37508 241360 -173583 -312779 -347626 -504901 -607452 -330932 228569 612732 584960 346410
37498 346410 185900 187117 272091 290460 94379 -240476 -342876 17552 499697 557107
37488 557107 208377 33579 351089 826238 1041920 1041002 1057790 1067665 927158 712689 588633
37477 588633 501162 303692 62060 -52383 -79579 -197821 -393915 -486523 -461302 -509612
37467 -509612 -698919 -854548 -854011 -824295 -907251 -978403 -779312 -287918 191281 336197 114035
37456 114035 -274849 -681045 -1095689 -1440012 -1449871 -960467 -238591 216330 263789 297383
37446 297383 691084 1254236 1463900 1150934 692210 487458 476195 319023 -72052 -386145
37436 -386145 -312964 54932 320598 230154 -91117 -352570 -420289 -346798 -184628 68742
37426 68742 345991 485032 408407 250394 221538 369625 537533 566786 498941 521962 706575
37415 706575 873998 822565 638497 610843 810485 955871 810542 523187 385203 397825
37405 397825 315587 39855 -258933 -368895 -196215 229185 696394 851651 551930 116535
37395 116535 -36512 81569 174232 215131 423757 723439 746483 477307 362714 577412
37385 577412 693908 389300 166 -32673 139770 112365 -72829 -97222 -1461 -87173
37375 -87173 -314256 -350039 -175088 -113741 -241327 -260233 -45970 143819 130773 71351 100524
37364 100524 101133 7888 -2043 176129 367659 423417 446421 498108 359677 -131846 -714136
37353 -714136 -964503 -819587 -576905 -459325 -411683 -292615 -71215 165306 270119 131006
37343 131006 -182523 -414923 -388471 -229872 -208655 -379288 -524087 -468393 -323094 -329397
37333 -329397 -518360 -636043 -453254 -78433 156951 127735 79304 275914 623139 798019
37323 798019 664343 370866 82649 -185616 -465248 -737521 -966244 -1097091 -1041884 -808756
37313 -808756 -608864 -647610 -829325 -866087 -669772 -433034 -333125 -375070 -514922 -691936
37303 -691936 -745326 -573857 -377275 -424083 -568642 -385108 141964 493412 354329 46256
37293 46256 -36685 -1625 -102142 -175695 90207 549811 729946 469384 41280 -267009
37283 -267009 -339855 -120012 294940 533735 347290 69694 250392 850850 1282396 1282033
37273 1282033 1228395 1422374 1566739 1288588 795121 603066 831255 1133780 1217329 1097346
37263 1097346 894813 666058 444015 239323 -9787 -323660 -529889 -405486 8926
37254 8926 402207 551301 543743 566809 614436 555119 421210 422813 614127 726785 508167
37243 508167 130042 22291 285734 520183 359518 -30647 -187641 51828 412140 566202
37233 566202 452754 239586 161036 374849 802279 1118499 1064651 750168 480913 332909
37223 332909 119696 -217010 -432162 -283109 149873 527814 548772 191322 -218381 -245444
37213 -245444 168704 534487 364830 -177166 -494024 -371286 -175489 -190881 -223365 -59527
37203 -59527 112841 56248 -91065 -109348 -140915 -421789 -763591 -762064 -445454 -269789 -442431
37192 -442431 -646834 -544370 -223821 1071 -3759 -156272 -348938 -505962 -550327 -453093
37182 -453093 -273681 -71240 183424 539684 925924 1132893 989427 589167 293560 383668
37172 383668 690372 731636 307994 -199324 -281022 79514 446626 522121 455132 535919
37162 535919 774711 889118 641173 127113 -265907 -214421 216524 650127 787469 613902
37152 613902 244739 -206202 -529591 -456716 8375 478833 607931 451765 221565 -90656
37142 -90656 -546382 -920924 -901876 -531927 -121719 183725 412605 457456 178502 -226979
37132 -226979 -387189 -298008 -292993 -461004 -538384 -421755 -294553 -136287 355255 1117489
37122 1117489 1504042 1073827 234014 -262237 -179769 147007 351472 299100 39621 -202133
37112 -202133 -167222 80654 160531 -75258 -300214 -248119 -123751 -178797 -265888 -210628 -258753
37101 -258753 -665674 -1140855 -1226660 -989644 -803990 -681895 -411035 -165141 -311987 -697834
37091 -697834 -783546 -482089 -228941 -211050 -173278 -29955 14647 43738 395383 878923
37081 878923 787759 -3548 -691925 -693389 -426955 -453208 -523038 -152196 419725 614850
37071 614850 469863 431915 488516 291083 -33439 -12031 271498 202804 -327404 -654314
37061 -654314 -344599 163730 256207 -35516 -281482 -321693 -268243 -104378 286173 768499
37051 768499 963480 647704 564 -557602 -716432 -501260 -180042 74002 350989 733707
37041 733707 990124 790500 201885 -307443 -400397 -170818 129243 393075 583951 600818
37031 600818 396870 103093 -89842 -90255 91925 376685 620878 721855 711029 613782
37021 613782 309338 -220228 -595263 -389115 195169 434968 22237 -541767 -718443 -656598
37011 -656598 -771843 -988807 -928749 -623193 -450382 -419116 -110326 549676 989567 743029
37001 743029 111203 -269664 -266496 -273672 -523102 -766725 -696807 -381004 -139857 -178523 -478073
36990 -478073 -897766 -1205609 -1117092 -547158 171075 535527 407991 119406 -17493 -64153
36980 -64153 -174333 -210641 52715 478694 671748 521274 319391 292069 320212 230281
36970 230281 83366 16508 8718 -35317 -129773 -258176 -421952 -548034 -534521 -472945 -594658
36959 -594658 -882652 -998991 -759345 -404486 -191179 -7519 310009 550622 421281 98479
36949 98479 57503 397916 720158 681331 346449 -27265 -241974 -163040 222217 672505
36939 672505 866229 770079 622928 543907 421653 232027 173298 365639 638420 739927
36929 739927 604315 346422 142977 135042 273101 281184 -1211 -290151 -180466 224289
36919 224289 405525 214280 98871 353310 602950 393813 -74238 -258265 -82964 50015
36909 50015 -31748 -42227 225927 534251 543368 284984 110292 273279 675421 979547
36899 979547 930039 570766 134725 -251260 -621001 -912096 -886944 -478214 -29300 55113
36889 55113 -193674 -382221 -251127 118860 515632 757278 694237 332337 -26526 -17938
36879 -17938 357506 737317 844079 714489 478359 183698 -83749 -170344 -70095 43665
36869 43665 110276 270473 531531 614138 358372 53165 69004 322886 437058 332007
36859 332007 283609 377737 298770 -172437 -747475 -971147 -806293 -622472 -681992 -885276
36849 -885276 -1017960 -1012887 -897757 -685098 -454118 -402804 -629146 -908672 -881425 -499670
36839 -499670 -143594 -204770 -642207 -1048416 -1109746 -898833 -705065 -664677 -640364 -474398
36829 -474398 -271821 -292113 -529773 -587947 -161573 463690 685480 359562 -31691 -93032
36819 -93032 -23700 -143208 -267944 -36188 346583 288114 -242545 -555968 -264360 76712
36809 76712 -232321 -985690 -1364833 -1092269 -729245 -813030 -1194668 -1388860 -1207531 -830171
36799 -830171 -499718 -362454 -439857 -576139 -531671 -260605 22646 151651 220967 362605
36789 362605 488664 451601 330366 338790 522021 735931 861812 855525 662631 307880
36779 307880 14239 -15230 88201 25388 -190136 -226104 23251 215347 62393 -225603
36769 -225603 -262033 -49059 80209 -19912 -151312 -119332 31119 173028 268305 287414
36759 287414 124628 -268848 -736082 -1016269 -1003850 -846453 -747172 -699150 -513423 -154473
36749 -154473 99944 18765 -173026 -56851 318837 441875 127418 -145956 1908 185617
36739 185617 -146008 -747174 -858595 -348765 104869 49947 -171219 -108101 120601 182803
36729 182803 103280 72591 38394 -93343 -118050 184558 617059 809127 753684 730130 810986
36718 810986 808077 628972 349442 1835 -382931 -597237 -470429 -217151 -212939 -426323
36708 -426323 -438041 -75480 321076 377239 134918 -121206 -255844 -335005 -428356 -505414
36698 -505414 -487777 -361049 -244620 -275341 -371286 -271148 68959 331726 299914 215956
36688 215956 362652 525709 322822 -97525 -229062 -29280 7620 -341747 -722003 -845188
36678 -845188 -881908 -972388 -887070 -507316 -171490 -148036 -161908 128150 512645 540425 191849
36667 191849 -183036 -382606 -399203 -158241 341190 774945 822503 647988 652914 854755
36657 854755 927280 775015 629815 605070 571815 482419 432267 397346 285665 232251 428736
36646 428736 662703 503227 23067 -156088 284279 913383 1197978 1184687 1220117 1326637
36636 1326637 1245647 915598 555239 350411 311616 379104 473009 498257 447415 432567 518687
36625 518687 632468 710737 777565 785082 587464 214266 -46454 -22511 90643 66292 24843
36614 24843 198363 487991 589475 470983 391856 470640 549925 513490 448974 439781 453636
36603 453636 504293 670270 857474 788485 371114 -118816 -366072 -346983 -186706 106943
36593 106943 533821 873883 868088 605675 471241 658043 938971 991352 773127 487793
36583 487793 334596 404997 678313 964496 963411 572957 89201 -82985 97035 289765
36573 289765 214176 -96871 -485205 -858872 -1099754 -1028523 -657508 -309080 -261284 -384755
36563 -384755 -344644 -68857 220289 372768 441806 464530 392290 288932 335160 530520
36553 530520 611804 398309 42579 -182814 -182458 -9827 264734 494948 447841 76083
36543 76083 -308492 -357349 -118702 56892 -8605 -168178 -261347 -328164 -430099 -461560 -296989
36532 -296989 -25119 121270 56792 -50415 -585 182701 300389 271099 271621 506608 909585
36521 909585 1206167 1252534 1156600 1055883 965492 902376 936846 986407 784831 281079 -123385
36510 -123385 -47631 275638 255173 -222622 -618612 -521944 -224973 -261782 -651731 -937705
36500 -937705 -836012 -517929 -282287 -234209 -310961 -388701 -313882 -29984 264604 259589 -101772
36489 -101772 -555223 -855190 -989608 -992215 -788787 -403164 -111474 -147093 -368467 -452030
36479 -452030 -323622 -160252 -48829 73849 182168 172152 123304 237784 469361 532457
36469 532457 352200 151131 -15495 -374374 -865936 -947462 -379002 202591 59973 -567512
36459 -567512 -815331 -492539 -303405 -691245 -1158213 -1025301 -330324 384755 767115 775835
36449 775835 461306 15837 -190702 19040 378341 541489 495929 386970 213576 -3861
36439 -3861 -41600 165216 229008 -188481 -778358 -967123 -764359 -707358 -994696 -1207801
36429 -1207801 -986318 -512549 -154824 -6285 26897 -22251 -140307 -256738 -360557 -523994
36419 -523994 -714635 -754441 -539782 -159009 217828 410849 267111 -124765 -339804 -73734
36409 -73734 355531 366949 -32355 -238339 20024 268576 32300 -483850 -767752 -653466
36399 -653466 -279594 221470 627929 587387 100416 -259749 -63364 313645 236336 -223885
36389 -223885 -441769 -207383 70970 108675 87790 161919 154465 -67649 -351740 -578312
36379 -578312 -850858 -1187150 -1359438 -1227051 -937430 -653312 -382430 -195956 -249590 -416685
36369 -416685 -294558 174881 472127 207778 -283008 -436848 -249985 -120498 -146216 -109352
36359 -109352 -35462 -200993 -563541 -717294 -547649 -451858 -685143 -906308 -702221 -265551
36349 -265551 -164110 -575553 -1098244 -1284464 -1077108 -703210 -378176 -196518 -158145 -202931
36339 -202931 -272044 -360262 -466920 -531340 -507333 -472225 -542697 -686752 -748334 -676176 -586855
36328 -586855 -551474 -476025 -305126 -203814 -345237 -577657 -528246 -88339 386139 470158
36318 470158 147421 -228586 -357363 -221582 46919 327628 498758 449987 235453 107089
36308 107089 248876 525932 637305 496387 305671 236305 207422 77930 -91566 -134289
36298 -134289 -54609 -16372 -66522 -70568 24505 60378 -70349 -189949 -62386 217818 277859
36287 277859 -74916 -614229 -962085 -965618 -758430 -565052 -510904 -538640 -457924 -147794
36277 -147794 273074 574078 702597 781475 800654 561941 61715 -329876 -330629 -205435
36267 -205435 -434527 -1009557 -1419044 -1341696 -993211 -692915 -445007 -153559 47075 -22320
36257 -22320 -241627 -331804 -259306 -239059 -373203 -527467 -565268 -492451 -352497 -170696 -31318
36246 -31318 -27925 -91266 -33064 185064 381625 409197 321213 219779 103590 -36902 -131210
36235 -131210 -158693 -226490 -379495 -463215 -337223 -106984 45155 152812 349908 522683
36225 522683 368104 -148891 -650363 -782625 -623282 -524008 -683741 -1006551 -1270617 -1296533
36215 -1296533 -1019775 -534601 -52501 253638 342663 241822 4690 -229607 -288800 -168348
36205 -168348 -31044 83327 336104 717120 853217 496537 5578 -73080 198050 246349
36195 246349 -110989 -405630 -315606 -174584 -340542 -534045 -318837 85780 92770 -280609
36185 -280609 -361489 187378 873445 1066364 748958 332196 77795 780 86500 286412
36175 286412 435794 420864 323862 230673 51916 -271848 -566531 -671697 -730797 -943208
36165 -943208 -1155978 -1055712 -716764 -570682 -767232 -929957 -712460 -297732 -99098 -168314
36155 -168314 -195203 -21835 125034 -27386 -415990 -724031 -770798 -684909 -659242 -644015
36145 -644015 -428041 -16156 271745 202904 -32891 -110433 -80117 -276011 -706369 -893481
36135 -893481 -496264 179032 543975 435990 200093 170575 351308 588084 794930 945088
36125 945088 1011496 979209 812143 423906 -158598 -615681 -550398 20044 567782 591725
36115 591725 144348 -302737 -422287 -304307 -209154 -223193 -225287 -103697 99602 274346
36105 274346 398221 525928 639902 635047 500413 370901 273144 -27288 -684956 -1363322
36095 -1363322 -1489307 -975166 -385046 -245349 -462133 -624487 -633594 -725266 -1008240 -1306850
36085 -1306850 -1439094 -1391928 -1218460 -983198 -817062 -820114 -892969 -851427 -707559 -631289
36075 -631289 -631490 -524384 -279195 -146530 -311544 -604790 -701912 -485875 -107969 183492
36065 183492 186046 -133438 -531790 -627608 -284154 214840 459937 308498 -72557 -430278
36055 -430278 -594345 -522573 -286497 14633 321931 526913 419968 -29636 -408087 -252938
36045 -252938 225172 265816 -387138 -1015523 -880559 -235665 131557 60665 72033 387934
36035 387934 597742 386368 -16827 -314656 -542588 -741554 -703364 -363223 -56180 -37746
36025 -37746 -83346 74827 228424 40411 -336611 -481996 -406189 -503807 -816259 -859767
36015 -859767 -345706 341380 638334 494878 289588 233459 178873 3524 -101894 123121
36005 123121 604516 953688 901228 568848 240317 4789 -207177 -335859 -212230 105332
35995 105332 283019 132037 -127149 -170218 47961 384324 781888 1201789 1419170 1194506
35985 1194506 640903 181809 103370 300309 471169 435302 265834 210078 433931 767166
35975 767166 823923 494236 134609 68309 100802 -146874 -575804 -700601 -369762 38701
35965 38701 204080 226575 267567 231210 35656 -135966 -135002 -127911 -284358 -422200 -302937
35954 -302937 -103824 -208670 -598897 -833415 -665374 -342713 -185709 -146926 14251 294590
35944 294590 427322 276347 53209 47786 245367 364972 271324 151088 159235 91866 -297537
35933 -297537 -744945 -645038 111091 837191 855562 339349 26328 256441 659801 758496
35923 758496 531093 306496 345450 630264 917066 929400 606599 180715 -78559 -146573
35913 -146573 -150029 -90667 117654 392737 539778 578367 731776 1016775 1126444 868247
35903 868247 478228 306888 377934 463607 445477 374174 281457 173190 146004 271451 392058
35892 392058 282889 35786 17278 342193 637322 528337 182408 86999 357769 590388
35882 590388 475384 247623 291363 523484 534503 278305 197615 531299 877038 739635
35872 739635 253933 -18811 123852 362547 447490 503602 632100 627830 347844 49472
35862 49472 43926 215882 212151 -21956 -225849 -281744 -357371 -562599 -750137 -754866 -634573
35851 -634573 -582138 -731383 -1080616 -1455869 -1539303 -1140984 -510253 -180563 -395405 -842560
35841 -842560 -1056336 -922604 -669518 -525236 -545902 -650077 -650194 -360419 145471 486832
35831 486832 392503 75818 -50245 29135 -73593 -522244 -954064 -965094 -641926 -372595
35821 -372595 -295455 -218459 -30728 88431 -52032 -349215 -500533 -337035 13424 271201
35811 271201 277864 135565 81963 232205 484969 687087 790365 776880 549512 66405
35801 66405 -459236 -686913 -513610 -168146 86914 188087 161922 -10818 -276920 -412387
35791 -412387 -249675 57498 190113 83872 28335 296992 785100 1082671 881454 300401
35781 300401 -185494 -189216 185166 457708 323410 -50254 -354061 -542349 -676091 -566621
35771 -566621 5355 742541 972640 501912 -72773 -164712 51866 66893 -86790 90243
35761 90243 704241 1236703 1275821 1017964 834956 726965 500092 205789 52858 31691
35751 31691 -46184 -197981 -242446 -103323 103983 290321 478667 659332 761448 784784
35741 784784 763553 599122 179493 -282881 -318318 234529 950114 1293295 1193612 934807
35731 934807 657272 282184 -146723 -395241 -387611 -361907 -539327 -800973 -828213 -477115
35721 -477115 68857 444828 369832 -113316 -608073 -700676 -398590 -111622 -136308 -334988
35711 -334988 -445076 -497088 -682246 -941030 -1002701 -819556 -646002 -608725 -498308 -164353
35701 -164353 130330 22906 -412189 -733173 -715808 -593691 -652372 -826906 -853386 -655854
35691 -655854 -389620 -178725 -5421 148518 231618 246807 301568 442005 542577 482491
35681 482491 365773 410043 606796 642841 262145 -357685 -711198 -480412 113578 527344
35671 527344 444409 42648 -295682 -428720 -490405 -554236 -494244 -260993 -77405 -157798
35661 -157798 -368303 -413614 -280453 -204173 -219179 -98432 166702 193129 -253665 -830139
35651 -830139 -1025924 -803477 -511552 -332413 -191019 -107038 -202225 -354716 -284458 -77430
35641 -77430 -187443 -709234 -1049600 -652722 230480 870051 965329 826728 747464 637715
35631 637715 365926 101148 102549 359595 642995 818249 921290 934273 670718 26694
35621 26694 -703282 -980761 -647335 -239533 -382406 -906076 -972646 -229533 597319 625665
35611 625665 -8775 -430890 -295444 -126832 -338650 -577342 -365495 101364 262887 8356
35601 8356 -276156 -323260 -224445 -116064 -8393 56080 -9604 -145997 -200858 -199546 -308672
35590 -308672 -507605 -577802 -479298 -436354 -522428 -459356 -50518 419958 507767 206935 -49431
35579 -49431 48398 357150 527519 396980 94058 -126758 -124085 -21372 -102359 -471684
35569 -471684 -870683 -950305 -678380 -334366 -152446 -154747 -305241 -584392 -855651 -881170
35559 -881170 -581594 -121130 333805 736626 957451 744817 121982 -405253 -360441 94756
35549 94756 378130 243842 -19916 -136610 -193530 -327468 -406534 -261404 -8141 107356
35539 107356 47626 -53561 -157258 -317049 -459449 -391249 -70355 262961 290754 -70033
35529 -70033 -559023 -793866 -664907 -470975 -524993 -675698 -486637 74761 475727 325587
35519 325587 -89103 -261468 -150842 -26951 113572 470344 910313 1058717 906882 806473
35509 806473 819738 630128 218340 37832 273145 491140 374003 246472 406141 444038
35499 444038 -135199 -987191 -1338063 -1107709 -890790 -917682 -814683 -467855 -354345 -749098
35489 -749098 -1239644 -1368400 -1228180 -1070780 -826566 -427830 -163354 -236401 -338991 -160265
35479 -160265 23284 -173141 -470505 -308035 161592 198677 -374880 -871857 -778834 -452386
35469 -452386 -438542 -627599 -545488 -147220 145976 38004 -369963 -781484 -901180 -560933
35459 -560933 76699 542572 522677 194077 -84440 -232405 -352786 -391186 -245025 -72988
35449 -72988 -102791 -205011 -68453 221792 225121 -161616 -476745 -323424 127628 450945
35439 450945 462486 199678 -280269 -810174 -1063464 -887472 -533311 -328886 -294004 -294117
35429 -294117 -357541 -543779 -664278 -466623 -10929 423429 720309 937287 1032571 898297
35419 898297 609458 332150 37223 -373342 -711251 -653532 -258749 46974 46308 -84363
35409 -84363 -223977 -504929 -907871 -1089528 -876409 -577346 -510822 -533243 -378763 -209684
35399 -209684 -417192 -987125 -1427975 -1325937 -744550 -105806 165408 -31033 -345676 -303972
35389 -303972 109778 375123 95963 -506269 -970676 -1169350 -1181468 -898751 -231164 470875
35379 470875 718246 553855 449698 566078 608922 446051 337912 429928 503816 417996
35369 417996 348365 379323 296693 55815 28356 429775 864424 856206 558410 492207 762018
35358 762018 981306 892988 640297 420980 242471 88369 35862 101059 157603 90186
35348 90186 -90926 -307240 -469265 -486085 -337053 -127535 16499 75433 85091 40745 -49390
35337 -49390 -105944 -82176 -29731 32304 163428 290998 162214 -258783 -524724 -170820
35327 -170820 611306 1092825 837990 157948 -319778 -313587 -44216 91811 -92597 -425403
35317 -425403 -566113 -381193 -68135 155197 328941 557018 709522 595721 324872 169424
35307 169424 116274 -91147 -447072 -598887 -385615 -123780 -167280 -443454 -632424 -597627
35297 -597627 -419644 -162402 158481 447357 560975 461879 245864 48806 -26317 37836
35287 37836 142582 166256 117057 113269 203174 302226 303683 145621 -186005 -561527 -671773
35276 -671773 -319931 258110 606492 584663 424864 265710 -5019 -358125 -481958 -252823
35266 -252823 -1778 -33547 -171148 -100351 80405 35290 -235308 -384704 -237775 9950
35256 9950 115294 43694 -118268 -290446 -403889 -420511 -351461 -178419 148952 530805
35246 530805 687157 489713 185511 83198 141973 91571 -167598 -528888 -915098 -1259852
35236 -1259852 -1343194 -961661 -249732 417608 810173 914608 737523 348494 40864 86950
35226 86950 336358 395395 210090 115232 271205 430991 362673 147363 -75131 -325200
35216 -325200 -590577 -722284 -703773 -752909 -977393 -1183803 -1203265 -1143900 -1123296 -1014994
35206 -1014994 -706330 -387230 -315725 -454248 -570826 -552691 -406768 -116564 260369 504356
35196 504356 507284 513881 807937 1229410 1289829 773118 -988 -534646 -607894 -376510 -166946
35185 -166946 -192964 -380409 -476668 -371567 -221030 -195754 -260102 -322446 -436057 -648658
35175 -648658 -772936 -552906 -32579 435811 556657 338715 12463 -178842 -145377 -11075
35165 -11075 39363 23874 139044 399035 517584 326933 92639 142418 360709 386860
35155 386860 201776 139818 340228 556000 559551 408845 224213 8756 -180222 -157818
35145 -157818 110525 358504 324918 72125 -142876 -190541 -126227 -30807 60892 116794 96807
35134 96807 -17904 -211983 -427468 -580542 -636509 -639182 -613768 -510821 -320505 -127743
35124 -127743 59094 367140 754683 850476 424634 -130869 -227772 66257 105909 -337126
35114 -337126 -711477 -548644 -162280 -90823 -265478 -254728 -73141 -160088 -608923 -944278
35104 -944278 -770645 -268639 83373 18969 -371670 -770640 -828649 -450248 36715 187081
35094 187081 -24046 -166653 74409 507864 720773 557827 175522 -211089 -453412 -451304
35084 -451304 -205082 137595 412490 596106 749367 863865 876663 791213 652395 422774
35074 422774 30741 -433067 -708247 -637918 -368768 -192802 -236424 -382759 -464332 -439774
35064 -439774 -378695 -350047 -354994 -334301 -233128 -80744 20743 30326 39189 119664 159924
35053 159924 5101 -251130 -317927 -102382 159694 273078 348068 503154 528425 158381
35043 158381 -440280 -805503 -789324 -699054 -783211 -896131 -795556 -507178 -231818 -85495
35033 -85495 -73539 -150960 -180570 1405 349095 592716 579516 469149 474549 586701 691388
35022 691388 773198 834510 774099 528019 207317 -47318 -211541 -275983 -214023 -184746 -475950
35011 -475950 -1002634 -1164373 -576104 279212 568311 153598 -335711 -419702 -255842 -153963
35001 -153963 -101696 16572 114781 95982 87604 218226 334059 183148 -219669 -609093
34991 -609093 -790884 -802390 -793058 -846039 -895385 -783803 -450528 -56117 173007 212978 233098
34980 233098 330125 424582 429373 361052 260319 148720 67666 5875 -176260 -533716 -785964
34969 -785964 -587051 -88603 115673 -239211 -693973 -678747 -264402 3975 -134388 -392619
34959 -392619 -399912 -152966 66973 70789 -49755 -94144 -55041 -133974 -375529 -445860 -34953
34948 -34953 599140 850161 562989 213003 155256 137097 -158705 -500549 -481754 -227151
34938 -227151 -209769 -487294 -632908 -434782 -206629 -290926 -610677 -865573 -915966 -834532
34928 -834532 -761383 -805655 -951728 -1024932 -883194 -622107 -426575 -283073 -71532 115617
34918 115617 51882 -218760 -374305 -272743 -109549 -29254 99387 372881 616273 649638
34908 649638 536522 371344 78975 -332633 -568958 -416260 -141542 -178714 -504183 -672663
34898 -672663 -462706 -150534 -63179 -139157 -85820 198564 511120 572068 279873 -193200
34888 -193200 -508431 -440793 -103582 172014 209948 148083 179524 263372 225369 75899 42635
34877 42635 248761 516052 601183 516900 444114 379302 121769 -308322 -496359 -118221
34867 -118221 540211 846311 580169 142220 -33301 38999 126457 180023 248504 211403
34857 211403 -79324 -490383 -740078 -788578 -805677 -788966 -561316 -190858 -36856 -214279
34847 -214279 -353135 -146465 156168 153389 -33333 50299 406518 512375 146497 -204547
34837 -204547 -71918 244589 105543 -483261 -832237 -536558 -16240 105089 -191245 -434632
34827 -434632 -387378 -301925 -476172 -831809 -1031961 -865850 -413599 92171 470132 670684
34817 670684 727593 676466 524482 279418 -8213 -230434 -270726 -128536 6208 -77785
34807 -77785 -307920 -343325 -42868 238444 78414 -384339 -591158 -329053 22195 98287
34797 98287 7165 -18978 -41707 -175626 -246450 -64562 198888 299246 372221 667714 1001781
34786 1001781 973449 648541 511203 726688 949697 924274 781089 629303 350851 -12029
34776 -12029 -127455 119514 381767 352275 142521 -66410 -343574 -696164 -844780 -663259
34766 -663259 -480292 -559114 -618497 -303360 174569 350263 220307 147334 231671 269005
34756 269005 187545 47748 -240717 -686796 -856042 -346848 440178 664483 216728 -136494
34746 -136494 79730 407388 271761 -158577 -345091 -171687 68304 160675 58857 -251075
34736 -251075 -610959 -646132 -216139 273245 335854 24361 -214388 -139963 129612 413233
34726 413233 590562 541470 276914 61033 127935 346917 420481 316048 220794 161741
34716 161741 -5726 -268503 -432680 -436224 -395564 -320662 -72755 333895 650565 705141
34706 705141 583274 425270 254265 101040 98339 305342 556012 600594 341302 -107249
34696 -107249 -501816 -606272 -384993 -110436 -144056 -525718 -870261 -755779 -174341 450845
34686 450845 681352 494236 304170 507426 999213 1275348 1073726 718255 654074 837903
34676 837903 877642 642534 361788 152692 -131987 -500534 -672977 -536903 -413624 -597004
34666 -597004 -888950 -906537 -660527 -482911 -487308 -468046 -338595 -326920 -607499 -973091
34656 -973091 -1051708 -749953 -346044 -180539 -343529 -650379 -844404 -786716 -493561 -84475
34646 -84475 257974 362270 221452 37972 -15669 -46706 -268240 -585546 -624495 -279129
34636 -279129 34658 -113355 -602978 -963613 -995065 -891340 -822211 -716642 -482475 -153671
34626 -153671 245070 716062 1073131 975627 374597 -248021 -316204 214270 824453 1000537
34616 1000537 712503 341760 246109 432577 613030 540221 257426 -1126 -101390 -116186
34606 -116186 -166409 -267865 -350998 -337770 -190053 17201 79718 -129142 -415579 -418068 -83696
34595 -83696 199226 89091 -252901 -392004 -189061 94054 205033 161097 65094 -98460
34585 -98460 -349386 -541467 -481346 -193775 55039 39829 -167469 -274911 -103579 212451
34575 212451 403518 378576 250433 90817 -144395 -406723 -500966 -369740 -212290 -128425
34565 -128425 116442 664948 1122376 997807 511724 421062 941131 1385153 1137520 489633
34555 489633 102479 51092 -60506 -321131 -489757 -635652 -1109886 -1780295 -1948407 -1326929
34545 -1326929 -575050 -441318 -753924 -753870 -200015 393767 574871 499260 525303 633743
34535 633743 507533 25361 -539154 -780808 -523129 63425 639319 981713 1101141 1105454
34525 1105454 1043784 940893 879952 913850 936365 782324 456962 151474 21683 47687
34515 47687 115791 140428 89050 -28728 -169579 -296091 -394779 -421299 -299945 -65000 70430
34504 70430 -84211 -465633 -842167 -1076470 -1174249 -1146899 -1004040 -826930 -646097 -296607
34494 -296607 351809 1035930 1272883 959598 510886 290563 197218 -12290 -269807 -331801
34484 -331801 -179174 1687 135979 305101 516308 628756 508068 156531 -250629 -412416
34474 -412416 -158522 241703 259004 -226875 -682770 -598811 -160553 99519 95550 164316
34464 164316 363426 344345 797 -254008 -71676 333880 511831 336552 34995 -133605
34454 -133605 -37290 303143 668454 763621 527099 198796 6121 -57984 -92813 -135730
34444 -135730 -218638 -352948 -392580 -171617 151665 204131 -41368 -181095 -30199 50433
34434 50433 -236235 -573390 -485238 -43491 315397 456955 589216 796805 963887 1045492
34424 1045492 1032742 801133 393518 247104 633360 1058999 846731 209026 23059 502343
34414 502343 870646 574898 61191 -57000 70992 -9529 -190548 -41995 388823 636707
34404 636707 515898 236067 -56394 -371879 -601517 -604018 -518379 -576690 -661379 -471433
34394 -471433 -92021 46657 -204979 -561877 -812129 -1022146 -1135725 -849317 -120139 593211
34384 593211 883191 880287 899507 884372 570144 22007 -389718 -514056 -578134 -782821
34374 -782821 -1027052 -1139406 -1153511 -1173859 -1096414 -687809 29479 634683 689820 236821
34364 236821 -208236 -196762 207864 580280 619564 377128 89365 -52143 10308 179169
34354 179169 255483 145438 12376 75222 261424 264892 4103 -204394 -78465 206980
34344 206980 250941 -16276 -255151 -200170 11227 93039 19844 2086 124352 221061 165156
34333 165156 99069 223778 464273 557148 447498 356308 390956 344775 54080 -261167
34323 -261167 -272282 -31107 99039 -49615 -287754 -408964 -413835 -345442 -162259 115550
34313 115550 327687 347964 195992 -68455 -382367 -572945 -446918 -86004 156361 68958
34303 68958 -192695 -380350 -416692 -277476 94236 549601 689808 356327 -41162 -6648
34293 -6648 391794 686763 686196 592685 522023 339836 25970 -200286 -243775 -273205 -340208
34282 -340208 -198934 254297 647888 565756 144672 -91742 73674 345477 418064 372369
34272 372369 426728 512952 343010 -149626 -644178 -776318 -525953 -163123 108365 298349
34262 298349 436564 428770 217136 -46237 -139060 -16045 214251 473300 692582 684632
34252 684632 299102 -265293 -568744 -455192 -239831 -238671 -355660 -353929 -304458 -423342
34242 -423342 -593612 -471598 -89464 84070 -138315 -278031 137910 792570 917313 329093
34232 329093 -324462 -419186 -37346 372344 624971 770491 722167 359240 -76670 -105918
34222 -105918 383203 938784 1059674 696954 168557 -211413 -314928 -204349 -87071 -132609
34212 -132609 -237606 -104918 359433 866709 1044117 779121 215983 -402722 -811749 -860628
34202 -860628 -714327 -730539 -1012194 -1291275 -1377005 -1425034 -1545785 -1470299 -967490 -349637
34192 -349637 -118521 -241032 -233978 85184 399487 465044 412849 361917 168354 -225292
34182 -225292 -536002 -488559 -178639 122435 317748 455416 554277 649085 827837 1046966
34172 1046966 1092944 908405 760300 864201 1020064 886110 490561 186882 158389 248929
34162 248929 302273 413055 722307 1102725 1190418 744967 -48210 -667030 -700189 -220431
34152 -220431 327143 581540 527368 354662 238449 280707 479525 664761 603209 254673
34142 254673 -175436 -463125 -513279 -304256 80595 341552 175905 -288940 -559353 -415223
34132 -415223 -189305 -222910 -370354 -329164 -167666 -153693 -274466 -330636 -362865 -563503
34122 -563503 -830621 -817182 -429756 64454 429524 637383 670927 509973 339431 414802
34112 414802 661347 751983 650961 701866 1042901 1312951 1160528 731348 384600 168815
34102 168815 -129451 -574392 -995082 -1233355 -1269475 -1157059 -987656 -860940 -778355 -650259
34092 -650259 -490562 -458461 -586867 -641657 -439587 -165923 -139504 -339633 -421153 -203019
34082 -203019 86369 123222 -116457 -380004 -461313 -386526 -298860 -261842 -240513 -236852 -325666
34071 -325666 -499411 -584850 -442136 -175826 16415 146832 357547 548342 399117 -106321
34061 -106321 -479781 -316949 118264 235821 -45318 -188548 165024 644955 636447 116921
34051 116921 -309410 -201994 178615 271483 -33738 -303823 -189107 131802 250709 52843
34041 52843 -265039 -538839 -713903 -652408 -217395 372818 593111 217899 -321035 -403030
34031 -403030 71730 636049 831273 626945 305268 127636 153760 262636 298255 244270
34021 244270 246995 406262 581021 516907 186542 -106991 -57766 247634 377316 55279
34011 55279 -471280 -706916 -526871 -314400 -403778 -628957 -645829 -504508 -550841 -828041
34001 -828041 -968488 -747132 -388990 -180668 -80761 84906 285368 364717 287393 119377
33991 119377 -75074 -169656 -13651 288328 355790 16758 -399785 -522078 -483500 -679229
33981 -679229 -1117762 -1389795 -1235140 -790162 -270709 248253 668084 787142 531059 77169
33971 77169 -354476 -689473 -911593 -941143 -709613 -289513 111868 278064 138635 -152427
33961 -152427 -345063 -338963 -213326 -2361 354077 749411 867259 601790 276511 185199
33951 185199 162672 -51751 -266184 -107793 300263 435834 120103 -306622 -548665 -615338
33941 -615338 -491842 -74574 447525 653052 504086 423101 566331 545786 160870 -129092
33931 -129092 97720 486072 388225 -189650 -644882 -619033 -307915 -21324 139931 183861
33921 183861 138001 65577 -36926 -267602 -564471 -626018 -340203 -57482 -111747 -310002
33911 -310002 -289867 -141627 -183411 -310446 -151241 220835 360339 243509 334347 728070
33901 728070 886490 505847 55849 58474 323413 379049 279480 427686 810390 959561
33891 959561 637479 123839 -214357 -312271 -318317 -362398 -460867 -494297 -295540 106080 412090
33880 412090 395877 209393 137779 163621 60079 -146080 -147218 151260 406611 253248
33870 253248 -246056 -697326 -801055 -583381 -303450 -211314 -324355 -397194 -182847 262083
33860 262083 622032 675876 493482 267153 82484 -84364 -242535 -334254 -274830 -44251
33850 -44251 218239 274410 54361 -199143 -214612 -64388 -35517 -156614 -142459 128941
33840 128941 389259 385111 244039 224899 325459 380372 360725 313313 178385 -28682 -19330
33829 -19330 402352 877021 841844 350910 72508 347153 717818 651002 304514 188433
33819 188433 360132 427375 217837 -19937 -84785 -81134 -113264 -59397 187873 501527 714776
33808 714776 858158 1032277 1173077 1113127 811174 400235 60885 -74697 18766 199172
33798 199172 245837 124860 75728 286028 560760 521623 119900 -277551 -372857 -277981
33788 -277981 -228553 -173985 74808 397170 412234 35529 -329975 -329508 -125850 -95707 -277028
33777 -277028 -443747 -575693 -836917 -1122720 -1088338 -726137 -469630 -531507 -577921 -356660
33767 -356660 -210964 -512860 -936381 -883189 -427020 -177453 -260520 -139899 418852 892998
33757 892998 825396 517916 466345 573936 455822 177370 83956 90932 -214072 -775668
33747 -775668 -988257 -563069 31954 264963 272405 537948 1093989 1463561 1344243 984038
33737 984038 784127 792484 773749 624334 471831 382947 226222 -61634 -276215 -220889
33727 -220889 -51335 -74562 -256369 -242162 94620 453779 585585 649565 874622 1123519
33717 1123519 1086972 745637 360210 117766 30835 62348 106180 -9949 -225288 -122307
33707 -122307 527726 1224407 1205651 448103 -269968 -395348 -222268 -288846 -590773 -751049
33697 -751049 -683479 -663747 -826951 -951882 -802618 -467027 -247471 -287667 -395516 -287762
33687 -287762 5762 133796 -65929 -239333 12975 463043 483285 -28416 -431336 -236835
33677 -236835 234260 408007 267858 159418 86121 -233196 -716259 -900851 -637978 -314106
33667 -314106 -240605 -254917 -142998 -66594 -248206 -511478 -515773 -301115 -220272 -365688 -421402
33656 -421402 -151004 268379 530369 567451 451199 137193 -414206 -960936 -1129131 -873984
33646 -873984 -550419 -454622 -513281 -524453 -472617 -426699 -321314 -80585 164638 230717 162125
33635 162125 100268 -49107 -496641 -1117016 -1454090 -1282013 -884908 -640841 -560275 -393685
33625 -393685 -10463 478150 823181 765925 252955 -366554 -579778 -299667 -1164 -98056
33615 -98056 -420557 -547044 -430317 -376235 -535502 -740098 -781667 -573167 -97668 515561
33605 515561 912655 828544 487020 386604 643993 844515 629569 145181 -240167 -414531
33595 -414531 -510186 -581477 -538529 -358231 -172437 -114314 -176793 -263812 -336148 -455032 -659928
33584 -659928 -837357 -797260 -506356 -150314 95145 245785 368275 388290 209265 -61032
33574 -61032 -206331 -196728 -188423 -223300 -134505 177577 528653 605605 262633 -376122 -1021716
33563 -1021716 -1388689 -1348146 -995735 -569469 -282176 -201516 -228830 -191788 -39403 63356
33553 63356 -36170 -185919 -108908 96035 -12203 -511374 -835220 -541078 -18192 51176
33543 51176 -304745 -464296 -217502 -4907 -99408 -194779 -34249 105565 -109267 -532898
33533 -532898 -824503 -936548 -990978 -966602 -851433 -854839 -1111209 -1351689 -1197460 -650534
33523 -650534 -33074 406488 580264 449799 134400 -19983 196891 512912 467347 -16856
33513 -16856 -585204 -875138 -750688 -237079 480938 1034002 1102951 717232 211781 -58669
33503 -58669 79850 500014 751370 446297 -155259 -295469 268653 790510 496294 -333747
33493 -333747 -806667 -668576 -439551 -427039 -348525 -11535 311177 391246 371385 363622 227901
33482 227901 -15130 -39383 240394 422724 225160 -67192 -80069 95442 168384 127010
33472 127010 86054 -45968 -357773 -627084 -591845 -341820 -115487 90060 374865 605994
33462 605994 593811 442655 382811 387936 279561 77297 -60707 -105255 -81974 81202 329452
33451 329452 340565 -20484 -349283 -241911 47444 2522 -308748 -388461 -172088 -61178
33441 -61178 -134757 -54144 176056 112039 -259344 -306719 240638 760499 663110 237830 50179
33430 50179 51311 -85946 -213428 -13309 271832 170978 -154505 -141368 186979 242209
33420 242209 -102497 -299303 -102997 5965 -295450 -554459 -294580 151052 145481 -267268
33410 -267268 -493725 -313205 -66004 34027 194947 525806 698668 402417 -164399 -551591
33400 -551591 -647426 -722305 -934766 -1075418 -892743 -480933 -172201 -121735 -177866 -154431
33390 -154431 -46564 75594 200225 288655 232665 56186 -9950 138270 247556 97303
33380 97303 -52680 179092 576710 500725 -128009 -569340 -264307 377026 584005 251177
33370 251177 -122089 -261609 -347415 -500531 -545929 -350518 -43325 165129 145636 -120312
33360 -120312 -412957 -293609 392100 1126016 1249577 820827 471474 454842 423360 221695
33350 221695 219652 571952 783184 471441 54002 116484 490594 581318 342463 251317
33340 251317 425854 442769 87576 -307364 -430770 -414277 -492830 -637858 -723895 -731019 -619896
33329 -619896 -333095 -71104 -195439 -643503 -819612 -374957 238500 370997 52435 -190064
33319 -190064 -196610 -303666 -631037 -810595 -612869 -370364 -441914 -586595 -304114 347346
33309 347346 727170 457675 -71529 -213507 173837 689727 944029 896423 718682 573653
33299 573653 551407 633200 682704 621337 601557 802947 1053621 935521 367924 -194827
33289 -194827 -328479 -142489 25804 172874 520080 969684 1075728 600602 -181465 -785002
33279 -785002 -910799 -563885 -25980 278901 124291 -296729 -664699 -944961 -1227414 -1306651
33269 -1306651 -895499 -247425 -21909 -375468 -701282 -529574 -194727 -232284 -538160 -614870
33259 -614870 -370973 -169583 -234867 -457596 -687169 -819715 -702249 -348190 -152751 -476622
33249 -476622 -1074431 -1346451 -1105900 -670569 -251577 234917 717412 889494 754768 756538
33239 756538 1109569 1422104 1275580 818387 459390 278941 100111 -92266 -170869 -145222
33229 -145222 -90884 72982 420100 734067 704783 355354 -1111 -176752 -212993 -133165
33219 -133165 89360 304668 241016 -116653 -436803 -437475 -191281 56819 196229 245675
33209 245675 181141 -58671 -424459 -729035 -792588 -589429 -257800 24991 185242 266187
33199 266187 305498 257484 75443 -181556 -376919 -394292 -188337 169268 446843 391090
33189 391090 32255 -258713 -181835 102162 186067 -24262 -188469 4221 456876 830368
33179 830368 918654 748564 436255 96329 -145438 -177426 8024 264884 368700 207954
33169 207954 -65198 -157769 4818 130023 -85386 -515554 -724599 -515849 -133267 136515
33159 136515 316626 554035 795714 877876 821491 795433 814053 690585 328141 -113558
33149 -113558 -410940 -515835 -527775 -513855 -438540 -233510 114875 516339 787479 775246
33139 775246 534036 330890 379999 584205 644656 446921 215305 203712 350980 400603
33129 400603 294761 226572 273874 221140 -116031 -574578 -845559 -864714 -787810 -674205
33119 -674205 -454019 -176438 -14606 13808 75437 195709 150033 -198404 -665404 -988765
33109 -988765 -1107509 -1051453 -772837 -312677 39112 24807 -230820 -405398 -444224 -565499
33099 -565499 -820639 -945963 -742981 -393193 -267607 -529566 -992384 -1286821 -1151333 -655370
33089 -655370 -146499 104311 165873 254826 379602 375831 232458 123711 118981 129993 172424
33078 172424 377342 663952 731068 531848 430943 650605 860267 643915 146804 -126159
33068 -126159 -16134 184600 264523 313691 386181 337577 119615 -85254 -170981 -272211
33058 -272211 -458909 -527619 -312440 -1262 100800 -10146 -94102 -61039 -63068 -192496
33048 -192496 -295423 -175913 106855 245761 26257 -359953 -453911 -93046 273837 87113
33038 87113 -521735 -771803 -230257 553276 710778 135137 -487432 -630945 -491238 -516022
33028 -516022 -739264 -818437 -554478 -136606 105892 52478 -141513 -264288 -260093 -177038
33018 -177038 25290 430785 886448 1004380 627537 103419 -155446 -218134 -415137 -695714
33008 -695714 -643120 -157968 310160 370053 169489 68744 142696 245137 312584 341451
32998 341451 248030 -10956 -318512 -566505 -766370 -855702 -669769 -311793 -226960 -585060
32988 -585060 -889555 -620288 -21076 253899 114553 81733 395133 671114 577028 324124
32978 324124 257549 360863 424963 404423 369581 335523 316148 342870 323325 122351 -146537
32967 -146537 -212084 -97913 -117375 -314125 -343314 -88940 75832 -77985 -216976 -27584
32957 -27584 244766 300031 389864 835637 1292405 1180841 647349 387303 600884 820835
32947 820835 773625 710460 781674 753569 540186 407906 421002 270237 -68783 -93724 428892
32936 428892 949713 875786 399253 111108 150897 247014 299620 371557 306653 -77824 -518033
32925 -518033 -553229 -226771 -56265 -274079 -540327 -496954 -216767 32141 155286 217325
32915 217325 289305 430049 648387 815904 767145 506289 169215 -175684 -494688 -633712
32905 -633712 -481592 -267077 -366247 -753343 -954625 -670630 -172061 85033 12633 -128068
$$ [...]
##END NTUPLES=NMR SPECTRUM
##END=
