##TITLE=31Pdec_2PEPA0207
 D2O, 24 sc
 5.07.2021
##JCAMPDX= 6.0         $$ Bruker NMR JCAMP-DX V2.0
##DATA TYPE= NMR SPECTRUM
##DATA CLASS= NTUPLES
##ORIGIN= UXNMR, Bruker Analytische Messtechnik GmbH
##OWNER= root
$$ XWIN-NMR		Version 3.5
$$ Mon Jul  5 09:59:17 2021 Russian Standard Time (UT+4h)  she@DPX200
##.OBSERVE FREQUENCY= 81.013821
##.OBSERVE NUCLEUS= ^31P
##.ACQUISITION MODE= SIMULTANEOUS
##.ACQUISITION SCHEME= undefined
##.AVERAGES= 24
##.DIGITISER RES= 16
##SPECTROMETER/DATA SYSTEM= spect
##.PULSE SEQUENCE= zgpg30
##.SOLVENT NAME= D2O
##.SHIFT REFERENCE= (INTERNAL, D2O, 0, 248.564)
##AUDIT TRAIL= $$ (NUMBER, WHEN, WHO, WHERE, WHAT)
$$ ##TITLE= Audit trail, XWIN-NMR		Version 3.5
$$ ##JCAMPDX= 5.01
$$ ##ORIGIN= Bruker BioSpin GmbH
$$ ##OWNER= she
$$ F:/spectra/data/she/nmr/P31/1/pdata/1/auditp.txt
$$ ##AUDIT TRAIL=  $$ (NUMBER, WHEN, WHO, WHERE, WHAT)
(   1,<2021-07-05 09:57:27.25 +0400>,<she>,<DPX200>,
      <created by zg, POWCHK disabled, PULCHK disabled
       configuration hash MD5:
       00 E9 B6 7A A2 85 ED C7 34 08 36 98 17 FE 4E 26
       data hash MD5: 32K
       9B 52 F2 4A 39 88 BB B7 AE 07 E8 D0 C2 35 50 27>)
(   2,<2021-07-05 09:57:44.50 +0400>,<she>,<DPX200>,
      <Start of raw data processing
       efp BC_mod = 2 LB = 1 FT_mod = 6 PKNL = 1 PHC0 = -7050.822 PHC1 = -765.714 SI = 64K 
       data hash MD5: 64K
       CC 1D 43 07 63 CC B8 0E 44 A9 CA 8A 6B B4 74 A3>)
(   3,<2021-07-05 09:58:15.09 +0400>,<she>,<DPX200>,
      <pk PHC0 = -6.763772 PHC1 = 13.6 
       data hash MD5: 64K
       55 F3 04 AC 99 0E EC 7D 44 C1 93 DF 7E A3 DB DD>)
(   4,<2021-07-05 09:58:18.25 +0400>,<she>,<DPX200>,
      <abs ABSG = 5 
       data hash MD5: 64K
       92 5A 39 29 3A 31 EC 2E F5 0E 43 6A 75 7A 92 06>)
(   5,<2021-07-05 09:58:39.93 +0400>,<she>,<DPX200>,
      <abs ABSG = 5 
       data hash MD5: 64K
       46 38 56 5C 54 F6 74 D7 C7 37 2E 59 21 DE 6E D8>)
$$ ##END=
$$ 
$$ hash MD5
$$ B6 CD 94 F2 CE 55 77 AD 1C B4 8F A5 C1 EE A8 06
##$RELAX= 
##$RELAX= 
##$RELAX= 
##$RELAX= 
##$RELAX= 
##$RELAX= 
##$RELAX= 
##$RELAX= 
$$ Bruker specific parameters
$$ --------------------------
##$DU= <F:/spectra>
##$EXPNO= 1
##$NAME= <P31>
##$PROCNO= 1
##$TYPE= <nmr>
##$USER= <she>
##$AMP= (0..31)
100 100 100 100 100 100 100 100 100 100 100 100 100 100 100 100 100 100 
100 100 100 100 100 100 100 100 100 100 100 100 100 100 
##$AQSEQ= 0
##$AQ_mod= 1
##$AUNM= <au_zg>
##$AUTOPOS= <>
##$BF1= 81.014009
##$BF2= 200.13
##$BF3= 200.13
##$BF4= 200.13
##$BF5= 200.13
##$BF6= 200.13
##$BF7= 200.13
##$BF8= 200.13
##$BYTORDA= 1
##$CFDGTYP= 0
##$CFRGTYP= 5
##$CHEMSTR= <none>
##$CNST= (0..31)
1 1 145 1 1 1 1 1 1 1 1 1 1 1 1 1 1 1 1 1 1 1 1 1 1 1 1 1 1 1 1 1 
##$CPDPRG= <waltz16>
##$CPDPRG1= <>
##$CPDPRG2= <waltz16>
##$CPDPRG3= <>
##$CPDPRG4= <mlev>
##$CPDPRG5= <mlev>
##$CPDPRG6= <mlev>
##$CPDPRG7= <mlev>
##$CPDPRG8= <mlev>
##$CPDPRGB= <>
##$CPDPRGT= <>
##$D= (0..31)
0 1 0 0 0 0 0 0 0 0 0 0.03 2e-05 3e-06 0 0 0 0 0 0 0 0 0 0 0 0 0 0 0 0 
0 0 
##$DATE= 1625464646
$$ [...]
##$SUBNAM3= <"">
##$SUBNAM4= <"">
##$SUBNAM5= <"">
##$SUBNAM6= <"">
##$SUBNAM7= <"">
##$SUBNAM8= <"">
##$SUBNAM9= <"">
##$SW= 501.771253377433
##$SWIBOX= (0..15)
0 1 3 0 0 0 0 0 0 0 0 0 0 0 0 0 
##$SW_h= 40650.406504065
##$TD= 32768
##$TD0= 1
##$TE= 0
##$TE2= 300
##$TE3= 300
##$TEG= 300
##$TL= (0..7)
0 120 53 12 22 120 120 120 
##$TP= (0..7)
150 150 150 150 150 150 150 150 
##$TP07= 0
##$TPNAME0= <>
##$TPNAME1= <>
##$TPNAME2= <>
##$TPNAME3= <>
##$TPNAME4= <>
##$TPNAME5= <>
##$TPNAME6= <>
##$TPNAME7= <>
##$TPOAL= (0..7)
0.5 0.5 0.5 0.5 0.5 0.5 0.5 0.5 
##$TPOFFS= (0..7)
0 0 0 0 0 0 0 0 
##$TUNHIN= 0
##$TUNHOUT= 0
##$TUNXOUT= 0
##$USERA1= <user>
##$USERA2= <user>
##$USERA3= <user>
##$USERA4= <user>
##$USERA5= <user>
##$V9= 5
##$VALIST= <valist>
##$VCLIST= <CCCCCCCCCCCCCCC>
##$VD= 0
##$VDLIST= <DDDDDDDDDDDDDDD>
##$VPLIST= <PPPPPPPPPPPPPPP>
##$VTLIST= <TTTTTTTTTTTTTTT>
##$WBST= 1024
##$WBSW= 4
##$XGAIN= (0..3)
0 0 0 0 
##$XL= 0
##$YL= 0
##$YMAX_a= 5135
##$YMIN_a= -5641
##$ZGOPTNS= <>
##$ZL1= 120
##$ZL2= 120
##$ZL3= 120
##$ZL4= 120
##$ABSF1= 248.5645
##$ABSF2= -253.2056
##$ABSG= 5
##$ABSL= 3
##$ALPHA= 0
##$AQORDER= 0
##$ASSFAC= 0
##$ASSFACI= 0
##$ASSFACX= 0
##$ASSWID= 0
##$AUNMP= <proc_1d>
##$AZFE= 0.1
##$AZFW= 0.5
##$BCFW= 0
##$BC_mod= 2
##$BYTORDP= 0
##$COROFFS= 0
##$CY= -3
##$DATMOD= 1
##$DC= 0
##$DFILT= <>
##$DTYPP= 0
##$F1P= 0
##$F2P= 0
##$FCOR= 1
##$FTSIZE= 65536
##$FT_mod= 6
##$GAMMA= 0
##$GB= 0
##$INTBC= 1
##$INTSCL= 5.30512e-09
##$ISEN= 30
##$LB= 1
##$LEV0= 0
##$LPBIN= 0
##$MAXI= 10000
##$MC2= 0
##$MEAN= 0
##$ME_mod= 0
##$MI= 50
##$NCOEF= 0
##$NC_proc= -7
##$NLEV= 6
##$NOISF1= 182.463
##$NOISF2= 159.3651
##$NSP= 0
##$NTH_PI= 0
##$NZP= 0
##$OFFSET= 248.5645
##$PC= 4
##$PHC0= -7057.585
##$PHC1= -752.114
##$PH_mod= 1
##$PKNL= yes
##$PPARMOD= 0
##$PSCAL= 0
##$PSIGN= 0
##$REVERSE= no
##$SF= 81.014009
##$SI= 65536
##$SIGF1= 159.3651
##$SIGF2= -187.1042
##$SINO= 113.3802
##$SIOLD= 16384
##$SREGLST= <1H.CDCl3>
##$SSB= 0
##$STSI= 65536
##$STSR= 0
##$SW_p= 40650.406504065
##$SYMM= 0
##$S_DEV= 0
##$TDeff= 32768
##$TDoff= 0
##$TI= <>
##$TILT= no
##$TM1= 0
##$TM2= 0
##$TOPLEV= 0
##$USERP1= <user>
##$USERP2= <user>
##$USERP3= <user>
##$USERP4= <user>
##$USERP5= <user>
##$WDW= 1
##$XDIM= 65536
##$YMAX_p= 404348308
##$YMIN_p= -29122454
$$ End of Bruker specific parameters
$$ ---------------------------------
##NTUPLES= NMR SPECTRUM
##VAR_NAME=  FREQUENCY,     SPECTRUM/REAL,   SPECTRUM/IMAG
##SYMBOL=    X,             R,               I
##VAR_TYPE=  INDEPENDENT,   DEPENDENT,       DEPENDENT
##VAR_FORM=  AFFN,          ASDF,            ASDF
##VAR_DIM=   65536,         65536,           65536
##UNITS=     HZ,            ARBITRARY UNITS, ARBITRARY UNITS
##FACTOR=    0.620285442955139, 1,           1
##FIRST=     20137.2065510759, 0,            0
##LAST=      -20513.1999529892, 0,           0
##MIN=       -20513.1999529892, -29122454,   0
##MAX=       20137.2065510759, 404348308,    0
$$ Real data points
##PAGE= N=1
##DATA TABLE= (X++(R..R)), XYDATA
$$ [...]
$$ plain form
13133 -1953220 -1241445 756689 2733032 3184931 2087039 32944 -2443089 -4162581
13125 -4162581 -3676014 -1236227 945095 1363491 973545 1187536 1295835 -351222 -3067433
13116 -3067433 -3879088 -1511093 1390782 1455631 -999621 -2546895 -1294456 1079853 2377510
13107 2377510 2877858 3872768 4765401 3778227 1000483 -1393873 -2149538 -2378448 -3454958
13098 -3454958 -4890615 -5132114 -3585938 -1179005 519699 430615 -1141195 -2617725 -2865542
13089 -2865542 -2653129 -3331806 -4323624 -3617371 -965712 1366997 1767674 1213264 923813
13080 923813 159181 -1777721 -3116283 -1787294 939137 1756506 64857 -1256104 -217326
13071 -217326 1625995 1908056 767130 -57763 24262 287090 417151 788357 1308351
$$ packed form
13133a953220P11775J998134J976343M51899j097892k054095k476033j719492
13125d162581M86567K439787K181322M18396l89946K13991J08299j647057k716211
13116c067433q11655K367995K901875O4849k455252j547274J252439K374309J297657
13107B377510N00348R94910Q92633r87174k777744k394356p55665k28910j076510
13098c454958j435657k41499J546176K406933J698704q9084j571810j476530k47817
13089b865542K12413o78677r91818P06253K651659K332709M00677n54410k89451
13080I23813p64632j936902j338562J328989K726431Q17369j691649j320961J038778
13071b17326J843321K82061j140926q24893Q2025K62828J30061L71206N19994
$$ plain form
13062 1308351 1298116 489116 -805302 -2378164 -4025631 -4872571 -3973741 -1866430 -467152
13053 -467152 -855165 -2003402 -2403806 -2141853 -2302505 -2864688 -2624822 -1304242 -353624
13044 -353624 -1017197 -2588511 -3413002 -2924867 -1824904 -781059 61841 542901 409025
13035 409025 -173155 -622895 -454219 502416 1970331 2949199 2321794 434366 -801636
13026 -801636 -390468 142681 -942763 -2682987 -2853275 -1705577 -1702229 -3475317 -4742941
13017 -4742941 -3912134 -2154424 -788799 816941 3058088 4191756 2896006 871735
13009 871735 353272 493472 -908382 -3059036 -2797065 483671 3570814 3768460 1952538
13000 1952538 292238 -775579 -1710227 -1752342 190284 3095147 4176515 2110881 -1167843
$$ packed form
13062A308351j0235q09000j294418j572862j647467q46940Q98830K107311J399278
13053d67152l88013j148237m00404K61953j60652n62183K39866J320580R50618
13044c53624o63573j571314q24491M88135J099963J043845Q42900M81060j33876
13035D09025n82180m49740J68676R56635J467915R78868o27405j887428j236002
13026h01636M11168N33149j085444j740224j70288J147698L348j773088j267624
13017d742941Q30807J757710J365625J605740K241147J133668j295750k024271
13009H71735n18463J40200j401854k150654K61971L280736L087143J97646j815922
13000A952538j660300j067817r34648m2115J942626K904863J081368k065634l278724
$$ plain form
12991 -1167843 -2589683 -1377972 491081 1257982 1585340 2707140 3360409 927245 -4027648
12982 -4027648 -7019408 -5155255 -1266051 -20691 -1483879 -1840387 136936 1272891
12974 1272891 -524721 -2612056 -1668878 1130943 1894544 -295600 -2341549 -1670091 580278
12965 580278 1617058 631356 -730255 -813134 208273 1025429 1058320 1009135 1548231 2126448
12955 2126448 1727719 497191 -207239 548185 2265382 3757500 4248195 3580356 2026135
12946 2026135 265809 -838086 -725529 658242 2817879 4494342 4161250 1729920
12938 1729920 -690300 -997071 242813 820023 285694 274862 1254008 1474973 253327
12929 253327 -204723 1768586 4074509 3682897 1334175 340783 1278508 1241827 -1139210
$$ packed form
12991a167843j421840J211711J869053P66901L27358J121800O53269k433164m954893
12982d027648k991760J864153L889204J245360j463188l56508J977323J135955
12974A272891j797612k087335R43178K799821P63601k190144k045949O71458K250369
12965E80278J036780r85702j361611q2879J021407Q17156L2891m9185N39096N78217
12955B126448l98729j230528p04430P55424J717197J492118M90695o67839j554221
12946B026135j760326j103895J12557J383771K159637J676463l33092k431330
12938A729920k420220l06771J239884N77210n34329j0832R79146K20965j221646
12929B53327m58050J973309K305923l91612k348722r93392R37725l6681k381037
$$ plain form
12920 -1139210 -3156314 -2040446 918550 2372943 1484633 265685 160807 463110 79639
12911 79639 -902571 -1841626 -2532214 -3020796 -3102373 -2435715 -938482 939331 2218644
12902 2218644 2133191 1233470 1042700 1955730 2397366 1196547 -201361 274773 1770867
12893 1770867 1386392 -1334578 -3480944 -3164244 -2150051 -2581015 -3626797 -3666782 -3575404
12884 -3575404 -4790729 -5680873 -3456042 878941 3141271 1778204 -320668 -503824
12876 -503824 412683 769736 831705 1228119 1282965 793972 1110713 2474823 2651525 498571
12866 498571 -1390258 -352386 2036595 2465762 1082836 667896 1674115 1848688 460032
12857 460032 -740716 -951918 -1287729 -1841085 -1116691 762828 1449719 109842 -1172967
$$ packed form
12920a139210k017104J115868K958996J454393q88310j218948j04878L02303l83471
12911G9639r82210r39055o90588m88582q1577O66658J497233J877813J279313
12902B218644q5453q99721j90770R13030M41636j200819j397908M76134J496094
12893A770867l84475k720970k146366L16700J014193m30964j045782l9985R1378
12884c575404j215325q90144K224831M334983K262330j363067k098872j83156
12876e03824R16507L57053O1969L96414N4846m88993L16741J364110J76702k152954
12866D98571j888829J037872K388981M29167j382926m14940J006219J74573j388656
12857D60032j200748k11202l35811n53356P24394J879519O86891j339877j282809
$$ plain form
12848 -1172967 -985183 -603567 -876687 -156366 2439517 4436831 3429654 935521 -118873
12839 -118873 19005 -853544 -2338686 -1775459 1104347 3299078 2868542 1262160 450064
12830 450064 317248 222845 932782 3115376 5285400 5225458 2950705 685551 -21117
12821 -21117 83166 -578421 -2243771 -3621211 -3495905 -2059238 -574087 63730 142884
12812 142884 423437 914103 795992 -400457 -1914317 -2337837 -1085784 814042 1529361
12803 1529361 200263 -2075165 -3262111 -2511423 -1023101 -581333 -1458518 -2196847 -1545701
12794 -1545701 -219764 -211980 -2225421 -4347345 -4052714 -1424873 713488 375014 -1029368
12785 -1029368 -855395 910057 1702715 145428 -2075896 -2586434 -1052191 1148141 2595254
$$ packed form
12848a172967J87784L81616k73120P20321K595883J997314j007177k494133j054394
12839a18873J37878q72549j485142N63227K879806K194731m30536j606382q12096
12830D50064j32816r4403P09937K182594K170024n9942k274753k265154p06668
12821b1117J04283o61587j665350j377440J25306J436667J485151O37817P9154
12812A42884K80553M90666j18111j196449j513860m23520J252053J899826P15319
12803A529361j329098k275428j186946P50688J488322M41768q77185p38329O51146
12794a545701J325937P784k013441k121924K94631K627841K138361l38474j404382
12785a029368J73973J765452P92658j557287k221324n10538J534243K200332J447113
$$ plain form
12776 2595254 2328901 55861 -2928485 -4145155 -2701221 -886139 -1529200 -4310985
12768 -4310985 -6240808 -5483957 -3082313 -849116 775895 2189403 3213435 3143834 1718287
12759 1718287 -445130 -2079212 -1962678 -79643 1846130 1851971 84729 -1179514 -314860
12750 -314860 1668870 2585645 1791047 468586 -386311 -1073603 -2145246 -3318012 -4008137
12741 -4008137 -4227599 -4166439 -3354525 -1280536 1188940 2128209 783013 -1336284 -2223055
12732 -2223055 -1553786 -419909 319242 383208 -491331 -1986071 -2492744 -754658 1740463
12723 1740463 1913004 -842776 -3590117 -3747338 -2297700 -1800526 -2742174 -3573623 -3311604
12714 -3311604 -2325280 -1177831 -243125 31016 -248892 -274981 -250690 -2009669 -6098586
$$ packed form
12776B595254k66353k273040k984346j216670J443934J815082o43061k781785
12768d310985j929823P56851K401644K233197J625011J413508J024032o9601j425547
12759A718287k163417j634082J16534J883035J925773N841j767242j264243Q64654
12750c14860J983730R16775p94598j322461q54897o87292j071643j172766o90125
12741d008137k19462O1160Q11914K073989K469476R39269j345196k119297q86771
12732b223055O69269J133877P39151O3966q74539j494740n06673J738086K495121
12723A740463J72541k755780k747341j57221J449638M97174r41648q31449K62019
12714c311604R86324J147449R34706K74141k79908k6089K4291j758979m088917
$$ plain form
12705 -6098586 -9530880 -9003520 -5529873 -2995773 -2620318 -2192632 -783974 -266985 -1082733
12696 -1082733 -487692 2723689 5155476 3538912 -29424 -1003227 1258513 3596708
12688 3596708 4254408 4181808 3665282 1574580 -1523873 -2945637 -1748183 -317420 -816178
12679 -816178 -2292282 -2669185 -1719014 -639953 -148195 -262882 -837080 -1357118 -1295454
12670 -1295454 -1224492 -2209109 -3669943 -3665372 -1906491 -321115 319133 1765679 4627391
12661 4627391 5955549 3130622 -1749926 -4362635 -3769628 -2513820 -2044253 -1379102 -93439
12652 -93439 671774 692496 1337460 2979471 4122544 3927530 3425270 3357964 2893244 1485774
12642 1485774 134385 -294336 -378026 -838594 -1486323 -2272755 -3744008 -5591457 -6436336
$$ packed form
12705f098586l432294N27360L473647K534100L75455M27686J408658N16989q15748
12696a082733N95041L211381K431787j616564l568336r73803K261740K338195
12688C596708O57700p2600n16526k090702l098453j421764J197454J430763m98758
12679h16178j476104l76903R50171J079061M91758j14687n74198n20038O1664
12670a295454P0962r84617j460834M571J758881J585376O40248J446546K861712
12661D627391J328158k824927m880548k612709N93007J255808M69567O65151J285663
12652i3439P65213K0722O44964J642011J143073j95014n02260o7306m64720j407470
12642A485774j351389m28721q3690m60568o47729p86432j471253j847449q44879
$$ plain form
12633 -6436336 -5932476 -5337937 -5147800 -4190013 -2191816 -1033205 -1856107 -2988290 -2624516
12624 -2624516 -1670821 -1808283 -2509466 -2412599 -2120085 -2871862 -3566498 -2095823 848895
12615 848895 2151607 505451 -2049015 -2958881 -1651757 708208 2210124 1293852 -1353868
12606 -1353868 -2620159 -723828 1684305 787644 -2709004 -4364680 -2381203 286024
12598 286024 818742 85855 -38579 190377 -166802 -609336 -503790 -535033 -998595 -517305
12588 -517305 1562627 3173810 2098561 -719197 -2538700 -2530837 -2109329 -2293807 -2686310
12579 -2686310 -2656508 -1896472 -150384 2176760 3569167 2975464 1481831 1102255 2240130
12570 2240130 3568402 4006664 3528011 2405169 1063720 476614 1338955 2884135 3692747
$$ packed form
12633f436336N03860N94539J90137R57787J998197J158611q22902j132183L63774
12624b624516R53695j37462p01183R6867K92514p51777o94636J470675K944718
12615H48895J302712j646156k554466r09866J307124K359965J501916r16272k647720
12606a353868j266291J896331K408133q96661l496648j655676J983477K667227
12598B86024N32718p32887j24434K28956l57179m42534J05546l1243m63562M81290
12588e17305K079932J611183j075249k817758j819503P863M21508j84478l92503
12579b686310K9802P60036J746088K327144J392407n93703j493633l79576J137875
12570B240130J328272M38262m78653j122842j341449n87106Q62341J545180Q08612
$$ plain form
12561 3692747 3565149 3371764 3160119 1878260 -717750 -3221795 -4291413 -4203635 -3917713
12552 -3917713 -3347551 -1647967 948392 2666184 2125599 201128 -891973 -279547 766267
12543 766267 961405 738722 976120 1235335 867020 939906 2801493 4986832 4207796
12534 4207796 67893 -3635451 -3553425 -749128 1371564 1297223 -19501 -1222103 -1338786
12525 -1338786 235021 2701812 3826310 2643710 1153614 1550254 2919770 2800842
12517 2800842 1037076 -385918 -783828 -1470318 -3040272 -4350182 -4585974 -4362767 -4307500
12508 -4307500 -4195759 -3838484 -3351487 -2410561 -747275 647893 541228 -344836 -104004
12499 -104004 1238238 1547169 3551 -1486342 -1167264 270834 1293730 1540626 1091336
$$ packed form
12561C692747j27598j93385k11645j281859k596010k504045j069618Q7778K85922
12552c917713N70162J699584K596359J717792n40585j924471j093101O12426J045814
12543G66267J95138k22683K37398K59215l68315P2886J861587K185339p79036
12534D207796m139903l703344Q2026K804297K120692p4341j316724j202602j16683
12525a338786J573807K466791J124498j182600j490096L96640J369516j18928
12517B800842j763766j422994l97910o86490j569954j309910k35792K23207N5267
12508d307500J11741L57275M86997R40926J663286J395168j06665q86064K40832
12499a04004J342242L08931j543618j489893L19078J438098J022896K46896m49290
$$ plain form
12490 1091336 -426103 -2553697 -3498304 -2562029 -1617650 -2324050 -3190151 -1667447 1653309
12481 1653309 3465401 2342054 557951 624573 1902354 1976226 316856 -1019811 -323980
12472 -323980 1366996 1640513 111907 -767361 955225 3511585 3205834 -564964 -4052231
12463 -4052231 -3928481 -1576589 -713900 -1853547 -1807969 1116056 4094709 3524683 105329
12454 105329 -2051207 -930084 1036284 789321 -1068126 -1513453 250304 1579465 184271
12445 184271 -2740612 -4349231 -3740782 -2088503 -112250 2389010 4595370 4611369 2220499
12436 2220499 -143615 -430601 458645 536838 -178591 -301429 185421 163289 11991 1396187
12426 1396187 3870764 4250063 933351 -3029315 -3389339 -229162 2307655 1576615 -694974
$$ packed form
12490A091336j517439k127594r44607R36275R44379p06400q66101J522704L320756
12481A653309J812092j123347j784103O6622J277781P3872j659370j336667O95831
12472c23980J690976K73517j528606q79268J722586K556360l05751l770798l487267
12463d052231J23750K351892Q62689j139647M5578K924025K978653n70026l419354
12454A05329k156536J121123J966368k46963j857447m45327J763757J329161j395194
12445A84271k924883j608619O08449J652279J976253K501260K206360J5999k390870
12436B220499k364114k86986Q89246P8193p15429j22838M86850k2132j51298J384196
12426A396187K474577L79299l316712l962666l60024L160177K536817p31040k271589
$$ plain form
12417 -694974 -1727205 -1651905 -2481589 -4422885 -5379998 -4042883 -1676048 -223030 126722
12408 126722 557448 1581095 2511448 2854856 3214921 4366747 5929428 6556941 5472480
12399 5472480 3445628 2029225 2001109 2833787 3568652 3694209 3021483 1366787 -977915
12390 -977915 -2830614 -3088863 -2195569 -1858460 -3050557 -4963966 -6251110 -6522546 -6023704
12381 -6023704 -4586502 -1989653 863195 2292160 1747339 593259 428890 1118563 1177538
12372 1177538 -120193 -1845335 -2784951 -2909145 -2878424 -2707130 -1948921 -1048336 -1252462
12363 -1252462 -2747853 -4004706 -3802302 -2997979 -3160464 -4114716 -4249983 -3008127 -1595881
12354 -1595881 -1072698 -1046618 -676260 113571 908918 1443478 1551699 1249884 1140763 1887340
$$ packed form
12417f94974j032231P5300q29684j941296r57113J337115K366835J453018L49752
12408A26722M30726J023647R30353L43408L60065J151826J562681O27513j084461
12399E472480k026852j416403k8116Q32678P34865J25557o72726j654696k344702
12390i77915j852699k58249Q93294L37109j192097j913409j287144k71436M98842
12381f023704J437202K596849K852848J428965n44821j154080j64369O89673N8975
12372A177538j297731j725142r39616j24194L0721J71294P58209R00585k04126
12363a252462j495391j256853K02404Q04323j62485r54252j35267J241856J412246
12354a595881N23183K6080L70358P89831P95347N34560J08221l01815j09121P46577
$$ plain form
12344 1887340 2989678 2995074 1332804 -839384 -1920403 -1253562 812100 3205528 4415757
12335 4415757 3760217 2487524 2123166 1668556 -1340942 -6290978 -8621409 -5385975 330951
12326 330951 2988092 1280064 -1305670 -1815178 -898051 -490477 -971019 -1497757 -1542868
12317 -1542868 -1183958 -787340 -885474 -1646010 -2289289 -1780413 -188745 1317411 1800928
12308 1800928 1260558 204073 -765096 -1067031 -457058 863493 2606648 4256824 4476800
12299 4476800 2010731 -2088591 -4618150 -3864672 -1773769 -1073943 -1704397 -2003559 -2013619
12290 -2013619 -2966350 -4239654 -3681956 -1011876 1524127 2155038 1220311 -291772 -1752770
12281 -1752770 -2250782 -1033921 984201 1944693 1508699 895916 541726 -203971 -1027875
$$ packed form
12344A887340J102338N396j662270k172188j081019O66841K065662K393428J210229
12335D415757o55540j272693l64358m54610l009498m950036k330431L235434N716926
12326C30951K657141j708028k585734n09508R17127M07574m80542n26738m5111
12317a542868L58910L96618r8134p60536o43279N08876J591668J506156M83517
12308A800928n40370j056485r69169l01935O09973J320551J743155J650176K19976
12299D476800k466069m099322k529559P53478K090903O99826o30454k99162j0060
12290b013619r52731j273304N57698K670080K536003O30911r34727j512083j460998
12281a752770m98012J216861K018122R60492m35994o12783l54190p45697q23904
$$ plain form
12272 -1027875 -668455 690846 1374918 994143 871260 1163097 181132 -2445987 -4447797
12263 -4447797 -4090556 -2569760 -1911381 -2360279 -3027370 -3316238 -2692832 -940126 492635
12254 492635 -403747 -2817460 -3376373 -1005281 1242207 853942 -485046 -82095 1591369
12245 1591369 2522761 2602884 2603607 1785068 -421428 -2099157 -1391095 108522 -273318 -1832996
12235 -1832996 -1834119 -314600 79740 -1352569 -2459071 -1917093 -779207 -200733 -297900
12226 -297900 -1205055 -2675174 -2936365 -723824 1965797 2192935 653852 435212 1599541
12217 1599541 1258294 -722662 -898875 1550531 2609958 -115395 -3024955 -1963576
12209 -1963576 1437809 2761549 1567584 954300 1932024 2445585 1511612 611991 706532
$$ packed form
12272a027875L59420J359301O84072l80775j22883K91837r81965k627119k001810
12263d447797L57241J520796O58379m48898o67091k88868O23406J752706J432761
12254D92635q96382k413713n58913K371092K247488l88265j338988M02951J673464
12245A591369R31392Q0123P23q18539k206496j677729P08062J499617l81840j559678
12235a832996j123J519519L94340j432309j106502N41978J137886N78474r7167
12226b97900r07155j470119k61191K212541K689621K27138j539083k18640J164329
12217A599541l41247j980956j76213K449406J059427k725353k909560J061379
12209a963576L401385J323740j193965o13284R77724N13561r33973q99621R4541
$$ plain form
12200 706532 800205 -1925 -1273851 -2505454 -3658432 -4216571 -3458280 -1996779 -1453098
12191 -1453098 -2211434 -2852535 -2193574 -766884 69863 -342773 -1491694 -2156037 -1547922
12182 -1547922 -495043 -812579 -2760488 -4166006 -3296950 -1485009 -1147105 -2152262 -2344768
12173 -2344768 -1080597 230768 928307 1818181 2837982 2689007 1552170 1591426 3563906
12164 3563906 5290952 4978556 3822176 3471901 3017946 930126 -1578996 -1954216 -297964
12155 -297964 740770 -92171 -1258799 -1177082 -215843 541188 713156 209304 -1062239
12146 -1062239 -2430314 -2670456 -1532209 -2933 1185996 2056137 2268070 1217465 -272940
12137 -272940 -245974 1427751 2201809 423715 -1836445 -1451939 1374499 3589999 3640008
$$ packed form
12200G06532R3673q02130j271926j231603j152978n58139P58291J461501N43681
12191a453098p58336o41101O58961J426690Q36747m12636j148921o64343O08115
12182a547922J052879l17536j947909j405518Q69056J811941L37904j005157j92506
12173b344768J264171J311365O97539Q89874J019801j48975j136837L9256J972480
12164C563906J727046l12396j156380l50275m53955k087820k509122l75220J656252
12155b97964J038734q32941j166628Q1717R61239P57031J71968n03852j271543
12146a062239j368075k40142J138247J529276J188929Q70141K11933j050605j490405
12137b72940K6966J673725P74058j778094k260160L84506K826438K215500N0009
$$ plain form
12128 3640008 3067885 3630465 4893321 5466036 5090197 4435135 3762585 2866449 1895861
12119 1895861 1312913 1067334 485996 -717084 -1638748 -976897 1116713 2571038 1688152
12110 1688152 -372032 -792483 986877 2317071 1271623 -329918 263464 2335304
12102 2335304 2776477 940237 -544031 -79123 661942 -150001 -1638433 -2023788 -1316416
12093 -1316416 -472172 547002 2017769 3045362 2837855 2403066 3051312 4018388 3579259
12084 3579259 1918364 813215 849775 1077282 1199420 1800655 2323645 1302211 -855746
12075 -855746 -1796307 -871849 -338816 -1390408 -1552272 1421049 4981563 4547518 188119
12066 188119 -3001813 -1804057 1026575 1149344 -1436648 -3284803 -2776426 -1669008 -1754797
$$ packed form
12128C640008n72123N62580J262856N72715l75839o55062o72550q96136r70588
12119A895861n82948k45579n81338j203080r21664O61851K093610J454325q82886
12110A688152k060184m20451J779360J330194j045448j601541N93382K071840
12102B335304M41173j836240j484268M64908P41065q11943j488432l85355P07372
12093a316416Q44244J019174J470767J027593k07507m34789O48246R67076m39129
12084C579259j660895j105149L6560K27507J22138O01235N22990j021434k157957
12075h55746r40561R24458N33033j051592j61864K973321L560514m34045m359399
12066A88119l189932J197756K830632J22769k585992j848155N08377J107418q5789
$$ plain form
12057 -1754797 -2674257 -3633647 -5003142 -6841771 -7450105 -5299871 -1792417 -273930 -2096907
12048 -2096907 -4923779 -5399440 -2689158 1056179 3102615 2521570 601987 -646622
12040 -646622 -455264 191473 106551 -451272 -402942 139437 -254083 -2040348 -3519301 -2968988
12030 -2968988 -1182635 -575456 -1994207 -3659554 -3484051 -1440519 823986 1991024
12022 1991024 2047083 1613435 970297 -48275 -1339509 -2003873 -1008876 1345370 3116090
12013 3116090 2626994 546362 -818310 -406291 433147 144440 -721708 -451402 1232918
12004 1232918 2836721 3153315 2317677 763141 -1328083 -3029976 -2778637 -649877 836860
11995 836860 -171566 -2014344 -1862211 -191106 -204556 -2699704 -4570729 -3636608 -2065189
$$ packed form
12057a754797r19460r59390j369495j838629o08334K150234L507454J518487j822977
12048b096907k826872m75661K710282L745337K046436n81045j919583j248609
12040f46622J91358O46737q4922n57823M8330N42379l93520j786265j478953N50313
12030b968988J786353O07179j418751j665347J75503K043532K264505J167038
12022A991024N6059m33648o43138j018572j291234o64364R94997K354246J770720
12013C116090m89096k080632j364672M12019Q39438k88707q66148K70306J684320
12004A232918J603803L16594q35638j554536k091224j701893K51339K128760J486737
11995H36860j008426j842778J52133J671105j3450k495148j871025R34121J571419
$$ plain form
11986 -2065189 -2705045 -4293652 -3498923 -525106 859375 -1112927 -3880398 -4620539 -3814115
11977 -3814115 -3263900 -2837670 -1251630 1226901 2905041 2987867 2243052 1573228 1094383
11968 1094383 549616 -223395 -1242731 -2303192 -3032570 -3231855 -2900160 -1992143 -778966
11959 -778966 -288851 -1281621 -2705532 -2556059 -686345 677618 -126462 -2195986 -3754216
11950 -3754216 -4211193 -3516041 -1319710 1583730 2706954 958993 -992240 92338
11942 92338 3358559 5049566 3874821 2288964 2293122 2916428 2757325 2405288 2824637
11933 2824637 3286307 2639577 1352535 667758 589122 206957 -444330 -189546 1608449
11924 1608449 3967701 5048347 3811886 1065764 -1131561 -1363925 1868 1783847
$$ packed form
11986b065189o39856j588607P94729K973817J384481j972302k767471p40141Q06424
11977c814115N50215M26230J586040K478531J678140Q2826p44815o69824m78845
11968A094383n44767p73011j019336j060461p29378j99285L31695R08017J213177
11959g78966M90115r92770j423911J49473J869714J363963q04080k069524j558230
11950c754216m56977O95152K196331K903440J123224j747961j951233J084578
11942I2338L266221J691007j174745j585857M158O23306j59103l52037M19349
11933B824637M61670o46730j287042o84777p8636l82165o51287K54784J797995
11924A608449K359252J080646j236461k746122k197325k32364J365793J781979
$$ plain form
11916 1783847 3347484 4258969 3654197 1582154 208952 1452225 3650298 3127006 -615643
11907 -615643 -3943200 -4138680 -2667335 -2034115 -2116817 -1721825 -1453192 -2407289 -3672189
11898 -3672189 -3758081 -3225477 -3362149 -3539845 -2672039 -2120807 -3889013 -6554859 -6445298
11889 -6445298 -2845426 1186728 3386367 4384588 4810583 3827591 1744815 845220 1917786
11880 1917786 2692093 1473408 -176265 -195752 953936 1929069 2745560 3274131 1981983
11871 1981983 -1240750 -3282119 -1825898 765684 800554 -1230634 -2063468 -1158586 -697701
11862 -697701 -825468 689364 3783505 5244639 3551773 1054854 89148 40763 -381796
11853 -381796 -857063 -940529 -1288051 -1946901 -1798075 -971881 -1307542 -3080641 -3962333 -2795675
$$ packed form
11916A783847J563637R11485o04772k072043j373202J243273K198073n23292l742649
11907f15643l327557j95480J471345O33220q2702L94992K68633r54097j264900
11898c672189q5892N32604j36672j77696Q67806N51232j768206k665846J09561
11889f445298L599872M032154K199639R98221M25995r82992k082776q99595J072566
11880A917786P74307j218685j649673j9487J149688R75133Q16491N28571j292148
11871A981983l222733k041369J456221K591582L4870k031188q32834R04882M60885
11862f97701j27767J514832L094141J461134j692866k496919r65706m8385m22559
11853c81796m75267q3466l47522o58850J48826Q26194l35661j773099q81692J166658
$$ plain form
11843 -2795675 -1616026 -2058363 -2622043 -1758850 -815231 -1181677 -1272540 407396 1697264
11834 1697264 89019 -2432009 -2126705 283706 686515 -1730983 -3429678 -2357456
11826 -2357456 -554589 -161710 -726670 -1571801 -3179891 -4786582 -4005168 -719724 1537612
11817 1537612 93207 -3388395 -5745640 -6273340 -5859478 -4436891 -1732202 999544
11809 999544 2271900 2344368 2136010 1357245 -499969 -2442533 -3094568 -2685538 -2304825
11800 -2304825 -2001853 -1149418 84177 1011114 1380696 936359 -796154 -2985419 -3267495
11791 -3267495 -863642 1472470 861542 -1465834 -1874341 517026 3178265 4319077
11783 4319077 4633537 4560970 2934152 -320245 -2667124 -2055685 145980 1204324 782405
$$ packed form
11843b795675J179649m42337n63680Q63193R43619l66446r0863J679936J289868
11834A697264j608245k521028L05304K410411M02809k417498j698695J072222
11826b357456J802867L92879n64960q45131j608090j606691P81414L285444K257336
11817A537612j444405l481602k357245n27700M13862J422587K704689K731746
11809I99544J272356P2468k08358p78765j857214j942564o52035M09030L80713
11800b304825L02972Q52435J233595R26937L69582m44337j732513k189265k82076
11791c267495K403853K336112o10928k327376m08507K391367K661239J140812
11783D319077L14460p2567j626818l254397k346879O11439K201665J058344m21919
$$ plain form
11774 782405 640061 1341345 1497684 354930 -888037 -1101522 -1000801 -1668782 -2366364
11765 -2366364 -1474476 712993 1892342 787601 -1309270 -2773395 -3787526 -4905737
11757 -4905737 -5036564 -3068200 -592531 -295297 -1740786 -1638044 1052347 3171246 1979348
11748 1979348 -850899 -1986864 -1103605 -182869 355347 1732785 3578590 3704202 1556247
11739 1556247 -580394 -739357 194034 123154 -1414876 -3050966 -3361640 -2063580 -82009
11730 -82009 1006018 208518 -1671735 -2571959 -1426030 448056 654802 -1717485 -5084379
11721 -5084379 -6872291 -5956103 -3534501 -1497677 -256927 1105086 2670598 3044828
11713 3044828 1614787 174808 801627 2772446 3376463 1798433 443773 1678840
$$ packed form
11774G82405j42344P01284J56339j142754j242967k13485J00721o67981o97582
11765b366364Q91888K187469J179349j104741k096871j464125j014131j118211
11757d905737j30827J968364K475669K97234j445489J02742K690391K118899j191898
11748A979348k830247j135965Q83259R20736N38216J377438J845805J25612k147955
11739A556247k136641j58963R33391p0880j538030j636090l10674J298060J981571
11730h2009J088027p97500j880253r00224J145929J874086K06746k372287l366894
11721e084379j787912R16188K421602K036824J240750J362013J565512L74230
11713C044828j430041j439979O26819J970819O04017j578030j354660J235067
$$ plain form
11705 1678840 4527991 5783285 3897965 668034 -1081545 -652428 335055 557998 678575
11696 678575 1819255 3327273 3519925 2363609 1608600 1897918 1671089 -29415 -1527969
11687 -1527969 -1026075 323415 94924 -1574407 -2392467 -1856561 -2004213 -3679269 -4697940
11678 -4697940 -3168785 -634917 2465 -1539801 -2993249 -2890656 -1838663 -574465
11670 -574465 1194338 3351774 4451100 3516247 1784157 1182607 1550711 1015597 -811772
11661 -811772 -1842455 -596972 1244575 965232 -1387651 -3172655 -2876878 -1797293 -1692326
11652 -1692326 -2450393 -2875080 -2502313 -1687395 -758407 71237 588696 1015135 1904004
11643 1904004 3058707 3279266 1851390 -284059 -1473159 -1094326 -22215 268183 -998063
$$ packed form
11705A678840K849151J255294j885320l229931j749579M29117R87483K22943J20577
11696F78575J140680J508018J92652j156316p55009K89318k26829j700504j498554
11687a527969N01894J349490k28491j669331q18060N35906j47652j675056j018671
11678d697940J529155K533868O37382j542266j453448J02593J051993J264198
11670e74465J768803K157436J099326r34853j732090o01550L68104n35114j827369
11661h11772j030683J245483J841547k79343k352883j785004K95777J079585J04967
11652a692326p58067m24687L72767Q14918R28988Q29644N17459M26439Q88869
11643A904004J154703K20559j427876k135449j189100L78833J072111K90398j266246
$$ plain form
11634 -998063 -2939686 -3556827 -2113606 -651771 -1713841 -4682874 -6198475 -4499805
11626 -4499805 -1410061 640748 1542192 2362509 3150966 3403383 3412916 3728918 4159094
11617 4159094 4253211 3834299 2550176 265198 -1775316 -2068467 -1483060 -2253091 -3798068
11608 -3798068 -2890096 686492 2564478 402478 -1886244 -314296 2246578 357834
11600 357834 -5064280 -7789921 -5335793 -1460070 431264 1024436 1324893 180036 -2479595
11591 -2479595 -3970907 -2704802 -618070 203896 536936 1713289 2846439 2426671 717709
11582 717709 -1177345 -2865695 -3851197 -3047103 -586500 1546963 1958941 1250743 40192
11573 40192 -2224707 -5075412 -5906551 -3115295 1170719 3424883 2688664 730222 -558387
$$ packed form
11634i98063j941623o17141J443221J461835j062070k969033j515601J698670
11626d499805L089744K050809R01444Q20317P88457K52417R533L16002M30176
11617D159094R4117m18912j284123k284978k040514k93151N85407p70031j544977
11608c798068R07972L576588J877986k162000k288722J571948K560874j888744
11600C57834n422114k725641K454128L875723J891334N93172L00457j144857k659631
11591b479595j491312J266105K086732Q21966L33040J176353J133150m19768j708962
11582G17709j895054j688350r85502Q04094K460603K133463M11978p08198j210551
11573D0192k264899k850705q31139K791256M286014K254164p36219j958442j288609
$$ plain form
11564 -558387 -458218 767102 1939300 1726719 369870 -396744 95587 486319 -76864
11555 -76864 -303299 865362 2022252 1385871 -218429 -575325 572225 1364424 523306
11546 523306 -1440008 -3303649 -4015669 -3002063 -997824 -123343 -1730386 -4426475 -5435736
11537 -5435736 -3704126 -688939 1533696 1933075 735010 -885135 -1476670 -576089 784804
11528 784804 1325305 825271 -285236 -1822601 -3461429 -4190226 -3329035 -1757035 -1094716
11519 -1094716 -1798787 -2836448 -3031726 -2007921 -41339 2221829 3956221 4717423 4867431
11510 4867431 5027570 5135463 4445346 2585128 404656 -527988 434063 1990075 2163665
11501 2163665 809846 -76971 821897 2139664 1821764 138520 -955459 -757110 -184793
$$ packed form
11564e58387J00169J225320J172198k12581j356849p66614M92331L90732n63183
11555g6864k26435J168661J156890o36381j604300l56896J147550P92199q41118
11546E23306j963314j863641p12020J013606K004239Q74481j607043k696089j009261
11537e435736J731610L015187K222635L99379j198065j620145n91535R00581J360893
11528G84804N40501n00034j110507j537365j638828p28797Q61191J572000O62319
11519a094716p04071j037661j95278J023805J966582K263168J734392P61202J50008
11510D867431J60139J07893o90117j860218k180472r32644R62051J556012J73590
11501B163665j353819q86817Q98868J317767l17900j683244j093979J98349N72317
$$ plain form
11492 -184793 288222 855538 742426 -1145498 -3663881 -4079897 -2006890 -241940 -651154
11483 -651154 -1621728 -1022647 544347 1271825 1065937 922991 817773 244919 -197781
11474 -197781 298789 1075684 980029 346253 325593 769645 401993 -1189825 -3078584 -4243032
11464 -4243032 -4186584 -2758887 -524388 1083752 1113212 285658 -126957 -130901 -577321 -1330533
11454 -1330533 -1251207 -20729 1239153 1498391 1055963 750333 578356 -137038 -1323416
11445 -1323416 -1764842 -714502 690076 748418 -303785 -747821 -523830 -1627527 -4279354
11436 -4279354 -5380419 -3141934 -784645 -2112324 -5243229 -5212726 -1915154 -313971
11428 -313971 -2412285 -4356359 -3152055 -1215839 -1524254 -2614036 -1878756 -339008 -360658
$$ packed form
11492a84793M73015N67316j13112j887924k518383m16016K073007J764950m09214
11483f51154r70574N99081J566994P27478k05888j42946j05218n72854m42700
11474a97781M96570P76895r5655o33776k0660M44052l67652j591818j888759j164448
11464d243032N6448J427697K234499J608140K9460q27554m12615l944m46420p53212
11454a330533P9326J230478J259882K59238m42428l05630j71977p15394j186378
11445a323416m41426J050340J404578N8342j052203m44036K23991j103697k651827
11436d279354j101065K238485K357289j327679l130905L0503L297572J601183
11428c13971k098314j944074J204304J936216l08415j089782P35280J539748k1650
$$ plain form
11419 -360658 -1309103 -1168994 -325572 -207714 -77277 1347331 2752274 2169281 604898
11410 604898 402354 1353699 1689480 1461354 1544941 860850 -1624851 -3633319 -2570778
11401 -2570778 -579835 -1832947 -5461792 -6374864 -3220429 -138035 385755 923160 3300837
11392 3300837 4553095 2009321 -1602571 -2031925 299790 1743511 1020150 -288822
11384 -288822 -1401976 -2822400 -3821930 -2815025 -288162 1389510 1322380 902721 989359
11375 989359 596704 -908418 -2366091 -2677749 -2507317 -2846302 -3094270 -2108491 -524513
11366 -524513 -404281 -2475326 -4946422 -5534652 -3933239 -1834319 -1047758 -2021444 -3788625
11357 -3788625 -4922958 -4799398 -4187001 -4299154 -5186041 -5713502 -5287015 -4554434 -3871567
$$ packed form
11419c60658r48445J40109Q43422J17858J30437J424608J404943n82993j564383
11410F04898k02544R51345L35781k28126Q3587o84091k485701k008468J062541
11401b570778J990943j253112l628845r13072L154435L082394N23790N37405K377677
11392C300837J252258k543774l611892m29354K331715J443721p23361j308972
11384b88822j113154j420424r99530J006905K526863J677672o7130m19659Q6638
11375I89359l92655j505122j457673l11658J70432l38985k47968R85779J583978
11366e24513J20232k071045k471096n88230J601413K098920P86561r73686j767181
11357c788625j134333J23560O12397j12153q86887n27461M26487P32581O82867
$$ plain form
11348 -3871567 -2370091 312046 2566132 2726893 1602933 1208863 1574696 982387 -827831
11339 -827831 -1954434 -1089207 962518 2715483 3155844 1620408 -1267882 -2775720 -930330
11330 -930330 1825072 1182635 -2451936 -3903941 -979075 2050356 1114414 -1598335 -1792711
11321 -1792711 54441 264521 -1796254 -3425492 -3286537 -2379908 -1110677 879835 2474869
11312 2474869 2188182 1133364 1514196 2522768 1329886 -1869784 -3549185 -2185789
11304 -2185789 -413185 -720358 -2056805 -2234443 -1249419 -475117 -221292 311896 1511743
11295 1511743 2705916 2580652 297921 -3012999 -4490418 -2643889 452289 1778552
11287 1778552 1365207 1438228 2352409 2384910 1518376 2060905 4484970 5615986 2810984
$$ packed form
11348c871567J501476K682137K254086J60761j123960l94070L65833n92309j810218
11339h27831j126603Q65227K051725J752965M40361j535436k888290j507838J845390
11330i30330K755402o42437l634571j452005K924866L029431r35942k712749j94376
11321a792711J847152K10080k060775j629238J38955R06629J269231J990512J595034
11312B474869k86687j054818L80832J008572j192882l199670j679401J363396
11304b185789J772604l07173j336447j77638R85024P74302K53825N33188J199847
11295A511743J194173j25264k282731l310920j477419J846529L096178J326263
11287A778552m13345P3021R14181L2501q66534N42529K424065J131016k805002
$$ plain form
11278 2810984 -2046376 -4684987 -3500917 -888280 -34493 -1520587 -3072044 -2261781
11270 -2261781 688813 3263545 3961248 4028151 4940124 5701753 4642667 2767970 2640810
11261 2640810 4246064 4706532 2490673 -513276 -1848059 -1369496 -397607 306923 682690
11252 682690 652859 165586 -636992 -1548417 -2096852 -1591041 -200290 687297 379457 332321
11242 332321 2079666 4444326 4777152 2609156 172824 -513845 580811 2237678 2798789
11233 2798789 842005 -3053019 -5798311 -5012418 -2071894 9791 667221 1264066 1693242
11224 1693242 783512 -504808 173568 2593446 4033409 3438571 2320075 1450042 133466
11215 133466 -963045 26348 2497836 3510463 2427647 1752060 2418346 2309790 856667
$$ packed form
11278B810984m857360k638611J184070K612637Q53787j486094j551457Q10263
11270b261781K950594K574732O97703O6903R11973P61629j059086j874697j27160
11261B640810J605254M60468k215859l003949j334783M78563R71889P04530L75767
11252F82690k9831m87273q02578r11425n48435N05811J390751Q87587l07840m7136
11242C32321J747345K364660L32826k167996k436332o86669J094656J656867N61111
11233B798789j956784l895024k745292P85893K940524K081685O57430N96845M29176
11224A693242r09730j288320O78376K419878J439963n94838j118496q70033j316576
11215A33466j096511R89393K471488J012627j082816o75587O66286j08556j453123
$$ plain form
11206 856667 765538 2919526 3742626 773051 -2710834 -2358249 692949 1921042 260966
11197 260966 -1213550 -699604 -101002 -1695689 -4833697 -6696324 -5303004 -1595222 1280342
11188 1280342 1424156 636750 1727459 3732608 2846501 -1346365 -4304492 -2955537 756
11179 756 944273 991688 2941012 5286274 4113118 -215396 -3033863 -2115006 -280661
11170 -280661 -414437 -1393114 -612562 1873746 3584533 2785855 212474 -1820134 -1588867
11161 -1588867 248120 1191840 -34658 -1508199 -463253 2755236 4724427 3086957
11153 3086957 -780827 -3745265 -4472627 -4292334 -5051596 -6817904 -7923804 -7233314 -5869313
11144 -5869313 -5875550 -7254778 -7622111 -5370958 -1960532 -31299 -201078 -1007386 -1376295
$$ packed form
11206H56667r1129K153988Q23100k969575l483885L52585L051198J228093j660076
11197B60966j474516N13946N98602j594687l138008j862627J393320L707782K875564
11188A280342J43814p87406J090709K005149q86107m192866k958127J348955K956293
11179G56R43517M7415J949324K345262j173156m328514k818467R18857J834345
11170b80661j33776r78677P80552K486308J710787p98678k573381k032608K31267
11161a588867J836987R43720j226498j473541J044946L218489J969191j637470
11153C086957l867784k964438p27362J80293p59262j766308j105900O90490J364001
11144e869313o237j379228l67333K251153L410426J929233j69779q06308l68909
$$ plain form
11135 -1376295 -1652777 -2296497 -2958288 -3299513 -3788923 -4936154 -6079760 -5744143 -3494612
11126 -3494612 -859572 357890 374237 804193 1737728 1332455 -798231 -1963147 -144952
11117 -144952 2454207 2396095 210733 -783013 -131735 -693735 -3150670 -4301937 -2308380
11108 -2308380 127896 59739 -1338006 -1333755 -101192 234584 -768025 -1936375 -2918369
11099 -2918369 -4040885 -4676284 -3974934 -2494208 -1263583 -104804 1390059 2273818 1576863
11090 1576863 335112 348521 1611677 2721062 3050877 2748315 1397108 -1322982 -4170676
11081 -4170676 -5380225 -4790778 -3451680 -1841010 -157518 524694 -447122 -1457031 -439388
11072 -439388 1682341 1840448 -660625 -2876592 -2226791 299501 2014473 1896971 740668
$$ packed form
11135a376295k76482o43720o61791l41225m89410j147231j143606L35617K249531
11126c494612K635040J217462J6347M29956R33535m05273k130686j164916J818195
11117a44952K599159n8112k185362r93746O51278n62000k456935j151267J993557
11108b308380K436276o8157j397745M251J232563L35776j002609j168350r81994
11099b918369j122516o35399P01350J480726J230625J158779J494863Q83759o96955
11090A576863j241751J3409J263156J109385L29815l02562j351207k720090k847694
11081d170676j209549N89447J339098J610670J683492O82212r71816j009909J017643
11072d39388K121729J58107k501073k215967O49801K526292J714972j17502j156303
$$ plain form
11063 740668 -754139 -2372676 -3419219 -2904045 -889212 1220606 1962320 918079 -1409420
11054 -1409420 -4100120 -5973780 -6038431 -4522485 -3080158 -3136982 -4168236 -4453356 -3400399
11045 -3400399 -2032069 -1176078 -591290 -184530 -438529 -974006 -506133 754889 666635
11036 666635 -1423830 -2989810 -2126581 -864334 -1893683 -3938435 -3940317 -2471961 -2871449
11027 -2871449 -5517853 -7147588 -6060166 -4071095 -2764012 -1651765 -921997 -2217085
11019 -2217085 -5334058 -7464944 -7065534 -5501826 -3935817 -1937388 -150399 -518450
11011 -518450 -2425042 -2511330 -115213 1113441 -820842 -2853472 -2212244 -1058891 -2210594
11002 -2210594 -3925818 -3228629 -1484281 -1978282 -3961852 -3862750 -1390322 -4525 -1432523
$$ packed form
11063G40668j494807j618537j046543N15174K014833K109818P41714j044241k327499
11054a409420k690700j873660o4651J515946J442327n6824j031254k85120J052957
11045c400399J368330Q55991N84788M06760k53999n35477M67873J261022q8254
11036F66635k090465j565980Q63229J262247j029349k044752j882J468356l99488
11027b871449k646404j629735J087422J989071J307083J112247P29768j295088
11019b217085l116973k130886L99410J563708J566009J998429J786989l68051
11011e18450j906592q6288K396117J228654j934283k032630O41228J153353j151703
11002b210594j715224O97189J744348m94001j983570R9102K472428J385797j427998
$$ plain form
10993 -1432523 -3361971 -3016883 -519919 1604790 810821 -3075832 -6745738 -6060843 -1059680
10984 -1059680 3595227 4530572 3424209 3019817 2694452 1090813 88205 1980753 4780889
10975 4780889 4656139 1664817 -1050454 -2548210 -4211219 -5434282 -3875270 -109280
10967 -109280 2291173 2045459 1792133 3451486 5291652 4985707 2996388 1480753 1572750
10958 1572750 2739492 3560027 2705029 244658 -2054927 -2772225 -2611221 -2948688 -3592965
10949 -3592965 -3625811 -3460911 -4140025 -5399568 -6247505 -6550594 -6368063 -5028338 -2788822
10940 -2788822 -1795999 -3020670 -3889264 -1765840 1726704 2978105 1626904 139526
10932 139526 -648499 -1767137 -2623353 -1340696 1389915 2525619 1130701 -661177 -1491385
$$ packed form
10993a432523j929448L45088K496964K124709p93969l886653l669906O84895N001163
10984a059680M654907R35345j106363m04392l25365j603639j002608J892548K800136
10975D780889j24750k991322k715271j497756j663009j223063J559012L765990
10967a09280K400453k45714k53326J659353J840166l05945j989319j515635R1997
10958A572750J166742Q20535q54998k460371k299585p17298J61004l37467o44277
10949c592965l2846J64900o79114j259543q47937l03089J82531J339725K239516
10940b788822R92823j224671q68594K123424L492544J251401j351201j487378
10932A39526p88025j118638q56216J282657K730611J135704j394918j791878q30208
$$ plain form
10923 -1491385 -2361665 -3822351 -4577066 -3692100 -1827396 107869 1350381 589295 -2475443
10914 -2475443 -5208358 -4694300 -2104385 -1120858 -2154979 -1963586 579368 2467999 1570135
10905 1570135 -217638 -685524 -750815 -1849827 -2774525 -1850195 -214168 -161836 -1472927
10896 -1472927 -1853939 -403724 1420875 2145382 2025402 2195153 2935662 3255294 2176780
10887 2176780 209166 -1064137 -1037726 -750481 -944126 -747585 596782 1981878 1906540
10878 1906540 601389 -807194 -1991894 -2645663 -1600638 1096208 2768439 1383710
10870 1383710 -1088952 -1399323 255695 1425028 1987266 3583737 5209547 3873603
10862 3873603 44708 -1789078 783261 4885815 6556355 5202154 2627693 359845
$$ packed form
10923a491385q70280j460686p54715Q84966J864704J935265J242512p61086l064738
10914b475443k732915N14058K589915R83527j034121J91393K542954J888631q97864
10905A570135j787773m67886o5291j099012r24698R24330J636027N2332j311091
10896a472927l81012J450215J824599P24507j19980J69751P40509L19632j078514
10887B176780j967614j273303K6411K87245j93645J96541J344367J385096p5338
10878A906540j305151j408583j184700o53769J045025K696846J672231j384729
10870A383710k472662l10371J655018J169333N62238J596471J625810j335944
10862C873603l828895j833786K572339M102554J670540j354201k574461k267848
$$ plain form
10854 359845 -715547 -358011 231708 -435256 -1609782 -1126662 927048 2041506 1323090
10845 1323090 766497 1542453 1959627 528429 -1603342 -2915391 -3884549 -5324193 -6339679
10836 -6339679 -5817997 -4500103 -3860942 -3918029 -3493022 -2001946 -181608 494481 -908263
10827 -908263 -3315241 -4010986 -1906901 300612 -670481 -3925770 -5454027 -3729548 -1320729
10818 -1320729 -635783 -1061726 -1105477 -625895 66302 898933 951695 -890663 -3381111
10809 -3381111 -3632822 -1439224 -162933 -1904118 -4369140 -4333756 -1977120 236200 1174186
10800 1174186 1437408 1397263 767951 -473474 -1941182 -3045572 -2847826 -817034 1830741
10791 1830741 2966792 2232324 1323316 1107569 396635 -1512998 -3068973 -2642049 -896265
$$ packed form
10854C59845j075392L57536N89719o66964j174526M83120K053710J114458p18416
10845A323090n56593P75956M17174j431198k131771j312049r69158j439644j015486
10836f339679N21682J317894O39161n7087M25007J491076J820338O76089j402744
10827i08263k406978o95745K104085K207513r71093l255289j528257J724479K408819
10818a320729O84946m25943m3751M79582O92197Q32631N2762j842358k490448
10809c381111k51711K193598J276291j741185k465022L5384K356636K213320R37986
10800A174186K63222m0145o29312j241425j467708j104390J97746K030792K647775
10791A830741J136051p34468r09008k15747p10934j909633j555975M26924J745784
$$ plain form
10782 -896265 527590 1400113 2373604 3062920 2430159 737459 -391870 -18755 996770
10773 996770 1254840 570818 -55402 -17803 92484 -355769 -851634 -698768 -463523 -897070
10763 -897070 -969131 736924 2854301 2451543 -114039 -1068281 806497 1947237 -36118
10754 -36118 -2188222 -1301044 528099 -260480 -2321221 -1876819 579380 1308998 -218351
10745 -218351 -1003115 57036 1219428 1906046 3052552 3810293 2409417 25706 -615156
10736 -615156 -64246 -1034049 -3025446 -3079360 -1570728 -1874968 -4130484 -4856338 -3344083
10727 -3344083 -2871931 -4562154 -5463006 -4040637 -2374155 -1597400 -416586 564198 -1308339
10718 -1308339 -4946059 -5534545 -2531830 -1525405 -5151522 -8285684 -6247984 -2187905
$$ packed form
10782h96265J423855Q72523R73491O89316o32761j692700j129329L73115J015525
10773I96770K58070o84022o26220L7599J10287m48253m95865J52866K35245m33547
10763h97070p2061J706055K117377m02758k565582r54242J874778J140740j983355
10754c6118k152104Q87178J829143p88579k060741M44402K456199P29618j527349
10745b18351p84764J060151J162392O86618J146506P57741j400876k383711o40862
10736f15156N50910r69803j991397n3914J508632l04240k255516p25854J512255
10727c344083M72152j690223r00852J422369J666482P76755J180814R80784j872537
10718a308339l637720n88486L002715J006425l626117l134162K037700M060079
$$ plain form
10710 -2187905 -1467529 -3366533 -3645165 -1751292 -215768 447399 1272264 1260854 -1142906
10701 -1142906 -4319415 -5148653 -3475697 -1763494 -1345921 -1690664 -2118114 -1826343 324917
10692 324917 3721403 5293984 3243467 -164204 -1800640 -1889755 -2518440 -3633724 -3418719
10683 -3418719 -1645764 18101 563975 374489 -216225 -1276536 -2296137 -2206453 -598260
10674 -598260 1566323 2522680 1290278 -888325 -1472849 159506 1642531 1099212 18683
10665 18683 603962 2114298 2616086 2480135 2749633 1988726 -1064055 -3479005 -1715160
10656 -1715160 2084845 2769561 232453 -987484 451853 1557092 1596321 3067749 5469279
10647 5469279 5054762 2076726 1292113 3497821 3711243 167797 -2145397 -188165 1928101
$$ packed form
10710b187905P20376j899004k78632J893873J535524O63167Q24865j1410k403760
10701a142906l176509q29238J672956J712203M17573l44743m27450K91771K151260
10692C24917L396486J572581k050517l407671j636436q9115o28685j115284K15005
10683c418719J772955J663865N45874j89486n90714j060311j019601Q9684J608193
10674e98260K164583R56357j232402k178603n84524J632355J483025n43319j080529
10665A8683N85279J510336N01788j35951K69498p60907l052781k414950J763845
10656a715160L800005O84716k537108j219937J439337J105239L9229J471428K401530
10647E469279m14517k978036p84613K205708K13422l543446k313194J957232K116266
$$ plain form
10638 1928101 458838 -1725797 -974905 819723 496826 -825138 -1047022 -1284124 -2478704
10629 -2478704 -2412196 -241186 679227 -1324259 -2455185 -62384 1941024 -575002 -4788388
10620 -4788388 -5709535 -4131398 -3933353 -4758278 -3424045 -368826 952414 -231287 -1525316
10611 -1525316 -1497591 -642993 510815 1333084 717982 -863998 -1003985 984331 2608483
10602 2608483 2129649 869960 30322 -1108001 -2209146 -1373398 599700 121332 -3027863
10593 -3027863 -4573266 -3033263 -2505047 -5340121 -7876573 -6952948 -4973551 -4614644 -4035663
10584 -4035663 -1561350 143353 -1061721 -2614168 -1998876 -868419 -730470 271153
10576 271153 2534527 2483431 -1144602 -3987714 -2946338 -767797 -107292 741761 2324904
$$ packed form
10638A928101j469263k184635P50892J794628l22897j321964k21884k37102j194580
10629b478704O6508K171010R20413k003486j130926K392801K003408k516026m213386
10620d788388r21147J578137J98045q24925J334233L055219J321240j183701j294029
10611a525316K7725Q54598J153808Q22269o15102j581980j39987J988316J624152
10602B608483m78834j259689q39638j138323j101145Q35748J973098m78368l149195
10593c027863j545403J540003N28216k835074k536452R23625J979397L58907N78981
10584d035663K474313J704703j205074j552447O15292J130457J37949J001623
10576B71153K263374n1096l628033k843112J041376K178541O60505Q49053J583143
$$ plain form
10567 2324904 1086745 -3524418 -5884141 -3007573 273269 -142804 -1064657 742750
10559 742750 2180954 533774 -727105 1060347 2169670 72036 -824843 2486556
10551 2486556 5015358 2321660 -1664130 -2167055 -1471210 -2515761 -2359848 919348 2650211
10542 2650211 -110555 -2763319 -2316332 -3248508 -7323493 -7845967 -2031784 1834094 -1382510
10533 -1382510 -3697158 1507716 6654567 3351618 -2479487 -1551761 2962700 3445677
10525 3445677 1807967 2626166 2274527 -2197708 -3623867 2831036 8569342 5947592
10517 5947592 1963781 4228872 6582236 3087513 1577494 7289651 9108930 -20796
10509 -20796 -6282976 1394702 9340684 3255068 -5157461 -988100 4993524 -1171569
$$ packed form
10567B324904j238159m611163k359723K876568L280842m16073r21853J807407
10559G42750J438204j647180j260879J787452J109323k097634q96879L311399
10551B486556K528802k693698l985790n02925O95845j044551J55913L279196J730863
10542B650211k760766k652764M46987r32176m074985n22474N814183L865878l216604
10533a382510k314648N204874N146851l302949n831105R27726M514461M82977
10525C445677j637710Q18199l51639m472235j426159O454903N738306k621750
10517E947592l983811K265091K353364l494723j510019N712157J819279r129726
10509b0796o262180P677678P945982o085616q412529M169361N981624o165093
$$ plain form
10501 -1171569 -6925245 1720400 8492311 -2797118 -11287675 4100695 18169773 2784189
10493 2784189 -12129351 11810998 38726231 15425890 -3441899 96732097 294616800
10486 294616800 404348308 306520358 110591101 3605064 15925328 38184171 13082950
10479 13082950 -10588931 2490013 16101342 1889686 -11943147 -1268278 11047919
10472 11047919 3243041 -6872238 -460869 8275655 3408483 -3291798 1233082 6253521
10464 6253521 779707 -4827283 -770357 3034105 -2108481 -6205781 -951635 3721495
10456 3721495 -430716 -3629243 2617289 8784933 5398926 286773 2711437 6582804
10448 6582804 4110817 879487 3067576 4164358 -1521074 -5865932 -1455543 3818335
$$ packed form
10501a171569n753676Q645645O771911j1289429q490557J5388370J4069078j5385584
10493B784189j4913540K3940349K6915233k3300341j8867789J00173996J97884703
10486B94616800J09731508r7827950j95929257j06986037J2320264K2258843k5101221
10479A3082950k3671881J3078944J3611329j4211656j3832833J0674869J2316197
10472A1047919p804878j0115279O411369Q736524m867172o700281M524880N020439
10464F253521n473814n606990M056926L804462n142586m097300N254146M673130
10456C721495m152211l198527O246532O167644l386007n112153K424664L871367
10448F582804k471987l231330K188089J096782n685432m344858M410389N273878
$$ plain form
10440 3818335 699952 -4899534 -3450749 1061987 -115021 -4137310 -3163175 532674
10432 532674 -338429 -4184395 -4320986 -1540246 -1589223 -4362026 -5482066 -4769442 -4648554
10423 -4648554 -4164264 -2055721 -1396873 -4340071 -6913177 -5362738 -2635483 -2557811 -3078552
10414 -3078552 -1421058 -296840 -2546636 -4847913 -3132449 459587 1844197 1573356
10406 1573356 1880698 1934757 987209 1317327 3372497 3194055 -770366 -3832769 -2649978
10397 -2649978 -853940 -2256910 -4296517 -3450890 -1536909 -1233984 -684951 2035514 4113223
10388 4113223 2929097 1014600 1111878 1108548 -1229589 -3348661 -2684316 -1656437 -3003502
10379 -3003502 -4630122 -3838736 -2345296 -2570561 -3182465 -2480401 -1858593 -2080638 -807827
$$ packed form
10440C818335l118383n599486J448785M512736j177008m022289R74135L695849
10432E32674q71103l845966j36591K780740m8977k772803j120040P12624J20888
10423d648554M84290K108543O58848k943198k573106J550439K727255P7672n20741
10414c078552J657494J124218k249796k301277J715464L592036J384610k70841
10406A573356L07342N4059r47548L30118K055170j78442l964421l062403J182791
10397b649978J796038j402970k039607Q45627J913981L02925N49033K720465K077709
10388D113223j184126j914497R7278l330k338137k119072O64345J027879j347065
10379c003502j626620P91386J493440k25265o11904P02064O21808k22045J272811
$$ plain form
10370 -807827 2431615 3850740 1764374 47580 1367013 2540506 764874 -1331502
10362 -1331502 -1329223 -1825096 -4734839 -6564987 -4559244 -2045037 -2419627 -3312050 -2076675
10353 -2076675 -1413008 -3680159 -5181482 -2475836 739083 -344509 -3421388 -3580497
10345 -3580497 -1711080 -1584633 -2438714 -1360342 313388 -281985 -1413936 130964 2523187
10336 2523187 1793930 -1166167 -2466657 -1709831 -978576 120427 2701076 4395924 2683118
10327 2683118 90580 396349 1969976 779258 -2084094 -2053328 1144910 3266877 2310496
10318 2310496 274962 -1234026 -2519861 -3408229 -3236935 -2569619 -1908871 -216742 2519390
10309 2519390 3678962 2053251 561066 1479431 2315605 442436 -1687807 -690787 1628968
$$ packed form
10370h07827L239442J419125k086366j716794J319433J173493j775632k096376
10362a331502K279m95873k909743j830148K005743K514207l74590q92423J235375
10353b076675O63667k267151j501323K705646L214919j083592l076879j59109
10345c580497J869417J26447q54081J078372J673730n95373j131951J544900K392223
10336B523187p29257k960097j300490P56826P31255J099003K580649J694848j712806
10327B683118k592538L05769J573627j190718k863352L0766L198238K121967r56381
10318B310496k035534j508988j285835q88368J71294O67316O60748J692129K736132
10309B519390J159572j625711j492185R18365Q36174j873169k130243R97020K319755
$$ plain form
10300 1628968 1455589 -523016 -1048235 -329866 -871454 -2300703 -2507982 -2185734 -3363110
10291 -3363110 -5032466 -4759793 -2970653 -1456246 321830 3243910 5211251 4173894
10283 4173894 2071406 1475147 1095405 -871558 -2166983 -404277 1660440 537455
10275 537455 -1372229 146775 3151593 2531142 -1019928 -2089894 595725 3231866
10267 3231866 4030918 4596869 4709784 2361236 -997945 -1530051 396186 596397 -1653184
10258 -1653184 -2576917 -699163 956710 366526 -910881 -1497198 -1814121 -1345376 1026999
10249 1026999 3379619 2088563 -2470839 -5864927 -5776393 -4118362 -2761850 -1484650
10241 -1484650 -516326 -841608 -1495505 -494987 1358846 1489070 177401 95208 1490103
$$ packed form
10300A628968j73379j978605n25219P18369n41588j429249k07279L22248j177376
10291c363110j669356K72673J789140J514407J778076K922080J967341j037357
10283D173894k102488n96259l79742j966963j295425J762706K064717j122985
10275E37455j909684J519004L004818o20451l551070j069966K685619K636141
10267C231866P99052N65951J12915k348548l359181n32106J926237K00211k249581
10258a653184r23733J877754J655873n90184j277407n86317l16923M68745K372375
10249A026999K352620j291056m559402l394088Q8534J658031J356512J277200
10241a484650R68324l25282o53897J000518J853833J30224j311669q2193J394895
$$ plain form
10232 1490103 2117201 1620934 1518664 1234165 -1073343 -4006612 -4207786 -1996996 -773312
10223 -773312 -1065018 -488455 651468 -332654 -2417075 -1403875 2540019 4158505 1360850
10214 1360850 -1897701 -2720188 -3126759 -4607861 -4877785 -2895766 -1539705 -2231509 -2182897
10205 -2182897 -92219 775060 -1292269 -2567634 -274544 2084565 510318 -2738853
10197 -2738853 -3299739 -1908464 -2027262 -3255012 -2761880 -1208839 -1637869 -3718478 -4412744
10188 -4412744 -3682032 -4336558 -6197706 -5502549 -1204634 2524188 1997869 -1073220 -2548835
10179 -2548835 -1343693 375554 959898 833974 729503 446307 -141041 -290572 297148
10170 297148 151955 -2386691 -6132247 -7323007 -4034321 986908 3472201 2659056 1262428
$$ packed form
10232A490103O27098m96267j02270k84499k307508k933269k01174K210790J223684
10223g73312k91706N76563J139923r84122k084421J013200L943894J618486k797655
10214A360850l258551q22487m06571j481102k69924J982019J356061o91804M8612
10205b182897K090678Q67279k067329j275365K293090K359109j574247l249171
10197b738853n60886J391275j18798j227750M93132J553041m29030k080609o94266
10188d412744P30712o54526j861148O95157M297915L728822n26319l071089j475615
10179b548835J205142J719247N84344j25924j04471k83196n87348j49531N87720
10170B97148j45193k538646l745556j190760L288686N021229K485293q13145j396628
$$ plain form
10161 1262428 1101501 1186181 319827 -731388 -608479 680602 2107118 2865065 2643138
10152 2643138 1597498 530034 266036 544531 309868 -719285 -1566610 -1256050 79186
10143 79186 1419452 1778072 1068545 293631 375487 734820 77164 -1294103 -1614203 -570565
10133 -570565 37487 -505251 -409593 1320378 2727256 2144987 1126570 1589892 2430837
10124 2430837 1910584 1096393 1570215 1915405 296597 -1454329 -582902 1436256 1108629
10115 1108629 -1036108 -1569139 -452903 -920878 -3318869 -4439550 -3383356 -2854836 -3820232
10106 -3820232 -3988254 -2760319 -2635724 -4127982 -4225665 -1912299 -484641 -1952982 -3544170
10097 -3544170 -2554139 -682150 -516971 -1249923 -1025406 -498000 -938068 -1401191 -664849
$$ packed form
10161A262428j60927Q4680q66354j051215J22909J289081J426516P57947k21927
10152B643138j045640j067464k63998K78495k34663j029153q47325L10560J335236
10143G9186J340266L58620p09527p74914Q1856L59333o57656j371267l20100J043638
10133e70565O08052n42738R5658J729971J406878n82269j018417M63322Q40945
10124B430837n20253q14191M73822L45190j618808j750926Q71427K019158l27627
10115A108629k144737n33031J116236m67975k397991j120681J056194N28520r65396
10106c820232j68022J227935J24595j492258r7683K313366J427658j468341j591188
10097c544170R90031J871989J65179p32952K24517N27406m40068m63123P36342
$$ plain form
10088 -664849 353657 644280 1115079 2083862 1413663 -1979818 -5144589 -4736149 -1793310
10079 -1793310 86617 -228720 -1056068 -1268311 -1265022 -1399956 -1665667 -2245314 -2785142 -2206541
10069 -2206541 -630497 14802 -1188625 -2428944 -1930742 -643119 -284646 -485888 -25102
10060 -25102 615156 139167 -1307431 -2713158 -3844947 -4574714 -3944509 -1754516 276826
10051 276826 796981 859166 1784229 2550746 1602630 -66995 -179865 1311908 2377652
10042 2377652 2071872 1376479 1151931 1114798 764022 -55224 -1271738 -2283103 -2171444
10033 -2171444 -1112103 -536961 -935510 -922431 231672 857120 -465631 -2109137 -1648381
10024 -1648381 230067 725242 -738880 -1807939 -806029 1300718 2830646 3205585
$$ packed form
10088f64849J018506K90623M70799R68783o70199l393481l164771M08440K942839
10079a793310J879927l15337q27348k12243L289j34934k65711n79647n39828N78601
10069b206541J576044O45299j203427j240319M98202J287623L58473k01242M60786
10060b5102O40258m75989j446598j405727j131789p29767O30205K189993K031342
10051B76826N20155O2185R25063P66517r48116j669625j12870J491773J065744
10042B377652l05780o95393k24548l7133l50776q19246j216514j011365J11659
10033b171444J059341N75142l98549J3079J154103O25448j322751j643506M60756
10024a648381J878448M95175j464122j069059J001910K106747J529928L74939
$$ plain form
10016 3205585 2361793 231479 -2323574 -3461660 -2302086 -204863 671094 -264908 -1607865
10007 -1607865 -1739493 -717198 -221708 -1493842 -3525712 -3919116 -1719995 1258769 2424941
9998 2424941 1302148 -112150 205361 1926440 2789036 1500642 -355072 -329792 1208041
9989 1208041 1254083 -1347054 -3885713 -3986390 -3571055 -5693004 -8971193 -8970203 -4780230
9980 -4780230 -461567 572724 -752273 -1915472 -2035373 -1197597 511938 1872912 986606
9971 986606 -1747445 -3461287 -2838723 -1868675 -2362217 -3317658 -3240594 -2580623 -2189196 -1606734
9961 -1606734 -471148 454471 916922 1590592 1964883 683073 -1033512 100766 3918507
9952 3918507 5776901 3366724 421083 521211 1325873 -881191 -4456183 -5121655 -2817388
$$ packed form
10016C205585q43792k130314k555053j138086J159574K097223Q75957r36002j342957
10007a607865j31628J022295M95490j272134k031870l93404K199121K978764J166172
9998B424941j122793j414298L17511J721079Q62596j288394j855714K5280J537833
9989A208041M6042k601137k538659j00677M15335k121949l278189R90M189973
9980d780230M318663J034291j324997j163199j19901Q37776J709535J360974q86306
9971I86606k734051j713842O22564R70048m93542r55441P7064O59971L91427N82462
9961a606734J135586R25619M62451O73670L74291j281810j716585J134278L817741
9952C918507J858394k410177k945641J00128Q04662k207064l574992o65472K304267
$$ plain form
9943 -2817388 -799689 136720 1492879 2642732 1732990 65158 547656 2332598 1911250
9934 1911250 -791429 -2407583 -2126035 -2529259 -4063660 -4009919 -2039359 -1566772 -3801530
9925 -3801530 -5326413 -3873633 -2038299 -2573170 -4042357 -4136722 -3659156 -3948153 -3599360
9916 -3599360 -1377066 252077 -1711109 -5942614 -8536479 -8087065 -5975833 -3242848
9908 -3242848 -462795 679978 -811017 -2769739 -2399105 -434768 335301 -313114 -434403
9899 -434403 -81765 -1078766 -2933867 -3226541 -2328102 -3328843 -6355579 -7446663 -4787243
9890 -4787243 -1835784 -1955302 -3834485 -4901039 -5518423 -6674227 -7100519 -6217527 -6418114
9881 -6418114 -8572533 -9157641 -6557004 -5796446 -10583048 -15112421 -12810328 -9745882 -16922443
$$ packed form
9943b817388K017699R36409J356159J149853r09742j667832M82498J784942m21348
9934A911250k702679j616154K81548m03224j534401N3741J970560M72587k234758
9925c801530j524883J452780J835334n34871j469187r4365M77566k88997L48793
9916c599360K222294J629143j963186m231505k593865M49414K111232K732985
9908c242848K780053J142773j490995j958722L70634J964337P70069o48415j21289
9899d34403L52638r97001j855101k92674Q98439j000741l026736j091084K659420
9890d787243K951459j19518j879183j066554o17384j155804m26292Q82992k00587
9881f418114k154419n85108K600637P60558m786602m529373K302093L064446p176561
$$ plain form
9872 -16922443 -29122454 -25960209 80777 29293446 38145615 27576340 16476505
9865 16476505 14305130 14363440 11084783 8688757 10335573 11301382 8065572 4904562 5917490
9856 5917490 7767184 5934245 2326368 1115190 1720240 1326042 557849 1422602 2599152
9847 2599152 1719226 36489 328946 2027050 2508464 1584836 899172 375232 -1039460
9838 -1039460 -2326938 -1589658 607641 2086441 2309116 2119020 1407194 -248620 -1754299
9829 -1754299 -1952280 -1794001 -2575009 -3294882 -2391023 -809255 -570714 -1380733 -1417331 -547929
9819 -547929 -110278 -333544 -436072 -412134 -459927 238002 1851095 2361101 237343 -2636830
9809 -2636830 -3322962 -1809447 -33636 1485378 3014669 3179417 699680 -2519920 -3535644
$$ packed form
9872a6922443j2200011L162245K6040986K9212669Q852169j0569275j1099835
9865A6476505k171375N8310l278657k396026J646816R65809l235810l161010J012928
9856E917490J849694j832939l607877j211178O05050l94198p68193Q64753J176550
9847B599152q79926j682737K92457J698104M81414r23628o85664n23940j414692
9838a039460j287478P37280K197299J478800K22675j90096p11826j655814j505679
9829a754299j97981J58279p81008p19873R03859J581768K38541q10019l6598Q69402
9819e47929M37651k23266j02528K3938m7793O97929J613093N10006k123758k874173
9809b636830o86132J513515J775811J519014J529291J64748k479737l219600j015724
$$ plain form
9800 -3535644 -2707682 -2450935 -2659986 -1282033 1192111 1983675 716803 -165709 76327
9791 76327 -478559 -2221792 -2733552 -858677 1254983 1464734 190640 -1299207 -2448372
9782 -2448372 -2480079 -751752 1132224 501805 -2120781 -2959902 -372984 2765153 3587260
9773 3587260 3076818 3311861 3644594 2350650 162751 -681317 118581 884118 794511
9764 794511 652667 1000198 1246419 891225 322595 -37220 -528097 -1550656 -2418606 -1792961
9754 -1792961 304413 1715605 640097 -1476274 -1444938 1043837 2669688 1339313 -830734
9745 -830734 -1268975 -1110112 -2764324 -5346547 -5951885 -4232792 -2243692 -596079 1652320
9736 1652320 3767846 3712402 1819053 662327 975839 965503 68636 111089 2021159
$$ packed form
9800c535644Q27962K56747k09051J377953K474144P91564j266872q82512K42036
9791G6327n54886j743233n11760J874875K113660K09751j274094j489847j149165
9782b448372l1707J728327J883976o30419k622586q39121K586918L138137Q22107
9773C587260n10442K35043L32733j293944k187899q44068P99898P65537q9607
9764G94511j41844L47531K46221l55194n68630l59815m90877j022559q67950O25645
9754a792961K097374J411192j075508k116371L1336K488775J625851j330375k170047
9745h30734m38241J58863j654212k582223o05338J719093J989100J647613K248399
9736A652320K115526n5444j893349j156726L13512j0336q96867M2453J910070
$$ plain form
9727 2021159 4391624 6053496 7297641 7940559 7025059 5104436 4028904 3842811 2724096
9718 2724096 560972 -462629 418734 1367213 1395621 1929358 3814238 5674686 6363286
9709 6363286 6298106 5538040 3539797 1593110 2077374 4275922 4587684 2208393 710440
9700 710440 2246934 4233506 4098263 3337016 3915611 4320198 2659237 614685 648090
9691 648090 1792078 1788536 1179314 1689215 2489324 1693065 30189 -405446 229050 354654
9681 354654 160844 880989 2041045 2359551 2210457 2409205 2005040 315127 -392680
9672 -392680 2225149 6175560 7265145 4966052 2628747 2329620 3008936 3512304 4014493
9663 4014493 4242021 3389486 2087260 1732495 1850165 871726 -607933 -405409 1349228
$$ packed form
9727B021159K370465J661872J244145O42918r15500j920623j075532j86093j118715
9718B724096k163124j023601Q81363R48479K8408N33737J884880J860448O88600
9709F363286o5180p60066j998243j946687M84264K198548L11762k379291j497953
9700G10440J536494J986572j35243p61247N78595M04587j660961k044552L3405
9691F48090J143988l542o09222N09901Q00109p96259j662876m35635O34496J25604
9681C54654j93810P20145J160056L18506j49094J98748m04165j689913p07807
9672c92680K617829L950411J089585k299093k337305k99127O79316N03368N02189
9663D014493K27528q52535j302226l54765J17670r78439j479659K02524J754637
$$ plain form
9654 1349228 2063124 854614 -200525 330621 1313924 1576388 1594326 1660960 982353 -280329
9644 -280329 -548654 369077 433426 -1209141 -2275508 -688420 1987731 2590434 654864
9635 654864 -1393219 -1778037 -1317102 -1769877 -3428289 -4783496 -4288341 -2213019 -432187
9626 -432187 -192985 -750182 -813892 -472096 -540677 -804697 -423546 498420 1372898 2545053
9616 2545053 4328254 5185281 3257121 -425638 -2754456 -2724025 -2233266 -2383442 -1907759
9607 -1907759 -236927 836694 211579 -385259 657989 1970028 1563397 160857 -437540
9598 -437540 -782302 -2656058 -5479976 -6866204 -6398412 -5889889 -5791798 -4404528 -1438823
9589 -1438823 571195 -25485 -1289953 -739053 836276 1116361 393238 820678 2018034
$$ packed form
9654A349228P13896j208510j055139N31146R83303K62464J7938O6634o78607j262682
9644b80329k68325R17731O4349j642567j066367J587088K676151O02703j935570
9635F54864k048083l84818M60935m52775j658412j355207M95155K075322J780832
9626d32187K39202n57197o3710L41796o8581k64020L81151R21966Q74478J172155
9616B545053J783201Q57027j928160l682759k328818L0431M90759j50176M75683
9607a907759J670832J073621o25115n96838J043248J312039m06631j402540n98397
9598d37540l44762j873756k823918j386228M67792N08523R8091J387270K965705
9589a438823K010018n96680j264468N50900J575329K80085p23123M27440J197356
$$ plain form
9580 2018034 981691 -2776768 -5349600 -3751834 -492153 51751 -2028537 -3033198
9572 -3033198 -1960294 -1798653 -4008112 -5796376 -4762798 -2807204 -2637382 -3073220 -1327805
9563 -1327805 1719574 2408306 -31093 -2296799 -1864400 85536 1355876 1577937 1203875
9554 1203875 66836 -1487522 -1885646 -454935 1041744 645223 -951398 -1362522 233243
9545 233243 2206233 2630319 1195112 -994156 -2609667 -2917217 -2002858 -572431 454682
9536 454682 274758 -1403536 -3751032 -4880106 -3390832 -33494 2814453 3514560 2516793
9527 2516793 1372406 1076154 1454763 1550402 543938 -1140792 -1825737 -471040 1617408
9518 1617408 2049941 316401 -1707744 -2404596 -2270408 -2618653 -3611385 -4413613 -4519700
$$ packed form
9580B018034j036343l758459k572832J597766L259681N43904k080288j004661
9572c033198J072904J61641k209459j788264J033578J955594J69822m35838J745415
9563a327805L047379O88732k439399k265706M32399J949936J270340K22061l74062
9554A203875j137039j554358l98124J430711J496679l96521j596621m11124J595765
9545B33243J972990M24086j435207k189268j615511l07550R14359J430427J027113
9536D54682j79924j678294k347496j129074J489274L357338K847947P00107r97767
9527B516793j144387k96252L78609R5639j006464j684730o84945J354697K088448
9518A617408M32533j733540k024145o96852J34188l48245r92732q02228j06087
$$ plain form
9509 -4519700 -4087956 -3354178 -2288683 -695476 1379613 3012279 2613031 -225551 -3381715
9500 -3381715 -4113918 -2363990 -624495 -353965 -451367 86231 220057 -959479 -2074736
9491 -2074736 -1559326 -466436 -712277 -1463889 -175845 2892956 4224468 1989274 -1161554
9482 -1161554 -1858183 -516286 83531 -656363 -706901 785029 1948593 1254592 -25667
9473 -25667 27215 786163 -17499 -2779215 -5333773 -5796946 -4362230 -1973122 958735
9464 958735 3656715 4509985 2974606 809357 -106244 -222865 -904925 -1544422 -464662
9455 -464662 1629496 1873096 -434446 -2281255 -1150854 1298810 1753583 -17370 -1300936
9446 -1300936 -613049 756364 1484191 2161016 3551129 4692814 4248422 2762983 1955691
$$ packed form
9509d519700M31744P33778J065495J593207K075089J632666l99248k838582l156164
9500c381715p32203J749928J739495K70530r7402N37598J33826j179536j115257
9491b074736N15410J092890k45841p51612J288044L068801J331512k235194l150828
9482a161554o96629J341897N99817p39894n0538J491930J163564o94001j280259
9473b5667N2882P58948q03662k761716k554558m63173J434716K389108K931857
9464I58735K697980Q53270j535379k165249r15601j16621o82060o39497J079760
9455d64662K094158K43600k307542j846809J130401K449664M54773j770953j283566
9446a300936O87887J369413P27827O76825J390113J141685m44392j485439q07292
$$ plain form
9437 1955691 2103126 1697869 -82090 -1998339 -2581180 -2223308 -2324791 -3050593 -3286169
9428 -3286169 -2532897 -1422770 -352516 833491 1477911 183659 -2832511 -5053590 -4689482
9419 -4689482 -3087952 -2533123 -2823005 -2081183 -199875 907398 399088 -388119 -302157
9410 -302157 62488 -266095 -1271177 -2434176 -3172560 -2527332 -28494 2811154 3631651
9401 3631651 2291426 959486 734296 410537 -637288 -951861 157138 772955 -539789
9392 -539789 -2029572 -1682403 -909544 -2186414 -4373339 -4003076 -794209 1741703 1565708
9383 1565708 580375 786380 1083146 -240858 -2170807 -2397046 -729257 982480 1577091
9374 1577091 1507105 1514212 1882735 2773361 4047179 4867976 4498268 3384613 2574959 2242514
$$ packed form
9437A955691J47435m05257j779959j916249n82841L57872j01483p25802k35576
9428c286169P53272J110127J070254J186007O44420j294252l016170k221079L64108
9419d689482J601530N54829k89882P41822J881308J107273n08310p87207Q5962
9410c02157L64645l28583j005082j162999p38384O45228K498838K839648Q20497
9401C631651j340225j331940k25190l23759j047825l14573J108999O15817j312744
9392e39789j489783L47169P72859j276870k186925L70263L208867K535912j75995
9383A565708r85333K06005K96766j324004j929949k26239J667789J711737N94611
9374A577091o9986P107L68523Q90626J273818Q20797l69708j113655q09654l32445
$$ plain form
9364 2242514 1712779 802241 98040 -105360 -76736 325702 1731758 3817904 4887733
9355 4887733 3870076 1950664 966062 658642 -858217 -3784252 -5545754 -4005675 -468879
9346 -468879 1941012 2137809 1690534 1912141 2159190 1458526 304657 -108801 406729
9337 406729 951194 698446 -390292 -1625331 -2101553 -1668893 -1462768 -2637612 -4433478
9328 -4433478 -4623256 -2325517 772349 2618544 3037669 2946309 2580086 1734405 818743
9319 818743 321921 -88088 -694732 -712341 467317 1703274 1439508 197188 -47710
9310 -47710 1080872 1699638 434876 -1636871 -2480264 -1539225 -70078 386663 -474482
9301 -474482 -1411614 -906676 956674 2356378 1944957 463567 -509096 -394331 708754
$$ packed form
9364B242514n29735r10538p04201k03400K8624M02438J406056K086146J069829
9355D887733j017657j919412r84602l07420j516859k926035j761502J540079L536796
9346d68879K409891J96797m47275K21607K47049p00664j153869m13458N15530
9337D06729N44465k52748j088738j235039m76222M32660K06125j174844j795866
9328d433478j89778K297739L097866J846195M19125r1360l66223q45681r15662
9319H18743m96822m10009o06644j7609J179658J235957k63766j242320k44898
9310d7710J128582O18766j264762k071747q43393R41039J469147M56741q61145
9301d74482r37132N04938J863350J399704m11421j481390r72663J14765J103085
$$ plain form
9292 708754 2743278 4542958 3557520 -817536 -4828943 -4369541 -808246 634764 -1669065
9283 -1669065 -3784360 -2543817 95059 944532 338747 290678 657143 227849 -334875
9274 -334875 280341 1289603 1158247 493761 800096 1419452 622081 -1085087 -1687990
9265 -1687990 -1083113 -808354 -902418 -234252 348429 -1207891 -3932975 -4068737 -611994
9256 -611994 2750905 2840904 1154196 918610 2567465 4362048 5426976 5818369 5160219
9247 5160219 3458834 2045532 1751271 1405588 45134 -881268 176390 1750940 1389182
9238 1389182 -119994 207340 2419878 2910017 -311830 -4506986 -5954728 -4677128 -3484121
9229 -3484121 -3655591 -3729781 -2325115 -422363 -152110 -1898432 -3324255 -1743189 2499571
$$ packed form
9292G08754K034524J799680r85438m375056m011407M59402L561295J443010k303829
9283a669065k115295J240543K638876Q49473o05785m8069L66465m29294n62724
9274c34875O15216J009262j31356o64486L06335O19356p97371j707168o02903
9265a687990O04877K74759r4064O68166N82681j556320k725084j35762L456743
9256f11994L362899Q9999j686708k35586J648855J794583J064928L91393o58150
9247E160219j701385j413302k94261l45683j360454r26402J057658J574550l61758
9238A389182j509176L27334K212538M90139l221847m195156j447742J277600J193007
9229c484121j71470p4190J404666J902752K70253j746322j425823J581066M242760
$$ plain form
9220 2499571 5730443 4748568 466412 -3169349 -3538352 -1513626 454537 979110 289509
9211 289509 -535936 -477886 335313 387352 -1254412 -2949261 -2236399 344155 1456066
9202 1456066 -317589 -2478145 -2758061 -2653629 -4317626 -6045304 -4394262 56133 2820214
9193 2820214 1743950 -257184 71440 1731173 1628180 -641027 -2544483 -2301425 -748635
9184 -748635 359879 413835 35613 -43655 145096 -82466 -1017435 -1820800 -1473872 -346451
9174 -346451 197931 -168189 -372179 124352 580275 785599 1839203 3923228 5024127
9165 5024127 3664165 1549567 1332461 2668521 2930691 1414597 236135 781829 1653819
9156 1653819 1007565 -854904 -2197000 -1912193 -221288 1581902 1714519 -470761 -3069879
$$ packed form
9220B499571L230872r81875m282156l635761l69003K024726J968163N24573o89601
9211B89509q25445N8050Q13199N2039j641764j694849P12862K580554J111911
9202A456066j773655k160556k79916J04432j663997j727678J651042M450395K764081
9193B820214j076264k001134L28624J659733j02993k269207j903456K43058J552790
9184g48635J108514N3956l78222p9268J88751k27562r34969q03365L46928J127421
9174c46451N44382l66120k03990M96531M55923K05324J053604K084025J100899
9165E024127j359962k114598k17106J336060K62170j516094j178462N45694Q71990
9156A653819o46254j862469j342096K84807J690905J803190J32617k185280k599118
$$ plain form
9147 -3069879 -3217410 -495136 2666160 4249513 4491599 3998787 2318978 -351151 -2081247
9138 -2081247 -1559990 10172 1002738 1760033 3016840 3546971 1882499 -641403 -1223321
9129 -1223321 437267 1951514 1862864 1135203 978545 1454315 2552350 4514920 6504974
9120 6504974 6793010 4947275 2380244 342566 -1121680 -2034077 -2097204 -1822758 -2217468
9111 -2217468 -2897372 -2409896 -919987 -464724 -1822251 -3359521 -3910492 -4325572 -4810110
9102 -4810110 -3397388 759375 4833980 5691366 4101545 2958388 2931908 2944680 3530785
9093 3530785 5886286 8087183 6350583 698356 -4258405 -5348454 -4352736 -3981301 -3714061
9084 -3714061 -2156861 -696051 -1307487 -2361363 -466696 3827898 5860295 3253705
$$ packed form
9147c069879j47531K722274L161296J583353K42086m92812j679809k670129j730096
9138b081247N21257J570162R92566P57295J256807N30131j664472k523902n81918
9129a223321J660588J514247q8650p27661j56658M75770J098035J962570J990054
9120F504974K88036j845735k567031k037678j464246r12397o3127K74446l94710
9111b217468o79904M87476J489909M55263j357527j537270n50971m15080m84538
9102d810110J412722M156763M074605Q57386j589821j143157k6480J2772N86105
9093C530785K355501K200897j736600n652227m956761j090049R95718L71435K67240
9084c714061J557200J460810o11436j053876J894667M294594K032397k606590
$$ plain form
9076 3253705 -558343 -959211 1874478 3909480 2927437 653727 -649528 -1169328 -2045177
9067 -2045177 -2724315 -1691215 847827 2825174 2872373 1508429 -418297 -2796839 -5048231
9058 -5048231 -5533615 -3638332 -1347244 -1014812 -2167758 -2295014 -525458 1370329 1751907
9049 1751907 984949 57137 -823542 -1326472 -434508 1743293 2877005 957217 -2694207
9040 -2694207 -4722226 -3853279 -2034484 -1332169 -1436003 -1046178 -331685 -572683 -1922330
9031 -1922330 -3005743 -2929608 -2512086 -2825885 -3281601 -2241690 531816 3054647 3246024
9022 3246024 1337196 -427908 -289522 1298743 2387198 1668225 -154805 -1172662 -602103
9013 -602103 41417 -1100693 -3297617 -3734839 -1498186 628026 -255509 -3178555 -4884450
$$ packed form
9076C253705l812048m00868K833689K035002r82043k273710j303255n19800q75849
9067b045177o79138J033100K539042J977347M7199j363944j926726k378542k251392
9058e048231m85384J895283K291088L32432j152946j27256J769556J895787L81578
9049A751907p66958r27812q80679n02930Q91964K177801J133712j919788l651424
9040b694207k028019Q68947J818795P02315j03834L89825P14493k40998j349647
9031a922330j083413P6135M17522l13799m55716J039911K773506K522831J91377
9022C246024j908828j765104J38386J588265J088455p18973j823030j017857N70559
9013f02103O43520j142110k196924m37222K236653K126212q83535k923046j705895
$$ plain form
9004 -4884450 -4367708 -3315882 -2538360 -996077 1215927 2031286 844366 7296 1046410
8995 1046410 1862244 124797 -2612789 -3173647 -1706548 -1074874 -1995988 -2219661 -659210
8986 -659210 888297 874083 35952 -666160 -1537138 -2332850 -1465544 1306935 3557358
8977 3557358 3474030 2636748 3445847 5412618 6355713 5981603 5675905 5604518 4744787 3378445
8967 3378445 2829409 2777706 1572096 -482902 -964553 721307 1952021 858783 -719095
8958 -719095 -183792 1787164 2421023 905585 -937381 -1442997 -674252 487939 1256838
8949 1256838 1153518 537050 548227 1495959 2077747 1416685 726301 1181214 1355706 -669968
8939 -669968 -3439359 -3500764 -676667 1329949 367458 -1304049 -978079 659356 1641324
$$ packed form
9004d884450N16742J051826P77522J542283K212004Q15359j186920q37070J039114
8995A046410Q15834j737447k737586n60858J467099O31674r21114k23673J560451
8986f59210J547507j4214q38131p02112q70978p95712Q67306K772479K250423
8977C557358q3328q37282Q09099J966771R43095l74110l05698p1387q59731j366342
8967C378445n49036n1703j205610k054998m81651J685860J230714j093238j577878
8958g19095N35303J970956O33859j515438j842966n05616P68745J162191P68899
8949A256838j03320o16468J1177R47732N81788o61062o90384M54913J74492k025674
8939f69968k769391o1405K824097K006616r62491j671507L25970J637435R81968
$$ plain form
8930 1641324 1998924 2425504 1932795 -191319 -1855043 -944860 590494 -781546 -4038900
8921 -4038900 -4080066 758243 5389335 4305004 -1336942 -5469816 -4529340 -677321 1845513
8912 1845513 1396994 -473068 -1693103 -1831888 -1694577 -1632451 -1253309 -849815 -1686349
8903 -1686349 -3801934 -4794946 -2670932 828724 2038362 362311 -990249 363887
8895 363887 3093106 4724655 4648388 3228545 288564 -3545050 -5849785 -5080601 -3069338
8886 -3069338 -2736204 -4265422 -5625091 -5974431 -6184708 -6459982 -5906116 -4567786 -3745732
8877 -3745732 -3901338 -4044320 -3634935 -3443106 -3940548 -4281669 -3619753 -2394037 -1682112
8868 -1682112 -1988304 -2957129 -3602595 -2837830 -653862 1321387 1453295 163928 -754550
$$ packed form
8930A641324L57600M26580m92709k124114j663724R10183J535354j372040l257354
8921d038900m1166M838309M631092j084331n641946m132874R40476L852019K522834
8912A845513m48519j870062j220035j38785J37311O2126L79142M03494q36534
8903a686349k115585r93012K124014L499656J209638j676051j352560J354136
8895C63887K729219J631549p6267j419843k939981l833614k304735P69184K011263
8886c069338L33134j529218j359669l49340k10277k75274N53866J338330Q22054
8877c745732j55606j42982M09385J91829m97442l41121O61916J225716P11925
8868a682112l06192r68825o45466P64765K183968J975249J31908j289367r18478
$$ plain form
8859 -754550 -678216 -608033 -1177083 -1798541 -1968527 -1846154 -1315355 -126726 789929 98560
8849 98560 -1391035 -1165142 1094814 2441558 1007742 -928199 -494198 1114128 521314
8840 521314 -2360742 -4018012 -2429883 437331 1781138 1137745 -424911 -2080060 -3016858
8831 -3016858 -2266291 -229307 880408 -469551 -3090301 -4728969 -4880515 -4619185 -4371054
8822 -4371054 -3479527 -1832774 -463479 -207713 -723674 -1169464 -1178866 -913377 -696645 -839355
8812 -839355 -1430423 -2121134 -2363561 -1881791 -728694 850104 2185416 2180163 355140
8803 355140 -2114129 -3234360 -2318765 -629443 330342 441089 477593 718382 777304 455942
8793 455942 45541 -122175 82500 671339 1376458 1516298 590042 -899687 -1658035 -876008
$$ packed form
8859g54550P6334P0183n69050o21458j69986J22373N30799J188629R16655o91369
8849I8560j489595K25893K259956J346744j433816j935941M34001J608326n92814
8840E21314k882056j657270J588129K867214J343807o43393j562656j655149r36798
8831c016858P50567K036984J109715j349959k620750j638668j51546K61330K48131
8822d371054Q91527J646753J369295K55766n15961m45790r402K65489K16732j42710
8812h39355n91068o90711k42427M81770J153097J578798J335312n253j825023
8803C55140k469269j120231R15595J689322R59785J10747L6504K40789N8922l21362
8793D55942m10401j67716K04675N88839P05119J39840r26256j489729p58348P82027
$$ plain form
8783 -876008 829528 1867043 1152103 -659572 -1500452 22026 2727569 3783031 1979154
8774 1979154 -741716 -1895404 -1757401 -2556462 -4721208 -5873621 -4162658 -983150 816970
8765 816970 445167 -411902 -161308 933208 1522869 839194 -561380 -1322558 -620174
8756 -620174 857562 1628403 1233010 589415 263832 -428680 -1764788 -2345668 -1053558
8747 -1053558 618844 226960 -1942546 -3068342 -1974837 -845974 -1725316 -3301460 -2954081
8738 -2954081 -766768 546632 -624400 -2869479 -3767937 -2566677 -478961 830245
8730 830245 635275 -484322 -1345204 -1367502 -1034151 -1020019 -1224267 -1026982 -123296 1340544
8720 1340544 3010716 4175103 3975400 2591382 1618595 2107528 2656394 967404 -2708591
$$ packed form
8783h76008J705536J037515p14940j811675q40880J522478K705543J055462j803877
8774A979154k720870j153688J38003p99061k164746j152413J710963L179508J800120
8765H16970l71803q57069K50594J094516N89661o83675j400574p61178P02384
8756f20174J477736P70841l95393o43595l25583o92512j336108n80880J292110
8747a053558J672402l91884k169506j125796J093505J128863q79342j576144L47379
8738b954081K187313J313400j171032k245079q98458J201260K087716J309206
8730H30245j94970j119597q60882k2298L33351J4132k04248J97285R03686J463840
8720A340544J670172J164387j99703j384018r72787M88933N48866j688990l675995
$$ plain form
8711 -2708591 -5324215 -4711799 -2019037 287439 1421479 2122662 2714286 2907765 2908624
8702 2908624 3113366 2917808 1317750 -1211799 -2767570 -2293891 -777947 183335 128746
8693 128746 -321323 -517207 -398153 -508803 -1384730 -2408670 -1825559 869790 3067970
8684 3067970 1628329 -2493863 -4649736 -2542632 630802 965772 -579632 -345012 1928217
8675 1928217 2960409 1571720 505050 1662261 3037015 2304972 653983 494841 1328379
8666 1328379 762607 -1369888 -2660663 -1677626 335630 1392129 672210 -1487087 -3880089
8657 -3880089 -4671595 -2934535 -119022 1407584 1305581 1219511 1820009 1866048 735995
8648 735995 -117774 588841 1825533 1781294 507080 -402427 -138002 570828 661773 -291306
$$ packed form
8711b708591k615624O12416K692762K306476J134040P01183N91624J93479Q59
8702B908624K04742j95558j600058k529549j555771M73679J515944R61282n4589
8693A28746m50069j95884J19054j10650q75927j023940N83111K695349K198180
8684C067970j439641m122192k155873K107104L173434L34970j545404K34620K273229
8675A928217J032192j388689j066670J157211J374754p32043j650989j59142Q33538
8666A328379n65772k132495j290775R83037K013256J056499p19919k159297k393002
8657c880089p91506J737060K815513J526606j02003q6070O00498M6039j130053
8648G35995q53769P06615J236692m4239j274214r09507K64425P08830R0945r53079
$$ plain form
8638 -291306 -1991288 -3510416 -3866870 -3177227 -2661638 -2832588 -2570978 -1073294 220162
8629 220162 -697693 -3247281 -4668466 -3713172 -2146648 -1972828 -2760515 -2802939 -1804581
8620 -1804581 -1077886 -1551933 -2764328 -3810173 -4464460 -5129004 -6012614 -6548696 -5744465
8611 -5744465 -3386816 -792708 271299 -419808 -1309516 -1095097 -208206 299272 545118
8602 545118 1492182 3190734 4366513 3835988 1688196 -952065 -2814937 -3250564 -2734432
8593 -2734432 -2630841 -3914304 -6036131 -7385931 -6812257 -4486761 -1679774 -71081 -617873
8584 -617873 -2303135 -2612899 -346898 2546904 3271365 1871834 877919 1386310 1694616
8575 1694616 434134 -1146912 -1373173 -842225 -1196597 -2421751 -3150099 -2827946 -1952934
$$ packed form
8638b91306j699982j519128l56454O89643N15589j70950K61610J497684J293456
8629B20162r17855k549588j421185R55294J566524J73820p87687m2424R98358
8620a804581P26695m74047j212395j045845o54287o64544q83610n36082Q04231
8611e744465K357649K594108J064007o91107q89708K14419Q86891N07478K45846
8602E45118R47064J698552J175779n30525k147792k640261j862872m35627N16132
8593b734432J03591j283463k121827j349800N73674K325496K806987J608693n46792
8584f17873j685262l09764K266001K893802P24461j399531r93915N08391L08306
8575A694616j260482j581046k26261N30948l54372j225154p28348L22153Q75012
$$ plain form
8566 -1952934 -905164 -140364 -725125 -2818157 -4289511 -2966983 100194 1804446 1235509
8557 1235509 415591 672708 904957 191213 -423770 -96344 29704 -1107827 -2377084
8548 -2377084 -2288476 -1607885 -2140110 -3760055 -4551653 -3452997 -1217951 831029 1668600
8539 1668600 802403 -867069 -1050560 1298345 3738366 2696406 -1846909 -5869725 -5909915
8530 -5909915 -2550172 1161945 3089704 2895645 1064327 -1409530 -2923767 -2248686 146929
8521 146929 2239002 2029221 -949759 -5192672 -8071978 -7749483 -4794545 -1671805 -327312
8512 -327312 -555146 -894996 -569219 -48363 -109538 -961868 -2196289 -3143792 -3342950 -2983118
8502 -2983118 -2728847 -2757605 -2297722 -800597 649426 208051 -2098700 -3765518 -2774828
$$ packed form
8566a952934J047770P64800n84761k093032j471354J322528L067177J704252n68937
8557A235509q19918K57117K32249p13744o14983L27426J26048j137531j269257
8548b377084Q8608O80591n32225j619945p91598J098656K235046K048980Q37571
8539A668600q66197j669472j83491K348905K440021j041960m543315m022816m0190
8530e909915L359743L712117J927759j94059j831318k473857j514237O75081K395615
8521A46929K092073k09781k978980m242913k879306L22495K954938L122740J344493
8512c27312k27834l39850L25777N20856o1175q52330j234421r47503j99158L59832
8502b983118K54271k8758M59883J497125J450023m41375k306751j666818R90690
$$ plain form
8493 -2774828 -298226 909646 204929 -663574 -780416 -1226923 -2316886 -2161633 202821
8484 202821 2253447 1057161 -2390347 -4687156 -5005021 -5330729 -6034824 -4937732 -1644014
8475 -1644014 751166 93164 -1619398 -1679952 -863448 -1529637 -3418984 -4239321 -3309959
8466 -3309959 -1894035 -587657 1086638 2785604 3251644 2091927 86035 -1917223
8458 -1917223 -3091013 -2547084 -792860 -126276 -1583443 -2746139 -1066352 1821572 2202681
8449 2202681 -56794 -1460946 -423577 768667 193100 -905688 -826491 -94769 39658
8440 39658 -480035 -1370176 -2733082 -3944751 -3944253 -3451458 -4445918 -6506677 -6505233 -3362874
8430 -3362874 -214328 79762 -1202255 -1539959 -1186950 -1399699 -1054572 1429546 4351999
$$ packed form
8493b774828K476602J207872p04717q68503j16842m46507j089963J55253K364454
8484B02821K050626j196286l447508k296809l17865l25708p04095J097092L293718
8475a644014K395180o58002j712562o0554Q16504o66189j889347q20337R29362
8466c309959J415924J306378J674295J698966M66040j159717k005892k003258
8458a917223j173790N43929J754224O66584j457167j162696J679787K887924L81109
8449B202681k259475j404152J037369J192244n75567j098788P9197P31722J34427
8440C9658n19693q90141j362906j211669M98M92795r94460k060759J444L142359
8430c362874L148546K94090j282017l37704L53009k12749L45127K484118K922453
$$ plain form
8421 4351999 4541483 2098836 39169 -232709 110153 425691 1224850 1608603 -388366
8412 -388366 -4082544 -5935863 -4304648 -1608162 -315505 463424 2281313 3681839 2212719
8403 2212719 -1179039 -2919479 -1793574 -320739 -591727 -1340444 -626180 633395 175552
8394 175552 -1539130 -1519627 1225765 3881491 3781336 2136870 1901412 3348629 4150462
8385 4150462 3116488 1346157 -145855 -1433140 -2124540 -1373738 -23454 -212622 -1961847
8376 -1961847 -2681661 -1208779 368870 464650 689892 2532466 4086929 3152312 1355625
8367 1355625 1580218 2871576 1872028 -1492205 -3782208 -3337721 -1917390 -811603 742217
8358 742217 2412916 1904291 -1172322 -3854757 -4101167 -3545609 -4020262 -4287929 -2776688
$$ packed form
8421D351999J89484k442647k059667k71878L42862L15538P99159L83753j996969
8412c88366l694178j853319J631215K696486J292657P78929J817889J400526j469120
8403B212719l391758j740440J125905J472835k70988p48717P14264J259575m57843
8394A75552j714682J9503K745392K655726j00155j644466k35458J447217Q01833
8385D150462j033974j770331j492012j287285o91400P50802J350284j89168j749225
8376a961847p19814J472882J577649R5780K25242J842574J554463r34617j796687
8367A355625K24593J291358r99548l364233k290003M44487J420331J105787J553820
8358G42217J670699n08625l076613k682435k46410N55558m74653k67667J511241
$$ plain form
8349 -2776688 -947477 -849267 -1316793 9985 2232929 2342800 203039 -1172150 -425198
8340 -425198 440377 -77495 -533738 558642 1915767 1582079 110198 -452558 332157
8331 332157 1190307 1457538 1587550 1663958 1257664 774203 1180658 2136771 2159674 1192169
8321 1192169 1156063 2884474 4265715 3130831 609651 -564998 -218452 -611823 -2352661
8312 -2352661 -3263096 -2060566 -541118 -607261 -1291739 -750257 423528 281827 -1025989
8303 -1025989 -1408954 -218022 852446 569542 -118350 122450 1036653 1516547 1269102
8294 1269102 858685 718434 859925 1257885 1985148 2933936 3517085 2859267 816473
8285 816473 -1149079 -1115530 712306 1719296 252432 -1881365 -1899163 -57104 979210
$$ packed form
8349b776688J829211R8210m67526J326778K222944J09871k139761j375189P46952
8340d25198Q65575n17872m56243J092380J357125l33688j471881n62756P84715
8331C32157Q58150K67231J30012P6408m06294m83461M06455R56113K2903r67505
8321A192169l6106J728411J381241j134884k521180j174649L46546l93371j740838
8312b352661r10435J202530J519448o6143o84478N41482J173785j41701j307816
8303a025989l82965J190932J070468k82904o87892K40800R14203M79894k47445
8294A269102m10417j40251J41491L97960P27263R48788N83149o57818k042794
8285H16473j965552L3549J827836J006990j466864k133797j7798J842059J036314
$$ plain form
8276 979210 310624 -168539 795917 1793278 1125410 -717080 -2148477 -2600596 -2444092
8267 -2444092 -2055052 -1950210 -2634583 -3386983 -2541538 -54072 1646114 767982 -1184111
8258 -1184111 -1531312 -85216 1230233 1556248 1647466 1594859 393724 -1859087 -3410715
8249 -3410715 -3246548 -2386789 -2007691 -1845780 -1461584 -1537002 -2466840 -2889858 -1423243 895232
8239 895232 1846413 1343940 1357786 2373668 2272176 -268792 -3319163 -4286801 -3420063
8230 -3420063 -2760716 -2752036 -2211903 -1065329 -573852 -862691 -680497 38653 -160059 -1373823
8220 -1373823 -1684791 -461730 294070 -469284 -481386 2325025 6030781 7212286 5628501
8211 5628501 3587895 1961211 -24477 -1883827 -2109275 -1064162 -578716 -764588 -230836
$$ packed form
8276I79210o68586m79163R64456R97361o67868j842490j431397m52119J56504
8267b444092L89040J04842o84373p52400Q45445K487466J700186q78132j952093
8258a184111l47201J446096J315449L26015R1218n2607j201135k252811j551628
8249c410715J64167Q59759L79098J61911L84196p5418r29838m23018J466615K318475
8239H95232R51181n02473J3846J015882j01492k540968l050371r67638Q66738
8230c420063O59347Q680N40133J146574M91477k88839J82194P19150j98712j213764
8220a373823l10968J223061P55800p63354j2102K806411L705756J181505j583785
8211E628501k040606j626684j985688j859350k25448J045113M85446j85872N33752
$$ plain form
8202 -230836 652417 40641 -1632311 -1764326 -151049 238799 -1660203 -2817135 -994759
8193 -994759 1458960 1311010 -687873 -1441698 -43707 2008813 3555068 4228993 3531541
8184 3531541 1759762 625597 881417 782859 -941414 -2315408 -978235 1686021 2353369
8175 2353369 693507 -625120 -246724 639906 1060826 1208902 670328 -1344269 -3739348
8166 -3739348 -4244318 -2736871 -1282497 -638863 409367 1787740 1477418 -632057 -1337371
8157 -1337371 1369664 4771193 4831796 1588467 -1254112 -1247524 462424 1474572 1033258
8148 1033258 265366 484020 1657354 2426571 1699043 -9042 -1334012 -1779345 -1722055
8139 -1722055 -1154600 94169 1091699 630118 -496533 -113238 1840726 2590853 379512
$$ packed form
8202b30836Q83253o11776j672952j32015J613277L89848j899002j156932J822376
8193i94759K453719j47950j998883p53825J397991K052520J546255O73925o97452
8184C531541j771779j134165K55820r8558j724273j373994J337173K664256O67348
8175B353369j659862j318627L78396Q86630M20920J48076n38574k014597k395079
8166c739348n04970J507447J454374O43634J048230J378373l10322k109475p05314
8157a337371K707035L401529O0603l243329k842579O588J709948J012148m41314
8148A033258p67892K18654J173334P69217p27528j708085j324970m45333N7290
8139a722055N67455J248769R97530m61581j126651L83295J953964P50127k211341
$$ plain form
8130 379512 -2989075 -4908776 -5406509 -5941190 -6310533 -5093149 -2450265 -327555 17972
8121 17972 -869943 -1870237 -2340744 -2133020 -1612223 -1403503 -1370302 -576081 861857 1060519
8111 1060519 -1027228 -3423297 -3487747 -1655556 -578375 -1063550 -1453683 -1054077 -1362240
8102 -1362240 -3040137 -4156901 -2900979 -181794 2025651 3411167 4693389 5427079
8094 5427079 4427158 1981915 -15599 -236361 816295 1717384 1588596 792667 650870
8085 650870 2055559 3922936 3852324 1159029 -1657152 -1793866 130051 866823 -1120610
8076 -1120610 -3851281 -4707422 -3520840 -1938920 -931882 -145064 807953 1542265 1490887
8067 1490887 760956 224917 753958 2182829 3153304 2467869 606542 -662173 -235976
$$ packed form
8130C79512l368587j919701m97733n34681l69343J217384K642884K122710L45527
8121A7972q87915j000294m70507K07724N20797K08720L3201P94221J437938J98662
8111A060519k087747k396069o4450J832191J077181m85175l90133L99606l08163
8102a362240j677897j116764J255922K719185K207445J385516J282222P33690
8094E427079r99921k445243j997514k20762J052656R01089j28788p95929j41797
8085F50870J404689J867377p0612k693295k816181j36714J923917P36772j987433
8076a120610k730671q56141J186582J581920J007038P86818R53017P34312n1378
8067A490887p29931n36039N29041J428871R70475o85435j861327j268715M26197
$$ plain form
8058 -235976 1357107 2928142 3696398 3265287 1647009 -156406 -629035 420508 1375065
8049 1375065 1021409 324303 837086 2164413 2563901 1686716 1021919 1480426 2075329
8040 2075329 1547696 175402 -659210 23633 2057562 4152528 4505730 2365078 -704172
8031 -704172 -2103066 -1152437 226741 211258 -726681 -1069316 -568053 -194295 -551544 -1495962
8021 -1495962 -2827038 -4229167 -4817402 -3778175 -1446508 839244 1723080 405005 -2800363
8012 -2800363 -5686015 -5214132 -1066182 2675830 1635275 -3166594 -6123459 -4144084
8004 -4144084 -474441 97842 -2296221 -3549209 -1918996 -254299 -1355182 -3860124
7996 -3860124 -4559563 -3115978 -2048160 -2512833 -2686969 -1134139 337295 -999350 -4663511
$$ packed form
8058b35976J593083J571035P68256m31111j618278j803415m72629J049543R54557
8049A375065l53656o97106N12783J327327L99488q77185o64797M58507N94903
8040B075329n27633j372294q34612O82843K033929K094966L53202k140652l069250
8031g04172j398894R50629J379178j5483r37939l42635N01263L73758l57249r44418
8021a495962j331076j402129n88235J039227K331667K285752Q83836j318075l205368
8012b800363k885652M71883M147950L742012j040555m801869k956865J979375
8004d144084L669643N72283k394063j252988J630213J664697j100883k504942
7996c860124o99439J443585J067818m64673j74136J552830J471434j336645l664161
$$ plain form
7987 -4663511 -7252741 -6730509 -4555593 -3139326 -2928838 -2982318 -3030027 -3500036 -4201264
7978 -4201264 -4379181 -3874029 -3206042 -2684970 -2262620 -1999408 -1868610 -1451580 -695402 -511888
7968 -511888 -1528732 -2674396 -2386528 -1020425 -462282 -1205205 -1497706 -14721 2133306
7959 2133306 3026519 2411026 1469229 1006483 1012244 1386453 1891235 1672480 -74870 -2941781
7949 -2941781 -5521785 -6742657 -6450615 -4953861 -2759828 -701743 409359 429433 -192891
7940 -192891 -1042352 -1859476 -2269382 -2083788 -1843528 -2303062 -3179341 -3145817 -1552852 367278
7930 367278 710162 -805999 -2400078 -2299085 -795319 251311 -151571 -823303 26665
7921 26665 2252094 3564037 2202137 -710308 -2199295 -829534 1630776 2360574 796411
$$ packed form
7987d663511k589230N22232K174916J416267K10488n3480m7709m70009p01228
7978d201264j77917N05152O67987N21072M22350K63212J30798M17030P56178J83514
7968e11888j016844j145664K87868J366103N58143p42923k92501J482985K148027
7959B133306Q93213o15493r41797m62746N761L74209N04782k18755j747350k866911
7949b941781k580004j220872K92042J496754K194033K058085J111102K0074o22324
7940a92891q49461q17124m09906J85594K40260m59534q76279L3524J592965J920130
7930C67278L42884j516161j594079J00993J503766J046630m02882o71732Q49968
7921B6665K225429J311943j361900k912445j488987J369761K460310P29798j564163
$$ plain form
7912 796411 -1040768 -1443636 -1075754 -1383234 -1904035 -782768 1999937 3634658 1761003
7903 1761003 -2303182 -4937595 -4364569 -2154492 -765452 -908261 -1658555 -2086628 -2085151
7894 -2085151 -2109815 -2667987 -3874555 -5208370 -5758092 -4799186 -2299932 668025 2000396
7885 2000396 98493 -3855647 -6103618 -4159122 61965 2438902 1586134 -168422
7877 -168422 -566988 49142 532690 1029761 2007774 2859191 2948707 2830087 3059680 2914442
7867 2914442 1670942 124820 -593553 -756007 -1136192 -1357122 -730242 206028 701913
7858 701913 1336827 2539134 2623592 -69608 -3688434 -4536392 -2259632 -303830 -691396
7849 -691396 -1566414 -1130043 -776717 -2153023 -3747178 -3189857 -1149844 -66625 -238312
$$ packed form
7912G96411j837179m02868L67882l07480n20801J121267K782705J634721j873655
7903A761003m064185k634413N73026K210077J389040j42809p50294m28073J477
7894b085151k4664n58172j206568j333815n49722R58906K499254K967957J332371
7885B000396j901903l954140k247971J944496M221087K376937q52768j754556
7877a68422l98566O16130M83548M97071R78013Q51417Q9516j18620K29593j45238
7867B914442j243500j546122p18373j62454l80185k20930O26880R36270M95885
7858G01913O34914J202307Q4458k693200l618826q47958K276760J955802l87566
7849f91396q75018M36371L53326j376306j594155N57321K040013J083219j71687
$$ plain form
7840 -238312 -88091 465609 -20418 -1336084 -1434948 65078 913968 -255801 -1799173
7831 -1799173 -1765695 -721724 -224401 -135481 517152 1089484 27885 -2237112 -3223280
7822 -3223280 -1679553 645853 1277497 -52929 -1582944 -1827273 -759222 827588 2100725
7813 2100725 2444019 1906849 1545100 2380161 3675826 3315847 693465 -1845855 -1912590
7804 -1912590 -706417 -1625839 -5207212 -7926755 -7082883 -4482928 -3317480 -3420184 -2508154
7795 -2508154 -820943 -965455 -3335657 -5268055 -5362857 -5150288 -5299404 -3888544 -609007
$$ packed form
7840b38312J50221N53700m86027j315666r8864J500026Q48890j169769j543372
7831a799173L3478J043971M97323Q8920O52633N72332j061599k264997r86168
7822c223280J543727K325406O31644j330426j530015k44329J068051J586810J273137
7813B100725L43294n37170l61749Q35061J295665l59979k622382k539320o6735
7804a912590J206173r19422l581373k719543Q43872K599955J165448j02704R12030
7795b508154J687211j44512k370202j932398r4802K12569j49116J410860L279537
$$ [...]
##END NTUPLES=NMR SPECTRUM
##END=
