##TITLE=31Pdec_2PEPA0107
 , 24 sc
 2.07.2021
##JCAMPDX= 6.0         $$ Bruker NMR JCAMP-DX V2.0
##DATA TYPE= NMR SPECTRUM
##DATA CLASS= NTUPLES
##ORIGIN= UXNMR, Bruker Analytische Messtechnik GmbH
##OWNER= root
$$ XWIN-NMR		Version 3.5
$$ Fri Jul  2 08:48:30 2021 Russian Standard Time (UT+4h)  she@DPX200
##.OBSERVE FREQUENCY= 81.013821
##.OBSERVE NUCLEUS= ^31P
##.ACQUISITION MODE= SIMULTANEOUS
##.ACQUISITION SCHEME= undefined
##.AVERAGES= 24
##.DIGITISER RES= 16
##SPECTROMETER/DATA SYSTEM= spect
##.PULSE SEQUENCE= zgpg30
##.SOLVENT NAME= CDCl3
##.SHIFT REFERENCE= (INTERNAL, CDCl3, 0, 248.564)
##AUDIT TRAIL= $$ (NUMBER, WHEN, WHO, WHERE, WHAT)
$$ ##TITLE= Audit trail, XWIN-NMR		Version 3.5
$$ ##JCAMPDX= 5.01
$$ ##ORIGIN= Bruker BioSpin GmbH
$$ ##OWNER= she
$$ F:/spectra/data/she/nmr/P31/1/pdata/1/auditp.txt
$$ ##AUDIT TRAIL=  $$ (NUMBER, WHEN, WHO, WHERE, WHAT)
(   1,<2021-07-02 08:47:11.89 +0400>,<she>,<DPX200>,
      <created by zg, POWCHK disabled, PULCHK disabled
       configuration hash MD5:
       00 E9 B6 7A A2 85 ED C7 34 08 36 98 17 FE 4E 26
       data hash MD5: 32K
       59 AB F0 40 81 35 DD 66 9D 03 7E CE 35 B7 A4 3B>)
(   2,<2021-07-02 08:47:21.46 +0400>,<she>,<DPX200>,
      <Start of raw data processing
       efp BC_mod = 2 LB = 1 FT_mod = 6 PKNL = 1 PHC0 = -7505.211 PHC1 = 391.6861 SI = 64K 
       data hash MD5: 64K
       31 2B C1 B7 90 AC 7A B2 EC 49 F0 CB 21 85 F8 15>)
(   3,<2021-07-02 08:47:42.85 +0400>,<she>,<DPX200>,
      <pk PHC0 = 74.17595 PHC1 = -199.4 
       data hash MD5: 64K
       65 FA F6 70 5A 60 01 42 FE 66 BC D6 C6 B7 FC 7A>)
(   4,<2021-07-02 08:47:46.37 +0400>,<she>,<DPX200>,
      <abs ABSG = 5 
       data hash MD5: 64K
       7B 66 71 70 B9 61 A9 29 E7 56 DE DD 96 8F A3 F1>)
(   5,<2021-07-02 08:48:00.45 +0400>,<she>,<DPX200>,
      <abs ABSG = 5 
       data hash MD5: 64K
       9C DB 4F DC 62 FD 01 61 7E C8 51 CB 7E 90 D0 77>)
$$ ##END=
$$ 
$$ hash MD5
$$ 07 16 B7 26 9D DA E6 11 A5 C0 E7 06 AB 3C 5D C7
##$RELAX= 
##$RELAX= 
##$RELAX= 
##$RELAX= 
##$RELAX= 
##$RELAX= 
##$RELAX= 
##$RELAX= 
$$ Bruker specific parameters
$$ --------------------------
##$DU= <F:/spectra>
##$EXPNO= 1
##$NAME= <P31>
##$PROCNO= 1
##$TYPE= <nmr>
##$USER= <she>
##$AMP= (0..31)
100 100 100 100 100 100 100 100 100 100 100 100 100 100 100 100 100 100 
100 100 100 100 100 100 100 100 100 100 100 100 100 100 
##$AQSEQ= 0
##$AQ_mod= 1
##$AUNM= <au_zg>
##$AUTOPOS= <>
##$BF1= 81.014009
##$BF2= 200.13
##$BF3= 200.13
##$BF4= 200.13
##$BF5= 200.13
##$BF6= 200.13
##$BF7= 200.13
##$BF8= 200.13
##$BYTORDA= 1
##$CFDGTYP= 0
##$CFRGTYP= 5
##$CHEMSTR= <none>
##$CNST= (0..31)
1 1 145 1 1 1 1 1 1 1 1 1 1 1 1 1 1 1 1 1 1 1 1 1 1 1 1 1 1 1 1 1 
##$CPDPRG= <waltz16>
##$CPDPRG1= <>
##$CPDPRG2= <waltz16>
##$CPDPRG3= <>
##$CPDPRG4= <mlev>
##$CPDPRG5= <mlev>
##$CPDPRG6= <mlev>
##$CPDPRG7= <mlev>
##$CPDPRG8= <mlev>
##$CPDPRGB= <>
##$CPDPRGT= <>
##$D= (0..31)
0 1 0 0 0 0 0 0 0 0 0 0.03 2e-05 3e-06 0 0 0 0 0 0 0 0 0 0 0 0 0 0 0 0 
0 0 
##$DATE= 1625201231
$$ [...]
##$SUBNAM3= <"">
##$SUBNAM4= <"">
##$SUBNAM5= <"">
##$SUBNAM6= <"">
##$SUBNAM7= <"">
##$SUBNAM8= <"">
##$SUBNAM9= <"">
##$SW= 501.771253377433
##$SWIBOX= (0..15)
0 1 3 0 0 0 0 0 0 0 0 0 0 0 0 0 
##$SW_h= 40650.406504065
##$TD= 32768
##$TD0= 1
##$TE= 0
##$TE2= 300
##$TE3= 300
##$TEG= 300
##$TL= (0..7)
0 120 53 12 22 120 120 120 
##$TP= (0..7)
150 150 150 150 150 150 150 150 
##$TP07= 0
##$TPNAME0= <>
##$TPNAME1= <>
##$TPNAME2= <>
##$TPNAME3= <>
##$TPNAME4= <>
##$TPNAME5= <>
##$TPNAME6= <>
##$TPNAME7= <>
##$TPOAL= (0..7)
0.5 0.5 0.5 0.5 0.5 0.5 0.5 0.5 
##$TPOFFS= (0..7)
0 0 0 0 0 0 0 0 
##$TUNHIN= 0
##$TUNHOUT= 0
##$TUNXOUT= 0
##$USERA1= <user>
##$USERA2= <user>
##$USERA3= <user>
##$USERA4= <user>
##$USERA5= <user>
##$V9= 5
##$VALIST= <valist>
##$VCLIST= <CCCCCCCCCCCCCCC>
##$VD= 0
##$VDLIST= <DDDDDDDDDDDDDDD>
##$VPLIST= <PPPPPPPPPPPPPPP>
##$VTLIST= <TTTTTTTTTTTTTTT>
##$WBST= 1024
##$WBSW= 4
##$XGAIN= (0..3)
0 0 0 0 
##$XL= 0
##$YL= 0
##$YMAX_a= 5952
##$YMIN_a= -6906
##$ZGOPTNS= <>
##$ZL1= 120
##$ZL2= 120
##$ZL3= 120
##$ZL4= 120
##$ABSF1= 248.5645
##$ABSF2= -253.2056
##$ABSG= 5
##$ABSL= 3
##$ALPHA= 0
##$AQORDER= 0
##$ASSFAC= 0
##$ASSFACI= 0
##$ASSFACX= 0
##$ASSWID= 0
##$AUNMP= <proc_1d>
##$AZFE= 0.1
##$AZFW= 0.5
##$BCFW= 0
##$BC_mod= 2
##$BYTORDP= 0
##$COROFFS= 0
##$CY= -3
##$DATMOD= 1
##$DC= 0
##$DFILT= <>
##$DTYPP= 0
##$F1P= 0
##$F2P= 0
##$FCOR= 1
##$FTSIZE= 65536
##$FT_mod= 6
##$GAMMA= 0
##$GB= 0
##$INTBC= 1
##$INTSCL= 5.30512e-09
##$ISEN= 30
##$LB= 1
##$LEV0= 0
##$LPBIN= 0
##$MAXI= 10000
##$MC2= 0
##$MEAN= 0
##$ME_mod= 0
##$MI= 50
##$NCOEF= 0
##$NC_proc= -7
##$NLEV= 6
##$NOISF1= 182.463
##$NOISF2= 159.3651
##$NSP= 0
##$NTH_PI= 0
##$NZP= 0
##$OFFSET= 248.5645
##$PC= 4
##$PHC0= -7431.035
##$PHC1= 192.2861
##$PH_mod= 1
##$PKNL= yes
##$PPARMOD= 0
##$PSCAL= 0
##$PSIGN= 0
##$REVERSE= no
##$SF= 81.014009
##$SI= 65536
##$SIGF1= 159.3651
##$SIGF2= -187.1042
##$SINO= 113.3802
##$SIOLD= 16384
##$SREGLST= <1H.CDCl3>
##$SSB= 0
##$STSI= 65536
##$STSR= 0
##$SW_p= 40650.406504065
##$SYMM= 0
##$S_DEV= 0
##$TDeff= 32768
##$TDoff= 0
##$TI= <>
##$TILT= no
##$TM1= 0
##$TM2= 0
##$TOPLEV= 0
##$USERP1= <user>
##$USERP2= <user>
##$USERP3= <user>
##$USERP4= <user>
##$USERP5= <user>
##$WDW= 1
##$XDIM= 65536
##$YMAX_p= 501815133
##$YMIN_p= -16988975
$$ End of Bruker specific parameters
$$ ---------------------------------
##NTUPLES= NMR SPECTRUM
##VAR_NAME=  FREQUENCY,     SPECTRUM/REAL,   SPECTRUM/IMAG
##SYMBOL=    X,             R,               I
##VAR_TYPE=  INDEPENDENT,   DEPENDENT,       DEPENDENT
##VAR_FORM=  AFFN,          ASDF,            ASDF
##VAR_DIM=   65536,         65536,           65536
##UNITS=     HZ,            ARBITRARY UNITS, ARBITRARY UNITS
##FACTOR=    0.620285442955139, 1,           1
##FIRST=     20137.2065510759, 0,            0
##LAST=      -20513.1999529892, 0,           0
##MIN=       -20513.1999529892, -16988975,   0
##MAX=       20137.2065510759, 501815133,    0
$$ Real data points
##PAGE= N=1
##DATA TABLE= (X++(R..R)), XYDATA
$$ [...]
46691 338331 -1601068 -3283687 -3946832 -3485776 -2272598 -1028345 -517837 -799940 -1125765
46682 -1125765 -1088401 -1268605 -1980845 -2157084 -774609 1120092 1460301 157484 -698996
46673 -698996 20763 934496 593330 -112345 572540 2326841 2870070 866355 -2407097
46664 -2407097 -4430609 -3841203 -1380206 1085793 2240190 2061514 1150266 -81841 -1192628
46655 -1192628 -1418180 -573455 210458 -119728 -647756 543326 3407330 5450198 4675707
46646 4675707 1790757 -940891 -1884839 -809844 1162211 2012707 647531 -1358021
46638 -1358021 -1353466 728373 2165543 1394452 -43495 -412112 -251819 -503585 -484385
46629 -484385 367973 831242 121001 -252276 720196 994879 -1170365 -3173797 -1373256
46620 -1373256 2538724 2980621 -1347899 -5061228 -3410100 1524751 4255960 2947880
46612 2947880 402416 -511508 238098 1160857 1391625 1012278 227429 -1085161 -2932138
46603 -2932138 -4525136 -4661342 -3224032 -1700000 -1485705 -2286729 -3028180 -3515271 -3968772
46594 -3968772 -3745719 -2129595 171458 1921919 3133493 4205248 4121537 1831427 -1105245
46585 -1105245 -1922569 -591455 371419 98284 354701 1890432 3078771 3236835 4024044
46576 4024044 5904610 6365763 3900934 993846 464690 1210761 623129 -666322 106747
46567 106747 3103153 5642676 6244774 5825027 5018322 3334686 1308119 682831 1630664
46558 1630664 2054833 615951 -1423501 -2296886 -1985613 -1374708 -645953 343613 1203506
46549 1203506 1587584 1747574 1675351 683188 -1213003 -2511040 -2093656 -1123229 -1564102
46540 -1564102 -3190999 -3738219 -2189993 -282214 27517 -789706 -978741 -338895 -185233
46531 -185233 -732973 -433900 1514337 3637319 4240161 3699690 3306535 2873568 1340054
46522 1340054 -795982 -1764356 -1351025 -1398341 -2812856 -3882272 -2736812 -140475 1583746
46513 1583746 1578516 950403 610420 53899 -1387871 -3017065 -3234697 -1458824 921921
46504 921921 1922066 1124867 -185630 -1062202 -1886639 -2735023 -2254662 248640 2692846
46495 2692846 2346014 -381201 -2480503 -2499178 -1748699 -1275056 -382214 1041643 1401788
46486 1401788 -16029 -1552914 -1753161 -1419712 -1581137 -1453336 -237447 919426 744310
46477 744310 -44832 -404501 -969030 -2132461 -1959822 1084331 4634247 4854819 1741100
46468 1741100 -1065947 -1451886 -794854 -739472 -1064216 -1356550 -2041883 -2711570 -1730533
46459 -1730533 1220684 3962688 4402712 3027823 1851005 1951698 2881503 3614381 3392057
46450 3392057 2246182 1023334 374190 -147961 -1210440 -2296359 -2297227 -1187221 159283
46441 159283 1473213 2940285 3855274 3180980 1467255 513758 916310 1453064 1055297
46432 1055297 -31399 -1031876 -1129080 559434 3706037 5770030 4448870 1093825
46424 1093825 -635999 398804 1889888 2182211 2289143 3019289 3218408 2312671 1712751
46415 1712751 1919019 1040379 -1625275 -3269730 -1636253 898024 587904 -1990354 -3035962
46406 -3035962 -1336993 547116 602687 -448144 -1419411 -2085537 -1894601 -102049 2080065
46397 2080065 2089730 -287762 -2254491 -2063998 -1251891 -1423902 -1429776 81054 1514026
46388 1514026 658206 -1262881 -1166786 807904 1266301 -983204 -2835028 -1694763 592586
46379 592586 944144 -150150 -63020 1151414 880658 -1435276 -3265676 -3067094 -2197909
46370 -2197909 -1750616 -661384 1333538 1937925 4131 -1611964 -13883 2974832
46362 2974832 3528317 1705762 610884 636237 -875452 -4055955 -5196529 -2395232 1332943
46353 1332943 2507305 1610377 1068767 1541087 2321129 3121738 3463297 2389912 549901
46344 549901 274468 1818241 2169219 -204308 -2282469 -1081807 1383931 1411133 -286544
46335 -286544 -71110 2343732 3687258 2820786 2128370 2758777 2697929 824339 -794654
46326 -794654 -425209 554627 441201 277419 1778067 3912862 4048622 1794730 -295362
46317 -295362 125420 2503062 4043543 2747837 -190955 -1347173 1001035 4468416
46309 4468416 5274409 2859565 136347 -604688 54802 725293 1183096 1296669 57176
46300 57176 -2697394 -4934721 -4497017 -1845985 554586 1071258 -8488 -1734249 -3542489
46291 -3542489 -4945637 -5148628 -3650876 -1183833 457268 170542 -862342 -322426 2063146
46282 2063146 3757378 2869258 937173 443488 840894 -256011 -2572876 -3166055 -1256982
46273 -1256982 261765 -565533 -1626345 -201353 2803826 4404994 3571439 1373785
46265 1373785 -1473371 -4649614 -6673739 -5942555 -3255700 -1251202 -1200968 -1975857 -2181625
46256 -2181625 -1688876 -844236 307131 1467521 1852652 1144449 71070 -419732 -275784
46247 -275784 -385386 -1533968 -3299577 -4240004 -3659115 -2839039 -3449319 -4869789 -4677353
46238 -4677353 -2148922 527334 1386027 1178872 1468619 2123549 2498681 3277942 4713435
46229 4713435 4594113 1123035 -3059486 -3389663 -23186 1805556 -786966 -4137330
46221 -4137330 -3570731 -218143 1050440 -1122168 -3223270 -2654462 -1199408 -1317652 -1839678
46212 -1839678 37638 3873713 6063235 4781831 2205453 918713 494040 -601775
46204 -601775 -1657491 -931525 860684 1349044 566993 956340 2827432 3259498 929439
46195 929439 -1316791 -964660 183739 -457100 -1493670 -261024 1751235 914789 -2031090
46186 -2031090 -2605831 -5288 1238994 -1435646 -4388848 -3542388 -460986 874433
46178 874433 518447 1696324 4957159 7167400 6190012 3447459 1426211 964576 1547287
46169 1547287 2460521 2967935 2560377 1609751 1072319 1305087 1655212 1205971 -367253
46160 -367253 -2400186 -3574057 -3298550 -2785118 -3597917 -5068954 -4976452 -3305118 -2891748
46151 -2891748 -4895378 -6249141 -4203590 -1193694 -1569030 -4741130 -5823827 -3114120
46143 -3114120 -645013 -1921548 -4803769 -5052444 -2410431 -316286 -900313 -2866829
46135 -2866829 -3941636 -3431821 -2252984 -1637074 -1958222 -2320583 -1598037 -132528 443979
46126 443979 -445567 -1258309 -477428 1172917 1746933 533160 -1596518 -3560439 -4606716
46117 -4606716 -4148094 -2431663 -979259 -1013445 -1688614 -1221961 389934 1297421 612816
46108 612816 -203795 591054 2708365 4374244 4426069 3114595 1414954 335999 539856
46099 539856 1806025 2883408 2499902 704967 -1114049 -1675483 -1029822 -236106 -64280
46090 -64280 -332755 -511793 -552469 -699549 -648377 426482 2640275 4679627 4993990 3641555
46080 3641555 2310584 2294003 2954884 2616806 658696 -1808116 -3240757 -3060445 -1702337
46071 -1702337 -16775 950025 324339 -1528994 -2770457 -2128259 -963561 -1704224 -4045000
46062 -4045000 -4796141 -2523900 -48554 -188505 -1036027 1144112 5336321 6366157 2616410
46053 2616410 -1149679 -690912 1757593 1606830 -930174 -1893176 -109572 1744331 2171246
46044 2171246 2656087 3864418 3901534 1734454 -804996 -2028921 -2670346 -3518954 -3518346
46035 -3518346 -2280038 -1888554 -3556960 -4698168 -2510093 1126078 1885272 -713851
46027 -713851 -2926232 -2545473 -1373112 -1319632 -1583756 -1144966 -993309 -1867697 -2247935
46018 -2247935 -925614 364100 -583352 -2758353 -3381508 -2109823 -1113297 -1411079 -1792209
46009 -1792209 -1363883 -625244 280288 1869444 3287697 2543804 -115492 -1493153 263863
46000 263863 2763245 2779219 767578 -501354 -486183 -1079199 -2710908 -3286066 -1616527
45991 -1616527 465814 499274 -1704758 -4474170 -6307351 -6641331 -5632637 -3989578 -2420296
45982 -2420296 -981737 330934 649698 -680093 -2235625 -1750734 415975 1275221 -435104
45973 -435104 -2190089 -1464261 602452 1412381 965690 1142605 2201382 2813163 2899609
45964 2899609 3521314 4068798 2514149 -927884 -2969109 -1256756 2608884 5189367
45956 5189367 4941822 2891948 856546 27770 426436 915048 365819 -797540 -1021960
45947 -1021960 195601 1628625 2191473 2369339 3214475 4807469 6211122 6275970 4368091
45938 4368091 1141040 -1500771 -2285443 -2162981 -2605866 -2810638 -844459 2433974 3453633
45929 3453633 881097 -2198289 -2584353 -1011909 21008 175827 534303 778364 4345
45920 4345 -795670 60518 1918783 2634948 1948258 1349442 957931 -561990 -2886336
45911 -2886336 -3782603 -2610288 -1391270 -1448493 -1469554 -183636 1287028 1343303 329602
45902 329602 -630227 -1592697 -2766579 -2969838 -1303194 570686 170492 -2110968 -3308386
45893 -3308386 -2032771 -218815 -126426 -1517237 -2903421 -3948536 -4958973 -5099251 -3250998
45884 -3250998 -389360 1064689 697770 806361 2575215 3667932 1729159 -1308362
45876 -1308362 -1488551 1084371 1931043 -1221456 -4902215 -4925800 -2178476 -492069 -674194
45867 -674194 -217208 1743401 2801976 1178287 -1631215 -3219026 -3205224 -2666233 -2253469
45858 -2253469 -2040804 -2082127 -2175880 -1958613 -1792904 -2555718 -4091700 -5004238 -4450587 -2999507
45848 -2999507 -1374165 210819 1012312 -121469 -2603757 -3837949 -2539577 -818638
45840 -818638 -1173227 -2693937 -2535916 -480874 581868 -968458 -2967249 -2520524 -44051
45831 -44051 1372199 89698 -2082596 -2276541 55845 2847966 4029427 3514626 2502834
45822 2502834 1727108 1058770 270317 -674464 -1806619 -2782714 -2574635 -547892 2160624
45813 2160624 3346957 2000822 -896281 -3735102 -5436879 -5377753 -3561122 -1197958
45805 -1197958 118278 234949 354292 932232 1076218 394550 -198857 -199830 -361344 -947944
45795 -947944 -913832 -308 209031 -1041514 -1768999 -216464 1742648 876147 -2555308
45786 -2555308 -5091708 -4993518 -3951913 -3486882 -2552090 -88630 2280874 2103549 -434362
45777 -434362 -2617649 -2447346 -593647 844290 749632 -56711 -71079 915409 1601726
45768 1601726 1221878 964201 2311828 4546570 5387255 4018416 1982313 899034 832954
45759 832954 1300129 2254591 3265213 3194485 1859494 901145 1770138 3711070 4971736
45750 4971736 5228822 5401108 5627501 5098466 3850608 3131642 3526380 3980968 3407762
45741 3407762 2327095 2014659 2594806 2981792 2524964 1722072 1135812 548163 -245916
45732 -245916 -596446 65766 899255 540007 -706048 -1043832 -5550 589532 -373091
45723 -373091 -996691 918030 3957339 4573214 2261009 338091 886001 1867466 956558
45714 956558 -381989 638909 3242871 3920795 1685394 -626488 -752593 62802 -283861
45705 -283861 -1410263 -1536667 -549087 -44569 -795306 -1719568 -1431389 123986 1650654
45696 1650654 1638569 -203695 -2185568 -1835948 1383821 4993502 5963586 3944974 1176299
45687 1176299 -410572 -768326 -573178 -23434 676738 890932 509528 513853 1661114
45678 1661114 3202450 3829637 3381857 2567085 1440728 -410090 -2187071 -2090159 -1654
45669 -1654 1474401 126065 -2568294 -3152953 -1067359 374347 -1260315 -3821657 -3598824
45660 -3598824 -773505 855073 -545256 -2457690 -2234005 -963943 -1010357 -1786150 -990960
45651 -990960 1054063 1719713 612831 318998 1758324 2162688 -483982 -3832701 -4518333
45642 -4518333 -2967310 -1985709 -2126200 -1660891 -284189 451840 159602 -57785 -361157
45633 -361157 -2023683 -4037793 -3304599 512171 3553552 3112343 1489611 1977604 3579247
45624 3579247 3114942 900290 398991 2599971 4470573 3720394 2017781 2077116 3839427
45615 3839427 5208500 5008147 3561864 1422318 -825153 -2066893 -1474368 265298
45607 265298 1584515 1869213 1812782 2014226 2167544 1871123 1445408 1465514 1959114 2542405
45597 2542405 3004357 3215312 2687846 953322 -1494252 -3259171 -3421471 -2451708 -1414059
45588 -1414059 -719241 -197783 -18496 -746353 -2476835 -4466045 -5679237 -5413094 -3662989
45579 -3662989 -1408333 -201339 -679749 -1617198 -1200995 882195 3364627 5056865 5558528
45570 5558528 4645507 2379182 -132521 -1522899 -1896911 -2306249 -2394188 -580695 2723354
45561 2723354 4298740 2052701 -1917592 -4040641 -3808640 -3616771 -4901615 -6510131
45553 -6510131 -6656038 -4792027 -1639542 1247369 2159276 822639 -918005 -1275214 -920860
45544 -920860 -1650103 -3058679 -2617899 635993 4361420 5669548 4307090 2260129 1178760
45535 1178760 1066202 948616 93431 -1342342 -2633503 -3412374 -3907213 -4032816 -3051786
45526 -3051786 -964771 532700 -186844 -2290068 -3188533 -1588390 1264779 3221743
45518 3221743 2994936 617481 -2455461 -3868437 -2487391 17076 1139117 871925
45510 871925 1224692 2490771 2450724 58625 -2455936 -2677684 -1329210 -644319 -833277
45501 -833277 -411249 620362 296776 -2220190 -4799753 -4586227 -1389908 1996680 2830265
45492 2830265 1292742 -24942 562104 1777375 1339387 -609237 -1426657 506103 3578257
45483 3578257 4984933 3905866 1738129 10207 -794458 -827771 -529520 -679493 -1796290
45474 -1796290 -3224406 -3533149 -2201799 -433438 156170 -613014 -1477389 -1496885 -1110066
45465 -1110066 -1051634 -974529 -175483 653659 -137900 -2621961 -4592751 -4258546 -2506533
45456 -2506533 -1459308 -1793839 -2713893 -3646098 -4450319 -4591640 -3701029 -2609575 -2394305
45447 -2394305 -2741517 -2617855 -2072043 -1850795 -1776623 -1267539 -949877 -1694085 -2400870 -1128746
45437 -1128746 1530503 2689536 1257468 -563238 -646407 379444 837385 444083 -136116
45428 -136116 -614263 -861415 -615230 -146377 -21321 111613 966229 1740414 861874 -1095481
45418 -1095481 -1700640 -504401 145730 -775687 -941194 1460758 4471776 5291486 4375484
45409 4375484 4154533 5209126 6028333 5447110 3477568 884573 -622744 582924 3319234
45400 3319234 3938778 1245478 -1236280 -244586 2386037 2909662 1505111 1172008 2280682
45391 2280682 2355570 742210 -479673 -420815 -727933 -2408717 -4185700 -4670525 -3848472
45382 -3848472 -2032778 492896 2621624 3284005 3120973 3303637 3149312 1283339 -1378988
45373 -1378988 -2585276 -2273763 -2168562 -2251177 -1095332 385888 -462451 -3006626 -2976372
45364 -2976372 1276555 5786278 6309592 3607154 1139266 131284 -531537 -1430278 -2082245
45355 -2082245 -2141972 -1519317 -433319 -198586 -2105694 -4658313 -4386317 -742545 2485190
45346 2485190 2453816 1173337 1700685 3097853 2510062 425452 120277 2519237 4888292
45337 4888292 4686314 2229933 -532306 -1885685 -1122127 702550 1034704 -1365692 -4223434
45328 -4223434 -4220073 -1359138 1126104 1133952 -89009 -437638 146482 79009 -1560272 -3796382
45318 -3796382 -4573502 -2865196 -128012 1024485 -86291 -1533743 -1671773 -1020395 -295903
45309 -295903 1299550 3854640 4771060 1873868 -2648345 -4472964 -2778113 -667532
45301 -667532 -240907 -436031 -81148 85835 -586350 -1352006 -1914812 -3203048 -5082568
45292 -5082568 -5583486 -3890305 -2078321 -2207055 -3387599 -3461291 -2151816 -788353 -78990
45283 -78990 73193 -542337 -1993521 -3215354 -2972438 -1466255 88372 960479 1062272
45274 1062272 401152 -586875 -965803 -594462 -532678 -1033045 -389186 2530815 5673285
45265 5673285 5863297 2983337 17766 -831857 -17889 1272152 2639038 3630922 3423463
45256 3423463 2145241 946261 120040 -1229389 -3018230 -3534527 -2026459 -228937
45248 -228937 97792 -294653 300597 1604285 1807760 314762 -1664493 -2871714 -2915052
45239 -2915052 -1883889 -536583 -429065 -2198531 -3977013 -3265471 -347383 1946327
45231 1946327 2005644 1100785 902477 1349216 1843016 2672849 3858376 4027022 2106988
45222 2106988 -724714 -2321323 -2244517 -1782798 -1697525 -1374684 -238177 1125820 1552873
45213 1552873 469775 -1525828 -2936917 -2577276 -947401 55861 -732528 -2482359
45205 -2482359 -3703285 -4011422 -3827036 -3223920 -2179824 -1307661 -1209323 -1635441 -2246395
45196 -2246395 -3365128 -4760273 -4769076 -2486831 -549 -110520 -2184640 -2888469 -1195550
45187 -1195550 186822 -708004 -2067285 -1609652 -651914 -2205390 -6135235 -8885073 -7926866
45178 -7926866 -4410013 -1096606 656258 1212219 1156108 449985 -1161943 -3357752 -4980932
45169 -4980932 -4850442 -3040633 -975401 115606 379317 498529 327509 -620373 -1654663
45160 -1654663 -1252660 701014 2228701 1771648 594105 1238632 3676758 4698498 2050888
45151 2050888 -2179219 -4013647 -2684414 -1085657 -1138692 -1353520 -107589 1235192 738297
45142 738297 -472614 56450 1756468 1656353 -811637 -2829827 -2532695 -1319592 -841240
45133 -841240 -557350 158498 109321 -1409765 -2485986 -1250984 777629 560152 -2093948
45124 -2093948 -4395715 -4414167 -2881901 -1228423 249873 1901144 3783083 5607024
45116 5607024 6777339 6472192 4480353 1859157 26768 -665564 -909107 -1343491 -2048939
45107 -2048939 -2710579 -2804452 -2113390 -1328442 -1324521 -1648676 -993197 504355 1156582 578357
45097 578357 533520 1759402 2361992 1326980 1172368 4153106 7742084 7586138 3966823
45088 3966823 1414678 2084572 3446606 3170187 2502859 3251729 4535388 4646878 3961722
45079 3961722 3895111 4391969 4209239 2739232 321251 -2350851 -4243482 -4439205 -3360749
45070 -3360749 -2521171 -2510233 -2479407 -2138860 -2683902 -4800355 -7086546 -7505414 -5505978
45061 -5505978 -2162907 693249 1253379 -721889 -2688900 -1560171 2153916 4530236
45053 4530236 3496715 1536183 1614005 2800297 2254982 -224623 -2252828 -2334948 -889727
45044 -889727 1328796 3475001 3979169 2126041 -35946 325982 2941114 4571677 3141344
45035 3141344 -127844 -2834145 -3831900 -3230306 -1613926 157128 1460491 2478660
45027 2478660 3398924 3382877 1654149 -688155 -1574751 -686801 279595 82403 -975375
45018 -975375 -2477274 -4476830 -6132787 -5649718 -2654162 663971 1838000 709477
45010 709477 -980673 -1732802 -1345317 -551650 -231525 -617481 -1184229 -1748682 -3096501
45001 -3096501 -5314210 -6170957 -3349212 1628410 4252415 2768792 627798 1499244
44993 1499244 4026776 4129892 1183055 -1218065 -576331 1308338 1482226 78283 -311133
44984 -311133 1435548 3397677 3090415 381352 -2639237 -4073397 -3676058 -2138997 -112453
44975 -112453 1519386 1493854 -436969 -2513065 -2772861 -1604214 -994528 -1405178 -1332967
44966 -1332967 -314751 -167194 -2080048 -4319672 -4463891 -2653226 -970988 -537874 -807478
44957 -807478 -976991 -568200 724989 2299406 2427760 283519 -2465310 -3588085 -3081919
44948 -3081919 -2414657 -1882533 -780126 523357 1090443 1592713 3367288 5399524 5116982
44939 5116982 2598643 1075037 2318529 4310963 4739333 4057628 3399574 2154086 -76251
44930 -76251 -1429636 -490895 722297 -474783 -2913492 -3068877 -482859 1602088 1129720
44921 1129720 -335645 -744561 -396466 -452448 -784084 -731040 -487832 -482202 -533848 -605082
44911 -605082 -1238011 -2335465 -2697277 -1788129 -832402 -984971 -1425597 -621623 1259630
44902 1259630 2602338 2533916 1552549 334075 -721042 -951334 83727 1466672 1679699
44893 1679699 850951 828705 2348385 3556642 2562042 297538 -833207 -427902 -115550
44884 -115550 -295405 606785 2780009 3464796 747100 -2957763 -3877814 -2165478 -1095002
44875 -1095002 -1546623 -1056585 1046972 1591684 -1254776 -4121453 -2875451 1404678 4290111
44866 4290111 4143076 2748731 1047467 -1497414 -3459067 -1842245 2920419 6136388
44858 6136388 4840935 1588241 280855 986051 1396158 1193959 1902124 3523131 4184263
44849 4184263 2906607 669202 -1191604 -2086008 -1884199 -938366 -295722 -791756 -2038373
44840 -2038373 -3008796 -3154525 -2328339 -484957 1638589 2501533 1548362 176758 -176264
44831 -176264 73421 -74933 -212649 474969 1120069 133837 -2143210 -3696625 -3641988
44822 -3641988 -3025430 -2812743 -2729252 -2283317 -1528673 -621876 203054 275562 -652720 -1369923
44812 -1369923 -458183 1496935 2431660 1520065 -115822 -1319517 -1808989 -1154177 1103019
44803 1103019 3747153 4247064 1844575 -1175757 -2326122 -1782264 -1396763 -1993984 -2870022
44794 -2870022 -3252727 -3103352 -2775228 -2646770 -2910112 -3355734 -3661292 -3961492 -4548162
44785 -4548162 -5006891 -4508324 -3073664 -1599972 -463261 803828 2125884 2382935 945437
44776 945437 -1216686 -2597508 -2589821 -1437848 339585 1940790 2556916 2285248 2123300
44767 2123300 2630620 3283165 3439055 3087971 2326421 1039335 -490819 -1555058 -1945452
44758 -1945452 -2054798 -1974112 -1658659 -1974415 -3870330 -6155796 -6082749 -3021089 312813
44749 312813 1402871 840712 359524 -16642 -942285 -1648738 -1261242 -924741 -2068756
44740 -2068756 -3481589 -2818321 -511835 585618 -608304 -2227227 -2648794 -2217276 -1297401
44731 -1297401 641246 2923426 3193449 698676 -1922068 -1982582 -368167 114448 -1184375
44722 -1184375 -2454620 -2525904 -2075897 -1767699 -1140560 92381 1076444 956419 135162
44713 135162 -336828 -145544 90276 -249018 -1066796 -1644981 -1239563 261934 2074475
44704 2074475 3010235 2437761 806614 -756151 -1345428 -928627 -342149 -597799 -1877750
44695 -1877750 -3139667 -3056022 -1538890 30296 434006 58121 -6569 -27738 -1574311
44686 -1574311 -4928167 -7712740 -7317770 -4201919 -1490624 -1335006 -2849839 -3796855 -3075322
44677 -3075322 -1106842 1054003 2215788 1643147 135828 -209162 1616867 3886608
44669 3886608 3988415 1634554 -920719 -1790863 -1399865 -1240333 -1745041 -2093380 -1593289
44660 -1593289 -514302 413340 856460 1006371 981677 456024 -821764 -2312457 -3013245
44651 -3013245 -2582911 -1665429 -1015775 -889833 -1367138 -2390975 -3166619 -2585872 -937306
44642 -937306 -107097 -1014402 -1863141 -467998 2371998 3683275 2320251 223510 -629349
44633 -629349 -636248 -1090632 -1892428 -2025167 -1302588 -353138 514841 1290516 1567131 996503
44623 996503 202323 213296 1032582 1631389 1386178 776999 587030 1011469 1563745 1316886
44613 1316886 -589440 -3875496 -6582506 -6569596 -3852262 -688946 912045 926770 319625
44604 319625 -444802 -1091236 -910346 227935 1034105 476639 -326055 303931 1562726
44595 1562726 1052126 -1157261 -2073907 -392309 1201572 206508 -1741267 -1818511 -825324
44586 -825324 -1433898 -2880373 -1686707 2314338 4981289 3953336 1729142 849787 -136733
44577 -136733 -3058170 -5720958 -4902865 -1693720 51274 -548974 -970975 -43104 611584
44568 611584 99790 -156378 849587 2119099 2635816 2639342 2261473 1165281 142806
44559 142806 660613 2076947 1886320 -210481 -1166319 893971 3491594 3190015 154148
44550 154148 -2893453 -4535310 -5057924 -4408459 -2480647 -717267 -872580 -2377942 -2988035
44541 -2988035 -1810361 161418 2096567 3812505 4481305 3137287 644464 -927012
44533 -927012 -1176424 -1602816 -2615031 -2535629 -425769 2109472 3089921 2487810 1291171
44524 1291171 -78564 -1076168 -417905 2015162 3863800 2904859 268180 -921493 332606
44515 332606 2150020 2970910 3286030 3718152 3482111 1946477 260694 -36283 774087
44506 774087 1117945 442203 -244644 -55363 622822 828658 88057 -1401093 -2901360
44497 -2901360 -3204634 -1410377 1712792 3733534 2859957 80534 -1911945 -1982860 -1640105
44488 -1640105 -2383077 -3235087 -2257963 253592 2021057 2241733 2674655 4410910 5608148
44479 5608148 4214036 1423720 37707 223252 -315513 -2060784 -2631081 -864097 951360
44470 951360 673906 -287939 413874 1875358 1333083 -1161288 -2551326 -1246874 986452
44461 986452 2105494 2284442 2449024 2494128 2212404 2263375 2816310 2571105 585939 -1863802
44451 -1863802 -2590375 -1043622 1414413 3075262 2859869 631480 -2357310 -4037167
44443 -4037167 -3612398 -2451767 -1982555 -1657833 -350765 1143202 897418 -1112469 -2660896
44434 -2660896 -2260393 -890766 -127607 75960 690013 1551123 1372241 -110554 -1065043
44425 -1065043 434497 3492287 4693947 2226451 -1216903 -1433430 1590213 3340419
44417 3340419 942027 -2854836 -3779058 -1922832 -516525 -266835 1096647 3613007
44409 3613007 3727034 -30433 -3478657 -2027099 2557786 4154219 379873 -4680510
44401 -4680510 -6214096 -4118936 -1415948 221237 1039754 792959 -1383443 -4673413
44393 -4673413 -6523918 -5668539 -3519748 -1735387 -158595 1526136 1880150 -325018
44385 -325018 -3333473 -4264225 -3384800 -3690773 -5951073 -7212056 -5400273 -2573335 -1627503
44376 -1627503 -2098451 -1713031 -365771 286893 145285 662098 1870685 2114110 938722
44367 938722 -3981 582050 2015351 2866645 2421733 798900 -1073901 -1707899 -679295
44358 -679295 248174 -831150 -3160121 -4352771 -3869874 -3323569 -3434760 -3091105 -1812240
44349 -1812240 -869547 -1205296 -2102387 -2564541 -2314220 -1018195 1559938 4139220 4633149
44340 4633149 2908489 1003009 189021 -115204 -189668 668079 1951742 1783393 63390
44331 63390 -850705 67152 721608 -507469 -2031572 -1793511 -225747 1451928 3223310
44322 3223310 4441486 3016125 -779265 -2720315 -392928 2268616 536357 -3400126
44314 -3400126 -3563090 324005 2375072 -306952 -3785623 -4044238 -2432902 -1917005 -2135197
44305 -2135197 -1314830 371 334627 212469 828971 1494410 1054847 427171 1124936
44296 1124936 2393673 2376319 1306554 998325 1629719 1540205 182502 -1057037 -1304425
44287 -1304425 -1372663 -1876556 -2022381 -1202864 -287341 -191158 -339906 174588 848034 698635
44277 698635 370060 1453410 3611960 4282800 2127389 -785376 -1656987 -644757 -21178
44268 -21178 -414829 -285800 796122 954471 -831539 -2523774 -1684924 1142812 3486033
44259 3486033 4188713 3732443 2297206 -266591 -2909397 -3974791 -3447268 -2913362 -3206064
44250 -3206064 -3697023 -3970943 -4448757 -5048860 -4916688 -4000337 -3388971 -3504198 -3374653
44241 -3374653 -2397163 -1496752 -1666301 -2383000 -2323558 -906830 1455341 3858222 5178290
44232 5178290 4730506 3193827 2069264 1765772 1157029 -442334 -1953147 -2064939 -1213403
44223 -1213403 -889486 -1413049 -1546817 -420875 1011602 997845 -706210 -2153782 -1388672
44214 -1388672 935474 2186936 1318761 402548 1512255 3442235 3466288 1522797 181080
44205 181080 541561 808992 -358972 -1535466 -951006 639638 1235241 531842 -42001
44196 -42001 482179 1723022 2775948 2942517 2123393 1217242 1460643 2707898 3265019
44187 3265019 2242837 1034968 1319630 2521107 2705961 1429965 133441 -167597 -142550
44178 -142550 -819796 -2084885 -2990183 -2897698 -1841851 -139611 1866864 3696846 4740888
44169 4740888 4739706 4212371 3964749 4059975 3877780 3414834 3545961 4348729 4390310 2928241
44159 2928241 1580207 1902877 2384355 487382 -2875471 -4158094 -2719337 -1969738 -3727681
44150 -3727681 -4988365 -2746240 879081 1603488 -792389 -2665642 -2014004 -380119
44142 -380119 641331 1651749 3409575 4897973 4686770 2949205 1170238 507591 925067
44133 925067 1528005 1581182 1337779 1545092 2071829 1960983 1213048 1166537 2188613 2394886
44123 2394886 151965 -3178478 -4644752 -3232629 -599590 1085176 785744 -1089687
44115 -1089687 -2652629 -1663780 1866790 5083923 5668605 4629133 4089492 3810522 2285610
44106 2285610 79681 -800630 -234074 214006 459883 1798481 3545050 2977724 -490257
44097 -490257 -3754347 -3856720 -1399461 927810 1595378 1090960 757933 1351751 1988786
44088 1988786 930506 -1530299 -2309670 220967 2845932 1740358 -1193878 -836192
44080 -836192 2636662 3284285 -1290762 -5823328 -5409261 -2532520 -1925958 -2597047 -286137
44071 -286137 4637986 7266143 5307250 1468324 -1240150 -2625567 -3484564 -4041436 -4706381
44062 -4706381 -5695491 -5700997 -3484313 -743768 -573448 -2843024 -3995615 -2085008 701036
44053 701036 1571466 794225 415383 1064122 1547936 722451 -1248491 -3028526 -3216205
44044 -3216205 -1874860 -765955 -1277124 -2646615 -3315135 -3197725 -3021843 -2317659 -300158
44035 -300158 1795781 1866980 397931 132114 1945852 3617845 3303454 1703609 -2855
44026 -2855 -1770032 -3119097 -2610615 -520623 282993 -1894829 -4817699 -5313333 -3370535
44017 -3370535 -1188525 334643 1819586 3198485 3670377 3278711 2522632 1006419 -1520856
44008 -1520856 -3399987 -2615832 98452 1946866 1937329 1873991 3111465 4500160 4447861
43999 4447861 3153384 1556818 -406001 -2919570 -4672078 -3980545 -1362665 620093
43991 620093 499946 -321467 305310 2255181 3406972 2626106 1042920 -14332 -897653
43982 -897653 -2282598 -3070212 -1566168 1527766 3354713 2581060 1014971 753875 1474897
43973 1474897 1852058 2132818 3440724 5332888 5939887 4374602 1605877 -904962 -2201786
43964 -2201786 -1721389 380301 2643327 3190816 1481368 -1488268 -4492500 -6628072
43956 -6628072 -6888425 -4667933 -1041383 1590378 1712203 -39472 -2000278 -3148950
43948 -3148950 -3467165 -3389501 -3295880 -3181225 -2714936 -1914592 -1500072 -1980297 -2633100 -2179739
43938 -2179739 -407091 1577958 2607471 2304865 932096 -760289 -1665182 -1157302 219228
43929 219228 1489193 2304236 2572843 1784185 -58761 -1461374 -983240 620604 1506183
43920 1506183 1605431 2266251 3153839 2138062 -1053222 -3594968 -3255548 -1213949 229708
43911 229708 742278 1064039 955719 176676 -42567 1103920 1819831 12757 -3018470
43902 -3018470 -3967177 -2283547 -709369 -804400 -829535 809548 2460918 1453445 -1919635
43893 -1919635 -4473972 -3759049 -406939 2928099 4130300 3177218 1673927 1002353 1039082
43884 1039082 852559 180449 -520838 -1136787 -1906868 -2411971 -1736279 62577 1644954
43875 1644954 1910025 990597 -444955 -1840550 -2428470 -1473123 563093 2138037 2539166
43866 2539166 2651253 3177876 3324294 2295577 1018141 958758 1879394 2196414 1263198
43857 1263198 -16268 -760168 -1147548 -1808266 -3008058 -4404230 -5006183 -3850404 -1585852
43848 -1585852 -651710 -2422365 -4769855 -4503891 -2092708 -1385145 -3920906 -6322116 -5270923
43839 -5270923 -2661282 -2665064 -5029614 -5256306 -1729950 1309423 -87134 -3549188 -3751136
43830 -3751136 -171874 2289380 464793 -2847637 -3252480 -750662 957814 -192281
43822 -192281 -2458957 -3216000 -2009278 -260012 670515 481139 -115181 95235 1731616
43813 1731616 3857397 4673958 3490464 1495770 356869 639511 1826374 3141335
43805 3141335 3884278 3565362 2270645 527494 -1444383 -3694284 -5475735 -5296666 -2907483
43796 -2907483 -332825 331323 -426474 -455729 886693 2170075 2518567 2964992 4490423
43787 4490423 6249055 6823431 6167074 5211080 4418167 3838954 3810349 4324021 4266475 2600455
43777 2600455 -40786 -2100887 -2998400 -3037946 -2070863 -22699 1593864 863206 -1626686
43768 -1626686 -3220753 -3024336 -2952152 -4051849 -4401856 -2458273 -128741 25021 -1132275
43759 -1132275 -927665 737894 1867745 2370492 3896031 5825956 5456711 3021171 2514702
43750 2514702 5627668 8442236 6934367 2880168 929643 1880410 2595445 1438969
43742 1438969 -48677 -656254 -1080681 -1495602 -717325 1104413 1568983 -700745 -3707312
43733 -3707312 -4472557 -2544676 61216 1466173 1506291 1381011 2293785 3887094 4087450
43724 4087450 1572162 -1812276 -2748081 -659235 1712883 2329469 2167916 2566302 2690658
43715 2690658 1478581 156910 471096 1641353 1498667 -58002 -1130721 -1100811 -1509564
43706 -1509564 -3308497 -5158092 -5257128 -3622018 -1783066 -914816 -800094 -403523 598266
43697 598266 934932 -802997 -3526581 -3934659 -667233 3217451 3844135 1535586 -202612
43688 -202612 -8783 85005 -1141209 -1995160 -1241321 -594827 -1747865 -3199393 -2636939
43679 -2636939 -905354 -706256 -2069126 -2041927 893595 4544631 5939114 4780291 3051217
43670 3051217 2425932 3002693 3790698 3659292 2285395 643584 129632 947842 1911313
43661 1911313 2024879 1559529 1247167 1174202 1032615 907776 1185184 1963420 2991465
43652 2991465 3894107 4133425 3188906 1282860 -377316 -610921 585956 2165983 3004142
43643 3004142 2473688 603632 -1694745 -2956574 -2559817 -1649657 -1820272 -2916400 -3173738
43634 -3173738 -1831116 -494485 -1042453 -2891241 -3523088 -1637434 1269188 2753583
43626 2753583 2057564 397012 -797374 -1217464 -1447645 -2058518 -3037626 -3707177 -3127166
43617 -3127166 -1005310 1637181 3163553 3015224 2321419 2359519 2780671 2153252 224969
43608 224969 -1321913 -917432 709984 1221215 -525976 -3006505 -3630831 -1562445 1333116
43599 1333116 2444171 1262583 -59146 628918 2609766 3056943 774821 -2058257
43591 -2058257 -2681820 -1191133 136834 152772 -332219 -764038 -1789520 -3421153 -4124058
43582 -4124058 -2876486 -810421 410876 739235 968343 858900 -300387 -1865663 -2327180
43573 -2327180 -1480931 -555579 -156323 406968 1522427 2463049 2634946 2378251 1970165
43564 1970165 998336 -586159 -1846219 -2110426 -1960248 -2095924 -2057127 -1178069 -189233
43555 -189233 -478929 -1838162 -2271318 -548124 1963525 2811828 1436937 -212933 -191233
43546 -191233 1036703 1371734 -21687 -1609383 -1651373 -564739 -212958 -1316772 -2664659
43537 -2664659 -2848597 -1803423 -452066 365483 362620 -173286 -682309 -1114697 -2155401
43528 -2155401 -3891337 -4731632 -3099281 -97378 1318111 251642 -959188 -402888
43520 -402888 560692 -242638 -2184370 -2991100 -2531983 -2815569 -4383335 -5309426 -4355607
43511 -4355607 -2806219 -2042847 -1268807 656969 2508417 1966996 -818424 -2973377 -2545842
43502 -2545842 -815697 -185312 -1015404 -1799988 -1784116 -1826479 -2552527 -3122826 -2654041 -1856368
43492 -1856368 -2081388 -3228291 -3820733 -3028646 -1431838 245982 1823857 2708340 1668143
43483 1668143 -1419864 -4499298 -5203241 -3493716 -1605322 -1580519 -3470066 -5639018 -6178143
43474 -6178143 -4267711 -851059 2021152 2866313 1796244 15443 -1117169 -593812
43466 -593812 1579393 3801151 4041208 2256341 628460 700624 1479525 1295183 145197
43457 145197 -1118367 -2461026 -3729185 -3462412 -1051903 971702 -268781 -3398602
43449 -3398602 -4223840 -1922416 -329849 -2020078 -4516702 -4402854 -2338200 -1269613
43441 -1269613 -1680395 -1656507 -555294 334301 411689 511049 999843 1189609 777500 201560
43431 201560 -409944 -1073719 -1013841 257663 1141307 -535225 -3961905 -5605344 -3758979
43422 -3758979 -744331 435434 -321364 -1270079 -1640963 -1715532 -1469991 -948418 -985037
43413 -985037 -1843176 -2044195 -336289 1994034 2726411 1917017 1313622 1118135 25526
43404 25526 -1454876 -729986 2726203 5500062 4262307 -90836 -4000935 -5462397 -4925482
43395 -4925482 -3337099 -1398661 -53165 247573 406830 1233451 1651630 88339 -2744228
43386 -2744228 -4309795 -3446222 -1504055 -368446 -866517 -2926920 -5595075 -6980531
43378 -6980531 -5956492 -3856227 -2714885 -2159704 -366584 2100186 2444174 202929
43370 202929 -1525786 -733260 665967 510637 -11231 1022692 2557453 2510831 1503665
43361 1503665 1342900 1272368 -629707 -3209804 -3278359 -789461 799957 -93991 -1047967
43352 -1047967 -51757 1305721 1019398 273862 1296459 3404649 3944314 2389495 1012118
43343 1012118 1403296 2286268 1500698 -974818 -2933001 -2614648 -734907 537107 219901
43334 219901 -727133 -1361227 -2191759 -3777995 -5024151 -4391043 -2212642 -209665 960411
43325 960411 1998224 2988567 2996740 1910625 1003527 1109873 1533237 1196712 -235893
43316 -235893 -2537905 -4960909 -6035990 -4775637 -2227306 -426577 155816 487010 547308
43307 547308 -628165 -2288060 -2118080 -33415 892333 -1045104 -3104431 -1819346 1904500
43298 1904500 3937843 2303198 -902671 -2721734 -2609084 -2231668 -3059075 -4505518 -4418041
43289 -4418041 -1779566 1450670 2470659 1382307 855938 1950928 2851831 2518850 2609068
43280 2609068 4074200 4714527 2611830 -372981 -1383757 -853728 -909824 -1261327 -224369
43271 -224369 1416622 1388131 86924 -67806 865324 475221 -1199076 -1135786 1474953
43262 1474953 3473400 2746947 1400424 1843992 2929618 2538676 1371138 1302173 1939296
43253 1939296 1657885 604624 7403 -265501 -845973 -736230 1094601 2831430 1698386
43244 1698386 -1470523 -2689137 -287912 2947170 3952045 3018336 1941341 974767
43236 974767 -441445 -1668769 -1707861 -990107 -485040 68343 1189982 1783562 419263
43227 419263 -1944245 -2817134 -1750257 -782315 -1048376 -1325733 -662407 -30674 -141249
43218 -141249 116805 1449404 2504533 2355685 2491666 3922444 4462829 2136903 -520489
43209 -520489 315982 3258660 3202679 -576909 -2895575 -615956 2719491 2754914 559983
43200 559983 -394122 23621 -82885 -242070 1040892 2254056 712897 -2357471 -2869232
43191 -2869232 45906 2866045 2962291 1531151 527538 -116255 -1037590 -1772608 -1775811
43182 -1775811 -1268933 -360145 954574 1651945 601192 -1111904 -1045040 995515 2520770
43173 2520770 2036260 745112 -64808 -780433 -1661364 -1815847 -1234833 -1472989 -2886236
43164 -2886236 -3503559 -2277396 -1172516 -1998114 -3206322 -2285129 149205 1226469 -36423
43155 -36423 -1775072 -2059698 -758473 1071253 2048651 1046139 -1601268 -3699987 -3360540
43146 -3360540 -1376360 -257061 -1098640 -2576355 -2932412 -1851494 -260870 867645
43138 867645 1259634 1307541 1441424 1544108 1301459 1053569 1570704 2795136 3569306 2977456
43128 2977456 1397856 5459 -315006 349044 839916 5218 -1429402 -1121885 1412329
43119 1412329 3052275 1213509 -1601932 -965635 2440190 3477909 683049 -1403999
43111 -1403999 88673 1593466 -528849 -3510970 -2911436 -279042 -326962 -2588717 -2073064
43102 -2073064 2314483 5897172 5492258 3428054 2831077 3231668 2819005 1644007 573095
43093 573095 -315519 -724543 59832 1136502 303246 -2385130 -4014998 -3077940 -1550394
43084 -1550394 -1157668 -559137 1500944 2983101 1417597 -1961200 -3910817 -3627478 -2671978
43075 -2671978 -1646727 -35076 1294555 676991 -1055377 -794201 2424314 5517894
43067 5517894 5144966 1749523 -1540329 -2860084 -2861302 -2563602 -1726010 66844 1828547
43058 1828547 1946483 453873 -615919 312657 2402406 3703567 3625088 2986179 2318509
43049 2318509 1705308 1887988 3517579 5160464 4188224 419111 -2987228 -3276795 -1096868
43040 -1096868 1270241 2837668 3609905 3100771 1237227 -373936 -231847 656572 203626
43031 203626 -1323764 -1388162 1181856 4415069 5509994 3733235 743242 -1041141 -359681
43022 -359681 1730999 2751574 1635235 153224 455662 1975854 2472070 1612837 1313156
43013 1313156 2373254 3056342 1824294 -412007 -1909875 -2455202 -2859404 -3285448 -3348175
43004 -3348175 -2981989 -2097150 -321376 1741235 2120975 72846 -1769807 -97752 4247941
42995 4247941 6534852 4121310 126306 -600428 2196835 4229084 2690247 -330321
42987 -330321 -1360732 -304605 299851 -425200 -720560 434070 1406020 465429 -1529719
42978 -1529719 -2555341 -2340515 -2136535 -2289296 -1886651 -630669 633902 1378816 1912492
42969 1912492 2273358 2054586 1610751 1954603 2997370 3370562 2599293 1912183 2060012
42960 2060012 1952182 704126 -477365 -125128 982266 1108906 492900 754897 1769464
42951 1769464 1553557 -434692 -2134113 -1827964 -388217 473372 597496 750729 939692
42942 939692 858477 1082168 2209880 3324407 2821504 626652 -1631150 -2528958 -1859604
42933 -1859604 -31692 2169989 3269653 2077644 -564930 -2241376 -1693537 -21594
42925 -21594 1332116 2471147 3973657 5155810 4888994 3502739 2328341 1611329 468487
42916 468487 -966137 -1045748 923946 2993587 2620987 -135626 -2683579 -3066681 -2007954
42907 -2007954 -1498612 -2219237 -3082515 -2955079 -1935518 -717439 519092 1795442 2316859
42898 2316859 1017233 -1510533 -2853957 -1634613 313056 148482 -1971207 -3009071
42890 -3009071 -1458086 446351 70033 -1857912 -2651759 -1553501 89414 1823500
42882 1823500 4492747 7373281 7701295 4451371 493123 -915168 -354012 -814024 -2905536
42873 -2905536 -4000123 -2327013 304246 973929 -487947 -1468461 25411 3019750
42865 3019750 4828108 4091911 2075844 891160 969653 1044930 475180 303706 1404495
42856 1404495 2847881 3375033 3527996 4638977 6353041 7182847 7244916 8056983 9369680
42847 9369680 8912503 6349001 4733180 6009352 7440946 5444050 1385998 13482
42839 13482 2613897 5476550 5748709 5212226 6513586 8713615 9335605 8788552 9431638
42830 9431638 11073994 10816685 7741487 4720304 4232344 4804913 3684997 1396130 935091
42821 935091 2938171 4471817 3341527 1228694 953500 2297975 2694000 1174876 -759112
42812 -759112 -2059606 -3384253 -4791287 -4648809 -2409369 -514245 -1293610 -3166906 -2502689
42803 -2502689 1105519 4012944 3411586 779335 -607770 152554 1382575 1703080 1453601
42794 1453601 1403161 1263608 -16463 -2687628 -5213878 -5378671 -2859630 -140538 207368
42785 207368 -1175341 -1325109 826683 2920582 2508983 204944 -1682560 -2232703 -2120264
42776 -2120264 -1772125 -996611 68015 1074685 2160767 3326401 3707597 2824058 1893449
42767 1893449 2230148 2897755 2036387 281408 321662 2558391 3855091 2022474 -733956
42758 -733956 -987735 955137 1992451 1317699 1494409 3994482 6428756 5768865 2508473
42749 2508473 -267504 -865841 -32818 1402737 3627085 6192700 7301092 5934894
42741 5934894 3478999 1963476 1530521 925665 -118680 -459700 650604 2604193 4309971
42732 4309971 4985778 4183161 2213587 541491 469957 1333919 1342806 304849 -178388
42723 -178388 392041 333434 -1384832 -3132169 -3015714 -1767741 -1398878 -2155171 -2798461
42714 -2798461 -2953234 -2986454 -2279107 -118660 1952167 1367441 -1517887 -3276545 -2053207
42705 -2053207 4148 221234 -898527 -1303498 -978931 -1470366 -2650472 -2480196 -205780
42696 -205780 2154708 2292775 396562 -1365520 -1503876 -580140 -55549 -317665 -266949
42687 -266949 962462 2295234 1715879 -704195 -1977085 332837 4458416 6055930
42679 6055930 3688334 806614 1162371 3848666 4958474 3420065 2473728 4689157
42671 4689157 7997999 8574937 6078133 3535956 2684296 2204452 977739 405216 2012050
42662 2012050 4609015 5707777 4699702 2893203 1127140 -844902 -2844032 -3819423
42654 -3819423 -3198162 -1624239 -122910 809309 1318037 1924423 2911988 3651699 3266074
42645 3266074 2441030 3315186 6432386 9077973 8384017 5170943 2724442 2436957 2881688
42636 2881688 2775820 2313391 1476017 -340814 -2342543 -2378340 -73499 2022938 1619108
42627 1619108 -544745 -2140289 -2035950 -708258 725096 1023227 -221946 -1418558
42619 -1418558 -361097 2475438 3903407 2260407 -369997 -1458080 -1338727 -1429806 -1317386
42610 -1317386 -86238 1134563 829900 253607 1920993 5282789 6728811 4247945
42602 4247945 -113722 -2918017 -2756503 -702636 1095748 900435 -1299260 -3625612
42594 -3625612 -4214080 -3030788 -1105264 1066556 3026874 3422474 1604196 -635824
42586 -635824 -1186635 -794923 -1497743 -2471350 -867844 2953578 4849043 2990897 1009197
42577 1009197 2564264 5682509 5849522 2875574 811466 1596502 2695173 1907153 1185751
42568 1185751 3491980 7852190 10317316 9436769 8290798 10219967 14223614 16212117
42560 16212117 14139504 10080419 7081027 5785680 5164989 5024859 5945819 7349257
42552 7349257 7533524 5804362 3206516 966730 -562834 -1295732 -1132740 -678913 -968953
42543 -968953 -1957333 -2428068 -1929137 -1557843 -2059170 -2363023 -1204302 587252 767589
42534 767589 -1499383 -4492701 -5761211 -4564133 -2338049 -988467 -934469 -1052824 -511506
42525 -511506 61618 -190830 -727729 -377780 724053 1424232 1596069 2213174 3223539
42516 3223539 3209005 1782275 499232 364844 153154 -1333364 -2811589 -2270789 -321410
42507 -321410 309324 -1476142 -3702466 -4005608 -2411267 -788581 -413245 -878158 -1126303
42498 -1126303 -829852 -439246 -218333 63905 324371 -49371 -903585 -759595 1139222
42489 1139222 2998503 2554167 564602 -73473 1264324 2082233 1027948 171435 1517766
42480 1517766 3790087 4690982 4155529 3101499 1089339 -1991071 -3731716 -1989187
42472 -1989187 1350218 2734225 2156380 2422098 3853990 3887870 2149599 1554276 3087444
42463 3087444 3619069 1131547 -1397834 -278704 3344035 5416913 4653897 3109472
42455 3109472 2289120 1889599 1867659 2696483 3497486 2682854 960754 1191481 4262064
42446 4262064 7214368 6895230 3912653 1311574 368475 -347220 -1986140 -3458844 -3162573
42437 -3162573 -1312782 620067 2045527 3409901 4448104 3944953 1833876 141237
42429 141237 705108 2825096 4336104 4310754 3493455 2768846 2622478 3442043 4635904
42420 4635904 4056231 467607 -3662711 -4323261 -1120967 2321191 3662669 4526879 6527747
42411 6527747 7719930 5611689 1557368 -863521 -642812 262719 510734 593792 872116
42402 872116 1020482 1455081 2961866 4712744 4812408 3137565 1638666 1451229 1638200
42393 1638200 1259674 778627 743247 792926 689084 765818 725855 -359120 -2124193 -2713851
42383 -2713851 -1451680 -35875 49144 -346538 100317 801781 577274 143517 1134588
42374 1134588 3234318 4405061 3899545 3146427 3368712 4032054 4316247 4741239 6313549
42365 6313549 8859537 11229882 12827168 14052263 15258519 16043113 15915533 15114320 14118720
42356 14118720 12610683 9851399 6303241 3850976 3644145 4542253 4784179 4493979 5021349
42347 5021349 6218283 6350990 4993167 4039839 4975591 6787999 7735105 7756393 7739093
42338 7739093 7546943 6396906 4528515 3040681 2456326 2548434 3037519 3407974 2784861
42329 2784861 1237165 403187 1346094 2557582 1858551 -312040 -1527647 -980272 -259591
42320 -259591 -458238 -741917 -296677 391208 931454 1724196 2356409 1321789 -1341713
42311 -1341713 -2969132 -1561952 1206834 2152773 792440 -472021 208867 2276010
42303 2276010 4061519 4407683 3139026 1228683 321426 945049 1573874 705335 -726174
42294 -726174 -679760 690214 1168999 -788 -957493 -227452 1165037 1675502 1524515
42285 1524515 1585801 1471496 435619 -807164 -885264 212792 1445545 2492962 3664820
42276 3664820 4471358 3960339 2323787 618757 -923921 -2590711 -3333652 -1441594 2401759
42267 2401759 4883471 3992305 1397062 -359450 -1234653 -2481685 -3660171 -3322216 -1945447
42258 -1945447 -1607721 -2690399 -3197259 -1861180 94121 1163296 1795567 3174316 4986771
42249 4986771 5816357 5141164 3758652 2494321 1384441 66624 -1555708 -2964824
42241 -2964824 -3192425 -1744898 516767 2085877 2578270 2899673 3361599 2926726 1219236
42232 1219236 35217 1304715 4212198 6030746 5644595 4589934 4384010 4447794 3479960
42223 3479960 1737072 863892 1913095 4260594 6202595 6227289 4208690 1881469 1604151
42214 1604151 3885631 6475026 6768312 4939029 3640159 4469017 5936736 5683138 3727989
42205 3727989 2274964 2740843 4394270 5925870 6852992 6930925 5727701 3790264 2924270
42196 2924270 3934171 5103619 4533392 3147723 3398446 5456886 6958522 6588840 5651824
42187 5651824 5638278 6490895 8017494 10662091 13627745 14504606 12534963 10327121 10308051
42178 10308051 11205987 10405279 8251999 7113184 7104437 6035638 3589395 2409985 4162310
42169 4162310 6958529 7921135 6573423 4582233 3478487 3591674 4155757 3685178 1212652
42160 1212652 -2176106 -3913756 -2637796 423974 3098510 4455487 4988511 5416342
42152 5416342 5741711 5096670 2620533 -981983 -3372986 -3196711 -2119205 -2586724 -3992875
42143 -3992875 -3303026 316618 3843838 4256970 2110100 154369 18976 1454694 3489750
42134 3489750 5057429 5459975 5179865 5320746 5688453 4803367 2512752 888106 1403692
42125 1403692 2895673 3724949 4256574 5298754 5605464 3492082 233291 -824308 1246223
42116 1246223 3552010 3205794 912125 -332004 859160 2869184 3438610 2431808
42108 2431808 1601245 1903490 2189737 1241519 53750 540343 2459206 3595484 3103751
42099 3103751 2571176 3172151 3867771 3448771 2394990 1419088 67599 -1655014 -2099292
42090 -2099292 -370219 1580934 1370803 -509334 -1880827 -2197298 -2347021 -2100122 -407246
42081 -407246 2102115 3401485 2906841 1967883 1487717 1007266 256030 -257570 -414834
42072 -414834 -583135 -407964 875359 2792401 3880595 3769766 3526290 3779126 3986040
42063 3986040 3769363 3566492 3636302 3557409 2923701 1713873 202961 -677547 344019
42054 344019 2988546 4844200 4318285 3084229 3483340 4628344 3907827 1615932 711335
42045 711335 2003657 3077348 2587209 2162149 2890647 3217156 2014964 803261 911800
42036 911800 1081848 149793 -268173 1562560 3992630 4022164 1715685 -104781 16549
42027 16549 731152 386662 -948605 -2022847 -1721220 -5731 1720926 1904487 1140387
42018 1140387 1828414 4506859 6335000 5008261 2429222 1943567 3235446 3150327 1132910
42009 1132910 360957 2699187 5493531 5045966 1365503 -2275472 -3364584 -2206336
42001 -2206336 -680396 -309769 -1284441 -2397060 -2058470 -69797 1810509 1753511 145749
41992 145749 -824434 91570 1847915 2999908 3938879 5876259 8001092 7669537 4295558
41983 4295558 1319721 2476151 7020081 10742210 11311160 10297263 9817461 9819951 9682641
41974 9682641 10030270 11119930 11232281 8928826 5878678 5213557 7524637 10447669 11947803
41965 11947803 12047097 11280426 9548925 7267434 6018510 6860690 8842309 10217071 10579950
41956 10579950 10814039 11238826 10967164 9408623 7513540 6734917 7163868 7625889 7521098
41947 7521098 7430584 7645388 7487043 6945310 7589821 10334868 13392584 14418357 13948737
41938 13948737 14381816 15937632 16416677 15254759 14839518 16645531 18695390 18539130 16621719
41929 16621719 14903565 14064317 14038514 15532036 18676034 21518382 22255811 22024155 23226631
41920 23226631 25965422 28469118 30306305 32555923 35074964 36269796 35935655 36100909
41912 36100909 38453942 42648109 47575625 52681953 57597032 62078319 66917678 73535775
41904 73535775 82108060 91354916 100769046 111815200 126138246 143606002 163158123
41897 163158123 185095474 211508255 244214451 282699000 324531151 367740214 411644965
41890 411644965 453909655 487266467 501815133 492338214 462461663 420777133 374413504
41883 374413504 327504291 283402589 244931781 212627294 185173986 161775339 142466289
41876 142466289 126498478 112459819 99959434 89464876 80676396 72786597 65962374
41869 65962374 60652793 55868654 50290558 44644840 40573293 37568025 33860221 30120331
41861 30120331 28878790 29861187 29540570 26498675 23660762 23361663 23619691 21927425 19692958
41852 19692958 19430275 19722995 17106916 12154207 9653054 12167180 16560659 18178436
41844 18178436 16272289 13744548 12926250 13425193 13883099 14284339 15560088 17360264 17634920
41835 17634920 15293677 12305024 11523658 12765407 13032429 10933205 8725693 8953487
41827 8953487 10976379 12362346 12214229 11376984 10514244 9895906 10371974 12651384 15809750
41818 15809750 17929902 18016431 16240843 13014944 9316661 7346032 8950149 13214642
41810 13214642 16971100 17926287 16428936 14407706 13661785 14907198 17267200 18863734
41802 18863734 18988657 19222138 21071880 23219973 23169462 21321237 20864853 23152261 25774294
41793 25774294 26427561 26271844 27508571 29575751 30330893 29855112 30176276 31458662 31374035
41784 31374035 28964675 26638074 26876832 28748725 29461879 28270763 26925572 26685356
41776 26685356 26712346 25670537 23584533 21563933 20388240 19738455 18524223 16063197
41768 16063197 13276134 12211512 13655200 15752828 16020718 14216188 11985215 10269437
41760 10269437 8807046 7839622 8121615 9082585 9240484 8875326 9882909 12266166 13454749
41751 13454749 12299138 10925052 10961552 10942104 9805885 9880898 13037239 16526643 16745530
41742 16745530 15114917 15600341 17784467 17575280 14331651 11911886 12178596 12755283 12435301
41733 12435301 13545090 16778442 18546549 16441620 13276610 12473646 12957445 11991778
41725 11991778 9952095 8750779 8258333 7842256 8888620 12004780 14019630 11848694
41717 11848694 7538355 5411844 5804415 5861475 5157989 5810707 7641522 7966590 6349363
41708 6349363 5278468 5666135 5670230 4633723 4335044 5386747 5990511 5375832 5139959
41699 5139959 6073534 6918651 7341577 8647080 10202561 8921151 4392635 1009236 2238250
41690 2238250 5705668 7007451 5925838 5442894 6402608 6863389 5931010 4794166 4001317
41681 4001317 2646536 756785 158458 2054721 5162377 7035082 6506895 4518268
41673 4518268 3051754 3301267 4531284 4890738 3492902 1234013 -422484 -573603 1188894
41664 1188894 4522636 7606942 8276656 6664547 5212483 5302789 5731981 5582538 6299383
41655 6299383 8915820 11255840 10684291 8389967 7943208 10167249 12379805 12650351 11922545
41646 11922545 11438131 10743945 9344592 8268710 8711234 10497239 12830395 15326296
41638 15326296 17521847 18590009 18384435 17770341 17292523 16572712 15590771 15340932 16406280
41629 16406280 17910768 18700409 18695090 18410320 18074786 17857176 17956297 17810517 16330951
41620 16330951 13661996 11512583 10893607 10848704 10429541 10361120 11292109 12020944 11523152
41611 11523152 11329036 13209407 15434257 14587062 11038885 9188893 11348106 14532489
41603 14532489 14967335 13032180 11543919 11470893 12139728 13968581 17631231 21167359 21286669
41594 21286669 17924776 14762286 14475650 15809158 16276798 15545632 14757594 14306475 13988336
41585 13988336 14148713 15048724 15918977 16101682 16455456 18221048 21025004 23356203 24565768
41576 24565768 25062529 25016196 24464581 24495695 26589796 30565168 34717371 38340561 42547266
41567 42547266 48034376 53756103 58964675 65085268 73840962 84408268 94445320 103752213
41559 103752213 114881332 129584767 146351274 162344608 176123066 186818341 191901395
41552 191901395 188428783 176859002 161532896 146379910 131742391 116586071 102050563
41545 102050563 90549840 82201905 74720739 66921775 59939162 54413254 48963957 42861960
41537 42861960 38088483 36618635 37070250 36492450 34756647 34555736 36968770 39522138
41529 39522138 39565412 37710568 36682674 38049345 41428294 46082845 51801145 58299256
41521 58299256 64887992 71149981 77619864 85638603 96515608 110569564 126881775 144300723
41513 144300723 162722315 182738102 203537096 221541026 231788928 230935030 219113921
41506 219113921 199523273 176652952 154399151 134769121 117717713 102251356 87882829
41499 87882829 75086500 64501937 56042052 49001357 42871275 37716500 33726659 30747875
41491 30747875 28446024 26602826 24911783 22795161 20004946 17305034 15881374 15889522
41483 15889522 16084271 15102729 12764221 10073715 8422568 8738655 10663528 12392457
41475 12392457 12125947 10018889 7977048 7248382 7113535 6370371 5037335 3821119 2874139
41466 2874139 2094074 1896999 2588030 3498937 3787217 3655712 3853120 4446765 4981127
41457 4981127 5250234 4948422 3313736 379912 -2062472 -2178870 -318963 1772394 3311151
41448 3311151 4434813 4514541 2704228 69171 -1039429 -66472 1248533 1803448 2476348
41439 2476348 3899181 5028863 5062434 4934215 5513251 5806464 4496118 2172815 538321
41430 538321 145575 274121 492921 1095359 2198063 3272617 3515962 2454695 629402
41421 629402 -381512 401508 1733195 1599216 420910 782452 3222335 4591606 2259210
41412 2259210 -1929404 -4050363 -3142047 -1538713 -1013988 -997035 -413626 771506 1970079
41403 1970079 2421465 1393202 -658990 -1607529 -46458 2284464 2489877 661291 -317284
41394 -317284 736810 1560031 75835 -2492926 -3585669 -2746393 -1586853 -1439695 -2402971
41385 -2402971 -3843230 -4641873 -3702409 -1343490 468487 302450 -966175 -1534375 -1072431
41376 -1072431 -591770 -569967 -556479 -298847 5810 366925 745201 424276 -1048431 -2498816
41366 -2498816 -2247536 -670299 21092 -1029122 -2055221 -1427237 -42308 319265 -371430
41357 -371430 -1065649 -1837481 -3310334 -4449628 -3320203 -287298 1723883 946669 -1059578
41348 -1059578 -1923861 -1434253 -680350 222045 1705806 3004345 2800874 1284456 -136554
41339 -136554 -996409 -2001972 -3092756 -2986062 -1178679 912168 1536413 579340 -543613
41330 -543613 -474036 765556 1662985 696935 -1603257 -2830443 -1851657 -713310 -1719456
41321 -1719456 -3617740 -3263632 -706800 537667 -1102716 -2790124 -1755999 628092
41313 628092 1528401 1042181 1072220 1452725 411724 -1776252 -2653430 -1180756 1050743
41304 1050743 2533675 3474025 4079154 3317910 591181 -2690990 -4420023 -4061712 -2847610
41295 -2847610 -2105024 -1953943 -1537296 -309007 1040060 1295409 378860 -463064 -429767
41286 -429767 -120172 -139522 1252 576346 531489 -812859 -2022169 -1328828 609900
41277 609900 1616789 1054736 75421 -550312 -679317 534252 3566419 6266505 5586402
41268 5586402 2052465 -288505 705774 2580238 2317709 551641 -79502 1191145 3029313
41259 3029313 4217774 4221900 2605758 -396206 -3399473 -5137765 -5441920 -4304537 -1501787
41250 -1501787 1842831 3205196 1815030 191707 633908 1778031 925255 -1607549
41242 -1607549 -3178569 -2987692 -2703455 -3233066 -3581522 -3071963 -2312622 -1623502 -567775
41233 -567775 665257 1307482 1558258 2135248 2323614 776367 -1597024 -2133733 -351934
41224 -351934 1247320 1140514 783748 1390302 1569035 181376 -974276 62025 1862896
41215 1862896 1724399 37117 -442360 977621 2151102 1695983 725407 571714 986997
41206 986997 1260856 1373916 1345419 807185 -161295 -814862 -706029 19805 1256226 2784738
41196 2784738 3695016 3337567 2742918 3524482 5323763 6012355 4638143 2469129 828525
41187 828525 -243018 -664166 337321 2566586 4224255 3994354 2422744 519764 -1299336
41178 -1299336 -2096790 -409969 3188472 5548637 4804542 2993156 2784904 3427452 2599892
41169 2599892 861912 986340 3347071 5161834 4617440 3018411 2165932 1915911 1297028
41160 1297028 318762 -258122 209490 2028717 4702019 6636933 6678514 5894475 6332506
41151 6332506 8106469 9428260 9439727 9030425 8721754 7828532 6115432 4377415 3046593
41142 3046593 2058471 2080233 3611398 4972109 4072190 2346118 3458471 7391459 9767667
41133 9767667 8522145 6951990 7611986 7563820 3666633 -1038386 -1288354 2362670 4744800
41124 4744800 3985551 2851535 2667780 1452326 -1150185 -2245235 -734402 400452
41116 400452 -909675 -2270080 -857757 2077110 3608232 3647606 4088128 5068713 4957772
41107 4957772 3201898 891259 -960103 -1979283 -1970187 -1376672 -1400053 -2281297 -2482658
41098 -2482658 -1051042 433707 178788 -657667 449028 3162594 4309531 2454117
41090 2454117 55915 42381 2029903 3379297 2929985 2118981 2641677 4290194 5513046
41081 5513046 5404050 4429956 3283447 1788577 -447821 -2671104 -3261670 -1683812 573888
41072 573888 1504795 566664 -1235911 -2718068 -3410709 -3473380 -3295058 -3043444 -2365887
41063 -2365887 -915090 632769 840461 -581810 -1820051 -921735 1590412 3152602
41055 3152602 2242586 18497 -1414700 -1416787 -815238 -214498 579614 1481283 1591045
41046 1591045 437720 -857716 -675935 874443 1813500 746729 -1415527 -2877757
41038 -2877757 -3306918 -3647060 -4028508 -3350279 -1290119 501174 138696 -2075354 -3840222
41029 -3840222 -3470601 -1752936 -898655 -1852965 -3132286 -2686113 -583376 966559 387102
41020 387102 -1393587 -2316726 -1537857 308388 2230868 3201031 2214826 -509101 -2892689
41011 -2892689 -3059026 -1712976 -977772 -1251331 -1081018 -18258 625155 299103 294478
41002 294478 1367484 2244714 1777335 939247 1202619 2253841 2873833 3001802 3313702
40993 3313702 3579885 3046485 1876240 763676 -335751 -1655322 -2357699 -1466925 236512
40984 236512 923088 285053 -193651 341159 1049613 1160301 1215867 1786705 2302811 2229946
40974 2229946 2323070 3364665 4353279 3541440 1190991 -261099 700600 2651644 3191222
40965 3191222 1997694 735400 492126 780415 1003291 1352541 1832634 1805067 1199552
40956 1199552 901126 1148110 942423 64586 11412 1308590 1573497 -1281499 -5063238
40947 -5063238 -5511212 -2122905 1295281 2041939 1313223 885402 325127 -838961 -1002912
40938 -1002912 1122248 3939393 5064245 4637015 4555790 5602087 7171866 8736616 9790811
40929 9790811 9479456 8078205 7635552 9122380 10115731 7713879 2929987 -431145 -923306
40920 -923306 -827562 -2180864 -3952165 -4056897 -2362517 -612471 -388096 -1831144 -3686637
40911 -3686637 -4322641 -3314857 -1957991 -1546960 -1562649 -568481 1516246 3342497 4142188
40902 4142188 4460485 4822545 4899996 4244712 2928565 1325504 14853 -207968 886092
40893 886092 2199367 2142696 284743 -2290694 -3995204 -3746355 -1698186 431094 675348
40884 675348 -724878 -1244471 540057 2752690 2812962 957036 -643644 -1170729 -1427989
40875 -1427989 -1652782 -1413589 -1281170 -2340894 -4203099 -5476224 -5872671 -5856578 -4868593
40866 -4868593 -2380989 -113050 -181168 -1248549 108769 3846834 5830419 3844117
40858 3844117 850753 581255 2865671 5350546 7117926 8127803 7322637 4188361
40850 4188361 877297 146265 1898199 3798622 4537335 4527634 4070002 2854114 1086227
40841 1086227 -429776 -1205573 -1055775 231528 2079501 2689385 810924 -2418005 -4541482
40832 -4541482 -4390452 -2764993 -1036490 26207 493801 1103761 2417837 3766306 3882728
40823 3882728 2919965 2472235 2961107 2729958 948216 -345154 1025752 3890766 5144086
40814 5144086 3922012 2293817 2090920 2920542 3347419 2557859 759502 -985374 -1420358
40805 -1420358 -418262 768181 1280796 1761636 2719688 3095463 2027054 814709 1058070
40796 1058070 1787834 870239 -1294687 -2112418 -742317 910510 1397487 1282087 899873
40787 899873 -687969 -3230996 -4231220 -2214301 718511 1585398 455242 -358604 -87065
40778 -87065 -196833 -1459965 -2429351 -1483509 901193 2733604 2820956 1986158 2096103
40769 2096103 3903903 5777485 5044920 1150256 -3010343 -3931975 -1629513 269160
40761 269160 -978402 -3810048 -4575525 -2424524 -229316 -413238 -1656259 -1059883 1534159
40752 1534159 3343856 2677422 1207660 1315771 2571055 2431981 10959 -2496365 -2677821
40743 -2677821 -1097351 -427074 -1611703 -2359714 -397203 2809415 3483552 681736 -2169569
40734 -2169569 -1821264 808046 2841887 3572593 3798175 2809151 -286886 -3059477 -1909408
40725 -1909408 1879054 2655367 -1592459 -6014379 -6019872 -3579012 -3057729 -4253632 -3917811
40716 -3917811 -1829520 -651547 -1011538 -1228495 -1276350 -2640613 -4388418 -3698597 -708445
40707 -708445 1249474 995495 1095987 2936798 4147193 2844574 1000837 1151586 2461451
40698 2461451 2639400 1743330 1561233 2540775 3431720 3088950 1246225 -1437434 -3109829
40689 -3109829 -1957345 1287983 3669212 3740434 3069100 3076302 2859367 1714886 1224486
40680 1224486 2535216 3776148 2826149 829272 153991 445718 -208308 -1420223 -1179105
40671 -1179105 238883 388782 -1342191 -2887283 -2920615 -2332709 -1817049 -642587 1333744
40662 1333744 2704512 2554955 1694874 1113202 877919 1119680 2241633 3430028 2866203
40653 2866203 447488 -1414225 -914631 689149 1053094 -55320 -968731 -676518 246681
40644 246681 844221 743850 50979 -924256 -1808790 -2354978 -2397596 -1749889 -673750 -219992
40634 -219992 -1106090 -2302208 -2023049 -368329 484521 -686200 -2442589 -3022668 -2901286
40625 -2901286 -3437633 -4078183 -3078469 -813588 -129118 -2487074 -5301971 -4657598 -176211
40616 -176211 4331637 5372215 3666276 2581071 3524878 4578665 3774072 1865577 757365
40607 757365 603426 162781 -780655 -1274822 -1204683 -1528692 -2360499 -2602990 -1916202 -1374976
40597 -1374976 -1548247 -1524685 -677251 127884 169630 352431 1672268 3217317 3251486 1799038
40587 1799038 724752 1277908 2619986 3043162 2097298 1169334 1841367 3703391 4458103
40578 4458103 2829444 519257 -71277 709889 664241 -355561 -242541 1337561 1872846
40569 1872846 208114 -1248231 -488965 773444 336562 -519468 487305 2240232 1973010
40560 1973010 8763 -1059228 -953105 -1470853 -2199493 -785703 2298605 3554961 1908112
40551 1908112 311027 616728 855192 -489004 -1361436 -4057 1310697 -363260 -3929136
40542 -3929136 -6100633 -6140439 -5558092 -4521669 -1992797 1151670 2279187 501956 -2185902
40533 -2185902 -3446216 -2660653 -646690 1115329 1135783 -829304 -3277908 -4564667 -4435283
40524 -4435283 -3324590 -1429286 445554 731189 -605370 -1181111 448781 2123510
40516 2123510 1103902 -1638052 -2860797 -1695930 6008 1059625 1578652 925986
40508 925986 -1509973 -3691026 -2705074 433737 1271943 -1913180 -5687809 -6375906 -4320992
40499 -4320992 -1792473 397120 2239781 2974069 2360002 1717150 1838727 1500457 -311089
40490 -311089 -2408257 -3394266 -3966588 -5242342 -6182874 -4843183 -1338700 2271219 4412473
40481 4412473 4829158 3778485 1944705 622602 658182 1526823 2228264 2425906 2131032
40472 2131032 1356845 792554 1529950 3280986 4250167 3677787 3005702 3575222 4872918
40463 4872918 6093615 7405559 8289872 6928153 3260064 534144 1345429 3851501
40455 3851501 4475010 2747130 729346 -751285 -2026133 -2006312 603780 3993723 4783643
40446 4783643 2977387 2035510 3605009 5375243 4973361 3095865 1656733 1240916 1556337
40437 1556337 2424257 3277093 3279432 2624286 2232725 1999973 1174981 479933 1496773 3642956
40427 3642956 4326034 2792334 1289595 1479242 2225817 2184957 2142645 3162978 4480525
40418 4480525 4966224 4973036 5077034 4560662 2855021 1184192 1112988 2429228 3811909
40409 3811909 4675808 5210367 5487660 5480634 5148667 4037503 1977188 378288 1029142
40400 1029142 3201001 4135632 3067897 2244159 2966794 3542794 2773049 2413835 3769064
40391 3769064 4685944 3053255 944429 1665375 4346188 5308520 3834560 2735647 3545301
40382 3545301 4845938 5554744 6412286 7505090 7343097 5510331 3893342 4185710 5890585
40373 5890585 7448767 7767708 6344914 3620959 1466998 1576225 3209215 4277367
40365 4277367 4521724 5413643 6916525 7020837 5116613 3298106 3328114 4533133 5738804
40356 5738804 7080597 8598405 9041991 7607965 5361739 3709701 2903675 2980489 4352786
40347 4352786 6307731 6859076 5522601 4328018 4490192 4193405 1840904 -508644 135911
40338 135911 2846644 3871369 2091395 225919 404190 1536309 1983010 2237817 3418887
40329 3418887 4975843 5728636 6065438 7239307 8884607 8973378 6597063 3534475 2177704
40320 2177704 2516751 2353510 625368 -758600 514898 3504782 4681242 2492010
40312 2492010 -426258 -583581 2089579 4669713 5127336 4208992 3667598 4090011 4814626
40303 4814626 5047740 4572576 3707257 2758015 1540885 -142485 -1463333 -919168 1647577
40294 1647577 4304938 5286553 5182952 5653071 6675649 6696211 5189614 3374175 2316738
40285 2316738 1913061 1985605 2826322 4162258 4991593 5033281 5035380 5073690 4032569 1703485
40275 1703485 -19969 629974 2916273 4849413 5952909 7143610 8379222 8316265 6530627
40266 6530627 4541302 4000801 4890502 6138530 7235637 8478318 10010712 11348183
40258 11348183 11907511 11698859 11370732 11562239 12226742 12762336 12879684 13001641 13535997
40249 13535997 14157833 14335191 14261468 14574831 15294175 15805040 15908624 16035003 16199706
40240 16199706 15625149 13898684 11774113 10139160 8754680 6866290 4724879 3510167
40232 3510167 3695880 4338942 4266145 3332144 2206826 1509864 1530197 2189896 2691909 1740648
40222 1740648 -970848 -3668854 -3903563 -1291392 1954663 3577188 3514907 3017324 2450088
40213 2450088 1193955 -642019 -1818264 -1603430 -808881 -684278 -1474666 -2507242 -3078014
40204 -3078014 -2806500 -1688606 -244269 887906 1775769 2917512 3932174 3659560 2132495
40195 2132495 1072942 1340235 1313182 -492162 -2464086 -1950537 431077 1395304 -22924
40186 -22924 -1060402 333449 2481573 2967048 2190017 1897575 2159053 2163300 2467482 3859023
40176 3859023 5062914 4257442 2224606 1391668 2156040 2776326 2645415 2832335 3271951
40167 3271951 2421638 363635 -649108 203096 928477 346421 339392 2482626 4847575
40158 4847575 4750222 2939495 2255143 3196977 3589665 2162821 -43665 -1720408 -2523391
40149 -2523391 -2205031 -508874 1774482 3249904 3634349 3703257 3650892 3048358 2283037
40140 2283037 2236992 2475723 1685372 218919 184875 2321739 4728733 5727380 6182719
40131 6182719 7572759 9260804 9504505 8312062 7455715 7881525 8640490 8530260 7597926
40122 7597926 6593976 5731911 4639750 3379707 2959657 4287447 6528627 7279358 5227162
40113 5227162 2185760 1243406 2963355 4844807 4806745 3602915 3055667 3530835 4520435
40104 4520435 6445176 10006743 14258427 17105605 17791903 17471468 17031773 15596087 11929985
40095 11929985 6753325 2858869 2607322 5278128 7350512 6158797 3088416 1912750
40087 1912750 3807623 5810196 5150778 3100422 2551693 3413783 3258744 1764517 1238733
40078 1238733 2478939 3285720 2140676 538525 122560 80994 -551785 -318254 2187823
40069 2187823 4884989 4407265 1076849 -1365498 -983305 236087 -7977 -1191938 -1517599
40060 -1517599 -573297 841151 2088028 2722455 2312478 1258254 836751 1639487 2915013
40051 2915013 3981525 4971413 5548125 4604094 2404540 1341124 2887663 5199051 5630144
40042 5630144 4419201 3684315 3815966 3548140 3060524 3914690 5577920 5051748 1184259
40033 1184259 -3110699 -4567899 -3569149 -2616825 -2412115 -1677549 -15428 1349532 1631335
40024 1631335 1434370 1291008 699641 -714179 -2071148 -2157808 -1097751 -317509 -734874
40015 -734874 -1570213 -1498794 -673320 -590856 -1700201 -2440011 -1686820 -918833 -2090685 -4152629
40005 -4152629 -4209307 -2116480 -1053951 -2617708 -4172540 -2925012 -240783 653619 -392975
39996 -392975 -753788 593120 1962156 2167904 2084018 2411300 2165839 442209 -1856171
39987 -1856171 -3054393 -2500194 -718562 1294644 2442306 2090331 794174 -213467
39979 -213467 -614097 -1421551 -3460593 -5956175 -7006455 -5353729 -1800172 1073114 1223171
39970 1223171 -482137 -1105968 606655 2638130 2887830 2303589 2916442 4201142 4118436
39961 4118436 2943263 2826392 3612648 2585847 -727519 -2796172 -893380 2926242
39953 2926242 4749150 3701238 1776098 418330 -384549 -714697 -720929 -1366382 -3153402
39944 -3153402 -4538841 -3537879 -731954 1077093 309944 -1733160 -2822757 -2166315
39936 -2166315 -546668 884497 1486440 1340171 947547 690817 707975 1199627 2253336
39927 2253336 3293955 3549053 3267931 3456272 4085011 3843327 2251041 578225 -226889
39918 -226889 -974897 -2296611 -2826891 -1257439 884528 786320 -1701338 -3760539 -3274357
39909 -3274357 -956846 1413353 3170103 4553815 5591499 5963089 5416381 3986214
39901 3986214 2160582 700033 -166042 -963742 -1822344 -1822877 -486404 832125 468825
39892 468825 -1047169 -1571007 -296125 1406981 2180604 2162572 1914103 1282396 29603
39883 29603 -1385793 -2358101 -2886296 -3310799 -3667240 -3537815 -2411440 -423362 1114502
39874 1114502 720826 -1138835 -2034276 -808464 315563 -1336437 -4700803 -6040673
39866 -6040673 -3956287 -854093 877902 1624594 2553264 3211288 2715594 1733953 1588430
39857 1588430 2343745 3120009 3499557 3520710 3111189 2571623 2737929 3577358 3567207 1773491
39847 1773491 -276763 -325137 1525913 3003388 2694793 1318138 -42786 -1276345 -2215375
39838 -2215375 -1731045 874904 4172787 5576832 4176457 1809544 956849 2113170
39830 2113170 3770537 4579903 4599628 4313254 3433422 1423488 -1297096 -3411243 -3792644
39821 -3792644 -2204700 544076 2705967 2724835 1132985 478175 2205035 4464533 4562930
39812 4562930 2793827 1761829 2325518 2732182 1989368 1393184 1731413 1474158 -610857
39803 -610857 -2989449 -3377515 -1788956 200297 1910026 3366071 3803833 2539036 691457
39794 691457 40219 621497 1300492 2110545 3799054 5367555 4618794 1549044 -1112416
39785 -1112416 -1524588 -841353 -703338 -637995 472182 1899634 2058895 1182134 1030861
39776 1030861 2123455 3023891 2674944 1924809 2029989 2776011 3102136 2940896 3273602
39767 3273602 4483738 5755229 6409474 6878118 7641843 7913058 6466427 3606017 1226027
39758 1226027 692392 1505638 2316759 2397115 1730905 615972 -156359 419451 2226091
39749 2226091 3647290 3478355 2574355 2458853 2870562 2226134 396238 -657371 470178
39740 470178 2637635 3566667 2348275 -109229 -2288839 -2954663 -1578894 1108248 3282166
39731 3282166 3550515 2259410 859906 319948 682140 1725085 3215421 4647573 5491723
39722 5491723 5710457 5518702 4871603 3857566 3232148 3523267 3795939 2625013 408939
39713 408939 -804899 -302344 159216 -767261 -1675672 -715959 1036936 899907 -1272684
39704 -1272684 -2818369 -2291177 -1244608 -1249653 -1480761 -595747 912721 1865640 2382053
39695 2382053 3035760 3324433 2755521 2315128 2898274 3221416 1489456 -1439340 -2828682
39686 -2828682 -1811269 -189845 518431 630887 540281 -420512 -2444039 -4179567 -4186642
39677 -4186642 -2461643 -13118 2065360 2845518 2127059 1121306 1448341 3176802 4896076
39668 4896076 5676400 5618700 4625526 2428679 -1936 -973899 -406747 132202 68003
39659 68003 510078 1824226 2680324 2335711 1820790 1956513 2187518 2220215 2640856 3002368
39649 3002368 1745928 -811476 -2034335 -971063 -60541 -1081636 -2323967 -2028975
39641 -2028975 -1588541 -2378523 -2327195 650530 4171002 4510961 2494755 1894962 3155222
39632 3155222 3267569 1358478 -140459 41046 608585 1064742 2352554 3620241 2510679
39623 2510679 -356271 -1192682 1339974 4021290 4045245 2568124 1683290 1278133 707593
39614 707593 411704 139321 -1212019 -2366595 -26110 5428230 8627051 6534497 3137672
39605 3137672 3120075 4596850 2913298 -1265475 -3227504 -1901991 -614328 -760379 -257649
39596 -257649 1328416 1361641 -833499 -2071019 -318417 2225808 3144077 3400458 4434079
39587 4434079 4698450 2226278 -1377119 -2684708 -1153246 634175 844865 93919 -565244
39578 -565244 -1203797 -2221387 -3464627 -4533308 -5037968 -4488119 -2817505 -1002273 -214022
39569 -214022 -273209 139031 1485407 2421939 1337301 -1646626 -4691327 -6013080 -5288242
39560 -5288242 -3519482 -1991605 -1434887 -1817622 -2579533 -3075798 -3035464 -2690399 -2404347
39551 -2404347 -2256487 -2148466 -2161171 -2436813 -2784796 -2913472 -3086977 -3901150 -5174676
39542 -5174676 -5798191 -5212888 -4389760 -4551612 -5336389 -5146493 -3223410 -573752 1173652
39533 1173652 1087041 -887983 -4050156 -6723237 -6756236 -3376631 1400052 4102322 3142521
39524 3142521 443243 -932444 -500331 -601418 -2709771 -5004012 -4931364 -3088669 -2412712
39515 -2412712 -3734501 -4587829 -3171391 -1182729 -1123724 -2542411 -2980500 -1488668 953716
39506 953716 3689080 6622196 8520853 7684280 4766870 2621627 2444979 2164193 -55027
39497 -55027 -2607710 -2698179 -569463 778407 -239627 -2022140 -2528452 -1983332 -1882887
39488 -1882887 -2573046 -3158832 -3233235 -3292928 -3435516 -2926676 -1520309 -129183 582768
39479 582768 1290009 2500350 2796695 459678 -3264394 -4686967 -2283729 1089381 1916061
39470 1916061 353262 -925241 -834539 -386308 186760 1902610 4276427 4807516 2416056
39461 2416056 -721790 -2272319 -2857132 -4137997 -5259497 -3824068 10790 3052778
39453 3052778 3234573 2063701 1805572 2041582 838906 -1686032 -3145703 -2236911 -466127
39444 -466127 118135 -517607 -1115573 -1370420 -2120027 -3699668 -5264769 -5699786 -4471953
39435 -4471953 -1917805 520384 965244 -708664 -1874128 -53834 3397132 4591698
39427 4591698 2297224 -565408 -1397214 -1294466 -2306548 -3758652 -3860984 -3248619 -3882174
39418 -3882174 -5314745 -5113585 -2753025 -236519 1206578 2223918 2840258 1844928 -427565
39409 -427565 -1572011 -809924 -622040 -2776672 -5001725 -4122590 -975044 587439 -1024025
39400 -1024025 -3342398 -3386885 -1043087 1461787 2088237 627195 -1276947 -1608879 -122582
39391 -122582 1245302 781334 -773961 -1484422 -1148456 -1423737 -3065265 -4603852 -4270861
39382 -4270861 -2080942 590498 2565353 3301685 2507451 245338 -2682413 -5018994
39374 -5018994 -5873817 -5215901 -3683602 -1966425 -270686 1550736 3237141 3808478 2521677
39365 2521677 71317 -1760652 -1906470 -1092553 -811057 -1443869 -1829395 -798073 1141796
39356 1141796 2056653 706048 -1861307 -3284086 -2484801 -802432 -252319 -1079622 -1655964
39347 -1655964 -786080 560886 368475 -1825141 -4246079 -5124326 -4793898 -4602404 -4324707
39338 -4324707 -2396487 1021667 3212061 2394460 402175 -24405 661498 -97347 -2483735
39329 -2483735 -3891221 -3153585 -2184148 -2473471 -2784044 -1871378 -909662 -1067475 -861208
39320 -861208 1384699 4009957 3992237 1671032 458129 1893046 3817864 4010924 3113752
39311 3113752 2803185 2973560 2306964 672145 -502654 -177746 801074 629169 -922851
39302 -922851 -1461692 1334619 5887625 7463610 3870013 -1444694 -3829413 -3179310 -2581684
39293 -2581684 -2742801 -1558606 1080627 2205985 537884 -1251908 -784291 555810
39285 555810 518868 -246132 131830 1288759 1528417 837206 507476 752661 959529 1395349
39275 1395349 2439499 2973968 1847711 229486 122818 1133952 1276156 612211 1252782
39266 1252782 3535368 4995227 3924207 1605547 41856 -511153 -734934 -850902 -1174500
39257 -1174500 -2425689 -4301719 -5169584 -4323711 -3219481 -3343953 -4174271 -4412722 -3928762
39248 -3928762 -3188932 -2040233 -487528 524221 618124 1020626 2315028 2449225 -646013
39239 -646013 -5281582 -7595739 -6770802 -5894288 -7149954 -8883415 -8672853 -6949063 -5635960
39230 -5635960 -4795311 -2914472 68430 2131549 1850719 350458 -48882 1443736 3222030
39221 3222030 3157026 1189763 -404057 200507 1911736 2242003 980863 421411 1460366
39212 1460366 1793063 -353920 -2648285 -1482503 2551445 5022227 3615151 905004
39204 905004 272379 1547863 2359915 1944479 1476490 1583175 1625824 1216813 742095 303884
39194 303884 -426029 -1059444 -527350 1143059 2124755 821681 -1829521 -3059764 -1441614
39185 -1441614 1324774 2409047 1343363 514564 1767954 3640412 3314123 723973
39177 723973 -1222960 -739556 616193 795824 360310 950776 2168695 2319660 1478832
39168 1478832 1324367 2103914 2235139 1207106 452310 601139 236563 -1359771 -2398508
39159 -2398508 -1366270 70965 -780563 -3581539 -5416368 -4934224 -3688892 -3095225 -2308253
39150 -2308253 -287136 1608659 918848 -2281920 -4607194 -3043445 1206400 3766131
39142 3766131 2278901 -674228 -1102821 868721 1329303 -1378335 -3706545 -1690036
39134 -1690036 3403668 6710586 5867465 2796688 30346 -1809680 -2716465 -2356063 -1331750
39125 -1331750 -1095407 -1589737 -1063101 771971 1709848 603439 -454450 396558 1316640
39116 1316640 -369910 -3423307 -4257873 -2623299 -2045412 -4165147 -6078839 -4729913
39108 -4729913 -1209320 1236568 1498050 878552 521454 586076 1016851 1280849 149712
39099 149712 -2446245 -4170512 -3002058 -602215 -436033 -2610928 -3476926 -1190465 1237920
39090 1237920 416521 -2196837 -2417867 452892 2756959 1923210 -191543 -561977 752721
39081 752721 1467336 648041 -740588 -2112228 -3817238 -5407497 -5428953 -3602182 -1548728
39072 -1548728 -451055 497150 2066959 2862087 1173528 -1799249 -2904642 -1310576
39064 -1310576 385825 -13106 -1483262 -2064890 -2023572 -2668205 -3386900 -2525788 -737611
39055 -737611 -602106 -2520617 -3738326 -2589809 -1177038 -1936953 -3697373 -3797350 -2696749
39046 -2696749 -3245052 -5757182 -7194540 -5970354 -4537297 -5554001 -7804874 -8110729
39038 -8110729 -5824602 -3181420 -1995861 -2113688 -2712458 -3114877 -2381047 -40116 2434416
39029 2434416 2600815 167212 -2236613 -2231256 -592753 -80039 -2031093 -4983062 -6387989
39020 -6387989 -5117471 -2362245 -295583 189598 220851 1166769 2661187 3213283 2347922
39011 2347922 978230 -99546 -690876 -327635 1278204 2596937 1155966 -2924712
39003 -2924712 -6050727 -5209930 -1500076 1808928 3248039 3358306 2307964 -149083
38995 -149083 -2769664 -3304228 -1208646 1769116 3834295 4571024 4327792 3803940 4055038
38986 4055038 5163236 5175189 2458574 -1076941 -1728899 741094 2538939 1469307 20705
38977 20705 956007 2688527 1915938 -1090206 -3066722 -2621081 -1386324 -692619 -77302
38968 -77302 641572 485911 -724819 -1629209 -1378473 -750409 -506455 -285344 54809 -396946
38958 -396946 -1969318 -3190646 -2422498 105124 2833417 4639697 5173122 4328411 2597461
38949 2597461 1419180 1930620 3444256 4090112 3002373 1153852 -34846 -236548 -64721
38940 -64721 199675 1134885 3128486 5073168 4965478 2345594 -581229 -1365733 -529120
38931 -529120 -947072 -3870679 -7076315 -7698193 -5643143 -3170523 -2061174 -2408113 -3514012
38922 -3514012 -4597440 -4800501 -3690259 -1920144 -692583 -532111 -1030625 -1507168 -1381928
38913 -1381928 -385141 841315 880675 -689186 -2088403 -1183903 1607282 3633868 3303906
38904 3303906 1629238 202600 -735225 -1418705 -1318433 -181658 757839 277906 -667843
38895 -667843 14649 2475120 4510242 4462246 2961642 1295813 -307068 -1740237 -1887976
38886 -1887976 -168866 1622444 994315 -1823491 -3937887 -3537411 -1871859 -900638 -691345
38877 -691345 -315793 98752 -167452 -811262 -1079334 -1449732 -2947536 -4917061 -5340468
38868 -5340468 -3768887 -2304944 -2917079 -5036881 -6668954 -6867343 -6179047 -5375660 -4696771
38859 -4696771 -3999032 -3067719 -2104855 -2086431 -3824112 -6299677 -6995907 -4711260 -1210086
38850 -1210086 860018 973372 625437 889488 1385828 1479147 1279580 1249231 1585501 2180223
38840 2180223 2750650 3027643 3072711 3110374 2857914 1746844 259936 27162 1607689
38831 1607689 3093216 2339405 26066 -1120242 21249 1741000 2134711 1403616 890404
38822 890404 1033186 1193386 896724 450015 418902 791233 736634 -515755 -2428618 -3449519
38812 -3449519 -2990442 -2166354 -1738476 -602875 2034072 4098614 2784210 -1041379 -3319245
38803 -3319245 -2214748 -423720 -917967 -2788775 -3175153 -1597192 -199770 -520885 -1839102
38794 -1839102 -2396136 -1065197 1766447 4130066 4009403 1720585 -209293 -312282 40279
38785 40279 -796340 -2096327 -2438969 -2431826 -3349046 -4189424 -2951228 -353750 724218
38776 724218 -334948 -1009422 115018 1136709 284687 -991382 -439095 1346603 2020907
38767 2020907 1081649 28420 -478345 -1313850 -2720100 -3507358 -3001631 -2191193 -2065944
38758 -2065944 -1984134 -766996 1261485 2465460 1982149 702577 26079 347664 1096689
38749 1096689 1653737 1646506 775452 -794908 -1958368 -1536524 113489 1273468 1130678
38740 1130678 923835 2008018 3657087 4018192 2696738 1001883 -65072 -507148 -73059
38731 -73059 1895725 4829468 6749840 6607345 5508807 4730584 3886440 2294097 813989
38722 813989 525589 447870 -1256577 -3969270 -4691767 -2034930 1621114 2982503 1604570
38713 1604570 -381341 -1370195 -1589468 -1543148 -720551 1381026 3681743 4042750 1677688
38704 1677688 -1458982 -2404501 -505327 1572243 797337 -2492880 -4701085 -3061890
38696 -3061890 1169119 4245641 4094469 2025469 449101 56885 -104867 -539361 -473887
38687 -473887 751605 2433661 3288496 2980778 2139308 1193953 189538 -299115 610914
38678 610914 2370126 2733419 497674 -2355825 -2961785 -1638902 -1539875 -3841448 -5572580
38669 -5572580 -3714971 300598 2381897 1086237 -1298617 -2677125 -3464964 -4375508
38661 -4375508 -4434145 -2820316 -986876 -1003471 -2662571 -3924370 -3670710 -2496066 -1256867
38652 -1256867 -407939 -436986 -1312361 -1639087 -35379 2612613 3943355 3289859 2250572
38643 2250572 1850461 1315719 459567 908751 3303701 5292875 4601969 2663053 2489484
38634 2489484 3753288 3081536 -584133 -4014146 -4268832 -2650432 -2077844 -2400872 -1041173
38625 -1041173 2409879 5076598 4793668 2897403 1784286 1485955 556355 -794074 -917401
38616 -917401 99575 68367 -1751503 -3143217 -2406808 -1063722 -885617 -312087 2898558
38607 2898558 6796926 7173246 4218053 2767745 4817433 6302477 3712523 -229493
38599 -229493 -1085181 372967 166530 -2088028 -3116319 -1731741 -139267 227639 44891
38590 44891 -672509 -2571104 -3992001 -2278415 1286447 2197401 -454893 -2293247 -542586
38581 -542586 1810873 1323492 -530917 -594026 846936 1897745 3112795 5579495 7167937
38572 7167937 5103628 979350 -1010218 -154463 359631 -1173852 -2926045 -3134183 -2515264
38563 -2515264 -2423396 -3039882 -3868330 -4170895 -3018520 -685481 643032 -439657 -2177260
38554 -2177260 -2314922 -1757416 -2446958 -2975434 -426558 4028624 5912470 4044838 1918191
38545 1918191 1780857 1867476 783287 101173 618922 262262 -1846259 -3128430 -2063524
38536 -2063524 -1214099 -2658580 -3997166 -2536218 -207026 -189717 -1392810 -811074 839098
38527 839098 695207 -661705 -324778 1141927 357111 -2491558 -3280129 -871024 691071
38518 691071 -1270455 -3855686 -3474761 -1104406 396851 1078535 2429745 3367691 1676168
38509 1676168 -1477877 -2205545 694321 3936519 4130027 1644088 -998335 -2639622
38501 -2639622 -3617153 -3505171 -1116656 2832435 5016863 3051459 -1109188 -3171967
38493 -3171967 -1767657 276999 339683 -630147 -533512 230459 -35334 -792652 143920
38484 143920 2742202 4177944 2571888 -806195 -3548331 -4447754 -3423967 -1096950
38476 -1096950 878621 873137 -521812 -993248 100585 666346 -826618 -2844947 -3025124
38467 -3025124 -1448556 -99928 -87343 -889578 -1621515 -1716490 -889063 493097 1442251
38458 1442251 1484067 1097723 474052 -1065805 -3560898 -5526606 -5764656 -4999704 -4419234
38449 -4419234 -3664189 -1897920 24727 461100 -318422 -378361 795573 1390440 119999
38440 119999 -1605890 -1528290 366808 1897326 1597647 424818 159087 925874 1298229
38431 1298229 685856 287949 971085 1436401 43371 -2223560 -2642287 -667353 1099758
38422 1099758 476566 -1667228 -3323646 -4106325 -4699642 -5005947 -4495324 -3444797 -2340271
38413 -2340271 -828956 1386131 3369740 3981654 3402207 2516900 1637102 929209 972794
38404 972794 1520230 933774 -1448712 -3550516 -3108290 -962579 327572 204709 40724
38395 40724 134025 -440350 -1277499 -772634 1039256 2380094 2712174 3217300 3943878 3276262
38385 3276262 1024176 -665702 -563941 21763 115675 967850 3350542 5222019 4173475
38376 4173475 619531 -3190999 -5783194 -6474570 -4653976 -1150448 1242557 952013
38368 952013 124426 1549537 4136849 4228233 1022037 -2091674 -1992715 608171 2793712
38359 2793712 2959144 1851209 1153004 1790305 3222717 4173353 4160546 3794963 3255101
38350 3255101 1606249 -1370045 -3848827 -4050042 -2794765 -2153380 -2216982 -1378835 472545
38341 472545 1493921 942211 318063 626398 719111 -219643 -417682 2154305 6119006
38332 6119006 7572830 4795266 484850 -1405169 -139686 1443956 816670 -1099669
38324 -1099669 -1443277 454768 1906245 433937 -2723617 -4046729 -2129325 891290
38316 891290 2295546 1699242 534412 -179088 -631890 -1307774 -2033842 -2023112 -774735
38307 -774735 1057675 2023837 1413651 29045 -955724 -1223173 -804476 614290 2641308
38298 2641308 3420208 1785319 -416751 -404186 1313022 1393723 -1183665 -3258349 -2146601
38289 -2146601 398002 1053730 -174282 -627114 505213 1187055 -80801 -2318893 -3949399
38280 -3949399 -4701733 -4928195 -4454963 -2996484 -915490 1026593 2202491 2246161 1248963
38271 1248963 -90025 -1100707 -1909196 -2997739 -4230482 -5091472 -5619799 -6115911 -6123950
38262 -6123950 -4919960 -3028601 -1959419 -2168833 -2497751 -1980913 -982819 -102157 709379
38253 709379 1286305 934680 -33762 149806 2190643 3874255 2537971 -1188502 -3921472
38244 -3921472 -3561920 -1076164 1609580 3508225 4061044 2820884 660750 -347013
38236 -347013 472480 1217938 168349 -1487434 -1336570 744090 2649932 3085496 2494882
38227 2494882 1127940 -1563404 -5083792 -7453546 -7545180 -6309910 -4858716 -3025072
38219 -3025072 -914836 -5059 -940004 -1750211 -411522 1925096 2598676 1489989 743352
38210 743352 910353 470172 -560304 137195 3117111 5327361 4236636 1357796 -525781
38201 -525781 -1404302 -2617076 -3296960 -1668836 1038419 1532365 -717873 -2788931 -2783386
38192 -2783386 -1922867 -1432906 -428684 1689767 3442054 3677096 3521737 3991728 3755814
38183 3755814 1561501 -904301 -1204758 99752 602872 -46010 -298746 -134052 -1104052
38174 -1104052 -2865281 -2840694 -189739 2562553 2967532 1426310 -547083 -2440140 -3674641
38165 -3674641 -2795477 165152 2300290 1158230 -1711264 -2764519 -1125418 942341
38157 942341 1533229 833681 -243239 -977098 -583794 872982 1484053 -354906 -2859501
38148 -2859501 -2526692 691178 2687538 795697 -2631195 -4047262 -3636055 -3716362 -4028823
38139 -4028823 -2159024 1665693 3711904 1816626 -1255570 -1463196 1000939 2111320
38131 2111320 -404579 -4007144 -4692154 -2024762 642098 536343 -1626239 -3550681
38123 -3550681 -4533561 -5256728 -5451989 -3984349 -1338829 124777 -695232 -1955384 -1570846
38114 -1570846 -196957 112200 -805165 -1224405 -436117 293669 -130822 -1114538 -1513780
38105 -1513780 -1139627 -551680 -168734 -80436 -212894 -396544 -606068 -1019920 -1410467 -989823
38095 -989823 257578 712074 -961994 -3395612 -3865437 -2081556 -449989 -70138 930216
38086 930216 3618864 5414818 3694299 447806 -133862 1960354 2444093 -445981 -2887877
38077 -2887877 -1270844 2108997 2367545 -838066 -3214774 -2292474 -258420 272341 -52767
38068 -52767 501365 1540398 1769223 1644355 2334115 3176499 2713202 1613147 1904703
38059 1904703 3358667 3335567 896030 -1342526 -699181 2046168 4041978 3896182 2347061
38050 2347061 478759 -1092919 -1731132 -917051 1009323 2909375 3632601 2682355 723766
38041 723766 -488290 310608 2142809 2778488 1709603 622635 553552 576279 142014
38032 142014 412853 1806598 2546749 1685800 1280087 2887166 4019842 1550118 -2840504
38023 -2840504 -4524443 -2508884 -181293 276947 82737 146596 -519622 -1584169 -686313
38014 -686313 2298048 3971975 2496561 544659 791744 1725680 846180 -859817 -975505
38005 -975505 148351 745471 1287535 3107941 4753806 3527107 20806 -2365577 -2157492
37996 -2157492 -934891 24578 1151362 2596325 3632757 4133963 4188629 2616921 -1252039
37987 -1252039 -4728608 -4206891 -662135 963988 -1379821 -4302225 -4509635 -3112114
37979 -3112114 -2366676 -1692151 121651 1527054 492520 -1666792 -2138676 -1089632 -956559
37970 -956559 -2026673 -2209216 -1181290 -1293622 -3435087 -4968159 -3454360 -319446 1145318
37961 1145318 105572 -1433657 -1787550 -1142281 -106433 1302370 2578267 2257685 -104803
37952 -104803 -2362272 -1826303 1224657 3648573 3374027 1656568 617615 217850 -632093
37943 -632093 -1161362 581255 4191307 6413060 5051539 1719163 -398115 -287357 554834
37934 554834 664258 189269 180307 1239227 2952407 4266204 4408393 3459776 1890421
37925 1890421 -47164 -1833696 -2166763 -271131 2376018 3179478 1611708 -210062
37917 -210062 -579598 -205671 -409721 -1049112 -1489044 -2147328 -3483443 -4573497 -4355303
37908 -4355303 -3437308 -3048408 -2991596 -2396263 -1791037 -2382748 -3608903 -3524644 -1695622
37899 -1695622 238671 1068509 1114008 515287 -1359165 -3941418 -5034069 -3740423 -2031927
37890 -2031927 -1720760 -1523318 612405 3457593 3660625 780414 -1724302 -1313907 331949
37881 331949 274914 -1478012 -2746392 -2732303 -2474102 -2517247 -2520979 -2830104 -3885032 -4033299
37871 -4033299 -866353 4437341 7145050 5082143 1896058 1662364 2775426 861658
37863 861658 -3870280 -6643980 -5226019 -2581083 -1564919 -1174312 45860 622027 -967293
37854 -967293 -2832705 -2374907 -601868 -454480 -1951714 -2278539 -368571 1540376 1227936
37845 1227936 -870953 -2786475 -3139584 -1897575 -272053 192997 -507369 -438005 1517867
37836 1517867 3405520 2570377 -455855 -2685992 -2889860 -2620061 -3020215 -3154496 -2121730
37827 -2121730 -658083 244736 673571 1069506 1577266 2458663 3665704 3909475 1982697
37818 1982697 -834349 -1764582 -248804 1534194 2223363 2757594 3564926 3177555 1147651
37809 1147651 -311649 435589 1822721 1786359 997555 1051310 1359881 560620 -485039
37800 -485039 30633 1648369 2504142 2550819 3077718 3690288 2826759 1036385 629089
37791 629089 1816177 2162210 504848 -1316965 -1541271 -789924 -233959 221523 677524
37782 677524 354513 -569522 -261929 1890137 3523369 2486222 328914 198786 2119464
37773 2119464 2990072 1256208 -877135 -719400 1252794 2401022 1637870 590979 1035617
37764 1035617 2396576 2632666 1121997 -460856 -432655 735438 1361538 914589 211879
37755 211879 -376688 -1423420 -2908527 -3526530 -2218265 367372 2469591 2811546 1513219
37746 1513219 38223 91631 1692454 2665578 1377671 -376781 727050 4548482 6818230
37737 6818230 4523189 -311393 -3797805 -5017753 -5497340 -5627433 -4460103 -2247734
37729 -2247734 -428699 704664 1963642 3077467 2946492 2047797 2050090 2750447 2055205
37720 2055205 -271805 -1565705 -307774 1244914 364873 -2180165 -3651302 -3331185
37712 -3331185 -2597087 -2010663 -932512 261414 77741 -1576463 -2774152 -2204740 -947958
37703 -947958 -818728 -2053418 -3410279 -3731284 -2727385 -918516 538882 516244 -928909
37694 -928909 -2364375 -2409508 -1089240 492104 1379898 1308321 485367 -601937 -1379503
37685 -1379503 -1602101 -1425046 -867372 308472 1717515 1955066 94886 -2536198 -3241658
37676 -3241658 -1055034 1959150 3200556 2535597 1756096 1637855 1175565 -73575 -675593
37667 -675593 469883 1845246 1020052 -1771783 -3623835 -2819975 -1021708 -746524 -2016302
37658 -2016302 -2825646 -2147391 -988745 -634585 -1153469 -1939694 -2802247 -3947628 -5233931
37649 -5233931 -5869864 -5017813 -2884923 -1108523 -1360813 -3247761 -4403639 -3306045 -1071549
37640 -1071549 564798 1934462 4164065 5840776 3771748 -2072091 -6873284 -6206219
37632 -6206219 -1484000 2032782 1854245 441363 761670 2191579 2128403 94518 -1633776
37623 -1633776 -1200743 498388 1124157 -261161 -2344675 -3304280 -2644440 -1068097 729555
37614 729555 2283887 2762031 1501450 -454543 -646488 1941435 5136892 5891045 3809110
37605 3809110 1158694 -160252 -142926 577466 1640705 2193451 971860 -1841602 -4071592
37596 -4071592 -3937971 -2128058 -582211 -89469 -61883 150195 836007 2099108 3305334
37587 3305334 3051296 968653 -1078111 -1085349 277290 607686 -776012 -2218336 -2593742
37578 -2593742 -2701660 -3215247 -3233816 -1993208 -420978 300888 389413 332676 -537795 -2568077
37568 -2568077 -3957752 -2703701 -5860 669882 -1670497 -3960546 -3304706 -985838
37560 -985838 -509116 -2699875 -4846797 -4655145 -3054317 -2202106 -2194842 -1410345 440041
37551 440041 1517830 559979 -1250036 -2190446 -2458630 -3079790 -3323514 -1565184 1340342
37542 1340342 2139227 -409478 -3443006 -3896094 -2632325 -2576733 -4114913 -4957173 -3989481
37533 -3989481 -2558295 -1738500 -773685 990546 2585339 2865036 2044983 915282 -173673
37524 -173673 -693207 330541 2781701 4636988 3907991 884752 -2334279 -3917703 -3319068
37515 -3319068 -1188576 838621 1124302 -193999 -1092785 -222375 1249638 1391881 196886
37506 196886 -865814 -1255931 -1648055 -2156263 -2058535 -1426534 -1391930 -2282445 -2838229 -2000586
37496 -2000586 -458881 386132 296566 247051 993200 2246587 3158652 3256578 2914890 2922802
37486 2922802 3436987 3588134 2592132 1029530 257155 578326 942854 709825 649567
37477 649567 1509065 2496421 2310384 1209671 784365 1662521 2666772 2627086 1877857
37468 1877857 1176518 170219 -1719284 -3436829 -3058826 -666700 1145962 467576 -1492407
37459 -1492407 -2288532 -1576085 -1154755 -2255714 -4232276 -5719415 -5829167 -4395036 -2241827
37450 -2241827 -949475 -1109413 -1276909 -141437 1002729 191317 -1327279 -225159 3542940
37441 3542940 5932717 4700251 2734538 3236253 4626139 3511042 479101 -930420
37433 -930420 100555 881832 -173685 -1719422 -2570850 -3349501 -4166981 -3533589 -962287
37424 -962287 1460930 1589839 -70452 -1310425 -912865 393359 1047366 415751 -197440
37415 -197440 1121013 3838095 4601855 1594343 -2227623 -2839044 -859526 -163653 -1538943
37406 -1538943 -1928875 -204470 891672 -98448 -693654 751327 1714833 79829 -1481906
37397 -1481906 437044 4145667 5248257 3188432 1282050 1217268 1562863 1435734 1803298
37388 1803298 2711529 2495279 622689 -1153478 -1254208 36899 1652850 2585439 1604559
37379 1604559 -1587044 -4612408 -4213195 -529489 2517563 2053681 -409002 -1551839
37371 -1551839 -520714 777079 583666 -890331 -2222019 -2498484 -2221419 -2527343 -3406228
37362 -3406228 -3340399 -1440335 856949 1517920 725179 330152 873064 1041646 124038
37353 124038 -887187 -1009294 -470465 166119 592246 255637 -1099459 -2167278 -1172288
37344 -1172288 1395817 3065517 2913409 2668565 3451208 3745425 2141195 74610 -147382
37335 -147382 1382324 2824868 3308894 2959047 1296267 -1929856 -4754158 -4411037 -1157905
37326 -1157905 1368912 449011 -2567937 -4327027 -3537702 -1868407 -1429400 -2530230 -3944844
37317 -3944844 -4601091 -4602718 -4780061 -5528241 -6223138 -5796360 -3859858 -1261492 503622
37308 503622 587603 -396077 -997457 -478874 539919 1222088 1850624 3324730 5400887
37299 5400887 6263915 4375079 510081 -2536681 -2579825 -362052 1157997 181121 -1800911
37290 -1800911 -2115881 -596605 547914 507012 1079849 3084524 4161125 2398064 2810
37281 2810 217773 2011232 1631290 -1098901 -2282471 -360482 1179264 -681670 -3841423
37272 -3841423 -4528476 -2667712 -903776 -298389 -54448 -152573 -1142411 -1943322 -755873
37263 -755873 1819318 2974896 1382799 -1132780 -2058746 -976227 572144 1127396 862678
37254 862678 1295088 3239127 5240675 5201736 3566897 2902358 3678672 3079123 -317594
37245 -317594 -3322667 -2368723 1116482 2947332 2353715 2144742 3481515 4536779 4395929
37236 4395929 4293581 4281275 2522118 -796578 -2419146 -711720 1683392 1885681 645256
37227 645256 -27935 -365482 -1244228 -1408884 511693 2789900 2679416 803803 330408
37218 330408 2158177 3893234 3705405 2498161 1683089 1049034 -262882 -2215608 -4035490
37209 -4035490 -4829022 -3751887 -696201 2970467 5383489 5973450 5379498 3973837 1885394
37200 1885394 183956 181388 1325600 1540059 144787 -1181040 -971222 83296 631022
37191 631022 649877 791665 867741 306291 -524637 -616510 349678 1776198 2990653 3717262
37181 3717262 3969511 3952314 3922465 3986358 4252163 4944840 5741221 5361893 2988575 -36626
37171 -36626 -1385060 -804774 -444628 -1705520 -3488458 -4312760 -4366695 -4300981 -3705278 -2320627
37161 -2320627 -1326724 -1722446 -2601323 -2686900 -2384928 -2559747 -2596645 -1816567 -1565239 -3271697
37151 -3271697 -5299637 -4678643 -1659984 377164 -387736 -2465993 -4181439 -5502525
37143 -5502525 -6139915 -4910834 -2209861 -404060 -433937 -557605 233074 386574 -867633
37134 -867633 -1290583 765666 3082766 2871759 1236903 976534 1532127 -12281 -3560761
37125 -3560761 -5540203 -4180776 -1926279 -1574680 -2655556 -2988325 -1989852 -1052101 -1581701
37116 -1581701 -3471288 -5046072 -4588678 -2562220 -1617722 -3211656 -5210056 -4719757 -2369315
37107 -2369315 -1211862 -1869493 -1884218 -204263 922325 -275868 -2252371 -2785792 -2145450
37098 -2145450 -1673352 -1144801 247533 1699793 1864108 1187966 1059038 1285772 581529
37089 581529 -775612 -974053 429081 1615575 1188924 126492 1010 435571 -242671
37080 -242671 -2253104 -3694636 -2917221 -519898 1647224 2671148 2790950 2031425 180540
$$ [...]
##END NTUPLES=NMR SPECTRUM
##END=
