##TITLE=31Pdec_2PEDM2907
 CDCl3, 24 sc
 29.7.2019
##JCAMPDX= 6.0         $$ Bruker NMR JCAMP-DX V2.0
##DATA TYPE= NMR SPECTRUM
##DATA CLASS= NTUPLES
##ORIGIN= UXNMR, Bruker Analytische Messtechnik GmbH
##OWNER= root
$$ XWIN-NMR		Version 3.5
$$ Mon Jul 29 15:53:09 2019 Russian Standard Time (UT+4h)  she@DPX200
##.OBSERVE FREQUENCY= 81.013821
##.OBSERVE NUCLEUS= ^31P
##.ACQUISITION MODE= SIMULTANEOUS
##.ACQUISITION SCHEME= undefined
##.AVERAGES= 24
##.DIGITISER RES= 17
##SPECTROMETER/DATA SYSTEM= spect
##.PULSE SEQUENCE= zgpg30
##.SOLVENT NAME= CDCl3
##.SHIFT REFERENCE= (INTERNAL, CDCl3, 0, 182.463)
##AUDIT TRAIL= $$ (NUMBER, WHEN, WHO, WHERE, WHAT)
$$ ##TITLE= Audit trail, XWIN-NMR		Version 3.5
$$ ##JCAMPDX= 5.01
$$ ##ORIGIN= Bruker BioSpin GmbH
$$ ##OWNER= she
$$ F:/spectra/data/she/nmr/P31/1/pdata/1/auditp.txt
$$ ##AUDIT TRAIL=  $$ (NUMBER, WHEN, WHO, WHERE, WHAT)
(   1,<2019-07-29 15:52:12.14 +0400>,<she>,<DPX200>,
      <created by zg, POWCHK disabled, PULCHK disabled
       configuration hash MD5:
       00 E9 B6 7A A2 85 ED C7 34 08 36 98 17 FE 4E 26
       data hash MD5: 32K
       A1 F7 6E 44 5E B3 D6 75 7A 58 B2 05 F2 F6 DF C5>)
(   2,<2019-07-29 15:52:15.10 +0400>,<she>,<DPX200>,
      <Start of raw data processing
       efp BC_mod = 2 LB = 1 FT_mod = 6 PKNL = 1 PHC0 = -429.9147 PHC1 = 130.4 SI = 64K 
       data hash MD5: 64K
       A2 0F 38 6F 29 75 A5 E8 47 C6 1A 64 49 01 3D 4B>)
(   3,<2019-07-29 15:52:34.76 +0400>,<she>,<DPX200>,
      <pk PHC0 = 24.88164 PHC1 = 0 
       data hash MD5: 64K
       68 A2 E7 E6 81 98 14 0D BE 2D 44 B9 89 2A E1 DF>)
(   4,<2019-07-29 15:52:37.43 +0400>,<she>,<DPX200>,
      <abs ABSG = 5 
       data hash MD5: 64K
       C0 44 63 F4 86 BD 0C 78 40 9D 7A 0E A3 C1 AF AB>)
$$ ##END=
$$ 
$$ hash MD5
$$ B6 F8 C8 52 3D 7B E0 89 76 EE BB 11 A5 86 2F CE
##$RELAX= 
##$RELAX= 
##$RELAX= 
##$RELAX= 
##$RELAX= 
##$RELAX= 
##$RELAX= 
##$RELAX= 
$$ Bruker specific parameters
$$ --------------------------
##$DU= <F:/spectra>
##$EXPNO= 1
##$NAME= <P31>
##$PROCNO= 1
##$TYPE= <nmr>
##$USER= <she>
##$AMP= (0..31)
100 100 100 100 100 100 100 100 100 100 100 100 100 100 100 100 100 100 
100 100 100 100 100 100 100 100 100 100 100 100 100 100 
##$AQSEQ= 0
##$AQ_mod= 1
##$AUNM= <au_zg>
##$AUTOPOS= <>
##$BF1= 81.014009
##$BF2= 200.13
##$BF3= 200.13
##$BF4= 200.13
##$BF5= 200.13
##$BF6= 200.13
##$BF7= 200.13
##$BF8= 200.13
##$BYTORDA= 1
##$CFDGTYP= 0
##$CFRGTYP= 5
##$CHEMSTR= <none>
##$CNST= (0..31)
1 1 145 1 1 1 1 1 1 1 1 1 1 1 1 1 1 1 1 1 1 1 1 1 1 1 1 1 1 1 1 1 
##$CPDPRG= <waltz16>
##$CPDPRG1= <>
##$CPDPRG2= <waltz16>
##$CPDPRG3= <>
##$CPDPRG4= <mlev>
##$CPDPRG5= <mlev>
##$CPDPRG6= <mlev>
##$CPDPRG7= <mlev>
##$CPDPRG8= <mlev>
##$CPDPRGB= <>
##$CPDPRGT= <>
##$D= (0..31)
0 1 0 0 0 0 0 0 0 0 0 0.03 2e-05 3e-06 0 0 0 0 0 0 0 0 0 0 0 0 0 0 0 0 
0 0 
##$DATE= 1564401131
##$DBL= (0..7)
120 120 120 11 120 120 24 19 
##$DBP= (0..7)
150 150 150 150 150 150 150 150 
##$DBP07= 0
##$DBPNAM0= <>
##$DBPNAM1= <>
##$DBPNAM2= <>
$$ [...]
##$SUBNAM3= <"">
##$SUBNAM4= <"">
##$SUBNAM5= <"">
##$SUBNAM6= <"">
##$SUBNAM7= <"">
##$SUBNAM8= <"">
##$SUBNAM9= <"">
##$SW= 369.568048894756
##$SWIBOX= (0..15)
0 1 3 0 0 0 0 0 0 0 0 0 0 0 0 0 
##$SW_h= 29940.119760479
##$TD= 32768
##$TD0= 1
##$TE= 0
##$TE2= 300
##$TE3= 300
##$TEG= 300
##$TL= (0..7)
0 120 53 12 22 120 120 120 
##$TP= (0..7)
150 150 150 150 150 150 150 150 
##$TP07= 0
##$TPNAME0= <>
##$TPNAME1= <>
##$TPNAME2= <>
##$TPNAME3= <>
##$TPNAME4= <>
##$TPNAME5= <>
##$TPNAME6= <>
##$TPNAME7= <>
##$TPOAL= (0..7)
0.5 0.5 0.5 0.5 0.5 0.5 0.5 0.5 
##$TPOFFS= (0..7)
0 0 0 0 0 0 0 0 
##$TUNHIN= 0
##$TUNHOUT= 0
##$TUNXOUT= 0
##$USERA1= <user>
##$USERA2= <user>
##$USERA3= <user>
##$USERA4= <user>
##$USERA5= <user>
##$V9= 5
##$VALIST= <valist>
##$VCLIST= <CCCCCCCCCCCCCCC>
##$VD= 0
##$VDLIST= <DDDDDDDDDDDDDDD>
##$VPLIST= <PPPPPPPPPPPPPPP>
##$VTLIST= <TTTTTTTTTTTTTTT>
##$WBST= 1024
##$WBSW= 4
##$XGAIN= (0..3)
0 0 0 0 
##$XL= 0
##$YL= 0
##$YMAX_a= 52647
##$YMIN_a= -52989
##$ZGOPTNS= <>
##$ZL1= 120
##$ZL2= 120
##$ZL3= 120
##$ZL4= 120
##$ABSF1= 182.463
##$ABSF2= -187.1042
##$ABSG= 5
##$ABSL= 3
##$ALPHA= 0
##$AQORDER= 0
##$ASSFAC= 0
##$ASSFACI= 0
##$ASSFACX= 0
##$ASSWID= 0
##$AUNMP= <proc_1d>
##$AZFE= 0.1
##$AZFW= 0.5
##$BCFW= 0
##$BC_mod= 2
##$BYTORDP= 0
##$COROFFS= 0
##$CY= -3
##$DATMOD= 1
##$DC= 0
##$DFILT= <>
##$DTYPP= 0
##$F1P= 0
##$F2P= 0
##$FCOR= 1
##$FTSIZE= 65536
##$FT_mod= 6
##$GAMMA= 0
##$GB= 0
##$INTBC= 1
##$INTSCL= 5.30512e-09
##$ISEN= 30
##$LB= 1
##$LEV0= 0
##$LPBIN= 0
##$MAXI= 10000
##$MC2= 0
##$MEAN= 0
##$ME_mod= 0
##$MI= 50
##$NCOEF= 0
##$NC_proc= -3
##$NLEV= 6
##$NOISF1= 182.463
##$NOISF2= 159.3651
##$NSP= 0
##$NTH_PI= 0
##$NZP= 0
##$OFFSET= 182.463
##$PC= 4
##$PHC0= -405.0331
##$PHC1= 130.4
##$PH_mod= 1
##$PKNL= yes
##$PPARMOD= 0
##$PSCAL= 0
##$PSIGN= 0
##$REVERSE= no
##$SF= 81.0140089999434
##$SI= 65536
##$SIGF1= 159.3651
##$SIGF2= -187.1042
##$SINO= 113.3802
##$SIOLD= 16384
##$SREGLST= <1H.CDCl3>
##$SSB= 0
##$STSI= 65536
##$STSR= 0
##$SW_p= 29940.119760479
##$SYMM= 0
##$S_DEV= 0
##$TDeff= 32768
##$TDoff= 0
##$TI= <>
##$TILT= no
##$TM1= 0
##$TM2= 0
##$TOPLEV= 0
##$USERP1= <user>
##$USERP2= <user>
##$USERP3= <user>
##$USERP4= <user>
##$USERP5= <user>
##$WDW= 1
##$XDIM= 65536
##$YMAX_p= 344762918
##$YMIN_p= -3412244
$$ End of Bruker specific parameters
$$ ---------------------------------
##NTUPLES= NMR SPECTRUM
##VAR_NAME=  FREQUENCY,     SPECTRUM/REAL,   SPECTRUM/IMAG
##SYMBOL=    X,             R,               I
##VAR_TYPE=  INDEPENDENT,   DEPENDENT,       DEPENDENT
##VAR_FORM=  AFFN,          ASDF,            ASDF
##VAR_DIM=   65536,         65536,           65536
##UNITS=     HZ,            ARBITRARY UNITS, ARBITRARY UNITS
##FACTOR=    0.456856943014862, 1,           1
##FIRST=     14782.0589164792, 0,            0
##LAST=      -15158.0608439998, 0,           0
##MIN=       -15158.0608439998, -3412244,    0
##MAX=       14782.0589164792, 344762918,    0
$$ Real data points
##PAGE= N=1
##DATA TABLE= (X++(R..R)), XYDATA
$$ [...]
41317A13042J07953l0718j89318k47952r1536J88770K80726M9919j99123j29241
$$ 113042 220995 190277 959 -246993 -338529 -149759 130967 180886 -18237 -147478
41307a47478J26480K07121J11514J12662J86934M1378k82008l67936j14756N6206
$$ -147478 -20998 186123 297637 410299 597233 638611 356603 -11333 -126089 -69883
41297f9883j10870k85632j12261K21203L25589J94751P8318K9244m8798r8943
$$ -69883 -180753 -466385 -578646 -357443 -31854 162897 241215 270459 221661 122718
41287A22718k0236O1343l2936j96594j84307r443R5156M5903l0246m8401l8773
$$ 122718 102482 163825 130889 -65705 -250012 -259455 -164299 -118396 -148642 -197043 -235816
41276b35816j9385j100l9371r5789R113K79786L70760M3555l69470l55961K4350
$$ -235816 -255201 -256301 -295672 -391461 -382348 -102562 268198 311753 -57717 -413678 -389328
41265c89328K25783L1638j93921j43083K1710P2322J02960K37916K96157Q2056
$$ -389328 -163545 -131907 -325828 -468911 -447201 -374879 -271919 -34003 262154 344210
41255C44210k23239k92686j23103K8707O5781J04182J66040J20709m3863j37452
$$ 344210 120971 -171715 -294818 -266111 -200330 -96148 69892 190601 146738 9286
41245I286l1252J60961K38877J39849m7189k02160k55922k09389j13170j2209
$$ 9286 -21966 138995 377872 517721 470532 268372 12450 -196939 -310109 -322318
41235c22318Q4213J61027J70650R7832R197k6980l5318p6658j30297j18413l0839
$$ -322318 -238105 -77078 93572 191404 200601 173621 138303 61645 -68652 -187065 -217904
41224b17904O2962J23009J68830J88589J15573n5622k04027k06102q8379J3651
$$ -217904 -154942 -31933 136897 325486 441059 385437 181410 -24692 -113071 -99420
41214i9420L3465L4907Q2697J30563R8874J3069k7419o971j2616o4357m4732J10694
$$ -99420 -65955 -31048 51649 182212 281086 294155 266736 259765 247149 182792 138060 248754
41202B48754K47280J60872j02652k75004k07783l8314L7805J7907J9258O5959
$$ 248754 496034 656906 554254 279250 71467 33153 70958 88865 108123 174082
41192A74082Q1093L7506j0737l4467o2335j01128j06418n0401L8793J13444J33897
$$ 174082 255175 292681 281944 247477 185142 84014 -22404 -72805 -34012 79432 213329
41181B13329O9143o3835j61196j10996O4073K09695K17852J36408O0465o211r8774
$$ 213329 282472 218637 57441 -53555 10518 220213 438065 574473 634938 628727 529953
41170E29953j62614j03548M0329J08936M2392k8955Q819P3882L7550m5427l0535
$$ 529953 367339 263791 304120 413056 455448 426493 435312 509194 546744 501317 470782
41159D70782M2715j4744k12808l09520j58350O9316J45522R3582N6883J8208j12362
$$ 470782 513497 498753 285945 -23575 -181925 -112609 32913 126495 183378 201586 89224
41148H9224k33741j57394N1232J11202n6548k02841j18719R5940K34065K43383
$$ 89224 -144517 -301911 -250679 -139477 -196025 -398866 -517585 -421645 -187580 55803
41138E5803J64267K580j80993k24972q4589M4599m394j11064p1925O2146Q8474
$$ 55803 220070 222650 41657 -183315 -267904 -223305 -227699 -338763 -410688 -348542 -260068
41127b60068M878o707Q0093Q7465l7658j03940J3003J53522J17237k9446o3600
$$ -260068 -255190 -261897 -181804 -94339 -131997 -235937 -222934 -69412 47825 18379 -45221
41116d5221N8446J50446P5186o8439r5677O678O8083k0447j42824j15942M8430
$$ -45221 13225 163671 238857 170418 74741 81419 149502 129055 -13769 -129711 -81281
41105h1281J69706J71425J57153J74578J07676q0796k03417j28730k2028o7979
$$ -81281 88425 259850 417003 591581 699257 618461 415044 286314 264286 196307
41095A96307j28857O687J77088N5074k56909l04644j0744J63430l7165k30725
$$ 196307 67450 74137 251225 306299 49390 -255254 -265998 -102568 -139733 -370458
41085c70458k6037L25189L25364k284k07019j08387N0769P6837L2463j9497j04935
$$ -370458 -396495 -71306 254058 251774 44755 -63632 -12863 63974 96437 76940 -27995
41074b7995j47426k1674J68667J75538k70j04573m6976k773n4214o7864m384n504
$$ -27995 -175421 -197095 -28428 147110 146840 42267 -4709 -7482 -61696 -129560 -133944 -139448
41062a39448p0601m350J78097J71979r8375k62520o7188K01740J84063O975k103
$$ -139448 -210049 -214399 -36302 135677 37302 -225218 -292406 -90666 93397 100372 98269
41051I8269J11954Q7054l2110K820J40803J06415q1540j35120l0840m7157k23405
$$ 98269 210223 297277 265167 267987 408790 515205 433665 298545 267705 220548 -2857
41040b857k53571l2845J45042J07665Q2676K20596K54932l4547l62152l29042
$$ -2857 -256428 -289273 -144231 -36566 46110 266706 521638 487091 124939 -204103
41030b04103l3595J13020K0857l5615O9671J55415J01836L3490N3907P2517N188
$$ -204103 -237698 -124678 -103821 -139436 -69765 85650 187486 220976 274883 347400 352588
41019C52588o4136m0599J8358J0442n0760q4567q1220j01211j63259j91774r1281
$$ 352588 288452 247853 266211 276653 225893 141326 60106 -41105 -204364 -396138 -487419
41008d87419J22149K80570K22443J1410j02555m754J14952L1203j79179k36927
$$ -487419 -365270 -84700 137743 149153 46598 41844 156796 187999 8820 -228107
40998b28107m8483J84497K45188J34899j30m6498P475Q4894Q0969j6368q5110
$$ -228107 -276590 -92093 153095 287994 287864 241366 248841 333735 414704 398336 313226
40987C13226l6837K4686m8277j82278j56612M9196J91417J14506k9443l6692L5245
$$ 313226 276389 301075 252798 70520 -86092 -36896 154521 269027 239584 202892 238137
40976B38137j7158k07982l23812k09003M8041K39927K64287J83002J01950M3049
$$ 238137 220979 12997 -310815 -519818 -471777 -231850 32437 215439 317389 360438
40966C60438m1570j46230j73825p2708N1988O0134l0211q9012q5710j06395j59737
$$ 360438 318868 172638 -1187 -73895 -21907 38227 8016 -80996 -166706 -273101 -432838
40955d32838j36579p381J04679J16868R5838R4350N1110l6612k5761J23443J86403
$$ -432838 -569417 -576798 -472119 -355251 -259413 -165063 -113953 -150565 -176326 -52883 133520
40944A33520j1875k56672j98346J16603K77853R7708j38234j18356O0538R8655
$$ 133520 121645 -135027 -333373 -216770 61083 158791 20557 -97799 -37261 61394
40934F1394m9224j56120q2170O9794J56404J70938J68553J45306P1788k6265r9808
$$ 61394 12170 -143950 -226120 -156326 78 171016 339569 484875 556663 530398 430590
40923D30590j52104k11218k44257j79766l3704O7374M9138R616P5622J80946J39180
$$ 430590 278486 67268 -176989 -356755 -390459 -323085 -273947 -264331 -188709 -7763 131417
40912A31417m5411j21061N5177K68242K29152o949j35404o1173Q90q7917j73544
$$ 131417 86006 -35055 20122 288364 517516 510567 375163 313990 314880 226963 53419
40901E3419r5449L9495M8153l0228k9047O3460J22586J14544J01526O5920n8907
$$ 53419 -42030 -2535 45618 15390 -13657 49803 172389 286933 388459 454379 395472
40890C95472j96081j80211l1780L3454o6395j41825l3246J26867J14640m0179
$$ 395472 199391 19180 -12600 20854 -45541 -187366 -220612 -93745 20895 -19284
40880a9284r7155M4469K05695J70260m0113j97403j40713L9685J25213N3487j1888
$$ -19284 -116439 -71970 133725 303985 263872 66469 -74244 -34559 90654 144141 132253
40869A32253N4863J28073K8933j52311j63709k589N9008p3973j38937N1667K73175
$$ 132253 187116 315189 344122 191811 28102 25513 84521 10548 -128389 -76722 196453
40858A96453K31386K0277o5006r085k8388j41418j54925n7120n8999j95955k30265
$$ 196453 427839 448116 383110 374025 345637 204219 49294 -7826 -66825 -262780 -493045
40847d93045n2678J23314J05127k510j4133O6960J41375J79100J65369P2018j4112
$$ -493045 -545723 -422409 -317282 -319792 -333925 -266965 -125590 53510 218879 290897 276785
40836B76785M8959J71297O6719k88085n19524l74270q1796L8060L9971J24406
$$ 276785 325744 497041 563760 275675 -243849 -618119 -699915 -661855 -621884 -497478
40826d97478K13415J26629k5022k2372L6234r3301l11826k92229k8168J65425
$$ -497478 -284063 -157434 -182456 -204828 -168594 -261895 -573721 -865950 -894118 -728693
40816g28693J82703K17071L00608K16041l8541j46558J0200J46192P1463q631
$$ -728693 -545990 -328919 -28311 187730 149189 2631 12831 159023 230486 221855
40806B21855O7705P4603j79889m16546k67539J16330K48403j641k62454j94420
$$ 221855 289560 364163 184274 -232272 -499811 -383481 -135078 -136719 -399173 -593593
40796e93593J23602L74011L56492J20476j24355k02173j36081q8669j16848j04449
$$ -593593 -469991 -95980 260512 380988 256633 54460 -81621 -170290 -287138 -391587
40786c91587R487J03700Q3487M7866J04635J72060J26508J1540o3048r9721j30699
$$ -391587 -382100 -278400 -194913 -147047 -42412 129648 256156 267696 204648 104927 -25772
40775b5772r9225L840L5117p4724j43157r418J61436J11252r4753j76966q6230
$$ -25772 -124997 -121157 -86040 -160764 -303921 -313339 -151903 -40651 -135404 -312370 -398600
40764c98600k9017p8096o9937P8826K26394K36491J28917m4113k50951l64119
$$ -398600 -427617 -505713 -575650 -496824 -270430 -33939 94978 50865 -200086 -564205
40754e64205k21533J10974L34949K72955O6695n6704n5770k0210Q404M4523P8323
$$ -564205 -785738 -674764 -339815 -66860 -165 -56869 -112639 -132849 -124445 -79922 -1599
40743a599Q3818N6884r41q2390j39324j14332k1975N8755P0606J1220q0121j15302
$$ -1599 82219 139103 138162 55772 -83552 -197884 -219859 -161104 -90498 -79278 -159399 -274701
40731b74701j5082J45326J57698k7981j61075k3463K10766J94626q1069k74334
$$ -274701 -289783 -144457 13241 -14740 -175815 -199278 11488 206114 125045 -149289
40721a49289j83160K3734J08326M4299p2461j68455j62127J2668K61012L70576
$$ -149289 -332449 -308715 -200389 -156090 -228551 -397006 -559133 -546465 -285453 85123
40711H5123K74474J19931L1775k1134p9712r8646n7443p768K7106M4806l0560
$$ 85123 359597 479528 511303 490169 410457 311811 254368 246600 273706 318512 287952
40700B87952k26726l34867j25556K37390L31088Q4617j07252m633J32885L5818
$$ 287952 61226 -273641 -399197 -161807 169281 253898 146646 142013 274898 310716
40690C10716j17929m6979J37540J42217k2307j27208j33576j62844j86641r0392
$$ 310716 192787 145808 283348 425565 403258 276050 142474 -20370 -207011 -297403
40680b97403M8610P4308N4718J41969K19058N6587k26306k58265O694K03767J30537
$$ -297403 -248793 -174485 -119767 22202 241260 297847 71541 -186724 -180030 23737 154274
40669A54274K2318J03842K13917J04400j47271k75189k04357p0662J8314N0781
$$ 154274 176592 280434 494351 598751 451480 176291 -28066 -98728 -80414 -29633
40659b9633K9692j3549P47P5657Q0268n2012j64190p2527J47456K40848J07014
$$ -29633 59 -13490 -12743 62914 143182 91170 -73020 -145547 1909 242757 349771
40648C49771j03185k12415j89070q3998N7072J68845J73262Q1302N349O150M281
$$ 349771 246586 34171 -154899 -238897 -181825 -12980 160282 241584 246933 253083 257364
40637B57364p9510j66847j15461N9133J74725J11205m9462j45001j09545J1407
$$ 257364 177854 11007 -104454 -45321 129404 240609 191147 46146 -63399 -51992
40627e1992J36054J78533Q8753o5773j32332o6394q602o9448j35446l9123J55200
$$ -51992 84062 262595 351348 285575 153243 86849 78247 8799 -126647 -165770 -10570
40616a0570K23855J06472m1348j09186j37648j45827p5423L5142L6408q4804j44325
$$ -10570 213285 319757 278409 169223 31575 -114252 -189675 -154533 -118125 -202929 -347254
40605c47254m5653P3268Q7630O7421P5365J2450j45902j83365L4250K53263J51993
$$ -347254 -392907 -319639 -232009 -164588 -89223 -76773 -222675 -406040 -371790 -118527 33466
40594C3466j56690k70411q3439J15659J41908J55697K91722L58542J35916k17800
$$ 33466 -123224 -393635 -477074 -361415 -219507 -63810 227912 586454 722370 504570
40584E04570l24325j02765J09596J9089k14984j96492J44329M23380L17898K206
$$ 504570 180245 77480 187076 206165 -8819 -205311 -60982 362398 680296 682502
40574F82502j35892n8071m0427j42686j12804J09640K14086L8836j21327j8320
$$ 682502 546610 488539 448112 305426 192622 302262 516348 555184 433857 415537
40564D15537R8144p8296l21616k12533J31486K07056o9891k57004j20254M6781
$$ 415537 513681 435385 113769 -98764 32722 239778 169887 -87117 -207371 -160590
40554a60590k3873j68021j51501n3226k8499O261J75532L50502L19305J15494
$$ -160590 -184463 -352484 -503985 -557211 -585710 -579449 -403917 -53415 265890 381384
40544C81384l9095l0519O2334J03648J9703j42830k28566j39147J0271L9357k1134
$$ 381384 342289 311770 374104 477752 497455 354625 126059 -13088 -2817 36540 15406
40533A5406o219N6279k5292k22495k48260m152K34558K26661Q3344J3083O967
$$ 15406 9187 65466 40174 -182321 -430581 -434733 -200175 26486 109830 122913 129880
40522A29880l2546p6741p5044p3756o8436M6159K25970K28935m476j90362j29358
$$ 129880 97334 20593 -54451 -128207 -196643 -150484 75486 304421 299945 109583 -19775
40511a9775r913l5453n5217J06059K37462P0995j97825j75113Q3894J65086k8601
$$ -19775 -29688 -65141 -120358 -14299 223163 294158 96333 -78780 5114 170200 141599
40500A41599j61758m2179J30117J62597J17879N7530q5311k39759j62655J42327
$$ 141599 -20159 -62338 67779 230376 348255 405785 320474 80715 -81940 60387
40490F0387K92118M4273l15038l65281j25550N3399L0345m606Q8587J85159J30939
$$ 60387 352505 396778 81740 -283541 -409091 -355692 -325347 -329953 -241366 -56207 74732
40479G4732j0181o5978q619K8374l8228j20819r5903Q398M9797j7984q0295m2184
$$ 74732 64551 -1427 -10046 18328 -19900 -140719 -236622 -228224 -178427 -196411 -276706 -318890
40467c18890L0808K8990k7157k8675N5040J42955J46979M8381q7420j32031j2092
$$ -318890 -288082 -259092 -286249 -314924 -259884 -116929 30050 78431 -8989 -141020 -153112
40456a53112J46104J12986j20429k63796j08526J59441K16857N0136q7822q5556
$$ -153112 -7008 105978 -14451 -278247 -386773 -227332 -10475 39661 -48161 -133717
40446a33717o9854j08975q6610O5489K19742K29060J09006k3868q6652o6197j8646
$$ -133717 -203571 -312546 -399156 -333667 -113925 115135 224141 200273 113621 47424 28778
40435B8778m2404j54564k15918r8502J06145J91368J18154L0630J1154J351l1409
$$ 28778 -13626 -168190 -384108 -482610 -376465 -185097 -66943 -36313 -25159 -23808 -55217
40424e5217l0918J9295N8720N6888K4701n5098j56228j29754R3827K82515J51396
$$ -55217 -86135 -66840 -8120 48768 73469 18371 -137857 -267611 -173784 108731 260127
40413B60127j87418l25735j34020Q7052R7668J9611J3518o461j29030k06786j04813
$$ 260127 72709 -253026 -387046 -299994 -202326 -182715 -169197 -175658 -304688 -511474 -616287
40402f16287M6938R1648J16311K27364K68659O9932j86213j80165N6407J91715
$$ -616287 -569349 -477701 -361390 -134026 134633 204565 18352 -161813 -105406 86309
40392H6309Q7174o6247r6802n0289j0819K3093L4518k2636q7028m5601M0477j4869
$$ 86309 173483 107236 10434 -39855 -50674 -27581 6937 -15699 -102727 -148328 -107851 -122720
40380a22720j94760k37061k2141K21304K49923J48945J39067J90152Q9469j57133
$$ -122720 -317480 -554541 -576682 -355378 -105455 43490 182557 372709 462178 305045
40370C05045k67858r1657J51789J78805L1338l2742M4571N4089j09393k47221
$$ 305045 37187 -54470 97319 276124 307462 274720 319291 373380 263987 16766
40360A6766j60672L0326P5163k1395n0739J5916j2537j61008j60171J37970M50932
$$ 16766 -143906 -113580 -38417 -59812 -110551 -94635 -107172 -268180 -428351 -290381 160551
40349A60551M01777K7339k83874k94206j34778l5487m4165o5118k8566N4747J27250
$$ 160551 562328 589667 305793 11587 -123191 -158678 -202843 -267961 -296527 -241780 -114530
40338a14530J19123K261j51813k03724p3600J61481L07968K22573k6905j92399
$$ -114530 4593 6854 -144959 -348683 -422283 -260802 47166 269739 242834 50435
40328E0435j02644J26472K24066R2494j12888k27589k42460j89770n1172J23602
$$ 50435 -52209 74263 298329 390823 277935 50346 -192114 -381884 -433056 -309454
40318c09454J78459P2724o08J18982K93220K69505M8840j24939j04211J4065P2328
$$ -309454 -130995 -58271 -58879 60103 353323 622828 671668 546729 442518 456583 528911
40307E28911L2620m2702q3113p0321o1409j18055j81078j19081L9122P7943q1167
$$ 528911 561531 518829 435716 365395 303986 185931 4853 -114228 -75106 2837 -78330
40296g8330k07063r6340Q5859N7821j16601j30520O1811J79481P2161p7938r1965
$$ -78330 -285393 -381733 -295874 -238053 -354654 -485174 -423363 -243882 -171721 -249659 -341624
40285c41624m3893m6594l4742P1832J69160J09155o9277j87598j40283K3602J68010
$$ -341624 -385517 -432111 -466853 -395021 -225861 -116706 -185983 -373581 -513864 -490262 -322252
40274c22252J73729M7101n8463j4865J00360J12018O412p2820o5894n0003n7673
$$ -322252 -148523 -101422 -159885 -174750 -74390 37628 44040 -28780 -94674 -144677 -202350
40263b02350m0118j3973l5145l0455J03534K36679J32112j37150k34188r1152
$$ -202350 -242468 -256441 -291586 -322041 -218507 18172 150284 13134 -221054 -312206
40253c12206j9140j50950j85439P7364L45072L03193J21580R6797J02607j24911
$$ -312206 -331346 -482296 -667735 -590371 -245299 57894 179474 276271 378878 253967
40243B53967l88174k61829J79757M12194K36182m250l9137j8988j04571j56697
$$ 253967 -134207 -396036 -216279 195915 432097 427847 388710 369722 265151 108454
40233A08454n0867N9113K7338k5521L3915R3089J5742r6134q8010j4693k52k72
$$ 108454 57587 116700 144038 118517 152432 245521 261263 165129 77119 62426 62174 61902
40221F1902Q2255J80380J64596M9451p2046j82406k69994k39677o3726J05938
$$ 61902 144157 324537 489133 538584 466538 284132 14138 -225539 -289265 -183327
40211a83327J40924J13068J06711L6279j36075j97873N152K15332P4255k98557
$$ -183327 -42403 70665 177376 213655 77580 -120293 -115141 100191 174446 -124111
40201a24111m26424j67456J11401J25000M1075R1326J65737O4920r8276o9607
$$ -124111 -550535 -717991 -606590 -481590 -440515 -349189 -183452 -118532 -216808 -286415
40191b86415J13058J69812K0012j02833j2091J72255K09728M7796j47536j99205
$$ -286415 -173357 -3545 16467 -86366 -98457 73798 283526 331322 183786 -15419
40181a5419q8379N4779R3351K4241k8048K4982J11101Q9985m8438j55487j13873
$$ -15419 -103798 -49019 44332 68573 40525 65507 176608 266593 218155 62668 -51205
40170e1205J0515O0118p907q0028n7322O392o022r3633j35158o4862M5019J05536
$$ -51205 -40690 19428 11521 -68507 -125829 -119437 -125459 -219092 -354250 -419112 -374093 -268557
40158b68557J17219J00905K4863j06957j83026j21121p761L3307M3056J26359
$$ -268557 -151338 -50433 -25570 -132527 -315553 -436674 -444435 -411128 -368072 -241713
40148b41713K03614R2341j51229k23880n686K23998J59864j10514k52633j35514
$$ -241713 -38099 54242 -96987 -320867 -326553 -102555 57309 -53205 -305838 -441352
40138d41352O6797J65613J51454R8710M0617j8384o3492p6747l8205O4605J83443
$$ -441352 -374555 -208942 -57488 41222 81839 63455 -37 -76784 -114989 -50384 133059
40127A33059K14336J22410N857m2647p0402j59145k54404k34708j08263M311O3958
$$ 133059 347395 469805 475662 433015 362613 203468 -50936 -285644 -393907 -389596 -325638
40116c25638J41509K48235K84860J95851N7667k7078l2982J0173M9879J2957j17959
$$ -325638 -184129 64106 348966 544817 602484 575406 542424 552597 602476 615433 497474
40105D97474k19953j46548M4829J20249j8380j84563j64519o918P3076M432p5771
$$ 497474 277521 130973 175802 296051 277671 93108 -71411 -78329 -5253 -821 -76592
40094g6592n5966l740k8407q5065k6098J58979K66693J25391j42111k38775q6473
$$ -76592 -132558 -136298 -164705 -249770 -275868 -116889 149804 275195 133084 -105691 -192164
40083a92164N9567k5472k09408k01909K3265K14151K13344J26999R5497R7721
$$ -192164 -132597 -158069 -367477 -569386 -546121 -331970 -118626 8373 103870 201591
40073B01591O0580J950l2593n7785q8118q8081n3347m3929p1057n3871M0199J17093
$$ 201591 262171 264121 231528 173743 85625 -2456 -55803 -99732 -170789 -224660 -184461 -67368
40061f7368J01060N5670O0119N5520o1503k45233l27111k30162o3933J5276j3490
$$ -67368 33692 89362 149481 205001 143498 -101735 -428846 -659008 -722941 -707665 -721155
40050g21155k6821P1111J96736J74054m326j12740P390J87126J46931q9530k22891
$$ -721155 -747976 -676865 -480129 -306075 -310401 -423141 -415751 -228625 -81694 -171224 -394115
40039c94115j10196P4890J53167J57406J51179Q2907m1020o8839L9807Q0896p4060
$$ -394115 -504311 -429421 -276254 -118848 32331 115238 74218 5379 45186 126082 52022
40028E2022k22650j27687J01038J82400Q9394J8037K3720j2572r4168q4199J0984
$$ 52022 -170628 -298315 -197277 -14877 74517 92554 116274 103702 9534 -74665 -63681
40017f3681J1007j22392j84227m4814J33903J37144Q089l3651Q4912J89283R2585
$$ -63681 -52674 -175066 -359293 -404107 -270204 -133060 -124971 -158622 -73710 115573 208158
40006B08158j48154k75286j40203R5520J57066J7206r2983m5345J9527k2433m9421
$$ 208158 60004 -215282 -355485 -259965 -102899 -85693 -178676 -224021 -204494 -226927 -276348
39995b76348P0322J99750J32626n2500j01504K0405J04304M3371m5104n5652l0524
$$ -276348 -206026 -6276 126350 73850 -27654 -7249 97055 140426 95322 39670 9146
39984I146k2870r370J8215K1280J332P97J9313L0541M0393K9653o5507j87706
$$ 9146 -13724 -23094 -4879 16401 17733 18530 37843 68384 108777 138430 72923 -114783
39972a14783j19624J90880M20602K55976j34550l25088k32570j33580j37831n8708
$$ -114783 -234407 -43527 377075 633051 498501 173413 -59157 -192737 -330568 -389276
39962c89276J54257K61363J32453m3042q4156n5434m5034J821Q6587P1194o5321
$$ -389276 -235019 26344 158797 115755 31599 -23835 -68869 -67048 19539 90733 25412
39951B5412j39884o7951L089j6869j3948O0317O7633k5441m3528M9165L0072j54268
$$ 25412 -114472 -182423 -179334 -196203 -210151 -149834 -82201 -107642 -151170 -102005 -71933 -226201
39939b26201j96345P2451L28409K26894o4728j62299m5659L2046J2931K4337N1464
$$ -226201 -422546 -350095 -21686 205208 140480 -21819 -67478 -35432 -22501 1836 53300
39928E3300o780p3516l2325n331j40430k53396q1209K05717J87080j33830k88182
$$ 53300 46520 -26996 -59321 -64652 -205082 -458478 -539687 -333970 -146890 -280720 -568902
39917e68902l9701K84681L02074P3812q4476m5491O4582R1065j217j20073j24639
$$ -568902 -608603 -323922 -21848 51964 -32512 -78003 -13421 77644 76427 -43646 -168285
39906a68285J5325J49764J37657M8662K9363M1530o1543k37542k63930o1471J85875
$$ -168285 -152960 -3196 134461 183123 212486 254016 192473 -45069 -308999 -370470 -184595
39895a84595K70517J73521K1546m9768n21N7066k5807j84995j66856O5460J73920
$$ -184595 85922 259443 280989 231221 230700 287766 261959 76964 -89892 -24432 149488
39884A49488o4481l36826k15693J68418L06147Q1433j00718J5295J87742J25804
$$ 149488 85007 -251819 -467512 -299094 7053 88486 -12232 3063 190805 316609
39874C16609r0060k07614j42175K8790J84509J82762j6188j98291j11657J40387
$$ 316609 226549 18935 -123240 -94450 90059 272821 256633 58342 -53315 87072
39864H7072K03360k236j75884j14221L8306R9982Q4421K6436r7382j76294l3014
$$ 87072 290432 288196 112312 -1909 36397 136379 220800 247236 149854 -26440 -59454
39853e9454K15938K30141j3208j43761j748J16280M848j11892m2576K1626p3097
$$ -59454 156484 386625 373417 229656 227908 344188 349036 237144 194568 216194 143097
39842A43097j17219J3685L2248k17607l36631o530L56775K05149k10809k15203
$$ 143097 25878 39563 71811 -145796 -482427 -488957 -132182 72967 -137842 -353045
39832c53045J94274L72892R5052j55286m9047J21193M6615j10149j06112k7946
$$ -353045 -158771 214121 309173 153887 104840 226033 272648 162499 56387 28441
39822B8441k8510k9509N5312J16522Q4917P4646J10118K6469j72292j95878O1384
$$ 28441 -69 -29578 25734 142256 227173 301819 411937 438406 266114 70236 131620
39811A31620K60367J04568k02360k91396j69330r3093j03882m2271R5212J51782
$$ 131620 391987 496555 294195 2799 -166531 -259624 -363506 -405777 -310565 -158783
39801a58783J02784O5797N7172j0846j19898j56259j02993k2421J02118K91711
$$ -158783 -55999 9798 66970 56124 -63774 -220033 -323026 -345447 -243329 48382
39791D8382L90206K07940j52520l55273k55557n2124L8680N1283J13816J97416
$$ 48382 438588 646528 494008 138735 -116822 -168946 -130266 -78983 34833 232249
39781B32249J67965J272j72950k12387q8283R7097J86378R8762q9173k20035k09813
$$ 232249 400214 401486 228536 16149 -72134 24963 211341 310103 220930 895 -208918
39770b08918r6443L0329Q9030L9236o0943o9848O2091J74157Q9645j02271j39066
$$ -208918 -305361 -275032 -186002 -146766 -207709 -277557 -215466 -41309 48336 -53935 -193001
39759a93001K8890J53155O5481o7012j6805J42899J64142J5499q5403j3088J06351
$$ -193001 -164111 -10956 54525 -12487 -29292 113607 277749 293248 207845 194757 301108
39748C01108J16497L3237m5813r2925j20654j07084m7884q217l0813n0125R083
$$ 301108 417605 450842 405029 312104 191450 84366 36482 28265 -2548 -52673 -43590
39737d3590R0989P1468m5896r7737L3524K42319K95854J07842j42156k14992j06748
$$ -43590 47399 118867 72971 -24766 8758 251077 546931 654773 512617 297625 190877
39726A90877l6396j16825j78821m0201J74073J89307L250j06069j7930O4016j1499
$$ 190877 154481 37656 -141165 -181366 -7293 182014 185264 79195 61265 125281 113782
39715A13782p7404M0573J80607Q6701j60514k54028j19876K3718L1200k0810m2712
$$ 113782 36378 76951 257558 344259 183745 -70283 -190159 -166441 -135241 -156051 -198763
39704a98763l3833K8964J57425K11188N8633j26404m4036K26073K62187n4679
$$ -198763 -232596 -203632 -46207 164981 223614 97210 53174 279247 541434 486755
39694D86755l17593k07598L7213M8183r7056q2976R1554J65044P9295O935j3471
$$ 486755 169162 -38436 -1223 46960 -50096 -133072 -41518 123526 202821 209756 196285
39683A96285r8842k02002j31032Q0151J53178o816j61434j20472l632J4108j8054
$$ 196285 97443 -104559 -235591 -155440 -2262 -9078 -170512 -290984 -294616 -280508 -298562
39672b98562K6955J09057J08075L9508J2789L9585K5596p2915j83059j98817q6139
$$ -298562 -271607 -162550 -54475 -14967 -2178 37407 63003 -9912 -192971 -391788 -477927
39661d77927P3482J35995M6226o4880k1905J47851K24083R0667r8745j32675j7977
$$ -477927 -404445 -268450 -222224 -287104 -309009 -161158 62925 153592 54847 -77828 -95805
39650i5805O7463L6682j6145K0156J24425J90921J61747O6719l3791r6113r7679
$$ -95805 -28342 8340 -7805 12351 136776 327697 489444 556163 522372 426259 328580
39639C28580n3747l8518j16697k14857j52711J02860L05533K13981m7777j35695
$$ 328580 274833 236315 119618 -95239 -247950 -145090 160443 374424 326647 190952
39629A90952J0645Q3322r0215k55274j40913R3257J10287p8055j67983n5869O0989
$$ 190952 201597 284919 194704 -60570 -201483 -108226 2061 -75994 -243977 -299846 -238857
39618b38857N7155L4550O5039N9247k9564j02928r8131p2165m3388N0209J73325
$$ -238857 -181702 -147152 -82113 -22866 -52430 -155358 -253489 -325654 -369042 -318833 -145508
39607a45508J80039N3559l8641q203L3963N989l570O8903J25714R4173O0203P5642
$$ -145508 34531 88090 49449 41246 75209 81198 77628 146531 272245 366418 426621 502263
39595E02263J8804j80678l40470k50854N222J47976N4989j31979k04884p8387
$$ 502263 521067 340389 -81 -250935 -245713 -97737 -42748 -174727 -379611 -457998
39585d57998J61473L05524J92356q9800k63159j89029j4066P8906R6667J04081
$$ -457998 -296525 8999 201355 111555 -151604 -340633 -354699 -275793 -179126 -75045
39575g5045N8706n5485j01073M298J01732L5020o0669K4726J87310J47412p7429
$$ -75045 -16339 -71824 -172897 -168599 -66867 -31847 -92516 -67790 119520 266932 189503
39564A89503j70729j3125J39026O6939r7044j19750j5055L6673k5649j04344j03026
$$ 189503 18774 5649 144675 211614 114570 -5180 -20235 16438 -9211 -113555 -216581
39553b16581l034J46226K21569J02409j48338k75990j28542J20110J81115L0617
$$ -216581 -219615 -73389 148180 250589 102251 -173739 -302281 -182171 -1056 29561
39543B9561q2339k569J21800O4502j57624k97858j81948R1302K69248K17636L9673
$$ 29561 -52778 -55347 66453 130955 -26669 -324527 -506475 -415173 -145925 71711 111384
39532A11384o6860l6339J5156k9805j11703o6273J26389K62060J58235q3377j85435
$$ 111384 44524 8185 23341 -6464 -118167 -184440 -58051 204009 362244 278867 93432
39521I3432n8352R1467O9101m3429n2551L4205M4030o5033j44837j05756l6363
$$ 93432 35080 126547 195648 152219 99668 133873 177903 112870 -31967 -137723 -174086
39510a74086k1370j0645M4429P3921J9895l8666j4656L4821J5902k9469m533N5749
$$ -174086 -195456 -206101 -161672 -87751 -67856 -106522 -121178 -86357 -70455 -99924 -104457 -48708
39498d8708M2695j8008N830J08795J12442n6103k01316j02897J61670K88359J33528
$$ -48708 -6013 -24021 -18191 90604 203046 146943 -54373 -157270 4400 292759 426287
39487D26287j07679j68786n1288K4508m0641j03882m4478K0198p3127k35376k20013
$$ 426287 318608 149822 98534 123042 82401 -21481 -65959 -45761 -118888 -354264 -574277
39476e74277J0802K18695K23864J23995J01445J69271K16908J87037R0817n8890
$$ -574277 -563475 -344780 -120916 3079 104524 273795 490703 677740 768557 709667
39466G09667k13363k60861j50765L40K6395r2763k25897k47152j41942M088P7659
$$ 709667 496304 235443 84678 85018 111413 18650 -207247 -454399 -596341 -592253 -514594
39455e14594M4416O102Q2267K25040K64008J62705Q2684J24297J63091O0672j02507
$$ -514594 -470178 -464076 -381809 -156769 107239 269944 352628 476925 640016 700688 598181
39444E98181j53549q0855j0418o832l5856n7274l6913N3498J40237O4771j71248
$$ 598181 444632 363777 353359 346527 310671 253397 216484 269982 410219 474990 303742
39433C03742l11339j67265R1463J77323R2211M4989O2542r145j48302j32041P9132
$$ 303742 -7597 -174862 -83399 93924 186135 231124 293666 284521 136219 4178 83310
39422H3310K28827J41293m1673j21951j14326j09580p3843L7468J21750O9483
$$ 83310 312137 453430 411757 289806 175480 65900 -7943 29525 151275 220758
39412B20758m7347r2915q0917j08509j54913j17854q528N3337K8257k900N577
$$ 220758 173411 80496 -421 -108930 -263843 -381697 -390225 -336888 -308631 -311531 -305954
39401c05954j211n9092j07427p7968J5517J19953K11559K73727K58740J35344
$$ -305954 -307165 -366257 -473684 -551652 -536135 -416182 -204623 69104 327844 463188
39391D63188m4165j75354j96304j20279K909J05148J00621m0735k01045j98252
$$ 463188 419023 243669 47365 -72914 -70005 35143 135764 95029 -106016 -304268
39381c04268k3056J09349M4663p5747k5296J39396J47833n1491j87002p8719Q7853
$$ -304268 -327324 -217975 -173312 -249059 -274355 -134959 12874 -38617 -225619 -304338 -216485
39370b16485O7028o7381o8475Q7440J90709J27252j07o4235m2451M6059J63801
$$ -216485 -149457 -216838 -285313 -197873 -7164 120088 119981 55746 13295 59354 223155
39359B23155K04674P4111j51134k67897j79399J3897J59954J88561J01307n3942
$$ 223155 427829 501940 350806 82909 -96490 -82593 77361 265922 367229 313287
39349C13287j74224j64449m6791N0065K8017q7270j75927j21616P3724K45914
$$ 313287 139063 -25386 -72177 -22112 5905 -81365 -257292 -378908 -305184 -59270
39339e9270K17770L0073q6385k6904M3964l3144j53774j22748M8660J99865K60821
$$ -59270 158500 188573 102188 75284 119248 86104 -67670 -190418 -141758 58107 318928
39328C18928K44248J12624j25700k78942j72831O3858J43251N052j59193k17463
$$ 318928 563176 675800 550100 271158 98327 162185 305436 310488 151295 -66168
39318f6168j99989j31528k878J09664J19174R3302J33706J57331M0339j04737
$$ -66168 -266157 -397685 -400563 -290899 -171725 -78423 55283 212614 252953 148216
39308A48216q5764J3979k9470j54350j01593R8567J46073k787o6684L8226O2062
$$ 148216 62452 76431 46961 -107389 -208982 -110415 35658 32871 -33813 4413 66475
39297F6475p8373j29890k493L2920j25599j53465J28035L66092K31808l3074m0053
$$ 66475 -11898 -141788 -144281 -111361 -236960 -390425 -262390 103702 335510 302436 262383
39286B62383J18801J20859L424J8499J11369L4787j61446k20410j46105j34770
$$ 262383 381184 502043 505467 523966 635335 670122 508676 288266 142161 7391
39276G391j39872L1913K60068K26152k7992j35501j9789R130j53623k12812k4747
$$ 7391 -132481 -100568 159500 385652 357660 222159 202370 211500 57877 -154935 -179682
39265a79682J22413J3480j19007j7543J46884Q4884j09216j33679J1241N9710
$$ -179682 -57269 -43789 -162796 -180339 -33455 51429 -57787 -191466 -180225 -120515
39255a20515n1050r5494M6681K04236J92228N2291p9135j66942k25521k00339
$$ -120515 -171565 -267059 -220378 -16142 176086 228377 149242 -17700 -243221 -443560
39245d43560m2289J62868K66479K33540J39714J5985j63192l17362k53504P0886
$$ -443560 -485849 -322981 -56502 177038 316752 332737 169545 -147817 -401321 -330435
39235c30435M02751M59060K58396L8771p5053j34279j60841j18588p8975j63149
$$ -330435 72316 531376 789772 828543 753490 619211 458370 339782 260807 97658
39225I7658k91006k49895o6764j9632j73715k20702L7141L40222L59235J76237
$$ 97658 -193348 -443243 -510007 -529639 -703354 -924056 -886915 -546693 -187458 -11221
39215a1221Q5040J17600R7121J5323J3763O9664K2778j19619j88433j40002q3183
$$ -11221 73819 191419 288540 303863 317626 387290 410068 290449 102016 -37986 -121169
39204a21169n1498K913K6770o2944j54724n6616J78393L02356K37667J27008L0992
$$ -121169 -172667 -169754 -142984 -205928 -360652 -417268 -238875 63481 301148 428156 459148
39193D59148j27564k96990k86498r5506L5804K882j0387J21920K32716J42165
$$ 459148 331584 34594 -251904 -347410 -311606 -308724 -319111 -197191 35525 177690
39183A77690m5806j20602p5178m4139m6823J2219J35631J92023R6818o0039j04565
$$ 177690 131884 11282 -63896 -108035 -154858 -142639 -7008 185015 281833 221794 117229
39172A17229K1082J71746J52036l6980j82903j35660R163P6728L9865k7771q7430
$$ 117229 138311 310057 462093 425113 242210 106550 115713 192441 232306 204535 117105
39161A17105q8316N4972K61810K46002q3263l66068k48671O7893J17207j17723
$$ 117105 28789 83761 345571 591573 508310 142242 -106429 -38536 78671 -39052
39151c9052k31417q8009J9343m3110j9198K08840L38975J57886p2190m4336J05288
$$ -39052 -270469 -358478 -339135 -382245 -401443 -192603 146372 304258 232068 187732 293020
39140B93020P2070j16718k12582j59343p9045L82J08692J53129N1368o1356j4202
$$ 293020 365090 248372 35790 -123553 -202598 -202216 -93524 59605 110973 49617 35415
39129C5415J06819R4713l7562r8494l6440J8604p307o1263j00844j21468q1601
$$ 35415 142234 236947 199385 100891 64451 83055 75748 14485 -86359 -207827 -289428
39118b89428L6809J39355J40156J03487J09853P5275r9611k82306k45159j5769
$$ -289428 -252619 -113264 26892 130379 240232 315507 215896 -66410 -311569 -327338
39108c27338J44044J14053M3997O6509R8427K2820r7350j12053K176J24528J38532
$$ -327338 -183294 -69241 -25244 41265 139692 162512 65162 -46891 -44715 79813 218345
39097B18345L4145j01291j52457p4991L9843L8789j12439k51414j80962Q6883
$$ 218345 252490 151199 -1258 -76249 -36406 2383 -110056 -361470 -542432 -455549
39087d55549L06654K61306Q841k01701k32973j65952r9609n805J32612K00827
$$ -455549 -148895 112411 121252 -80449 -313422 -479374 -578983 -584788 -452176 -251349
39077b51349J24446L7902R0649J83406J19157n2779r6569L3109J36737J03344
$$ -251349 -126903 -89001 1648 185054 304211 251432 154863 187972 324709 428053
39067D28053L4453m762r0902k22994k53012j40714m6086n5391m0405Q1677J66802
$$ 428053 462506 457744 366842 143848 -109164 -249878 -295964 -351355 -391760 -310083 -143281
39056a43281P8641p8142j17087j8206J11597J91427J78485O8044l7993j4900P5153
$$ -143281 -64640 -142782 -259869 -278075 -166478 24949 203434 271478 233485 218585 293738
39045B93738L9568j28514k10325j03297L6673P1992M6415j0194j52429k92644
$$ 293738 333306 204792 -5533 -108830 -72157 -165 46250 36056 -116373 -409017
39035d09017k18393L2577J47337L9497P860J97747L06436J03633j45036j18778
$$ -409017 -627410 -594833 -447496 -407999 -400139 -202392 104044 207677 62641 -56137
39025e6137N0225R0239P5182J72256K16357J0563k15941j54368J2868p5038k76255
$$ -56137 -5912 84327 159509 331765 548122 558685 342744 188376 201244 126206 -150049
39014a50049j71690J63392K46955Q773j14993M8401J65012M9144k8562J00424
$$ -150049 -321739 -158347 88608 97381 -17612 30789 195801 244945 216383 316807
39004C16807J68407k4590k21689j40359O4322Q4522o9125j73701j54081q0487
$$ 316807 485214 460624 238935 98576 162898 247420 178295 4594 -149487 -229974
38994b29974J7043J15248J31390O2225L6861R3228P7533r2133k43251j89644j226
$$ -229974 -212931 -97683 33707 95932 132793 226021 303554 211421 -31830 -221474 -222700
38983b22700J19808J05142L2830j0780K5023J39500K27372J56845l7975j69314
$$ -222700 -102892 2250 35080 24300 49323 188823 416195 573040 535065 365751
38973C65751j48255q3414q2664j12171j09369q6921o4268k3521K8304O7319J16359
$$ 365751 217496 134082 51418 -60753 -170122 -257043 -321311 -344832 -316528 -249209 -132850
38962a32850J71350J19364q6211k40234j24643J18034J46245o1653j79661n1737
$$ -132850 38500 157864 71653 -168581 -293224 -175190 -28945 -90598 -270259 -321996
38952c21996J11473J27717Q5195P4355J9297p4026l2971J39638J61064p9880k72691
$$ -321996 -210523 -82806 2389 76744 96041 22015 -10956 128682 289746 209866 -62825
38941f2825j40373J26583J77615K2871n6321L7238J37245R7053p3637k75943l59259
$$ -62825 -203198 -76615 101000 123871 67550 104788 242033 339086 265449 -10494 -369753
38930c69753k02646R3953K40282J22752k8080O317J12190Q6983L154O1190K21908
$$ -369753 -572399 -478446 -238164 -115412 -143492 -137175 -24985 61998 65152 126342 348250
38919C48250K64995J31183m3296j68347k44491k25354p2653P7526K7714j87794
$$ 348250 613245 744428 701132 532785 288294 62940 -9713 67813 95527 -92267
38909i2267l06120j66520R6275K24705J17327q8430j70077n3789J12683J59658
$$ -92267 -398387 -564907 -468632 -243927 -126600 -215030 -385107 -438896 -326213 -166555
38899a66555J13646J00030R6951j706j09811k5416J75902J56010j51164l58633
$$ -166555 -52909 47121 144072 142366 32555 7139 183041 339051 187887 -170746
38889a70746j88240J05468J53401L0249M1875J68815J29252j05054k50816j63589
$$ -170746 -358986 -253518 -100117 -69868 -27993 140822 270074 165020 -85796 -249385
38879b49385j1410M0940M3453Q6079J25903P5918n9349j83990j80893j0739J93938
$$ -249385 -260795 -219855 -176402 -90323 35580 111498 52149 -131841 -312734 -323473 -129535
38868a29535K16962K8796j41490j08851L0663R6347R6448J27333J48136O9519
$$ -129535 87427 116223 -25267 -134118 -103455 -7108 89340 216673 364809 434328
38858D34328m5933q4482q7818j57398k42903k20419r4086N3478J97113K83620
$$ 434328 388395 303913 216095 58697 -184206 -404625 -498711 -445233 -248120 35500
38848C5500J71516j23762k91580j02762K15001K65542K5698j99313k41070j61451
$$ 35500 207016 83254 -208326 -311088 -96087 169455 195153 -4160 -245230 -406681
38838d06681R996K62455L93387K03057j12434j47502J11525K55913Q3545j31879
$$ -406681 -396685 -134230 259157 462214 349780 202278 313803 569716 653261 521382
38828E21382j22627j5437n0392j95665k49764j37481N4537J94061J69069r808
$$ 521382 398755 383318 332926 137261 -112503 -249984 -195447 -1386 167683 157875
38818A57875j37496l4938J50237J09967j38076k33807k0032K16694J93377K0488
$$ 157875 20379 -14559 135678 245645 107569 -126238 -146270 70424 263801 284289
38808B84289m8054n67J8206j6490l3724k3573M760Q6953J85185J58767j3399j50124
$$ 284289 236235 235668 253874 237384 203660 180087 184847 271800 456985 615752 602353 452229
38796D52229j42421j17214j70941j58491L6636K21988J54696o6265j52284o8106
$$ 452229 309808 192594 21653 -136838 -100202 121786 276482 210217 57933 -10173
38786a0173k4424q1037o8981O7935J38218K248k06778k73320j60351J6890J53959
$$ -10173 -34597 -115634 -184615 -116680 21538 23786 -182992 -456312 -616663 -599773 -445814
38775d45814K00512J43303M4841L1374J59356L42173M65042N01318M43838K16256
$$ -445814 -245302 -101999 -57158 -25784 133572 475745 940787 1442105 1885943 2102199
38765B102199j99339n83140o17647k77805O7537O9862j84671l28109k03822m173
$$ 2102199 1902860 1319720 702073 424268 491805 561667 376996 48887 -154935 -159108
38755a59108P2320O7217Q5854Q3859j7046j39840j46939m3426N5109R2976R3019
$$ -159108 -86788 -19571 66283 150142 133096 -6744 -153683 -197109 -142000 -49024 43995
38744D3995P2239M8000N5816O6907j2903j67528k29439j31688l4032m3192o418
$$ 43995 116234 164234 220050 286957 274054 106526 -122913 -254601 -288633 -331825 -338243
38733c38243J94973L51849K28220j5526n9756M4789j976j79190j67939N1746J30467
$$ -338243 -143270 208579 436799 421273 361517 406306 404330 225140 57201 108947 239414
38722B39414k4350o2307J69189K95013L8799k61303j83554P5584L0111k80853
$$ 239414 215064 152757 321946 616959 655758 394455 210901 286485 316596 35743
38712C5743l48177p362L13850K54349N061n6907Q3553J48660K4513j01510m1340
$$ 35743 -312434 -319796 -5946 248403 253464 196557 280110 428770 453283 351773 310433
38701C10433J32799J97583P2922r1441j36649j04433j32283k06009j77301k6146
$$ 310433 443232 640815 713737 622296 485647 381214 248931 42922 -134379 -160525
38691a60525P6547K8881m8201j5480P4479R5284N1017K4635J5457l5497j21068
$$ -160525 -83978 -55097 -103298 -118778 -44299 50985 102002 126637 142094 106597 -14471
38680a4471j78909j70209p3484J08545K61086K06930m1465k12765j09978J05512
$$ -14471 -193380 -363589 -437073 -328528 -67442 139488 98023 -114742 -224720 -119208
38670a19208J38845k7945j51516r1494M8012J20131Q9897j0664j13259j00130
$$ -119208 19637 -8308 -159824 -251318 -203306 -83175 6722 -3942 -117201 -217331
38660b17331P4800K50692K16908J5983r2926l250J04724O9510j2196J6984J03492
$$ -217331 -142531 108161 325069 341052 248126 244876 349600 419110 406914 423898 527390
38649E27390Q7429k4059q1293m7735m2956j16816j49737m4964J05155J41678N4168
$$ 527390 614819 590760 509467 461732 418776 301960 152223 107259 212414 354092 408260
38638D08260k7353k4779k787n5346j64569k12235j23291K5964P5656k0158j09655
$$ 408260 380907 356128 353341 297995 133426 -78809 -202100 -176136 -100480 -120638 -230293
38627b30293l3526J33873J69615M0542k7686R1198J98478Q4634j08251j01184
$$ -230293 -263819 -129946 39669 80211 52525 143723 342201 426835 318584 217400
38617B17400O8224J25841L1198N599Q6403M8554j42373k01467j4056J34484M5406
$$ 217400 285624 411465 442663 448262 534665 583219 440846 239379 225323 359807 405213
38606D05213n3435N5356J62173J6548j86954j34520N2954N1995q4850p1961M8499
$$ 405213 351778 407134 569307 585855 398901 264381 317335 369330 284480 212519 261018
38595B61018Q128j33190p8283J13309Q5812j49124j88257M6285J53406k5911j16187
$$ 261018 269146 135956 57673 170982 256794 107670 -80587 -34302 119104 93193 -22994
38584b2994J10678L04540J34818j45140j41359M0382L9760j32820j61531K4858
$$ -22994 87684 392224 527042 381902 240543 280925 320685 187865 26334 51192
38574E1192J63665Q1851q3040r8650R0142L01161K75001k5794k90379k08766Q1407
$$ 51192 214857 296708 213668 115018 205160 506321 781322 755528 465149 256383 337790
38563C37790J68891k0846j53005o9677j4071j22489j47810N9712K19602Q9728
$$ 337790 506681 485835 332830 263153 249082 126593 -21217 38495 258097 347825
38553C47825j06226p8303L6804k6383j61936j09729N8935R2711J3393J4236O3565
$$ 347825 241599 163296 200100 173717 11781 -97948 -39013 53698 67091 81327 144892
38542A44892O331p1226L2096K43529L15674K19919J04888j9786k06873l03360
$$ 144892 151223 79997 112093 355622 671296 891215 996103 976317 769444 466084
38532D66084j44617P8037M1380j84107k35610m4339R6596N5065L1527J42551K22851
$$ 466084 321467 399504 440884 256777 21167 -23172 73424 128489 160016 302567 525418
38521E25418J60880R3267J16496Q9206j07724l28708l49904j63546L7298Q4096
$$ 525418 686298 779565 896061 985267 877543 548835 198931 35385 72683 156779
38511A56779k0365j17934n2923J26941J85615O023k11171j93823M4583K51406
$$ 156779 136414 18480 -34443 92498 278113 284136 72965 -120858 -76275 175131
38501A75131K60325J12645o8439j68703j26289k2537k7268j30739r4232J70074
$$ 175131 435456 548101 479662 310959 184670 162133 134865 4126 -90106 79968
38491G9968L76660K61284K178n1767Q5138J14452l7899j52204j16029n4838n3812
$$ 79968 456628 717912 720090 668323 753461 867913 830014 677810 561781 506943 453131
38480D53131n1978m2008j04114k00494j75989r260J39972J65509J16359N4631
$$ 453131 401153 359145 255031 54537 -121452 -130712 9260 174769 291128 345759
38470C45759r165l0911M4020J53458J58546K9130j17385j60303q3283L2576P4335
$$ 345759 336594 305683 349703 503161 661707 690837 573452 413149 329866 362442 436777
38459D36777J3868l0259M3134J16308J1057j73133j66536Q795M7182r7799j06269
$$ 436777 450645 420386 463520 579828 590885 417752 251216 260011 307193 209394 103125
38448A03125J20916K39364O9346n7823J03612K48138P2679j50251n3206J64673
$$ 103125 224041 463405 532751 474928 578540 826678 899357 749106 695900 860573
38438H60573J08202j15182j46184l8745p4249j47078M7383L85098M70948K86287
$$ 860573 968775 853593 707409 668664 594415 447337 494720 879818 1350766 1637053
38428A637053J22391K2812j46806k44949o7691J42467K0233k40011j76805J01619
$$ 1637053 1759444 1782256 1635450 1390501 1322810 1465277 1485510 1245499 1068694 1170313
38418A170313Q1524k38886l40487q7922R4119J1386m3805O1725P4742p7932j22009
$$ 1170313 1251837 1012951 672464 584542 678661 690047 646242 707967 782709 704777 582768
38407E82768Q060L4498r1236n7469K04157L40564J82432J4688P0223K26531L49677
$$ 582768 590828 625326 534090 476621 680778 1021342 1203774 1218462 1288685 1515216 1864893
38396A864893M82152N64814M13704P9581j73857k92543m28324n43123m67545k93025
$$ 1864893 2347045 2911859 3325563 3405144 3231287 2938744 2510420 1967297 1499752 1206727
38386A206727k21748j26738K02765N12477L95779L1104o5260Q6302K4365k72947
$$ 1206727 984979 858241 1061006 1573483 1969262 2000366 1935106 2021408 2045773 1772826
38376A772826l75307k15957j28882j13422J11608L54622J38294l53346m32937
$$ 1772826 1397519 1181562 1052680 939258 1050866 1405488 1543782 1190436 757499
38367G57499n6867J27295o1491j26238O0033L6762k39933k28598J30672K30027
$$ 757499 700632 827927 766436 640198 700231 736993 497060 268462 399134 629161
38357F29161n9821j16928K54968M48915K00020L0709J69114J15245k78159l87382
$$ 629161 569340 452412 707380 1156295 1356315 1387024 1556138 1671383 1393224 1005842
38347A005842K5165L01011N4462j88738m7658N9521j39562k08333O1152J70984
$$ 1005842 1031007 1332018 1386480 1197742 1150084 1209605 1070043 861710 922862 1093846
38337A093846q1611j61569J29638K19700q5130j65991J67995K30851j81942k88492
$$ 1093846 1012235 850666 980304 1200004 1114874 948883 1116878 1347729 1165787 877295
38327H77295J92417M14536k0018k74148J27213L68660p3042l88188M494L19356
$$ 877295 1069712 1484248 1464230 1190082 1317295 1685955 1612913 1224725 1229219 1548575
38317A548575o2739l72532M4404M32873R3775k72823o64J97098k96995o23831
$$ 1548575 1485836 1113304 1157708 1590581 1684356 1411533 1410869 1607967 1310972 687141
38307F87141k9424N88675K84448j79550J78517O83545L47662k22164m4824L55678
$$ 687141 657717 1246392 1530840 1351290 1529807 2213352 2561014 2338850 2294026 2649704
38297B649704Q2589l37552o4938L65024J96432R561M10171N81280r3290n09033
$$ 2649704 2732293 2394741 2329803 2694827 2891259 2900820 3310991 3892271 3798981 3289948
38287C289948K07555R01748M85733Q883N66034J116543O25033K52680J014890
$$ 3289948 3497503 4399251 4884984 4893867 5459901 6576444 7201477 7454157 8469047
38278H469047J551633P94581L27147J355026K209585J849536K469176N233136
$$ 8469047 10020680 10815261 11142408 12497434 14707019 16556555 19025731 24258867
38270B4258867P408629P706516R682175J5156218K0659684K6939268M3005180
$$ 24258867 31667496 39374012 49056187 64212405 84872089 111811357 154816537
38263A54816537O8165242P7428191M4352948k0322659p1462528p7848968n2940614
$$ 154816537 222981779 300409970 344762918 324440259 252977731 175128763 122188149
38256A22188149k9770202k0970826j6925332j0835842o816344o887060o284312
$$ 122188149 92417947 71447121 54521789 43685947 36869603 29982543 23698231
38249B3698231l084556j174983k043180k394814j080649p94133j970652j804839
$$ 23698231 20613675 19438692 17395512 15000698 13920049 13125916 11155264 9350425
38241I350425o1817L53636q81172j040408J59471K37561q16516n28000Q93744
$$ 9350425 9288608 9642244 8761072 7720664 7880135 8117696 7301180 6773180 7666924
38232G666924Q54600l48178m3907J392433J271624J91644J015740K942584K858773
$$ 7666924 8521524 8173346 8129439 9521872 10793496 10985140 12000880 14943464 17802237
38223A7802237J806948L362157O495717P462750P680366J1391026J7104619K1757484
$$ 17802237 19609185 22971342 29467059 36929809 44610175 56001201 73105820 94863304
38215I4863304L1462594N2944215P2073160N9359842P581913n0034033p3479477
$$ 94863304 126325898 179270113 251343273 310703115 318285028 268250995 194771518
38208A94771518n8988612l4814041k2229712j8081812j2968178p652651o246419
$$ 194771518 135782906 100968865 78739153 60657341 47689163 40036512 33790093
38201C3790093o534028m797303k544466k425115k937149j880554o03521r02212
$$ 33790093 27256065 22458762 19914296 17489181 14552032 12671478 12067957 11165745
38193A1165745j459233o73346K63438m1476m92633R9352O85233K76018M996Q36852
$$ 11165745 9706512 9033166 9296604 9255128 8762495 8861847 9547080 9823098 9828094 10664946
38183A0664946J629877J409111J298511K336194L447090L314338K345278J250341
$$ 10664946 12294823 13703934 15002445 17338639 20785729 24100067 26445345 27695686
38175B7695686l82301k570319l887425l500847k599747k398208k357609j718060
$$ 27695686 27313385 24743066 20855641 17354794 14755047 12356839 9999230 8281170
38167H281170j103815j168551j197282n10195J31559r5401n81294m74665j52302
$$ 8281170 7177355 6008804 4811522 4301327 4432886 4337485 3756191 3281526 3129224
38158C129224k51616l99263j13975J25236j28353k87815J64193N97333L39945
$$ 3129224 2877608 2478345 2364370 2489606 2361253 2073438 2237631 2834964 3174909
38149C174909j24057j08391Q8191l5679j59193R3073K65521n4176l39774o0876
$$ 3174909 3050852 2942461 3030652 2994973 2835780 2928853 3194374 3140198 2800424 2739548
38139B739548L32286K81607J34472L69820O46564N41238M25703P09041J005465
$$ 2739548 3071834 3353441 3487913 3857733 4504297 5045535 5471238 6180279 7185744
38130G185744R44283R96365J592729K226178K331514K225155K225777J717571
$$ 7185744 8130027 9126392 10719121 12945299 15276813 17501968 19727745 21445316
38122B1445316J86982j564775k390587k360495k278520k254892j896437j393153
$$ 21445316 21632298 20067523 17676936 15316441 13037921 10783029 8886592 7493439
38114G493439j238922j233351q46065k74048j27618l40621l59476j67999j90922
$$ 7493439 6254517 5021166 4175101 3901053 3773435 3432814 3073338 2905339 2714417
38105B714417l89819l50295j02972l4476j39509j16727j8894p7216r8481K18953
$$ 2714417 2324598 1974303 1871331 1836855 1697346 1580619 1561725 1484509 1386028 1604981
38095A604981N79720M51677m7897l46999l24673l12136l57084k10998N6157J07044
$$ 1604981 2184701 2636378 2588481 2241482 1916809 1604673 1247589 1036591 1092748 1199792
38085A199792o3845j69122j64070k03012k14699n7663Q1926k2516j67213o4301
$$ 1199792 1135947 966825 802755 599743 385044 327381 409307 386791 219578 155277
38075A55277J01063K0702j23301j2005J44581k2652k82681j56004J99422K32354
$$ 155277 256340 277042 153741 141736 286317 263665 -19016 -175020 24402 256756
38065B56756l6702r5572J13981J45062p8009j31613R3784K00133K1971j22176
$$ 256756 220054 124482 238463 383525 305516 173903 267687 467820 489791 367615
38055C67615n8026j520l1412P4737L09740L25515N7053p8614J57233M34696L69689
$$ 367615 309589 308069 276657 351394 661134 986649 1043702 965088 1122321 1557017 1926706
38044A926706L3934k70744m04864l63129j61255O3389Q3103j40529l87259m45468
$$ 1926706 1960640 1689896 1285032 921903 760648 824037 907140 766611 379352 -66116
38034f6116k79257L8765L42363L84217R3775k37472k82654r9443L7485P7159J42477
$$ -66116 -345373 -306608 35755 419972 513747 276275 -6379 -105822 -68337 8822 151299
38023A51299J89328R2205m4514m1569m51j15924k55371j48349J10743J93889Q4302
$$ 151299 340627 432832 388318 346749 346298 230374 -24997 -173346 -62603 131286 215588
38012B15588L5821P1226M30j22451n9412J23204J22262n9598j29508m5949l6946
$$ 215588 251409 322635 323065 200614 141202 264406 386668 327070 197562 151613 114667
38001A14667r3696O250J61829K5729l19103l74671m6299J73324K9782j02525O9827
$$ 114667 20971 27221 189050 214779 -104324 -478995 -525294 -351970 -322188 -424713 -354886
37990c54886K49048J11249j27591j24421K8676O9172L8315Q2526Q8617o8580j72757
$$ -354886 -105838 5411 -122180 -246601 -217925 -148753 -110438 -27912 60705 -7875 -180632
37979a80632J7954K97563K71941l4646k25250j18369O8723J20867R1963J02896
$$ -180632 -162678 134885 406826 372180 146930 28561 97284 218151 310114 413010
37969D13010J10756O682j66334k14079k7157K28338K48704k6899k87737k35734
$$ 413010 523766 530448 364114 150035 122878 351216 599920 573021 285284 49550
37959D9550J6711J39591P4606M2149J03434O6028j17190k00446m1967J39247R0737
$$ 49550 66261 205852 280458 322607 426041 492069 374879 174433 132466 271713 362450
37948C62450j10472k13484j45015k6397L9142M0633j96m9890p2673o7502m8064
$$ 362450 251978 38494 -106521 -132918 -93776 -53143 -53339 -103229 -175902 -243404 -291468
37937b91468l629M1560j143j26629j49091M0228K42362K24363J05744J51052K75164
$$ -291468 -295097 -253537 -254680 -381309 -530400 -490172 -247810 -23447 82297 233349 508513
37926E08513J63483j41866k40418l0745J02317p4189k63971j58027O3900P1791
$$ 508513 671996 530130 289712 258967 361284 287095 23124 -134903 -71003 788
37916G88q3303j27385k8623M1971N9911J28372K03523J37333m0630j28307l6261
$$ 788 -82515 -209900 -238523 -196552 -136641 -8269 195254 332587 291957 163650 127389
37905A27389J11231J58651P1188q5342k15891k55208k10972j30881k8663R0006
$$ 127389 238620 397271 468459 383117 167226 -87982 -298954 -429835 -458498 -368492
37895c68492J50783Q0057n4751j06291m1974N6872J53248K41053K25963M2513
$$ -368492 -217709 -137652 -192403 -298694 -340668 -283796 -130548 110505 336468 378981
37885C78981j47401j28850J6887K1214j29962j90306r6997m8365q3053J3212K59483
$$ 378981 231580 102730 119617 140831 10869 -179437 -276434 -324799 -407852 -394640 -135157
37874a35157L46361J33887j00998j29332j08383k05307k52417q5378J02901Q4351
$$ -135157 211204 345091 244093 114761 6378 -198929 -451346 -536724 -433823 -349472
37864c49472j2613K4821R8554M0174l551J68372L62681K33560j50115l83190k92678
$$ -349472 -362085 -337264 -238710 -198536 -202087 -33715 328966 562526 412411 29221 -263457
37853b63457o4524J24305K42664K31947N4598j05514k4334J87719K03592l2519
$$ -263457 -327981 -203676 38988 270935 325533 220019 195685 383404 586996 554477
37843E54477k42265k47211j61723j15468o8886K6464J20148J77781K09578J61416
$$ 554477 312212 65001 -96722 -212190 -281076 -254612 -134464 43317 252895 414311
37833D14311k5401k40616k98778k06914j27057q7164K4820J78676J93867O5492
$$ 414311 388910 148294 -150484 -357398 -484455 -571619 -546799 -368123 -174256 -108764
37823a08764K2185J58097K57141J23024j23773k38026j76625p0461P694P7564
$$ -108764 -86579 71518 328659 451683 327910 89884 -86741 -157202 -149508 -71944
37813g1944J23487R1600P883j4757P9780J93176J63601m0430k53048k89784j71556
$$ -71944 51543 143143 151026 136269 216049 409225 572826 532396 279348 -10436 -181992
37802a81992p3692n4710Q668J61719K38062J22299l0659l5618J6178n8185j59969
$$ -181992 -255684 -310394 -301726 -140007 98055 220354 189695 154077 170255 112070 -47899
37791d7899l6852K51246L37151Q6762j74839j27316J00301J51555n0940k41386
$$ -47899 -84751 166495 503646 590408 415569 288253 388554 540109 489169 247783
37781B47783j93062J6846J36210K6591k04316l19701j95808N1042J99058J63216
$$ 247783 54721 71567 207777 234368 30052 -289649 -485457 -434415 -235357 -72141
37771g2141M8075k3063l8782l7834j0877O6890J51432J54599N7982m6582o2127
$$ -72141 -24066 -47129 -85911 -123745 -134622 -67732 83700 238299 296281 249699 187572
37760A87572j1924q155q4047j28019m3791R2084J32581O4849j6684q8720j73942
$$ 187572 175648 167493 83446 -44573 -88364 3720 136301 201150 184466 95746 -78196
37749g8196j74650K8724K90571K84758k7960k84917k19744j1237O0145L8408J03225
$$ -78196 -252846 -224122 66449 351207 323247 38330 -181414 -192651 -132506 -94098 9127
37738I127J80307P7389j32056k03048j15613n4099m9999K3669J25884N7034j69885
$$ 9127 189434 266823 134767 -68281 -183894 -237993 -287992 -264323 -138439 -81405 -251290
37727b51290k81213j43958N1774J02504N4666O2553J66455K88141L05286J17870
$$ -251290 -532503 -676461 -624687 -522183 -467517 -404964 -238509 49632 354918 472788
37717D72788j99694l48932j30974K12618K54598k7611k27423j11828R4488J32428
$$ 472788 273094 -75838 -206812 5806 260404 232793 5370 -106458 -11970 120458
37707A20458P1702P0071P1489k3655j22629j10872o8706r6916j02366J7673J41770
$$ 120458 192160 262231 333720 310065 187436 76564 7858 -89058 -191424 -173751 -31981
37696c1981J14897K8201N0326R7725l8219k94195l61063j28026J50669K04039
$$ -31981 82916 111117 161443 259168 220949 -73246 -434309 -562335 -411666 -207627
37686b07627O6956l8137n544P3040O7627l0197j01505l8108J16632K01141J29456
$$ -207627 -140671 -178808 -184352 -111312 -43685 -73882 -175387 -213495 -96863 104278 233734
37675B33734o943p3105n7580l8135m3725m0376j6665N511K7617O6165R6667P0998
$$ 233734 226791 153686 96106 57971 14246 -26130 -42795 -37284 -9667 56498 153165 224163
37663B24163p507p3119o8141j092O4472P2560L3617Q342J6995P500m0244m2845
$$ 224163 216656 143537 75396 74304 138776 211336 244953 253295 270290 277790 237546 194701
37651A94701N8095J54558J01084m6466r3498p322M2770j4408k8852R3830J97929
$$ 194701 252796 407354 508438 461972 368474 361152 403922 389514 360662 454492 652421
37640F52421J15771o2276j37293r9690q5452j19114j00204j1280M0946l581q3472
$$ 652421 768192 705916 568623 468933 383481 264367 164163 152883 193829 190248 106776
37629A06776j21776j04994n7918j7640j1034K152J01199K42674K26595l9898l28630
$$ 106776 -15000 -119994 -177912 -195552 -206586 -204434 -103235 139439 366034 326136 -2494
37618b494l21868k3861K45576K69858J56423R4355Q1133Q234j06789j26565l719
$$ -2494 -324362 -348223 -102647 167211 323634 417989 499122 507356 400567 274002 270283
37607B70283J26736R2882j15113l15920l14934j11641R5812J29707J8250p1121
$$ 270283 397019 489901 374788 58868 -256066 -367707 -271895 -142188 -123938 -195059
37597a95059l3861R7435K36594L13781K78502J24209p5002k12331k40061j72895
$$ -195059 -228920 -131485 105109 418890 697392 821601 746599 534268 294207 121312
37587A21312l0279J48574K56080J89193j1316j82651k26035j91453j54674j06749
$$ 121312 91033 239607 495687 684880 673564 490913 264878 73425 -81249 -187998
37577a87998k1450N0877M1873k4131n3619j80R6611J67227J57302M5397j19286
$$ -187998 -209448 -158571 -116698 -140829 -194448 -194628 -98017 69210 226512 271909 152623
37566A52623k14993j58745j9280N7300M0357L7302R4574J00872j6116j11825j3100
$$ 152623 -62370 -221115 -240395 -183095 -142738 -105436 -10862 90010 73894 -37931 -51031
37555e1031J77176J84632j3720j21721J3990J30348l9308k86493k02941J55906
$$ -51031 126145 310777 297057 175336 189326 319674 280366 -6127 -209068 -53162
37545e3162K89156m094k97216j68736J67121K03136r0148k50104m2217K10356
$$ -53162 235994 231900 -65316 -234052 -66931 136205 46057 -204047 -246264 -35908
37535c5908J40848j32608k17893m118K42383K70828J17175l1240p7520n8562m3494
$$ -35908 104940 -27668 -245561 -249679 -7296 263532 380707 349467 271947 213385 169891
37524A69891o0285q9666r5652p3673n9648n8386L873J72745L27423K79109M9541
$$ 169891 109606 19940 -75712 -149385 -209033 -267419 -263546 -90801 236622 515731 565272
37513E65272r2312J9252J89430J32678r1610j59536R374J08241q7212l61568l72881
$$ 565272 472960 492212 681642 814320 722710 563174 572548 680789 593577 232009 -140872
37502a40872j36172N4155O9556M4490P3341Q1813K7752o455J2428O02o0267n1894
$$ -140872 -277044 -222889 -153333 -108843 -35502 46311 74063 67608 80036 80638 20371 -31523
37490c1523P5909J85730J42518m302j24903j74804j60115n8537J05068J96438
$$ -31523 44386 230116 372634 368332 243429 68625 -91490 -150027 -44959 151479
37480A51479J10128q1206k06443j80203m8706Q2647J11859O329j36089j65978
$$ 151479 261607 180401 -26042 -206245 -254951 -172304 -60445 -54116 -190205 -356183
37470c56183o5230L7231O1263O0716O8652J6868j01164j43790k0119J56907K36059
$$ -356183 -421413 -384182 -322919 -262203 -193551 -176683 -277847 -421637 -441756 -284849 -48790
37459d8790K12132J28339l7433k32520k57334m6964J37705N6361j18341o4810
$$ -48790 163342 291681 254248 21728 -235606 -282570 -144865 -88504 -206845 -271655
37449b71655J42058J30386j45729k95932r9072J68085J92884Q0817Q5934J53928
$$ -271655 -129597 789 -144940 -440872 -539944 -371859 -178975 -98158 -12224 141704
37439A41704O1383j47443k03195l7606J35129J69356J48527J41485N3114j55174
$$ 141704 203087 55644 -147551 -185157 -50028 119328 267855 409340 462454 307280
37429C07280k93141j71462J02093K38191J41127L100P138Q5892N8272r2197j98712
$$ 307280 14139 -157323 -55230 182961 324088 327188 334326 420218 478490 386293 187581
37418A87581j47974k0588L7704n82n4224p2527q0248r4759q0937j7875M3517L5068
$$ 187581 39607 19019 56723 56141 1917 -70610 -150858 -245617 -326554 -344429 -300912 -265844
37406b65844l6909r0960n8905M6563J50931J85677J35192L7768m1199m6234K7885
$$ -265844 -302753 -393713 -452618 -406055 -255124 -69447 65745 103513 62314 16080 43965
37395D3965J18610J39291O4255m0765r6482j03928j23765j67821j63560n2999
$$ 43965 162575 301866 366121 325356 228874 124946 1181 -166640 -330200 -383199
37385c83199J06934J84761J15584k1859q3730j6462P9471O0516q6994k16533j80201
$$ -383199 -276265 -91504 24080 2221 -81509 -97971 -18500 42016 -44978 -261511 -441712
37374d41712R660K00088K54660J69104N4277K4267P9640R9253j0372j65983j88444
$$ -441712 -432052 -231964 22696 191800 246077 270344 349984 449237 438865 272882 84438
37363H4438m1156J21175J74039J59327J36920O0328q2173j59926r5785k5689p1393
$$ 84438 43282 164457 338496 497823 634743 695071 612898 452972 357187 331498 260105
37352B60105j01445L8529J94397J12830j07079j28357Q2827K08291J04153j2976
$$ 260105 158660 197189 391586 504416 397337 268980 351807 560098 664251 651275
37342F51275n94j9380j64029k32543q4941Q7984R1772K8424K5881k8889k02257
$$ 651275 650681 631301 467272 234729 149788 237772 329544 357968 383849 354960 152703
37331A52703k57754k8641K15098J52393n9578n6907J11596R5376j35003k49701
$$ 152703 -105051 -133692 81406 233799 174221 117314 228910 324286 189283 -60418
37321f0418j21587J9955L0432L4062R7274R9641K9012N4312J85305J87940j8963
$$ -60418 -182005 -162050 -131618 -97556 -282 99359 128371 182683 367988 555928 536965
37310E36965j86297j21332J9369J4596p5063o0898M2129N5649p8319k25990k36717
$$ 536965 350668 229336 248705 263301 188238 127340 169469 225118 146799 -79191 -315908
37299c15908q6066J23591K49273K26878J23269M0971N996k477R434N031p7309
$$ -315908 -401974 -278383 -29110 197768 321037 362008 368004 365527 374961 379992 302683
37288C02683j73285j09033Q6855J05374j73573l74163j37406K69641L12742J4886
$$ 302683 129398 20365 107220 212594 39021 -335142 -472548 -202907 109835 124721
37278A24721j19656M3780J04260j05602k10541J4461K17668Q5149j09084N380
$$ 124721 5065 48845 153105 47503 -163038 -148577 69091 154240 45156 50536
37268E0536K43857J83071j40014l17803k00089r913P7550J08563J45238J68464
$$ 50536 294393 477464 337450 19647 -180442 -190355 -112805 -4242 140996 309460
37258C09460J55004O5882j43806l53789l08024p493J66257j9697k48107j16227
$$ 309460 464464 530346 386540 32751 -275273 -282766 -116509 -136206 -384313 -500540
37248e00540K25222L13127R6695m2006O0376J38127n454j89097j73657O599J69535
$$ -500540 -275318 37809 134504 92498 152874 291001 285547 96450 -77207 -70608 98927
37237I8927K24742J77594O0610n7409j12275j23177j33789j13539l7803J2581
$$ 98927 323669 501263 561873 504464 392189 269012 135223 21684 -16119 -3538
37227c538j3563n376J14098J75347m192k65605k77998k1441J89297J54395j3924
$$ -3538 -17101 -22477 91621 266968 262776 -2829 -280827 -302268 -112971 41424 27500
37216B7500j43720j76373p7433J43043K91743J54365j56823k90317j40905L2460
$$ 27500 -116220 -292593 -370026 -226983 64760 219125 62302 -228015 -368920 -336460
37206c36460L5896j3895K0672N8112L655n5445k8786J3388J0222M3967J50435
$$ -336460 -300564 -314459 -293787 -235675 -232020 -287465 -316251 -302863 -292641 -248674 -98239
37195i8239J90835P6414n6099n4314L1713R1529J31979J47527J1969k84008m61694
$$ -98239 92596 169010 112911 58597 90310 181839 313818 461345 473314 189306 -272388
37184b72388k80571Q1851K39132J06472o0912r0718p1129q9760p1331K8445Q5655
$$ -272388 -552959 -471108 -231976 -125504 -186416 -277134 -348263 -438023 -509354 -480909 -395254
37173c95254M206r9583n7327R7086J77930J09749M157k7907k0867n8491j14257
$$ -395254 -391048 -490631 -547958 -450872 -272942 -163193 -159036 -186943 -207810 -266301 -380558
37162c80558p8110P4562K23714K41664J36473K1453k1484o184N772k4110p8959
$$ -380558 -458668 -384106 -160392 81272 217745 239198 217714 211530 217302 193192 114233
37151A14233j01904o0270l683j7397r9341j39332n7272R0830J85090J66937N7478
$$ 114233 12329 -47941 -51624 -69021 -168362 -307694 -364966 -274136 -89046 77891 135369
37140A35369p8869j45762p6705N2494O6743p1958j70550n4538J79168K87867J91493
$$ 135369 56500 -89262 -165967 -113473 -46730 -118688 -289238 -343776 -164608 123259 314752
37129C14752K2631p5430o7859J0141Q4442O8570l6685j17030j03682p3090r0419
$$ 314752 337383 261953 194094 204235 288677 357247 320562 203532 99850 26760 -63659
37118f3659p6107L3334J22889P2401l2712n8406n5870j11035j03859R5078L05184
$$ -63659 -139766 -106432 16457 88858 56146 -2260 -58130 -169165 -273024 -177946 127238
37107A27238K48146Q538p4783N3873J12165k7941j75482j98520j87943j68214
$$ 127238 375384 383922 309139 363012 475177 447236 271754 73234 -114709 -282923
37097b82923l1333J37157P0478j94205k56421K3077K54284J34762p1994r635J87956
$$ -282923 -314256 -177099 -106621 -300826 -557247 -534170 -279886 -145124 -217118 -226753 -38797
37086c8797J89804M1408j120K0056j05070k66663j61825J52005K86954J16433
$$ -38797 151007 192415 191295 211351 106281 -160382 -322207 -170202 116752 233185
37076B33185p4981q1871l5671p3506q9752K5215J52264J19611m4736j61782j08408
$$ 233185 158204 76333 40662 -32844 -122596 -97381 54883 174494 129758 -32024 -140432
37065a40432P8097K22795J54374p8036j95718l9959J67607J21387j06523j77946
$$ -140432 -62335 160460 314834 236798 41080 1121 168728 290115 183592 5646
37055E646j1845J28448R1607M1796J04571J28430k2334j93405j74159k1084O3515
$$ 5646 -6199 122249 213856 255652 360223 488653 466319 272914 98755 77671 141186
37044A41186L8516Q254K971l1679r1530j26982j46970j65163j03886R1332K90730
$$ 141186 179702 187956 190927 159248 67718 -59264 -206234 -371397 -475283 -383951 -93221
37033i3221L05534J52969K2999j7141r0055k32361k59379m4948K15368K20386
$$ -93221 212313 365282 388281 371140 281085 48724 -210655 -255603 -40235 180151
37023A80151k0759j95671j19057M2680N0488p7004j47005q7759L206M7075O1100
$$ 180151 159392 -36279 -155336 -112656 -62168 -139172 -286177 -373936 -370730 -323655 -262555
37012b62555O6026N3792M6609P3212R3599N4949j948r887o699n1839o1813P4206
$$ -262555 -196529 -142737 -96128 -22916 70683 125632 123684 113797 107098 55259 -6554 67652
37000F7652K40661J95260n6270k32106j77668m5869P180L6120Q8706N2259r3871
$$ 67652 308313 503573 447303 215197 37529 -8340 -1160 34960 123666 175925 82054
36989H2054j28449O8736K39980R3379k36896l65753j90950K8291P2988q221o1147
$$ 82054 -46395 22341 262321 355700 118804 -246949 -437899 -409608 -336620 -344841 -405988
36978d05988j3881J01135J79417J25284j5911r1980p2715q3052j30380m0553J93022
$$ -405988 -419869 -318734 -139317 -14033 -29944 -121924 -194639 -277691 -408071 -448624 -255602
36967b55602K83111Q9061j13701q0922L6r0359j37460J05266L46645J76613j61195
$$ -255602 27509 116570 2869 -78053 -78017 -168376 -305836 -200570 146075 322688 161493
36956A61493r2914K92369L16633j72795n16694k75775J47049K33804Q3486J9769
$$ 161493 68579 360948 677581 504786 -11908 -287683 -140634 93170 176656 196425
36946A96425k81j26077j89345j6425J64287P5711j22665j22881J4395M6875J3891
$$ 196425 196144 70067 -119278 -135703 28584 104295 -18370 -141251 -126856 -79981 -66090
36935f6090Q0758J31330l2708k50216k14078p918K1276j49066k01547k3476J56399
$$ -66090 14668 145998 113290 -136926 -351004 -358922 -337646 -486712 -688259 -711735 -555336
36924e55336J90582J81426J84029R9574o4875j42034q0483m915L9667J29801K15795
$$ -555336 -364754 -183328 701 100275 35400 -106634 -187117 -192032 -152365 -22564 193231
36913A93231J25074j18236k49388j28616Q1870J82305J59717Q5316K020k5712
$$ 193231 318305 200069 -49319 -177935 -96065 86240 245957 331273 333293 307581
36903C07581M7326J14077K8170j33791j61475p3460r8610k47246k36385L1395
$$ 307581 354907 468984 497154 363363 201888 128428 29818 -217428 -453813 -422418
36893d22418K46884J56639m1844k6910J52078K00977N1483r4084j12739p8452
$$ -422418 -175534 -18895 -60739 -87649 64429 265406 316889 222805 110066 31614
36883C1614m7538K8093J37506J54989K0383j50853k09973j52555r0920q5182o4536
$$ 31614 -15924 12169 149675 304664 325047 174194 -35779 -188334 -279254 -364436 -428972
36872d28972N4638J98841J74269o4306k66714j51780K09938M45739L34356M4095
$$ -428972 -374334 -175493 -1224 -65530 -332244 -484024 -274086 171653 506009 550104
36862E50104j32881j17415k8346J9567j0299r2924j32734l8521J14883J23046
$$ 550104 417223 299808 271462 291029 280730 187806 55072 16551 131434 254480
36852B54480o4170k37873k17372q5206P320J00727K83876M23014L01903j4452
$$ 254480 190310 -47563 -264935 -350141 -342821 -242094 41782 464796 766699 752247
36842G52247k16718j65598l7753j2134l0623L1446J35431J56338P8849j2414p3331
$$ 752247 535529 369931 332178 320044 289421 320867 456298 612636 691485 679071 605740
36831F05740j18085j31812p0477M3596J00416K0609j24940j62467j5299J71642
$$ 605740 487655 355843 285366 328962 429378 449987 325047 162580 147281 318923
36821C18923J77482j9344j99558j72884O439J54230J76628P9053j27143l72272
$$ 318923 496405 477061 277503 104619 111058 265288 441916 520969 393826 21554
36811B1554m68937k95665l658J41789J00036M6216N6845M3897P850P6804K20457
$$ 21554 -447383 -743048 -746706 -604917 -504881 -458665 -401820 -357923 -350073 -273269 -52812
36800e2812K11045M199j20461R053J55409O2545r8546j8786J97644J86395n6451
$$ -52812 158233 162432 41971 51024 206433 268978 170432 151646 349290 535685 479234
36789D79234j54926J9186J42905k336j81514j37372j9077p5558j89194p6471K03821
$$ 479234 324308 343494 486399 484063 302549 165177 146100 70542 -118652 -195123 8698
36778H698L08751J23099j07889j60806p6019J2797N1577J7607r5905j89725j33134
$$ 8698 317449 440548 332659 171853 95834 108631 160208 177815 81910 -107815 -240949
36767b40949J9300N7973q1649k22194k08095q8037M2430J89816L35070L37430
$$ -240949 -221649 -163676 -245325 -467519 -675614 -763651 -721221 -531405 -196335 141095
36757A41095J39705n8337k9331J45676J65267p7509l40730l39607q6568J47312
$$ 141095 280800 222463 193132 338808 504075 426566 85836 -253771 -340339 -193027
36747a93027J50877k0890j56849j47771p3585l7157j2319O1580J21872P0223k4467
$$ -193027 -42150 -63040 -219889 -367660 -441245 -478402 -490721 -429141 -307269 -237046 -261513
36736b61513O26J22871J43235K5570j4628J20850K04948M9532j46739j01462O6810
$$ -261513 -260887 -138016 5219 30789 16161 137011 341959 391491 244752 143290 210100
36725B10100J7526k20210k44104P1507L17557J38571k34247l23400p6252J29736
$$ 210100 227626 7416 -236688 -165181 152376 290947 56700 -266700 -342952 -213216
36715b13216O5942r0596j09872l5495k8712p6120k9331J44566L03681L05925J42696
$$ -213216 -147274 -237870 -347742 -383237 -411949 -488069 -517400 -372834 -69153 236772 379468
36704C79468q9027k60195k65623j03639Q3994J35989N7277k147K7174M2809m3177
$$ 379468 290441 30246 -235377 -339016 -255022 -119033 -61756 -63903 -36729 6080 -37097
36693c7097j54094j82064j47973r3071N9144L29331M77155K55330j57351l02264
$$ -37097 -191191 -373255 -521228 -614299 -555155 -225824 251331 506661 349310 47046
36683D7046q1928Q6099q8750l17588k02618J20929K06038L118r0119J20445L37050
$$ 47046 -34882 51217 -37533 -355121 -557739 -436810 -230772 -227654 -317773 -197328 139722
36672A39722K47918l5961k01676j55563k9467O8141J14396Q7719o743p8837n0820
$$ 139722 387640 351679 150003 -5560 -35027 33114 147510 235229 228486 149649 98829
36661I8829J8619L819j19759k45693k50937j00967J17815K44103J80480J5334
$$ 98829 117448 121267 1508 -244185 -495122 -596089 -478274 -234171 -53691 -38357
36651c8357o1910P216Q8548N9255l2102p6080p3872r8476j47352j39379l9057
$$ -38357 -100267 -93051 -4503 54752 22650 -53430 -127302 -225778 -373130 -512509 -551566
36640e51566R2053J63577J38998P1310P1921J90528L03751K07291j19320m16676
$$ -551566 -459513 -295936 -156938 -85628 -13707 176821 480572 687863 568543 151867
36630A51867m09155j25149J41288J73442M2760l7506J6412R5674P5548j9446o6497
$$ 151867 -257288 -382437 -241149 -67707 -24947 -62453 -46041 49633 125181 105735 39238
36619C9238k5276J3253j4630k3350R3996K62017K75043O9437j68953k24689j00119
$$ 39238 13962 27215 12585 -10765 83231 345248 620291 689728 520775 296086 195967
36608A95967K3711K0362o1677r7440m6455Q166k5022j14588j35095l9762O4030
$$ 195967 219678 240040 178363 80923 34468 42634 17612 -96976 -232071 -271833 -207803
36597b07803O7833K0170L3274Q4752M7664r0701j79099j02846P6992K21392K53419
$$ -207803 -139970 -119800 -86526 -1774 45890 -44811 -223910 -326756 -249764 -28372 225047
36586B25047J66934o912j89948k81631k35959q3075J05718K17803J30367j29749
$$ 225047 391981 385069 195121 -86510 -322469 -405544 -299826 -82023 48344 -81405
36576h1405l08323j84785J01574J91387k708j68486m0012K47212L82218K77548
$$ -81405 -389728 -574513 -472939 -281552 -284260 -452746 -492758 -245546 136672 414220
36566D14220P9758p5061j41484j04621r159K2282n5403j03715R854J79573J72474
$$ 414220 493978 418917 277433 172812 163653 185935 130532 26817 36671 216244 388718
36555C88718n2864k72968k58130k6266J75112J23040j22800k46870n2178K40032
$$ 388718 335854 62886 -195244 -221510 -46398 76642 -46158 -293028 -345206 -105174
36545a05174K43347n6229k69724j70291R516J854p3808K4954K15716K38621J00109
$$ -105174 138173 81944 -187780 -358071 -348555 -346701 -420509 -395555 -179839 58782 158891
36534A58891K5429N1018M272j34331j72505m0198R6729J10566O2871K8746j6020
$$ 158891 184320 235338 239610 105279 -67226 -107424 -10695 99871 162742 191488 175468
36523A75468p5378q6594m3689j3146j0373q788m4709j34333j38099O0098K79720
$$ 175468 100090 13496 -30193 -43339 -53712 -62500 -107209 -241542 -379641 -319543 -39823
36512c9823K29855l5934j61005k1791J07949K7663q8850l5290P9970N6975n5921
$$ -39823 190032 154098 -6907 -28698 79251 106914 18064 -17226 62744 119719 63798
36501F3798q9831n2665o0121r3257m8520N0704Q3824K2218n3888p2437l485J36463
$$ 63798 -26033 -78698 -138819 -232076 -280596 -229892 -146068 -123850 -177738 -250175 -253660 -117197
36489a17197K29236J32539q6717j54317L9219K34896J55118r4252j96919q9730
$$ -117197 112039 244578 157861 3544 42763 277659 432777 338525 141606 51876
36479E1876K464n1512j25623p9673L7180Q9909L3157p1605j33969j03332j1077
$$ 51876 54340 2828 -122795 -202468 -165288 -75379 -42222 -113827 -247796 -351128 -362205
36468c62205O0073P8110Q5936R6029N6407k1180k1867Q3055J28941k1273k44981
$$ -362205 -302132 -224022 -138086 -42057 14350 -6830 -28697 54358 183299 162026 -82955
36457h2955l03442j52622L3363R9042M0672m7751n3513O6450J87575J12806j36234
$$ -82955 -386397 -539019 -505656 -406614 -365942 -413693 -467206 -400756 -213181 -100375 -236609
36446b36609k74188j38023O1819P4285l406N0947J49040N2971j31145n8256K48631
$$ -236609 -510797 -648820 -587001 -512716 -516122 -465175 -316135 -263164 -394309 -452565 -203934
36435b03934L45959M5868k67068k04544Q9246K35380J69686Q5921L9847n2593
$$ -203934 142025 187893 -79175 -283719 -194473 40907 210593 296514 336361 283768
36425B83768j38596p7655O4904N7799j38401k83540j85329N8542K12372J70764
$$ 283768 145172 67517 132421 190220 51819 -231721 -417050 -358508 -146136 24628
36415B4628J0707j34716j88109j52631p0136L4588J49249K23767J97181J05667
$$ 24628 35335 -99381 -287490 -440121 -510257 -475669 -326420 -102653 94528 200195
36405B00195Q2837J90936L16147K96626J02275j59809l50407l67475k08252k3096
$$ 200195 283032 473968 790115 1086741 1189016 1029207 678800 311325 103073 79977
36395G9977J932j09657j25623N2987K10748J34736m8624q1970K245l8271k09066
$$ 79977 81909 -27748 -153371 -100384 110364 245100 196476 114506 116751 78480 -130586
36384a30586k41728m2924J38489J12173K9123Q4513J79482J14018n6744j17492
$$ -130586 -372314 -415238 -276749 -164576 -135453 -50940 128542 242560 185816 68324
36374F8324l8415K4959J5504J4486K9170j4014o2282K4359J81108J44629j38373
$$ 68324 29909 54868 70372 84858 114028 100014 37732 62091 243199 387828 249455
36363B49455l47504k10813R5072J86579n489j94859j66558q552R5994J01598O3596
$$ 249455 -98049 -308862 -213790 -27211 -32700 -227559 -394117 -402669 -306675 -205077 -141481
36352a41481K3061L838J9724L4589P287m131R5152K43492K41972L0981j99353
$$ -141481 -118420 -114582 -94858 -60269 -52982 -57113 38039 281531 523503 554484 355131
36341C55131k62334j94485j17936m0365N8020Q6767m771n5765R0201K75547K08104
$$ 355131 92797 -101688 -219624 -259989 -201969 -115202 -119973 -175738 -85537 190010 398114
36330C98114p5044k22546r1344N4224r982j14637q962K01951K15555L230j63719
$$ 398114 323070 100524 9180 63404 53422 -61215 -70177 131774 347329 350559 186840
36319A86840j19614K0043R7575R9704N8086l8609j54390j86460j24266r5146j57335
$$ 186840 67226 87269 184844 284548 342634 304025 149635 -36825 -161091 -256237 -413572
36308d13572j71558m086K33379K99328J46450j8447k2955N0129J2369j39217k09817
$$ -413572 -585130 -589216 -355837 -56509 89941 71494 48539 98668 111037 -28180 -237997
36297b37997r2784N9672M5134r2091j28486j2152M9857o4306j56608n823K42189
$$ -237997 -330781 -271109 -225975 -318066 -446552 -458704 -408847 -473153 -629761 -635584 -393395
36286c93395K49552O770j26375L7229K28585J50783o3892r1691N3126N8012j59431
$$ -393395 -143843 -137073 -263448 -226219 2366 153149 89257 -2434 50692 108704 -50727
36275e0727l00241j48156R6883J27038k7025q4761N0529J88971J79786J13902
$$ -50727 -350968 -499124 -402241 -275203 -302228 -386989 -336460 -147489 32297 146199
36265A46199J15476J06656n5741k92231l45875j39220Q5792Q7747m2654l7838
$$ 146199 261675 368331 312590 20359 -325516 -464736 -378944 -291197 -333851 -371689
36255c71689J27601J95917L4374j48322j27460o563j6385j03867j3484K50469
$$ -371689 -244088 -48171 -13797 -162119 -289579 -296142 -312527 -416394 -429878 -179409
36245a79409L57355J33101j62073k00634k0342J09966R4011M4771K0335l2896
$$ -179409 177946 311047 148974 -51660 -72002 37964 131975 176746 197081 164185
36235A64185j10714j41682j35625j49095j20588N0512K63374K87527J10960k3512
$$ 164185 53471 -88211 -223836 -372931 -493519 -443007 -179633 107894 218854 195342
36225A95342n67J678j45337k61342j43906Q2671J51390N2986n524L8466M8208
$$ 195342 194775 196453 51116 -210226 -354132 -271461 -120071 -67085 -72609 -34143 14065
36214A4065l2291r4396q1377o5352o3858J3107J62082K19028R2538q2965j28574
$$ 14065 -18226 -112622 -193999 -259351 -323209 -310102 -148020 71008 163546 80581 -47993
36203d7993l7824P6616J40118J27828K6387j09885j49875m0209R4735J03653K537
$$ -47993 -85817 -9201 130917 258745 285132 175247 25372 -14837 79898 183551 186088
36192A86088p3614o0668r464K4192L8313M4500M1151K6458l92l4399m1619J4720
$$ 186088 112474 51806 42342 66534 104847 149347 190498 216956 216564 182165 140546 155266
36180A55266J01179J27848O7181r676m9189q1941j25109j18332l1334N5334O0183
$$ 155266 256445 384293 451474 441798 392609 310668 185559 67227 35893 91227 151410
36169A51410O904n4267j23177j57828m4899J96711L22421J68322o4089p1343Q6131
$$ 151410 158314 104047 -19130 -176958 -221857 -25146 297275 465597 401508 330165 416296
36158D16296P6427j61612k99421j28636J17202J25534n1717j37001l9647J03248
$$ 416296 492723 331111 31690 -96946 20256 145790 94073 -42928 -82575 20673
36148B0673J87739K13441J53536k1039j97393k01441m9684M9547r065q7002l0221
$$ 20673 208412 421853 575389 554350 356957 155516 105832 155379 146314 59312 29091
36137B9091R5772J16119J1474o4753k2436L8056j3898j39847j88884j16548k8704
$$ 29091 124863 240982 252456 187703 165267 203323 189425 49578 -139306 -255854 -284558
36126b84558O078N4346J55775J94814P2853q7799r3782K1278N7140j7217l1358
$$ -284558 -278480 -224134 -68359 126455 199308 111509 17727 39005 96145 78928 47570
36115D7570N4672N5545j01258k04599r2214P7415R1157J3147J0391L3319m2397
$$ 47570 102242 157787 56529 -148070 -240284 -162869 -71712 -58565 -48174 -14855 -57252
36104e7252j06980J6522J93430J31634j16797j89971Q509J51066J9122j65764
$$ -57252 -164232 -147710 45720 177354 60557 -129414 -120905 30161 49283 -116481
36094a16481j34966J3199M1227k5873n703R5629J17845L6253k2476m155K8562
$$ -116481 -251447 -238248 -197021 -222894 -228597 -132968 -15123 21130 -1346 -5501 23061
36083B3061L3743J0596o2962j61909j53642K9789K27366K34782R5165J3290K8472
$$ 23061 56804 67400 4438 -157471 -311113 -281324 -53958 180824 275989 289279 317751
36072C17751p159j31081j82369o9429O7047N5327p7028j68998j32262j3182R0938
$$ 317751 310592 179511 -2858 -72287 -5240 50087 -26941 -195939 -328201 -341383 -250445
36061b50445J19759Q9640O9578R0491R5151K6287p0546j03391n7649J5905R0829
$$ -250445 -130686 -41046 28532 119023 214174 240461 169915 66524 8875 24780 115609
36050A15609J47382J20788r634j27549j15869m0896m0684p7916r190J21582J08136
$$ 115609 262991 383779 374145 246596 130727 89831 49147 -28769 -37959 83623 191759
36039A91759o3098j45171j8033J07445L1124j14361r4754M8887J02710M1615K2067
$$ 191759 128661 -16510 -34543 72902 104026 -10335 -105089 -56202 46508 88123 110190
36028A10190P1530N6612l2731k8856J10111J70250q334k55407k76700n1237J49465
$$ 110190 181720 238332 205601 176745 286856 457106 448772 193365 -83335 -134572 14893
36017A4893J23320l1800r1470K976J12552J08671J3253p4094j04065r0836n7027
$$ 14893 138213 106413 14943 17919 130471 239142 252395 178301 74236 -16600 -73627
36006g3627k2984j2468j4693J7263O8683K5494j59897l15204k16667Q6973K89068
$$ -73627 -96611 -109079 -123772 -106509 -37826 -12332 -172229 -487433 -704100 -617127 -328059
35995c28059K17186M6127J9923J13000J25473J3965o7274l1959J4836l6393j25759
$$ -328059 -110873 -64746 -44823 68177 193650 207615 140341 108382 123218 86825 -38934
35984c8934j21848j7897O3581M5105r443p277K2465k0498j09241o9703J55697
$$ -38934 -160782 -178679 -115098 -69993 -79436 -86713 -64248 -84746 -193987 -263690 -107993
35973a07993L38946K25809r3827k77509j85875k0460L4216M6934R9269P2078j12635
$$ -107993 230953 456762 362935 85426 -100449 -120909 -86693 -39759 59510 131588 18953
35962A8953k48970j23591J11539J50308K3129L3086K23958K84249O5676j53109
$$ 18953 -230017 -353608 -242069 -91761 -68632 -35546 188412 472661 538337 385228
35952C85228j01435P2661P2538p7066j18759k094O3612k9034j37674j24025l4532
$$ 385228 283793 356454 428992 351926 233167 231073 294685 265651 127977 3952 -30580
35941c0580M5135J23643J87789J24710q7585k40822j39874Q4502J20871p4599
$$ -30580 14555 138198 325987 450697 363112 122290 -17584 66918 187789 113190
35931A13190k06428q3205R5834N5521j34605j83370k0130J43085J65654J35776
$$ 113190 -93238 -176443 -80609 -25088 -159693 -343063 -363193 -220108 -54454 81322
35921H1322J34934R0719l5752j22627p8539L988J7623J2589O3179J06929P0138
$$ 81322 216256 306975 271223 148596 70057 74045 91668 104257 167436 274365 344503
35910C44503K1212L5292L2730o7454j53378q4839M7928N2452n4711r7841m9476
$$ 344503 365715 401007 433737 366283 212905 128066 175994 228446 173735 75894 26418
35899B6418m3341j02743j01626o671O9730P9263Q4187P6273k2780j48224j20110
$$ 26418 -16923 -119666 -221292 -227963 -158233 -78970 5217 81490 58710 -89514 -209624
35888b09624N5627J52059P1396o700N8520J34471N5129j00177j54363j14106j14075
$$ -209624 -153997 -1938 69458 62758 121278 255749 310878 210701 56338 -57768 -171843
35877a71843j74679j87120q8303P5532K15975K49133J41557j6037n9604N1069
$$ -171843 -346522 -533642 -621945 -546413 -330438 -81305 60252 44215 -15389 35680
35867C5680J65887J36920j0397j49028j88452r6229Q8513K10053J17956r4472
$$ 35680 201567 338487 328090 179062 -9390 -105619 -17106 192947 310903 216431
35857B16431j47162L2728J69325M2305j61707j26593J06686K06681N3322j03999
$$ 216431 69269 101997 271322 313627 151920 25327 132013 338694 392016 288017
35847B88017l6474J40601J54889m2367k28116k15504q8560n7746j38506j21082
$$ 288017 251543 392144 547033 504666 276550 61046 -27514 -85260 -223766 -344848
35837c44848Q7997K64025J73774m6301q2896N4888O2448j20692j80582L3476K20595
$$ -344848 -256851 7174 180948 134647 51751 106639 169087 48395 -132187 -98711 121884
35826A21884J15528p0172j7247J57038J11559j33206k36105r3952L3329k8566
$$ 121884 237412 167240 149993 307031 418590 285384 49279 -44673 -11344 -39910
35816c9910j38071j26928l9605J2914K4154K4748O979j1453K3583J03893J54386
$$ -39910 -177981 -304909 -344514 -331600 -307446 -282698 -275719 -287172 -263589 -159696 -5310
35805e310J44443J10322P5281L4553j0659p6062j78578k30093q5899J89714K88529
$$ -5310 139133 249455 324736 359289 348630 272568 93990 -136103 -222002 -32288 256241
35794B56241O6822j99440j99075l4367Q795m1987M5410K21854K05889j8314j72555
$$ 256241 323063 123623 -75452 -109819 -101024 -143011 -97601 124253 330142 311828 139273
35783A39273j62162j60318j78233o008L07114L72371N9620k37781j84912J9277
$$ 139273 -22889 -183207 -361440 -367448 -60334 312037 371657 133876 -51036 -31759
35773c1759L6988p4569o7506K8017J5736o8946m0900P0995Q5329K3167P5697K37063
$$ -31759 5229 -69340 -136846 -108829 -93093 -162039 -202939 -131944 -46615 -23448 52249 289312
35761B89312K68998O7471j79397k61635j88177r1245l6831r026Q186Q595l906
$$ 289312 558310 625781 446384 184749 -3428 -94673 -131504 -140530 -132344 -123749 -127655
35750a27655P59M6408R2205M7312r3091j72860n2877J64753K42818J30336m03
$$ -127655 -126896 -80488 11717 59029 -34062 -206922 -259799 -95046 147772 278108 277705
35739B77705m3726p4281j31643j26461m4568j3292n9837l9711P2581Q2267p1111
$$ 277705 233979 159698 28055 -98406 -142974 -156266 -216103 -255814 -183233 -100966 -172077
35728a72077j31549O9408K79205J87679p9860j64043j8195J00304R5657J17585
$$ -172077 -303626 -234218 44987 232666 152806 -11237 -29432 70872 166529 284114
35718B84114J91465J32117r0804k14423o2569J61212J44968r7736k49270j10545
$$ 284114 475579 607696 516892 302469 239900 401112 546080 448344 199074 88529
35708H8529J47467K14060M4201r5773j9903R8604N046k03868k06179J7888J29148
$$ 88529 235996 450056 494257 398484 378581 477185 482231 278363 72184 90072 219220
35697B19220k6257j74422p9616R3678J17609P0686Q0420J4223k11251l02766j3519
$$ 219220 192963 18541 -61075 32603 150212 220898 301318 315541 104290 -198476 -211995
35686b11995L34305K48842j56683l18488q6477J14590K0622j09726n693K04047
$$ -211995 122310 371152 214469 -104019 -190496 -75906 -55284 -165010 -170703 33344
35676C3344K80748K06941N4463j50979k83364j58606J27089K19640J4654j83342
$$ 33344 314092 521033 575496 424517 141153 -17453 109636 329276 343930 160588
35666A60588j57544p3921q7531l7227J87815L23815J25620j81818k15766n289
$$ 160588 3044 -70877 -158408 -195635 -7820 315995 441615 259797 44031 38742
35656C8742J15797M0964m6376n3040o9572j12081p7181L6376J11299J22709J44453
$$ 38742 154539 195503 149127 96087 26515 -85566 -162747 -126371 -15072 107637 252090
35645B52090J49994L0536j72604k63501j60627K345Q4339R3156R2614Q8807O3114
$$ 252090 402084 432620 260016 -3485 -164112 -161767 -77428 15728 108342 197149 260263
35634B60263K2715k0560n4668m5553J7386O2610M139j33397k28537j99466p0968
$$ 260263 282978 262418 207750 162197 179583 242193 246332 112935 -115602 -315068 -386036
35623c86036P6703J67333J58861P3728j3959n8331p8507r0278o3770M671M7510
$$ -386036 -309333 -142000 16861 90589 76630 18299 -60208 -150486 -214256 -209585 -162075
35612a62075J8088l0390k5485J6666L2375J5382J3451M7309Q3819P7204K3533
$$ -162075 -143987 -174377 -199862 -183196 -150821 -135439 -121988 -74679 9140 86344 109877
35601A09877n818Q0371K38209K48234l2997m13123n35304l16811k5385J04931
$$ 109877 104059 184430 422639 670873 637876 224753 -310551 -627362 -652747 -547816
35591e47816J11490J00614N9933p830M79Q8532R4754j4143k2221J64990K82183
$$ -547816 -436326 -335712 -275779 -283609 -283130 -194598 -99844 -113987 -136208 28782 310965
35580C10965J04955j40847j04992J26658J76309k4610j74786j14560j0985L574
$$ 310965 415920 275073 170081 296739 473048 448438 273652 159092 148107 151681
35570A51681J5073O0965O513j77162k82227j64248M0768J37430J22338Q8506N4893
$$ 151681 166754 227719 234232 57070 -225157 -389405 -348637 -211207 -88869 -363 54530
35559E4530K1880M1570J03772Q7631n0785j65784j16499L3463J24282J13307P2473
$$ 54530 76410 117980 221752 309383 258598 92814 -23685 9778 134060 247367 319840
35548C19840N3105N5083O9754P0289J1183r8858j73098j44050m0406N7169Q7613
$$ 319840 372945 428028 497782 568071 579254 480396 307298 163248 122842 180011 267624
35537B67624L7029m1263n3016J1730K5429r1684j99628j24366M1769O0295m8766
$$ 267624 304653 263390 210374 222104 247533 155849 -43779 -168145 -126376 -66081 -114847
35526a14847j1308K31068L61810J53629j77028k94904k08236j51561j68403j01725
$$ -114847 -126155 104913 466723 620352 443324 148420 -59816 -211377 -379780 -481505
35516d81505P2700J82784J39535O1975P6443J43856J39752J5936j46523k01277
$$ -481505 -408805 -226021 -86486 -24511 51932 195788 335540 351476 204953 3676
35506C676p6079J15255J66600L6826q0316j6227J54173K50263K18962J08031o1574
$$ 3676 -72403 42852 209452 246278 165962 149735 303908 554171 773133 881164 819590
35495H19590k37256k73062j18598L5154O996q1452q234J49921J29644n0954r2459
$$ 819590 582334 309272 190674 225828 232824 151372 143138 293059 422703 371749 279290
35484B79290P4978J48585m3838k41462j71226K0480M1409o8385o8473J9809l9912
$$ 279290 354268 502853 459015 217553 46327 66807 108216 39831 -28642 -8833 -48745
35473d8745k32491k51565R05K09525J04315j33122j46149Q1546K38882J45840
$$ -48745 -281236 -532801 -531896 -322371 -218056 -351178 -497327 -415781 -176899 -31059
35463c1059m3571j13821o1288j3764j7699k1283J593K1417K5215L2237L9720K4535
$$ -31059 -74630 -188451 -249739 -263503 -281202 -302485 -300892 -279475 -254260 -222023 -182303 -157768
35451a57768P039M4466J32523J70813P3321j17135k66042k79124j66452m948J17002
$$ -157768 -150729 -106263 26260 197073 270394 153259 -112783 -391907 -558359 -563307 -446305
35440d46305J39834P6889J6857L0966P6243M5600p8526j83670j66673n4976N1695
$$ -446305 -306471 -229582 -212725 -181759 -105516 -59916 -138442 -322112 -488785 -543761 -492066
35429d92066J07696J32383J35035J02175M6920L186l0508p9088j16036o9704O5054
$$ -492066 -384370 -251987 -116952 -14777 32143 35329 4821 -74267 -190303 -260007 -194953
35418a94953J79988J66558M2614p5776j01150l4519O7729J30656Q7395n7266j83977
$$ -194953 -14965 151593 194207 118431 17281 -17238 50491 181147 268542 211276 27299
35407B7299j51172L4481J91134J53183l9995j95196j85706o1864N7489J29256
$$ 27299 -123873 -89392 101742 254925 214930 19734 -165972 -227836 -170347 -41091
35397d1091J72812J66518N5577j23177k18498j38154J1064M9441l9187j07025
$$ -41091 131721 298239 353816 230639 12141 -126013 -114949 -65508 -104695 -211720
35387b11720p0496j896L6828R1865J63073J18099q3344k22276r6565J34535J50649
$$ -211720 -282216 -284112 -247284 -155419 7654 125753 42409 -179867 -276432 -141897 8752
35376H752l0311p1529J29255K55346Q4033j47837j34599K0114L2132o9262m8852
$$ 8752 -21559 -93088 36167 291513 375546 227709 93110 113224 145356 76094 27242
35365B7242O8007M5567r6590r0808P9184J15883n0376r1569J44277L04575Q8982
$$ 27242 95249 140816 44226 -46582 32602 148485 98109 6540 150817 455392 544374
35354E44374k19045j83579Q1444J15982j25722k31804l7193J35645N6635n0566
$$ 544374 325329 141750 223194 339176 213454 -18350 -55543 80102 136737 86171
35344H6171M8131J74378O4270j61460j98309n0023K5406l8951o1288L6549J28222
$$ 86171 134302 308680 372950 211490 13181 -36842 -11436 -50387 -111675 -75126 53096
35333E3096J44987J54805J45238R289j81762j77771N0008J77142j8241k98887
$$ 53096 198083 352888 498126 507415 325653 147882 197890 375032 356791 57904
35323E7904l03421n8473J13132P5117j7462l6509k1097m892L7536N0255n4829
$$ 57904 -245517 -303990 -190858 -115741 -133203 -169712 -190809 -195701 -158165 -107910 -162739
35312a62739j75036r4290J54740K64292R2334j20192j19029J1690N6406J7370
$$ -162739 -337775 -432065 -277325 -13033 79301 -40891 -159920 -148230 -91824 -74454
35302g4454K2255M3120l0726j36666j11773K5259R5420M1367j6702M228O6398
$$ -74454 -52199 -9079 -39805 -176471 -288244 -262985 -167565 -126198 -142900 -138672 -72274
35291g2274J32737J93667J81159L2411j61750k37567j80886j09292o0028J6147
$$ -72274 60463 254130 435289 467700 305950 68383 -112503 -221795 -281823 -265676
35281b65676P4288J1885j02982p2149J14825K21711R8678j19704k26819j74173
$$ -265676 -191388 -179503 -282485 -354634 -239809 -18098 80580 -39124 -265943 -440116
35271d40116j9469J67529K66095J60435o7409j74517q0884K1369k1557j00324
$$ -440116 -459585 -292056 -25961 134474 67065 -107452 -188336 -166967 -188524 -288848
35261b88848n4815P2734J47280J47135J12122K6904j00114j69707j31531o3805
$$ -288848 -343663 -270929 -123649 23486 135608 162512 62398 -107309 -238840 -302645
35251c02645j3349Q0971K01271J91034K3609q5347o627Q3240J2492r2558p2195
$$ -302645 -315994 -235023 -33752 157282 180891 95544 88917 172157 184649 92091 19896
35240A9896m9326j70256k53220p5987J59534Q5434k09994k81647k9367J68038
$$ 19896 -29430 -199686 -452906 -528893 -369359 -283925 -493919 -775566 -804933 -636895
35230f36895Q2547n0517O102J18770P9070m7584r1567n0893P90O5308J16687N8058
$$ -636895 -554348 -604865 -598763 -479993 -400923 -448507 -540074 -590967 -590177 -524869 -408182 -350124
35218c50124p2195p6700P0402J17682o0902k17521j14133Q8927J07936n588m379
$$ -350124 -422319 -499019 -428617 -310935 -371837 -589358 -703491 -614564 -506628 -512216 -516595
35207e16595J03309R4070m6439q8168M1869J33314L9296j06163j23124l7877K3943
$$ -516595 -413286 -319216 -365655 -453823 -411954 -278640 -239344 -345507 -468631 -506508 -482565
35196d82565M9239J06152J84934J98974J26843O0879Q3482J36282P5584j18194
$$ -482565 -433326 -327174 -142240 56734 183577 244456 327938 464220 539804 421610
35186D21610k56115j59559P7894J89032Q9229m1576o7805p7349j50539j68594
$$ 421610 165495 5936 83830 272862 362091 320515 252710 175361 24822 -143772
35176a43772k8544J33554J49980J01177J44092J90277M8664j83989k00453M0874
$$ -143772 -172316 -38762 111218 212395 356487 546764 595428 411439 210986 251860
35166B51860K23357J22805j15469k43528k15961j14300J8490J29963J21158p64
$$ 251860 475217 598022 482553 239025 23064 -91236 -72746 57217 178375 177611
35156A77611p2607J859J11007J20534N3603k1184j19583k28565k28132q5626K5901
$$ 177611 105004 106863 217870 338404 392007 370823 251240 22675 -205457 -291083 -265182
35145b65182j8125p3528K9086J67924J19210m8075p2904N4388Q0591o1938j33308
$$ -265182 -283307 -356835 -327749 -159825 -40615 -88690 -161594 -107206 -26615 -88553 -221861
35134b21861n423J15545M8223o2289k0074P5217K3233j02079o8880J09392J82576
$$ -221861 -227284 -111739 -63516 -125805 -145879 -70662 -47429 -149508 -218388 -108996 73580
35123G3580N7055q9803j14672q0538o2464j1937Q0182Q6401m7206j48274m2146
$$ 73580 130635 40832 -73840 -154378 -216842 -228779 -148597 -62196 -109402 -257676 -299822
35112b99822J76089K64178J64799M4081J8756J5695n5234j27283p4200Q1948J67011
$$ -299822 -123733 140445 305244 349325 368081 383776 328542 201259 127059 209007 376018
35101C76018O9631j11044j80533p7669P6002J42337R3110m2492k30080l56443
$$ 376018 445649 334605 154072 76403 152405 294742 387852 345360 115280 -241163
35091b41163k45862R4410L53103K50475o6670k07115q0898K9188l5459q5937J5874
$$ -241163 -487025 -392615 -39512 210963 144293 -62822 -143720 -114532 -149991 -235928 -220054
35080b20054Q4288l5917j46821k9323J51508J19187l6909m1863O4487L7639o4728
$$ -220054 -135766 -171683 -318504 -347827 -196319 -77132 -114041 -155904 -91417 -53778 -118506
$$ [...]
##END NTUPLES=NMR SPECTRUM
##END=
