##TITLE=31Pdec_2PEDM2511
 CDCl3, 24 sc
 26.11.2020
##JCAMPDX= 6.0         $$ Bruker NMR JCAMP-DX V2.0
##DATA TYPE= NMR SPECTRUM
##DATA CLASS= NTUPLES
##ORIGIN= UXNMR, Bruker Analytische Messtechnik GmbH
##OWNER= root
$$ XWIN-NMR		Version 3.5
$$ Thu Nov 26 10:54:52 2020 Russian Standard Time (UT+4h)  she@DPX200
##.OBSERVE FREQUENCY= 81.013821
##.OBSERVE NUCLEUS= ^31P
##.ACQUISITION MODE= SIMULTANEOUS
##.ACQUISITION SCHEME= undefined
##.AVERAGES= 24
##.DIGITISER RES= 17
##SPECTROMETER/DATA SYSTEM= spect
##.PULSE SEQUENCE= zgpg30
##.SOLVENT NAME= DMSO
##.SHIFT REFERENCE= (INTERNAL, DMSO, 0, 182.463)
##AUDIT TRAIL= $$ (NUMBER, WHEN, WHO, WHERE, WHAT)
$$ ##TITLE= Audit trail, XWIN-NMR		Version 3.5
$$ ##JCAMPDX= 5.01
$$ ##ORIGIN= Bruker BioSpin GmbH
$$ ##OWNER= she
$$ F:/spectra/data/she/nmr/P31/1/pdata/1/auditp.txt
$$ ##AUDIT TRAIL=  $$ (NUMBER, WHEN, WHO, WHERE, WHAT)
(   1,<2020-11-26 10:53:27.67 +0400>,<she>,<DPX200>,
      <created by zg, POWCHK disabled, PULCHK disabled
       configuration hash MD5:
       00 E9 B6 7A A2 85 ED C7 34 08 36 98 17 FE 4E 26
       data hash MD5: 32K
       D1 8A BD 2B 88 4B D2 EF 77 BA 39 CF 52 CF 41 19>)
(   2,<2020-11-26 10:53:30.21 +0400>,<she>,<DPX200>,
      <Start of raw data processing
       efp BC_mod = 2 LB = 1 FT_mod = 6 PKNL = 1 PHC0 = -2416.249 PHC1 = 163.0008 SI = 64K 
       data hash MD5: 64K
       26 C8 E2 24 9F 56 B3 BE DE C6 E4 B9 33 F6 90 3E>)
(   3,<2020-11-26 10:53:54.03 +0400>,<she>,<DPX200>,
      <pk PHC0 = -23.90116 PHC1 = 57.4 
       data hash MD5: 64K
       01 C1 CC 4E CE 42 7C D2 80 BD CE DB 26 06 2F FE>)
(   4,<2020-11-26 10:53:57.45 +0400>,<she>,<DPX200>,
      <abs ABSG = 5 
       data hash MD5: 64K
       B2 EE 8C A9 52 7B B8 B1 79 9A 13 59 4D 9F DE E6>)
(   5,<2020-11-26 10:54:13.26 +0400>,<she>,<DPX200>,
      <abs ABSG = 5 
       data hash MD5: 64K
       62 32 E4 96 62 9F F4 4B 03 6E 75 48 B6 3D 71 0C>)
$$ ##END=
$$ 
$$ hash MD5
$$ 6D 24 9A 89 C0 34 E5 77 64 B7 83 77 62 27 DC 10
##$RELAX= 
##$RELAX= 
##$RELAX= 
##$RELAX= 
##$RELAX= 
##$RELAX= 
##$RELAX= 
##$RELAX= 
$$ Bruker specific parameters
$$ --------------------------
##$DU= <F:/spectra>
##$EXPNO= 1
##$NAME= <P31>
##$PROCNO= 1
##$TYPE= <nmr>
##$USER= <she>
##$AMP= (0..31)
100 100 100 100 100 100 100 100 100 100 100 100 100 100 100 100 100 100 
100 100 100 100 100 100 100 100 100 100 100 100 100 100 
##$AQSEQ= 0
##$AQ_mod= 1
##$AUNM= <au_zg>
##$AUTOPOS= <>
##$BF1= 81.014009
##$BF2= 200.13
##$BF3= 200.13
##$BF4= 200.13
##$BF5= 200.13
##$BF6= 200.13
##$BF7= 200.13
##$BF8= 200.13
##$BYTORDA= 1
##$CFDGTYP= 0
##$CFRGTYP= 5
##$CHEMSTR= <none>
##$CNST= (0..31)
1 1 145 1 1 1 1 1 1 1 1 1 1 1 1 1 1 1 1 1 1 1 1 1 1 1 1 1 1 1 1 1 
##$CPDPRG= <waltz16>
##$CPDPRG1= <>
##$CPDPRG2= <waltz16>
##$CPDPRG3= <>
##$CPDPRG4= <mlev>
##$CPDPRG5= <mlev>
##$CPDPRG6= <mlev>
##$CPDPRG7= <mlev>
##$CPDPRG8= <mlev>
##$CPDPRGB= <>
##$CPDPRGT= <>
##$D= (0..31)
0 1 0 0 0 0 0 0 0 0 0 0.03 2e-05 3e-06 0 0 0 0 0 0 0 0 0 0 0 0 0 0 0 0 
0 0 
$$ [...]
##$SUBNAM3= <"">
##$SUBNAM4= <"">
##$SUBNAM5= <"">
##$SUBNAM6= <"">
##$SUBNAM7= <"">
##$SUBNAM8= <"">
##$SUBNAM9= <"">
##$SW= 369.568048894756
##$SWIBOX= (0..15)
0 1 3 0 0 0 0 0 0 0 0 0 0 0 0 0 
##$SW_h= 29940.119760479
##$TD= 32768
##$TD0= 1
##$TE= 0
##$TE2= 300
##$TE3= 300
##$TEG= 300
##$TL= (0..7)
0 120 53 12 22 120 120 120 
##$TP= (0..7)
150 150 150 150 150 150 150 150 
##$TP07= 0
##$TPNAME0= <>
##$TPNAME1= <>
##$TPNAME2= <>
##$TPNAME3= <>
##$TPNAME4= <>
##$TPNAME5= <>
##$TPNAME6= <>
##$TPNAME7= <>
##$TPOAL= (0..7)
0.5 0.5 0.5 0.5 0.5 0.5 0.5 0.5 
##$TPOFFS= (0..7)
0 0 0 0 0 0 0 0 
##$TUNHIN= 0
##$TUNHOUT= 0
##$TUNXOUT= 0
##$USERA1= <user>
##$USERA2= <user>
##$USERA3= <user>
##$USERA4= <user>
##$USERA5= <user>
##$V9= 5
##$VALIST= <valist>
##$VCLIST= <CCCCCCCCCCCCCCC>
##$VD= 0
##$VDLIST= <DDDDDDDDDDDDDDD>
##$VPLIST= <PPPPPPPPPPPPPPP>
##$VTLIST= <TTTTTTTTTTTTTTT>
##$WBST= 1024
##$WBSW= 4
##$XGAIN= (0..3)
0 0 0 0 
##$XL= 0
##$YL= 0
##$YMAX_a= 58906
##$YMIN_a= -60827
##$ZGOPTNS= <>
##$ZL1= 120
##$ZL2= 120
##$ZL3= 120
##$ZL4= 120
##$ABSF1= 182.463
##$ABSF2= -187.1042
##$ABSG= 5
##$ABSL= 3
##$ALPHA= 0
##$AQORDER= 0
##$ASSFAC= 0
##$ASSFACI= 0
##$ASSFACX= 0
##$ASSWID= 0
##$AUNMP= <proc_1d>
##$AZFE= 0.1
##$AZFW= 0.5
##$BCFW= 0
##$BC_mod= 2
##$BYTORDP= 0
##$COROFFS= 0
##$CY= -3
##$DATMOD= 1
##$DC= 0
##$DFILT= <>
##$DTYPP= 0
##$F1P= 0
##$F2P= 0
##$FCOR= 1
##$FTSIZE= 65536
##$FT_mod= 6
##$GAMMA= 0
##$GB= 0
##$INTBC= 1
##$INTSCL= 5.30512e-09
##$ISEN= 30
##$LB= 1
##$LEV0= 0
##$LPBIN= 0
##$MAXI= 10000
##$MC2= 0
##$MEAN= 0
##$ME_mod= 0
##$MI= 50
##$NCOEF= 0
##$NC_proc= -3
##$NLEV= 6
##$NOISF1= 182.463
##$NOISF2= 159.3651
##$NSP= 0
##$NTH_PI= 0
##$NZP= 0
##$OFFSET= 182.463
##$PC= 4
##$PHC0= -2440.15
##$PHC1= 220.4008
##$PH_mod= 1
##$PKNL= yes
##$PPARMOD= 0
##$PSCAL= 0
##$PSIGN= 0
##$REVERSE= no
##$SF= 81.014009
##$SI= 65536
##$SIGF1= 159.3651
##$SIGF2= -187.1042
##$SINO= 113.3802
##$SIOLD= 16384
##$SREGLST= <1H.CDCl3>
##$SSB= 0
##$STSI= 65536
##$STSR= 0
##$SW_p= 29940.119760479
##$SYMM= 0
##$S_DEV= 0
##$TDeff= 32768
##$TDoff= 0
##$TI= <>
##$TILT= no
##$TM1= 0
##$TM2= 0
##$TOPLEV= 0
##$USERP1= <user>
##$USERP2= <user>
##$USERP3= <user>
##$USERP4= <user>
##$USERP5= <user>
##$WDW= 1
##$XDIM= 65536
##$YMAX_p= 333301863
##$YMIN_p= -1074546
$$ End of Bruker specific parameters
$$ ---------------------------------
##NTUPLES= NMR SPECTRUM
##VAR_NAME=  FREQUENCY,     SPECTRUM/REAL,   SPECTRUM/IMAG
##SYMBOL=    X,             R,               I
##VAR_TYPE=  INDEPENDENT,   DEPENDENT,       DEPENDENT
##VAR_FORM=  AFFN,          ASDF,            ASDF
##VAR_DIM=   65536,         65536,           65536
##UNITS=     HZ,            ARBITRARY UNITS, ARBITRARY UNITS
##FACTOR=    0.456856943014862, 1,           1
##FIRST=     14782.0589164895, 0,            0
##LAST=      -15158.0608439895, 0,           0
##MIN=       -15158.0608439895, -1074546,    0
##MAX=       14782.0589164895, 333301863,    0
$$ Real data points
##PAGE= N=1
##DATA TABLE= (X++(R..R)), XYDATA
$$ [...]
41339a12597J00210J74366O2082j00095q1145O8344Q1882j03010k41624j58248
$$ -112597 -12387 161979 224061 123966 42821 111165 193047 90037 -151587 -309835
41329c09835J662K3987n0371l4976Q5429J53065J03387L0588j7185j10305k44144
$$ -309835 -308173 -284186 -334557 -369533 -284104 -131039 -27652 2936 -14249 -124554 -368698
41318c68698k51147l1658K43798L10274J31567q4056j59601j06078q126J01182
$$ -368698 -619845 -651503 -407705 -97431 34136 -49920 -209521 -315599 -323725 -222543
41308b22543J99112K22532J47286N4968L6394O2655K7842r2567j92209j56485
$$ -222543 -23431 199101 346387 401355 437749 500404 528246 435679 243470 86985
41298H6985k295J21293P8780r2548j93486q6257J14269J70293M5762m0451N1915
$$ 86985 84690 205983 284763 192215 -1271 -87528 26741 197034 242796 202345 254260
41287B54260J59456O6182j54124k52682j82214j14272j03499j1173J77717K36320
$$ 254260 413716 479898 325774 73092 -109122 -223394 -326893 -338066 -160349 75971
41277G5971M1469j86277j81554o422Q5132K5378m8932o5032o6323m7778K9749
$$ 75971 117440 -68837 -250391 -256813 -171681 -146303 -195235 -260267 -326590 -374368 -344619
41266c44619Q3581n892j56972j58426Q009J47004J73226J97955K40686J47895
$$ -344619 -261038 -266930 -423902 -582328 -574319 -427315 -254089 -56134 184552 332447
41256C32447q0794j84689n1747M9519r0805k21326k4387K92780K58304r8305k46977
$$ 332447 251653 66964 15217 64736 -26069 -247395 -271782 20998 279302 180997 -65980
41245f5980J3927K33397K7869l17215l16336k7715J07454j6892q6285L9597J05531
$$ -65980 -52053 181344 209213 -108002 -424338 -452053 -344599 -361491 -447776 -408179 -302648
41234c02648n4939j94783l6824K69356L37145P3832k08952j97980O5960K67026
$$ -302648 -357587 -552370 -589194 -319838 17307 91139 -117813 -315793 -249833 17193
41224A7193J79723p8757j81882K094K23050J84318k3636n9368J20447J72153o5901
$$ 17193 196916 118159 -63723 -61629 161421 345739 322103 262735 383182 555335 489434
41213D89434k59368q8030K14279J94478j23787k96338j42147N6130O5230N075
$$ 489434 230066 142036 356315 550793 427006 130668 -11479 44651 109881 114956
41203A14956K4977M3479j4153l1352M9813P2452l3916o8129Q5922J83397k204
$$ 114956 139933 183412 169259 137907 187720 260172 226256 158127 244049 427446 425242
41192D25242k53730k15604M4456J59170M1223n6952k3743k7576j36442j71109
$$ 425242 171512 -44092 364 159534 200757 143805 120062 92486 -43956 -215065
41182b15065m2500Q1340P5712N4315J21939J69603P1481j03097k10892k07827
$$ -215065 -257565 -176225 -100513 -46198 75741 245344 316825 213728 2836 -204991
41172b04991j03883P8587K13889J38467r2452k17404j39861n8240j02208j01597
$$ -204991 -308874 -230287 -16398 122069 29617 -187787 -327648 -385888 -488096 -589693
41162e89693R1361K98043K81637J20462M2254M7565j3266j10493q5146M1503R4702
$$ -589693 -498332 -200289 81348 201810 244064 291629 278363 167870 82724 124227 218929
41151B18929M3839J0079P243o2036j62389j38252J1269J06323O1980k4722p9888
$$ 218929 262768 272847 280090 218054 55665 -82587 -71318 35005 96985 72263 -7625
41140g625j27495j40913m2803J17723K02142K12447K53417K64295P9295k00957
$$ -7625 -135120 -276033 -318836 -201113 1029 213476 466893 731188 810483 609526
41130F09526k35894K9575J98310j3278l37790l56043r4095R7474R1814O4867J08574
$$ 609526 373632 403207 601517 588239 250449 -105594 -199689 -102215 -10401 54466 163040
41119A63040J10012K1052m9792o2763j06980j69864r5587J13595J83373o1743
$$ 163040 273052 294104 244312 181549 74569 -95295 -190882 -77287 106086 44343
41109D4343l71231l39576N0349L72492K83191p0214k70384j50268O2291J00643
$$ 44343 -326888 -666464 -616115 -243623 39568 -30646 -301030 -451298 -389007 -288364
41099b88364p639m8204N5307J69814J68528O8588n9804j79333k31470j32970P9200
$$ -288364 -296003 -344207 -288900 -119086 49442 118030 58226 -121107 -352577 -485547 -406347
41088d06347K06070J11678p7681j28006j2122P0613q960j35154j29117K703J03820
$$ -406347 -200277 -88599 -166280 -294286 -306408 -235795 -244755 -379909 -509026 -506323 -402503
41077d02503R8430O5664P4502O5906k1340r7314l1179J18287J52303L8109k4848
$$ -402503 -304073 -238409 -163907 -98001 -119341 -216655 -247834 -129547 22756 60865 36017
41066C6017O4900J18060l0022j92471q7878J86553K61209M9358j40908j03484
$$ 36017 100917 218977 188955 -3516 -91394 95159 356368 405726 264818 161334
41056A61334p101m1301j01387k9369Q5331Q3485J6287P224J230r8532j87250j18474
$$ 161334 154233 112932 11545 -17824 67507 150992 167279 174503 175733 77201 -110049 -228523
41044b28523M432k4115j48095j20951Q9083K43647J98945P3782J0510q117l7507
$$ -228523 -224091 -248206 -396301 -517252 -428169 -184522 14423 88205 98715 90598 53091
41033E3091n1600k1175J9359L2550P981o4788j49183j33895R922J12189K7972
$$ 53091 1491 -19684 -325 32225 40206 -24582 -173765 -307660 -297738 -185549 -157577
41022a57577r3023p1K37521K91358P6817j09489m9564Q2843K9181j63357k56464
$$ -157577 -250600 -250671 -13150 278208 355025 245536 195972 278815 307996 144639 -111825
41011a11825j71455l3596M0651M1339M464k9108k6051L592J8312R526l041j9912
$$ -111825 -283280 -316876 -276225 -234886 -230422 -259530 -285581 -281989 -263677 -254151 -257192 -277104
40999b77104j8353Q1220K62793L07460N9041k60288k86687n2908N1477r7299j67726
$$ -277104 -295457 -214237 48556 356016 415057 154769 -131918 -184826 -133349 -230648 -398374
40988c98374M9703K77482K18061L1519J4171Q9725R616j49358j08730J05859J89632
$$ -398374 -348671 -71189 146872 178391 192562 282287 291903 142545 33815 139674 329306
40977C29306M9365r5879j03372o6282o1827m0733j1782o9577j86948k12955j16235
$$ 329306 378671 282792 179420 113138 51311 10578 -1204 -70781 -257729 -470684 -586919
40966e86919j3794N6724J59431K41824J55205n6069j39280J0854K01589K28042
$$ -586919 -600713 -543989 -384558 -142734 12471 -43598 -182878 -172024 29565 257607
40956B57607J07609l9753j42702j45238k9223O8321k1054j98113j72256Q2114
$$ 257607 365216 325463 182761 37523 8300 76621 55567 -142546 -314802 -232688
40946b32688K31696Q4359j12902q4113M3517K063j39125j03208J01838J74097
$$ -232688 -992 83367 -29535 -113648 -70131 -68068 -207193 -310401 -208563 -34466
40936c4466r612k18406k20197o5592O7966J23606J43663J32479O4802k4583n3816
$$ -34466 -44078 -262484 -482681 -548273 -480307 -356701 -213038 -80559 -15757 -40340 -94156
40925i4156N020P6905N1222q9598k14835j67539L9724K14581K09538Q6389l018
$$ -94156 -89136 -12231 38991 -50607 -265442 -432981 -393257 -178676 30862 117251 114233
40914A14233k2172l9004o5882l9307M1237P1545j3484j30657j47722n4517L7157
$$ 114233 92061 53057 -12825 -52132 -10895 60650 47166 -83491 -231213 -285730 -248573
40903b48573O2576Q6118J55636J57341l6550k91377k89861J9186K60336J12967
$$ -248573 -185997 -99879 55757 213098 176548 -114829 -404690 -385504 -125168 -12201
40893a2201k15138k67235J5825K57060K23852Q6307L3206q611j17529j60182m5086
$$ -12201 -227339 -494574 -478749 -221689 2163 88470 121676 113065 -4464 -164646 -209732
40882b09732O6021K6239m4330l241M2230l5405r8415J3490J44645O4703j03993
$$ -209732 -143711 -117472 -161802 -165043 -122813 -158218 -256633 -243143 -98498 -33795 -137788
40871a37788p2918J03179J09620o9030r6291J48121L38805J91165j33414k91497
$$ -137788 -210706 -107527 2093 -66937 -163228 -15107 323698 514863 381449 89952
40861H9952k01536m8080L901m5199p7789J7436J94739K42843N3750j64859j45853
$$ 89952 -111584 -159664 -155763 -200962 -278751 -261315 -66576 176267 230017 65158 -80695
40850h0695L6617R1494r088j0017J50816K20955Q3185m1168O497O4613j0971q3959
$$ -80695 -44078 47416 38328 28311 179127 400082 483267 442099 448596 513209 502238 418279
40838D18279m3072n3719k33069l64960k42852l4326K0384K0806J55222K74161
$$ 418279 375207 321488 88419 -276541 -519393 -553719 -533335 -512529 -357307 -83146
40828h3146J36579r9330q9287J11583J48526j4398o9023M6901M5535j41414j87563
$$ -83146 53433 -45897 -135184 -23601 124925 110527 41504 88405 133940 -7474 -195037
40817a95037N8763K76311J79886n1114j18414n3350l4951m0061J9220L4642j09829
$$ -195037 -136274 140037 319923 268809 150395 97045 62094 22033 41253 75895 -33934
40806c3934k59821j96514J3732J46284J66264J79907J62896L1506j07391q3740
$$ -33934 -293755 -490269 -476537 -330253 -163989 15918 178814 210320 102929 19189
40796A9189J4234m3901k15652k11741K3911J80076M2669j74005j39305J31214
$$ 19189 33423 -10478 -226130 -437871 -413960 -233884 -191215 -365220 -504525 -373311
40786c73311L21966K39850K1306p5506K2404J45874J11242m5160j28188o8515
$$ -373311 -51345 188505 209811 134305 156709 302583 413825 368665 240477 171962
40776A71962r135m6178n4210P8688K00943J13404p7653j06888O261j9078k38598
$$ 171962 162827 116649 62439 141127 342070 455474 377821 270933 277194 258116 19518
40765A9518l48705j43684J79073L18267K36677P6705p6557j80957j72015p5668
$$ 19518 -329187 -472871 -293798 24469 261146 337851 261294 80337 -91678 -167346
40755a67346k3945l0139N2971K18966K11300n4847k45218p4683K08949J71800
$$ -167346 -191291 -221430 -168459 50507 261807 206960 -38258 -112941 96008 267808
40745B67808j42667l04536j62990O366J4214m280N7428P0580l7068j02852j5125
$$ 267808 125141 -179395 -342385 -336019 -321805 -326085 -268657 -198077 -235145 -337997 -353122
40734c53122Q2220M1465n4256o9772l3853k2820q843L3628M4235K7548R8807K45833
$$ -353122 -270902 -229437 -283693 -353465 -387318 -410138 -418981 -385353 -341118 -313570 -214763 31070
40722C1070K54320L5966j76813j64006n1364p5457j82309j35102Q0849K36988
$$ 31070 285390 321356 144543 -19463 -70827 -146284 -328593 -463695 -382846 -145858
40712a45858K07526J00167M4680M0140K4815l2487j06144j06484L2024J97440
$$ -145858 61668 161835 206515 246655 271470 238983 132839 26355 58379 255819
40702B55819J79534q731r1796M1578J20344o5691k62603j37188J41543J38484
$$ 255819 435353 426622 334826 376404 496748 431057 168454 31266 172809 311293
40692C11293j42764k64575n3955J74440J68509O3982J5342p9827k70378l26066
$$ 311293 168529 -96046 -150001 24439 192948 256930 272272 192445 -77933 -403999
40682d03999r2324K02058K57839J11741r829m4946n9409k7893R2254J88631J27359
$$ -403999 -496323 -294265 -36426 75315 65486 20540 -38869 -66762 25492 214123 341482
40671C41482k6053j09473j02936r8426j19335j22026r2869k3363J03865K06701
$$ 341482 315429 205956 103020 4594 -114741 -236767 -329636 -352999 -249134 -42433
40661d2433J39122n2757j10748N0212J68897N3605q1246J8144J76344O9230j88586
$$ -42433 96689 43932 -66816 -16604 152293 205898 124652 142796 319140 388370 199784
40650A99784j87281R4268K13541m7395l38384k66649O2911K63134J87215m733
$$ 199784 12503 106771 320312 272917 -65467 -332116 -269205 -6071 181144 176411
40640A76411j50382k20773k16849j27385L498Q6480Q6012M9566K8766Q802n9969
$$ 176411 26029 -194744 -411593 -538978 -535480 -449000 -362988 -313422 -284656 -275854 -335823
40629c35823j59515j72281k1224J68122J67602m5305k17676j53143K9601J08280
$$ -335823 -495338 -667619 -688843 -520721 -353119 -398424 -616100 -769243 -739642 -631362
40619f31362Q3829J01392J57378J23265P468m3632P833N8726P1038R8497J10915
$$ -631362 -547533 -446141 -288763 -165498 -158030 -201662 -193829 -135103 -64065 34432 145347
40608A45347J5694j27910j41016r610Q0648M2340j205L0722L3605o6871j56448
$$ 145347 161041 33131 -107885 -117495 -36847 5493 4288 35010 68615 1744 -154704
40597a54704j19450k1410K8299N8329J37277J97167J07093j12751k64937j82762
$$ -154704 -274154 -295564 -267265 -208936 -71659 125508 232601 119850 -145087 -327849
40587c27849O8902K26777J08103j46244k20151n0716P7125j9044j13743L9414
$$ -327849 -258947 -32170 75933 -70311 -290462 -341178 -264053 -283097 -396840 -357426
40577c57426K46527J69303p5394o8263K12831L36234J09291j54107j84045j11049
$$ -357426 -110899 58404 -16990 -85253 127578 463812 573103 418996 234951 123902
40567A23902r2852l0107J12228J19161o6570j46578K4744J28842p0931k60549
$$ 123902 31050 943 113171 232332 165762 19184 43928 172770 101839 -158710
40557a58710q0939K35725K28555n0140j76851o3315Q289m4196j7766J12846J27969
$$ -158710 -239649 -3924 224631 174491 -2360 -65675 -57386 -101582 -119348 -6502 121467
40546A21467p463p0165J3262O2976M033k6812J0336j9622j30561j56407n7536
$$ 121467 114004 43839 57101 120077 124110 97298 107634 88012 -42549 -198956 -256492
40535b56492O912k6185l7471J6950L9243K1889O1637J08139M679j72291j40301
$$ -256492 -249580 -275765 -313236 -296286 -257043 -235154 -173517 -65378 -60699 -232990 -373291
40524c73291J34538L24163K01713n9243j75480r9436M2461J35211J01360n6941
$$ -373291 -238753 85410 287123 227880 52400 -47036 -4575 130636 231996 175055
40514A75055j80437j15119L7918O3620j2874j1553J7379j09580k45272l8758L92895
$$ 175055 -5382 -120501 -82583 -18963 -31837 -43390 -26011 -135591 -380863 -419621 -26726
40503b6726M63145l766m17894k70259J35907K07163p5801k78681k15966o4170
$$ -26726 436419 432653 14759 -255500 -119593 87570 11769 -266912 -482878 -547048
40493e47048M4122J15127J06668N380k7098J03629J88342L3653j59801q9715J42820
$$ -547048 -502926 -387799 -281131 -275751 -302849 -199220 -10878 22775 -137026 -226741 -83921
40482h3921K02231N8060l9795k0720k5080n0739K6268J22120L6561j50052j66828
$$ -83921 118310 176370 136575 115855 90775 40036 66304 188424 224985 74933 -91895
40471i1895k3108K2496l7659N6563K92340L00928l4032l25620k61219m6161o691
$$ -91895 -115003 -92507 -130166 -73603 218737 519665 485633 160013 -101206 -147367 -154058
40460a54058q4591m1867Q6159Q3964n0232j15745l8731O5099J13588J29773J12421
$$ -154058 -238649 -280516 -194357 -110393 -160625 -276370 -315101 -250002 -136414 -6641 105780
40449A05780K0609j03074j36834l8144Q9772J17779L3271n5404n0390R437k869
$$ 105780 126389 23315 -113519 -151663 -61891 55888 89159 33755 -16635 -7198 -10067
40438a0067j03751j35595J2628K13287K68985J93918J40927J08171l9744k58449
$$ -10067 -113818 -249413 -236785 -23498 245487 439405 580332 688503 648759 390310
40428C90310k97415o9926J74773J73312k4355j70540j34446N929R1019K4782j31250
$$ 390310 92895 22969 197742 371054 346699 176159 41713 47642 138661 163443 32193
40417C2193j91457p0939N7961n029j53386j15147Q5917J30328o7862j81832Q878
$$ 32193 -159264 -230203 -172242 -177271 -330657 -445804 -359887 -229559 -297421 -479253 -470375
40406d70375K47874K05809j4584q7836J5442N5785m2943j16213p2735l439J8600
$$ -470375 -222501 -16692 -31276 -119112 -103670 -47885 -90828 -207041 -279776 -283215 -264615
40395b64615J6040q840o7340q3554M770Q3217J1337j04073l4499J81367K50212
$$ -264615 -248575 -257415 -324755 -408309 -403539 -320322 -308985 -413058 -447557 -266190 -15978
40384a5978P4056q7314j7690J36304J20898l3975r2081J9238J24147O7043r2414
$$ -15978 58078 -29236 -46926 89378 210276 176301 84220 103458 227605 294648 202234
40373B02234j81077j10872N7094J87999J84168N4067j00916j70901j21554j3094
$$ 202234 21157 -89715 -32621 155378 339546 393613 292697 121796 242 -12852
40363a2852N0341O899j00041j54424r1286K4033P4793L6485r442m316R873k4813
$$ -12852 37489 44388 -55653 -210077 -301363 -277330 -202537 -166052 -175494 -179810 -169937 -194750
40351a94750p0077l2059R0100J69418J12321M623O430J09095J18272o2462k49608
$$ -194750 -264827 -296886 -206786 -37368 74953 79576 86006 195101 313373 250911 1303
40340A303k06466K6085J87388J52679M9879J0282k214m3190m9179L1336J03370
$$ 1303 -205163 -179078 8310 160989 210868 221150 218936 175746 126567 157903 261273
40329B61273O1254l3960m9134J3443L1932m9898j60892k00931j24107L6570J61476
$$ 261273 322527 288567 239433 252876 284808 234910 74018 -126913 -251020 -214450 -52974
40318e2974J21467o1161j92437j29461M1785J35077R6045P521o2006r7387q2454
$$ -52974 68493 7332 -185105 -314566 -272781 -137704 -41659 -34138 -96144 -193531 -275985
40307b75985k8323j3677q2906j43797p9341P4597J73673J54429P5427O607j8717
$$ -275985 -304308 -317985 -400891 -544688 -624029 -549432 -375759 -221330 -145903 -139296 -158013
40296a58013J6948P8360O7895l7208r8566J747J55015J60089J8737q4480q0686
$$ -158013 -141065 -62705 5190 -32018 -130584 -128837 26178 186267 205004 120524 39838
40285C9838r3959j84517k07173k8768K37516L36207J67909r4265j92526o6805
$$ 39838 -54121 -238638 -445811 -474579 -237063 99144 267053 172788 -19738 -86543
40275h6543P9616L9659j06915r3639J26789K74883J49943o8428j18883o2003j06083
$$ -86543 -6927 32732 -74183 -167822 -41033 233850 383793 315365 196482 134479 28396
40264B8396j80519m2079K50469L52098J57510n4238r3840j20650k63583l20529
$$ 28396 -152123 -194202 56267 408365 565875 511637 417797 297147 33564 -286965
40254b86965r2755K28367K99024R8161r9313j28673p2346m0203k8504n79M2615
$$ -286965 -379720 -151353 147671 245832 146519 17846 -54500 -94703 -123207 -123786 -81171
40243h1171Q3549R3077L8221n3856r9335q3106r0930j46606j30395L6123K26737
$$ -81171 2378 95455 133676 79820 -19515 -102621 -193551 -340157 -470552 -434429 -207692
40232b07692K56960J21317k6395o7117Q73J03426J31343J7656j52555k02994j01607
$$ -207692 49268 170585 144190 77073 77946 181372 312715 330371 177816 -25178 -126785
40221a26785j0896k8455l8819O0016J56543J17584K2701J0494K9370l5723j07030
$$ -126785 -137681 -166136 -204955 -144939 11604 129188 151889 162383 191753 156030 49000
40210D9000l7617R1601O8884r2546j64005o5449L6603K4024j8992J154N2820R2268
$$ 49000 11383 102984 171868 79322 -84683 -150132 -113529 -89505 -108497 -107343 -54523 37745
40198C7745J18510P6221q8094k31964j19829J95831L43953J25542j87966k28301
$$ 37745 156255 232476 144382 -87582 -207411 -11580 332373 457915 269949 41648
40188D1648j5063J47752J17314J2080n4899r6715j13317m4689R1566J73471J40069
$$ 41648 26585 174337 291651 303731 248832 152117 38800 -5889 85677 259148 399217
40177C99217O1535n568j10481k72217l51866j94205J26794L33288K57632L7578
$$ 399217 460752 455184 344703 72486 -279380 -473585 -346791 -13503 244129 281707
40167B81707p8683m7825k6659q7494j16917m7349k617p7131j25881J9317K24746
$$ 281707 203024 155199 128540 41046 -75871 -123220 -125837 -202968 -328849 -309532 -84786
40156h4786K00708n3133k17478j14975N6883O1603m3699p3531j7415J9033K9872
$$ -84786 115922 62789 -154689 -269664 -212781 -151178 -194877 -268408 -285823 -266790 -236918
40145b36918N6764L5155q4753j48875J9902K86327L09541J8434k58673k24501
$$ -236918 -180154 -144999 -229752 -378627 -358725 -72398 237143 255577 -3096 -227597
40135b27597K7686K01960J82843Q3346K0983K680j1337m6432r6285r8495K2126
$$ -227597 -199911 2049 184892 268238 289221 291901 280564 234132 137847 39352 61478
40124F1478K14776K79954R5084j86953k90730j48365N0669J34175J24441J01144
$$ 61478 276254 556208 651292 464339 173609 25244 75913 210088 334529 435673
40114D35673L6160j24365l01203l36841j91229J2459J35263J40194O6542k7920
$$ 435673 471833 347468 46265 -290576 -481805 -469346 -334083 -193889 -127347 -155267
40104a55267p5788k7511P8561J21002L0809r6749q6241J09567L28083L56338J57741
$$ -155267 -231055 -258566 -180005 -59003 -28194 -124943 -211184 -101617 226466 582804 740545
40093G40545r2557k00333j45446o1257n6606j12850j50961j34176p7130p976L4554
$$ 740545 647988 447655 302209 240952 184346 71496 -79465 -213641 -290771 -298747 -264193
40082b64193Q070p4851j19325l4800J54143L16486L29105J74908l6781j38328
$$ -264193 -256123 -330974 -450299 -485099 -330956 -14470 314635 489543 452762 314434
40072C14434n7433P3928N4212j04741j62017n764J36242K5820j88332j73231O3598
$$ 314434 257001 330929 385141 280400 118383 112619 248861 274681 86349 -86882 -23284
40061b3284J82078N8869k8546J08232K35483Q5613j91615k58913q9501O7509R5886
$$ -23284 158794 217663 189117 297349 532832 618445 426830 167917 78416 145925 241811
40050B41811Q0742M5619o6949j73159j04521Q7102J50316J1501j15010o3135O8448
$$ 241811 322553 368172 301223 128064 23543 110645 260961 272462 157452 94317 162765
40039A62765J23429R9985N2813k5856j13673j15187k3601K9642j1108l0774K2636
$$ 162765 286194 386179 438992 413136 299463 184276 160675 190317 179209 148435 171071
40028A71071j403j93827l55541k51312J8925J46365N8719j0079Q8675J96053J17456
$$ 171071 169668 -24159 -379700 -631012 -612087 -465722 -407003 -417082 -328407 -132354 -14898
40017a4898n8102p6791J10059K61626J66844o9575j61624j6581J57699J47982
$$ -14898 -73000 -149791 -39732 221894 388738 319163 157539 140958 298657 446639
40007D46639K497r2747q7013o2872m3991M643K6058o6018j78263j20551P2391
$$ 446639 449136 356389 269376 206504 162513 167156 193214 127196 -51067 -171618 -99227
39996i9227J47185K6711o5178Q954O6278n3013j73339q1494Q0575M6963j00757
$$ -99227 47958 74669 9491 18445 84723 31710 -141629 -223123 -142548 -95585 -196342
39985a96342o3663J43964J88281k9860j92432o4021J47428J32780n3449j16785
$$ -196342 -260005 -116041 72240 42380 -150052 -214073 -66645 66135 12686 -104099
39975a04099K5870J65495J32155J164o6301m7937m4639r8719j21764l5289P8723
$$ -104099 -78229 87266 219421 220585 154284 106347 61708 -37011 -158775 -194064 -115341
39964a15341O7485n5452r9028J8227J22733N8471m5103J3998J44960R0654j26690
$$ -115341 -47856 -103308 -202336 -184109 -61376 -2905 -48008 -34010 110950 201604 74914
39953G4914k05448m7264Q7805K3541n6087K8828J06328m1441k43806j68388J29450
$$ 74914 -130534 -177798 -89993 -66452 -122539 -93711 12617 -28824 -272630 -441018 -311568
39942c11568K54371O0874j51036j07832P1947J31235N5698N805K4531K2329k3021
$$ -311568 -57197 3677 -147359 -255191 -183244 -52009 3689 9494 34025 56354 33333
39931C3333m1134k2452l8465r3711q7380L1341J63509J81770R7173L1105L7049
$$ 33333 -7801 -30253 -68718 -162429 -249809 -218468 -54959 126811 223984 255089 292138
39920B92138K9541p1012j79503j25178R9069K67027J79947o7962k05016j37916
$$ 292138 321679 250667 71164 -54014 45055 312082 492029 424067 219051 81135
39910H1135m0684n6366p9533M3461K26401K42292O3595r4327r2437m3557q5618
$$ 81135 40451 -15915 -95448 -51987 174414 416706 480301 385974 293537 249980 164362
39899A64362j43495o7905Q7185J12157m4399j75182q4341J52451K80863J67329
$$ 164362 20867 -47038 40147 152304 107905 -67277 -151618 833 281696 449025
39889D49025p0021k14375j73038l1690P4779R6830O4761L303p3885r7770J8392
$$ 449025 379004 164629 -8409 -40099 34680 131510 196271 199574 125689 27919 46311
39878D6311K25906L25350J95133m1287j81426j98952j93378j59790j4959J61564
$$ 46311 272217 597567 792700 751413 569987 371035 177657 17867 2908 164472
39868A64472J52642o1784k17193j36232Q879k1566j56453j45221L3771J50788
$$ 164472 317114 255330 38137 -98095 -89216 -110782 -267235 -412456 -378685 -227897
39858b27897R0241J98L2412J30637J62039J11527M6056j2913q2823j44613j52594
$$ -227897 -137656 -137458 -105046 25591 187630 299157 345213 332300 249477 104864 -47730
39847d7730r2898O642R5450J15651M8076m2869o6309k2440j240m4678q1324l7524
$$ -47730 -140628 -133986 -38536 77115 125191 82322 16013 -6427 -7667 -52345 -133669 -171193
39835a71193M6915O8732n667j02450j22973m1654O7218R7524K6044n1546l5271
$$ -171193 -124278 -55546 -61213 -163663 -286636 -328290 -261072 -163548 -137504 -189050 -224321
39824b24321M4971O9539J160n7633o835J13595J75067J13578j0439q7970o7151
$$ -224321 -179350 -109811 -108651 -166284 -173119 -59524 115543 229121 218682 130712 63561
39813F3561P450M3250o944r4376j25549o2167M2671J03690Q3799J6722m0099p0426
$$ 63561 71011 114261 107317 12941 -112608 -174775 -132104 -28414 55385 72107 32008 -38418
39801c8418j02743j34727r0373Q4256K95008L56339J96544o5827k65747l27210
$$ -38418 -141161 -275888 -366261 -282005 13003 369342 565886 500059 234312 -92898
39791i2898k49301q3261M2424J9412o2635m730J60488J42210j43001l34361j24889
$$ -92898 -342199 -425460 -383036 -363624 -426259 -430989 -270501 -128291 -271292 -605653 -730542
39780g30542K20847K21265q1029j81714Q9962L16225J67827j00709r3880J25316
$$ -730542 -509695 -288430 -369459 -551173 -461211 -144986 22841 -77868 -171748 -46432
39770d6432K06686O0528j03886j59563j64516j40095l3917R0695O9194j08114
$$ -46432 160254 220782 116896 -42667 -207183 -347278 -381195 -290500 -221306 -329420
39760c29420k31318j33760R0278J94851N8687j82731k74873j20329J06757J79823
$$ -329420 -560738 -694498 -604220 -409369 -350682 -533413 -808286 -928615 -821858 -642035
39750f42035J08990P9166J28562J01222l8288r1529M4507J69410R2473m8955k1457
$$ -642035 -533045 -453879 -325317 -224095 -262383 -353912 -309405 -139995 -47522 -96477 -117934
39739a17934J18996J46455N3281K5294Q9909Q3702l6859j25656j12946r2686j01601
$$ -117934 1062 147517 200798 226092 316001 399703 362844 237188 124242 31556 -70045
39728g0045m5534Q8569J61384J04710K7416J1727j7713j17373j79164r2588O2577
$$ -70045 -115579 -27010 134374 239084 266500 278227 260514 143141 -36023 -128611 -66034
39717f6034J18548M6997k8291j3914M5242M5173l2633q5985k7113O8504M1440
$$ -66034 52514 99511 71220 57306 102548 147721 115088 29103 1990 70494 111934
39706A11934j03472j67827n5438O8073N0376Q149R2804J67751J7622k31900k54670
$$ 111934 8462 -159365 -214803 -146730 -96354 -88205 4599 172350 189972 -41928 -296598
39695b96598m2655Q5475P278n7849M937J4890j06528j35758M6158K03569J52706
$$ -296598 -339253 -253778 -246500 -304349 -299412 -284522 -391050 -526808 -480650 -277081 -124375
39684a24375Q0774J63398J89073o2816l43172k70706L9656J50516k021o2503J13771
$$ -124375 -43601 119797 308870 246054 -97118 -367824 -328168 -177652 -179673 -242176 -128405
39673a28405K53084J57485j2898q1120j10976j60393j03031J02958K38561J36703
$$ -128405 124679 282164 269266 188146 77170 -83223 -186254 -83296 155265 291968
39663B91968m1584n9989L9964N7316l2041p5581j137J07127J40064M6170j47903
$$ 291968 250384 190395 230359 287675 255634 180053 178916 286043 426107 472277 324374
39652C24374k99834k38379M674J75954J39606Q0975J94079L22828J73315k04243
$$ 324374 24540 -213839 -209165 -33211 106395 187370 381449 704277 877592 673349
39642F73349m37072l29697p6084O7434P2056K1678n7928j28105q5033P4199J81120
$$ 673349 236277 -93420 -169504 -102070 -30014 -8336 -66264 -194369 -279402 -205203 -24083
39631b4083J34484O8123J17683J56478j6318l04197l85011j64648P4853O3642
$$ -24083 110401 178524 296207 452685 436367 132170 -252841 -417489 -342636 -278994
39621b78994j02920j29794P5192L08928L39020J45816r7224k07211j46535l5512
$$ -278994 -381914 -511708 -436516 -127588 211432 357248 260024 52813 -93722 -129234
39611a29234j1263o1846m2262J09582K35556J30456j62264l41412j89606J52282
$$ -129234 -140497 -202343 -244605 -135023 100533 230989 68725 -272687 -462293 -310011
39601c10011L41931K36214K4300o3321n4856j30016k83731k85373k1310K88287
$$ -310011 31920 268134 292434 229113 174257 44241 -239490 -524863 -546173 -257886
39591b57886L46709J54152l1961n5382q146k5697j04250j62746j51861n6805R0388
$$ -257886 88823 242975 211014 155632 147486 121789 17539 -145207 -297068 -353873 -263485
39580b63485J72934R7507l3310k0828J16496J34123m7968j80287o9235J03106
$$ -263485 -90551 6956 -26354 -47182 69314 203437 155469 -24818 -94053 9053
39570I053Q0605m4311j6333J14822P5831j33559k08169m0785J07582N0258m9209
$$ 9053 89658 45347 29014 143836 219667 86108 -122061 -162846 -55264 -5006 -54215
39559e4215j3196L9259n3802j73621j13563P2891J76145J62930J56503J70919
$$ -54215 -67411 -28152 -81954 -255575 -369138 -296247 -120102 42828 199331 370250
39549C70250J08111k7954j33090j85799k29212k11270n7764J20582J26750q137
$$ 370250 478361 450407 317317 131518 -97694 -308964 -366728 -246146 -119396 -127533
39539a27533m6731P2434J18147o1122k64722k10455O3800K54849J85039k0005
$$ -127533 -174264 -101830 16317 -44805 -309527 -519982 -456182 -201333 -16294 -36299
39529c6299j26385m4640J21011K01545J28018p005o8856n7438q8145j76043j63601
$$ -36299 -162684 -207324 -86313 115232 243250 236245 167389 109951 21806 -154237 -317838
39518c17838M0427K58286K39225J0018j49766r0170L3863K9201p3001j42740j81765
$$ -317838 -277411 -19125 220100 230118 80352 -9818 24045 53246 -19755 -162495 -344260
39507c44260k41137k16633K3939L28281L47395K1614k62476j62137J67701L23011
$$ -344260 -585397 -802030 -778091 -449810 -102415 -80801 -343277 -505414 -337713 -14702
39497a4702K05377O0174L5912J4134q7543j31805j0240J39095J27722j4237j25035
$$ -14702 190675 250849 286761 300895 213352 81547 71307 210402 338124 323887 198852
39486A98852j57072j70069j55143m6724J01521J13678p9419k96434k70408M1660
$$ 198852 41780 -128289 -283432 -330156 -228635 -114957 -194376 -490810 -761218 -719558
39476g19558L61912L70113Q9025j16902j2187J75655Q8769j98495k62273J9104
$$ -719558 -357646 12467 101492 -15410 -27597 148058 236827 38332 -223941 -204837
39466b04837K61282J62442n3288l7378J28952J27453m9057j30590n1971j2042
$$ -204837 56445 218887 165599 128221 257173 384626 335569 204979 153008 140966
39456A40966p3771p7284J0718J2024j07576j19640Q8663K91441K50470M4072j04727
$$ 140966 67195 -10089 629 12653 -94923 -214563 -125900 165541 416011 460083 355356
39445C55356j43530j53475j45210p5168K8703R9900J15329N5677r8738k45560
$$ 355356 211826 58351 -86859 -162027 -133324 -33424 81905 137582 38844 -206716
39435b06716j92727N8701K28530J26347m7001J0210K26108K48248k1105k68841
$$ -206716 -399443 -340742 -112212 14135 -32866 -22656 203452 451700 430595 161754
39425A61754k17351J0871J10933J3136r2184p0036N81J971k9024K3489J46834
$$ 161754 -55597 -44726 66207 79343 -12841 -82877 -82296 -80325 -109349 -85860 60974
39414F0974J86105N8931j10157j37177k404J49223J84813P6946j25255l00330
$$ 60974 247079 306010 195853 58676 56272 205495 390308 467254 341999 41669
39404D1669k74397J270K94295K89984j1747k69928k40299o1668L427n8814o7506
$$ 41669 -232728 -231458 62837 352821 341074 71146 -169153 -230821 -227394 -286208 -353714
39393c53714M4252J59585J63125M8992j14134k07417j16164J09006K17159M4965
$$ -353714 -309462 -149877 13248 62240 -51894 -259311 -375475 -266469 -49310 -4345
39383d345k13419k13067P5613L03872J94968j11004k55591r6429J60865K22737
$$ -4345 -217764 -430831 -355218 -51346 143622 32618 -222973 -319402 -158537 64200
39373F4200K5515k11968k36811m4294J37905J53135R3292R8515J09531j2471j99191
$$ 64200 89715 -122253 -359064 -403358 -265453 -112318 -19026 79489 189020 176549 -22642
39362b2642k29642o7744P6026P1927M6042J24949K04168J37943J2566J9991J32378
$$ -22642 -252284 -320028 -244002 -172075 -126033 -1084 203084 341027 353593 373584 505962
39351E05962J22450q6925k86514k60829o5661P0824M2060m5815m8827L8811J04434
$$ 505962 628412 541487 254973 -5856 -71517 -693 41367 -4448 -53275 -14464 89970
39340H9970O6409l2331q0342l1275L9646K6348p6004j63012j50671p4971l1288
$$ 89970 156379 124048 43706 12431 52077 78425 2421 -160591 -311262 -386233 -417521
39329d17521l9602k4334O3904J62150J75110J09404O2794P8843Q3395N007r7216
$$ -417521 -457123 -481457 -417553 -255403 -80293 29111 91905 170748 254143 259150 161934
39318A61934r8380J6703J21418J10698K7612k3485l7663r7174k07117k43876j20924
$$ 161934 63554 80257 201675 312373 339985 316500 278837 181663 -25454 -269330 -390254
39307c90254O3901J33692N5281l8621m9135k6728m6362o5737N096J45536K28012
$$ -390254 -326353 -192661 -137380 -176001 -225136 -251864 -298226 -363963 -358867 -213331 14681
39296A4681J68152J1089j20894j29010k0065P3314J0961j63477k29817p6794J14231
$$ 14681 182833 193922 73028 -55982 -76047 -2733 8228 -155249 -385066 -461860 -347629
39285c47629J13382r210J7237K36390L71124K20070o3705k09162j71862r2639
$$ -347629 -234247 -243457 -226220 10170 381294 601364 537659 328497 156635 63996
39275F3996m1587K1139R5415J13557M9894m7180j17453j17980m0392L5299j7142
$$ 63996 22409 43548 138963 252520 302414 255234 137781 19801 -20591 14708 -2434
39264b434j84266k57704q9491J72373K56619J30890K0177O8043J53364R6576q7011
$$ -2434 -186700 -444404 -533895 -361522 -104903 25987 46164 114207 267571 364147 277136
39253B77136k22663j90303l8513P5673L1900j29456k22014j05894J31157K52272
$$ 277136 54473 -135830 -174343 -98670 -66770 -196226 -418240 -524134 -392977 -140705
39243a40705J45023n4747j41865p4609K5049N2796K4534K099o900k7488l6899
$$ -140705 4318 -50429 -192294 -266903 -241854 -189058 -164524 -162425 -169325 -196813 -233712
39232b33712J4593R5572R5749p921p1515K5293J68652J35263q6625k58169k00214
$$ -233712 -219119 -123547 -27798 -35719 -107234 -81941 86711 221974 135349 -122820 -323034
39221c23034L563J61086J88518J10041k1262j21870j15030l7898L834K1522J13395
$$ -323034 -319471 -158385 30133 140174 118912 -2958 -117988 -155886 -152052 -130530 -17135
39210a7135K09207R2856k04780l16032n3168K46100J86283r0027j45163O1733
$$ -17135 192072 284928 80148 -235884 -289052 -42952 143331 53304 -91859 -30126
39200c0126J58374k640j35176l3393J03520L7602j25698j41626j305J11555J09405
$$ -30126 128248 125608 -9568 -42961 60559 98161 -27537 -169163 -170468 -58913 50492
39189E0492O8396P5618J24550J27031O10j94624k45975m8835J76297J32576j16742
$$ 50492 118888 194506 319056 446087 446697 252073 6098 -42737 133560 266136 149394
39178A49394k17867m5730J39517J26404L4448K3182J3392r2721j55972j3964K17554
$$ 149394 -68473 -114203 25314 151718 186166 209348 222740 130019 -25953 -39917 177637
39167A77637K93597J72416J462j15229j53848r2404K0398K7627j24499k46375
$$ 177637 471234 643650 645112 529883 376035 283631 304029 331656 207157 -39218
39157c9218j57715L1042Q7620P144k3591N8666J31028J06463L2138k1139k6666
$$ -39218 -196933 -165891 -78271 -71127 -94718 -36052 94976 201439 233577 212438 185772
39146A85772J0304K4517p2492k18250j91241O8792K82334J85408p1711j42040
$$ 185772 196076 220593 148101 -70149 -261390 -192598 89736 275144 203433 61393
39136F1393O454R9583K4364m1100J3768N6807j7951j09837j13029q5267j00049
$$ 61393 67847 167430 191794 150694 164462 221269 203318 93481 -19548 -104815 -204864
39125b04864j05532l7129P1753J68189K30202J91053j7053k81779l57693j85062
$$ -204864 -310396 -347525 -275772 -107583 122619 313672 296619 14840 -342853 -527915
39115e27915J1851M6638J4935Q6487K18058K44676J42086K3663n0591j01417j15750
$$ -527915 -516064 -469426 -454491 -368004 -149946 94730 236816 260479 209888 108471 -7279
39104g279n7937K2475K6341m5320q1390j9478O2997M7969p2623j72839j20816
$$ -7279 -65216 -42741 -16400 -61720 -143110 -162588 -99591 -51622 -124245 -297084 -417900
39093d17900O5252K07182J50417n2704j97074j59356j6791P1549L5722o1260q8279
$$ -417900 -352648 -145466 4951 -47753 -244827 -404183 -420974 -349425 -313703 -374963 -463242
39082d63242M4692K72233L79254K14579j01567k87435k24461n9147K9282K3786
$$ -463242 -418550 -146317 232937 447516 345949 58514 -165947 -225094 -195812 -172026
39072a72026o640l1561l2094K3770R2623N7974q7187j76677r8817K4750K1747
$$ -172026 -178666 -210227 -242321 -218551 -125928 -67954 -155141 -331818 -430635 -405885 -384138
39061c84138o6424o3576O2657J75646J99202J97518K06796J47882k4831k01776
$$ -384138 -450562 -514138 -451481 -275835 -76633 120885 327681 475563 450732 248956
39051B48956k34713j18205J7941P1924O8087Q9568J48753J57120L7685j56866
$$ 248956 14243 -103962 -86021 -14097 53990 143558 292311 449431 487116 330250
39041C30250k86530k81821j94152p8105P7661K43424K80008J06287j21607j54457
$$ 330250 43720 -238101 -432253 -510358 -432697 -189273 90735 197022 75415 -79042
39031g9042K4927J69548J02130n9831r8670J524P9262N5250J3158K1863J9726
$$ -79042 -54115 115433 217563 157732 59062 60586 139848 195098 208256 230119 249845
39020B49845o7681j92201k39584j64045q040J54357K30507J35926q9601k40559
$$ 249845 182164 -10037 -249621 -413666 -421706 -267349 -36842 99084 9483 -231076
39010b31076j50968P0478J50316J3471j18009n2212J03546J27175J5444m0322
$$ -231076 -382044 -311566 -161250 -147779 -265788 -318000 -214454 -87279 -71835 -112157
39000a12157L8367J12541M9574q4692j20077n07J44024J34269m9642k04509j12544
$$ -112157 -73790 38751 88325 3633 -116444 -116951 27073 161342 111700 -92809 -205353
38989b05353J69264L35411K12739j2463o9291K4384N1970l2137o7180L105M1246
$$ -205353 -36089 299322 512061 499598 430307 454691 506661 474524 407344 410449 451695
38978D51695j9883o2942k1453q379q6731j12496K6484J75199J16216q8408j67263
$$ 451695 431812 368870 347417 339038 252307 139811 166295 341494 457710 369302 202039
38967B02039k0150J52407J21279r9577k96584k95957j20676N8669J06041M8115
$$ 202039 181889 334296 455575 355998 59414 -236543 -357219 -298550 -192509 -144394
38957a44394R742M3980Q1161M5837l6593o3305N0970K77795M31756L00472q1758
$$ -144394 -134652 -90672 -9511 36326 -267 -63572 -12602 265193 696949 997421 915663
38946I15663l80889l40943j24454n8565j33888p8191J00685O6551k40907l91398
$$ 915663 534774 193831 69377 10812 -123076 -201267 -100582 -34031 -274938 -666336
38936f66336j07778K58779K51863k060n7618J20114J73861o873j51294j03774
$$ -666336 -774114 -515335 -263472 -265532 -323150 -203036 -29175 -36048 -187342 -291116
38926b91116p546N2413J66929K77502J50577j75706l07405o1279K27916K05156
$$ -291116 -298662 -246249 -79320 198182 348759 173053 -134352 -195631 32285 237441
38916B37441n426p6282R150L7256k6959m2055O432N993l6968j3760N8752N7732
$$ 237441 232015 155733 164883 202139 175180 133125 139557 145550 108582 94822 153574 211306
38904B11306k3869q1224r2254j10108j00028M568J11806O2150r6664j50924m7066
$$ 211306 187437 106213 13959 -96149 -196177 -191609 -79803 -17653 -114317 -265241 -312307
38893c12307N1747N6067N0828N9082k4271j65793j40929Q8775K14731L2430j81690
$$ -312307 -260560 -204493 -153665 -94583 -118854 -284647 -425576 -336801 -122070 -89640 -271330
38882b71330n5611K84787L81610J34038q3307l3149N4954o8475k47286k08051
$$ -271330 -326941 -42154 339456 473494 390187 357038 411992 343517 96231 -111820
38872a11820j7949O3834K6563N9247J51401J03356o7713r4019Q4397J64540m8690
$$ -111820 -129769 -65935 -39372 19875 171276 274632 206919 112900 197297 361837 313147
38861C13147l07603k91264p9248K6261j1379K6365J88468K64136J36628m7835
$$ 313147 5544 -285720 -364968 -338707 -350086 -323721 -135253 128883 265511 217676
38851B17676j29048j25075j02348n6733q493k9155q2219j8615J66779K61526J48133
$$ 217676 88628 -36447 -138795 -195528 -204021 -233176 -315395 -334010 -167231 94295 242428
38840B42428P28j404K7094r8496k52917j51224J62713K99926P1994k21512k08860
$$ 242428 243156 241752 268846 170350 -82567 -233791 -71078 228848 300842 79330 -129530
38829a29530M7323J70252n78k20637j97003L9344K13220J69939L1368j9120J3348
$$ -129530 -82207 88045 87467 -133170 -330173 -290829 -77609 92330 123698 104578 117926
38818A17926K04n8906j5446J58799K47456O8203k28774l14864r8570J81529K77469
$$ 117926 118130 59224 43778 202577 450033 518236 289462 -25402 -123972 57557 335026
38807C35026J81124K7804q2976j05571l2107N2764J5609j40653k39331j60907
$$ 335026 516150 543954 460978 355407 323300 376064 391673 251020 11689 -149218
38797a49218k574Q3839R1926Q0933K1632j13033j98456r5047J12521K05131J38084
$$ -149218 -151792 -67953 23973 104906 126538 13505 -184951 -279998 -167477 37654 175738
38786A75738O7838P0591M0039q7349j95526j63520l1499Q9894J51484J37917L7655
$$ 175738 243576 314167 354206 266857 71331 -92189 -123688 -33794 117690 255607 293262
38775B93262q3244j03124j9838K0806n0698j13835o2853K3579L9294L3175Q6973
$$ 293262 210018 106894 87056 107862 57164 -56671 -119524 -95945 -56651 -23476 63497
38764F3497J39569R7507R258l8035q2900j68623j76956j889K09268K32719J08980
$$ 63497 203066 300573 309831 271796 188896 20273 -156683 -158572 50696 283415 392395
38753C92395M4525M0323p3607k58441k67957p5780M5057k4889n7852R5062K06849
$$ 392395 436920 477243 403636 145195 -122762 -198542 -153485 -178374 -236226 -141164 65685
38742F5685M8053k02444k09772K8738K30041K40774J43289L2601o3495r3282l0336
$$ 65685 113738 -88706 -298478 -269740 -39699 201075 344364 376965 313470 220188 189852
38731A89852K3971k5642q8875l2442O9801M5937p2797r9242j1233K4443m3052
$$ 189852 213823 188181 99306 66864 136665 182602 109805 10563 -670 23773 -19279
38720a9279o9101J2306O6106q894j17443j33633o6836K1513J13489J66571J05405
$$ -19279 -88380 -76074 -9968 -18862 -136305 -269938 -336774 -315261 -201772 -35201 70204
38709G0204k6363n7398O1605J47033N1962q8586m9995J37777K27489J04287p8559
$$ 70204 43841 -13557 48048 195081 247043 158457 108462 246239 473728 578015 499456
38698D99456j34398p0272k1174n3729j09370r8918L355J39548K02102J09389j00317
$$ 499456 365058 294786 273612 219883 110513 11595 14950 154498 356600 465989 365672
38687C65672k55116j96458K9652J91160J37106j6699o3835q041k7459j50401j76359
$$ 365672 110556 -85902 -56250 134910 272016 255317 191482 183441 155982 5581 -170778
38676a70778R31J89631J67694Q02q7625m6206M357J2119J8254k050r7121j66222
$$ -170778 -169847 19784 187478 188280 100655 54449 58806 70925 89179 87129 -9992 -176214
38664a76214o3522J23407J37450o5992k28776j53053N0944J68783J48466O4203
$$ -176214 -239736 -116329 21121 -44871 -273647 -426700 -375756 -206973 -58507 5696
38654E696k0620m9767K4527J41930J63764P1116p653j8531n1353j23683j12694
$$ 5696 -14924 -64691 -40164 101766 265530 336646 328993 310462 259109 135426 22732
38643B2732p374P804j24160j67808L2628K43266J80692k5300m2823J14849J30828
$$ 22732 15358 23162 -100998 -268806 -236178 7088 187780 162480 119657 234506 365334
38632C65334o8623k00564j10610k062m8035j02897k464J15590M5627j20793j39357
$$ 365334 296711 96147 -14463 -16525 -64560 -167457 -169921 -54331 -8704 -129497 -268854
38621b68854q421N9328J4869M5425K33002L79735K79215k873k36492k98850k21522
$$ -268854 -277275 -217947 -203078 -157653 75349 455084 734299 731426 494934 196084 -25438
38610b5438o0842J35034K68666K44439R7879k1048k3268K7857K4555m5596r8957
$$ -25438 -86280 48754 317420 561859 659738 638690 615422 643279 667834 622238 523281
38599E23281n3958Q8531K26582K20960L7756j69676k03066o5257L0959n2332j88594
$$ 523281 469323 557854 784436 1005396 1043152 873476 670410 605153 636112 583780 395186
38588C95186j73516j6936Q1756J6661r9214j10003j5254N9111L5448k5529j6632
$$ 395186 221670 204734 286490 303151 203937 93934 78680 137791 173239 147710 131078
38577A31078N3008L9840j30493k87024j80991J48084L45294J83873j17541j84830
$$ 131078 184086 223926 93433 -193591 -374582 -226498 118796 302669 185128 298
38567B98J9193J97335J50173j9851j35993j60759j22014o521J66430K75235K06183
$$ 298 19491 216826 366999 347148 211155 50396 -71618 -78139 88291 363526 569709
38556E69709m833j94070k16899p1804R4760J29478M5053j738O3665J28482Q0288
$$ 569709 564876 370806 153907 82103 176863 306341 351394 349656 413321 541803 622091
38545F22091k2898p4911q3243p7464m908J12742Q7134j40499k75280m5500L21726
$$ 622091 599193 524282 441039 363575 358667 471409 558543 418044 142764 97264 418990
38534D18990L60476L4402k40709k25776r9754l3385M6132J45120P6509j61639
$$ 418990 779466 813868 573159 347383 247629 214244 260376 405496 482005 320366
38524C20366k47703r472K78161L04487J42457J5877o6798j71545j92372n3709
$$ 320366 72663 63191 341352 645839 788296 804173 737375 565830 373458 319749
38514C19749N0242p1751k64558k51859n5507R8892J55617K07419K16251P2286
$$ 319749 369991 298240 33682 -218177 -273684 -174792 -19175 188244 404495 476781
38504D76781j28195j57992M443J55464J67153R7459K3641l6074m9776O391O6500
$$ 476781 348586 190594 195037 350501 517654 615113 638754 602680 552904 559295 625795
38493F25795M9449j8692o4985q3477q6880m4796K1825R240q7699j07616K9173
$$ 625795 675244 656552 591567 508090 421210 376414 398239 407479 319780 212164 241337
38482B41337J61173J25054n833p8003q0932n2321M6511J79317J65558l4930j82732
$$ 241337 402510 527564 521731 443728 362796 310475 356986 536303 701861 666931 484199
38471D84199j20535l5425j11698j85672n5701J22296J15544N4279J74866L27421
$$ 484199 363664 328239 216541 30869 -24832 97464 213008 267287 442153 769574
38461G69574K07914o7046j18249M7293N8208j68288l01556j70804J3670R5606
$$ 769574 977488 910442 792193 839486 897694 729406 427850 257046 270716 366322
38451C66322J73964K52624J32051j76543l26308j33402J33925J72021M7511k3514
$$ 366322 540286 792910 924961 748418 422110 288708 422633 594654 642165 618651
38441F18651k5075l7901j6133R2310J76514J39745J08705K43696M30759L84907
$$ 618651 593576 555675 539542 631852 808366 948111 1056816 1300512 1731271 2116178
38431B116178M7496k99545l71624k22109j39561k33267k75328n9283K28579K40656
$$ 2116178 2163674 1864129 1492505 1270396 1130835 897568 622240 562957 791536 1032192
38421A032192Q021q8762O7617J40026p8389k92644k03093p846l6562j87824j55335
$$ 1032192 1040213 951451 1019068 1159094 1080705 788061 584968 577122 540560 352736 197401
38410A97401K8097J17274J26928K21255K94496J31407j31904j66979J5982J27174
$$ 197401 225498 342772 469700 690955 985451 1116858 984954 817975 833957 961131
38400I61131Q9923M6955j3453j88543l22775j95283N2921J27111Q3723J55153
$$ 961131 1051054 1098009 1084556 896013 573238 377955 430876 557987 641710 796863
38390G96863K38973J07163l8770J53581M70754L74980q7865l26653j62973l2039
$$ 796863 1035836 1142999 1104229 1257810 1728564 2103544 2015679 1689026 1526053 1494014
38380A494014j49973k05445m2690L6749j19190k22924j06782j4725r8249j37610
$$ 1494014 1344041 1138596 1095906 1132655 1013465 790541 683759 669034 570785 433175
38370D33175J908J04071M919j46575j83778j10929N8064K71100K92025J4559k04460
$$ 433175 435083 539154 544073 397498 213720 102791 160855 431955 723980 738539 534079
38359E34079l6315J97298K7796k78553j42137K39199J76728k48055k74784J74713
$$ 534079 497764 695062 722858 444305 302168 541367 718095 470040 195256 369969
38349C69969L53157M1370j05364J76078K85503o7697l08330p0236J80182P5257
$$ 369969 723126 764496 659132 835210 1120713 1053016 744686 674450 854632 929889
38339I29889m6854O2362P6222j38439j63095J26974K43762L482j36175J2476O9333
$$ 929889 883035 945397 1021619 883180 720085 847059 1090821 1094303 958128 970604 1039937
38328A039937k3927J38208M32010K36837k90657k75816K61987L09000k80194m28798
$$ 1039937 1016010 1154218 1586228 1823065 1532408 1256592 1518579 1827579 1547385 1118587
38318A118587J69281M31793q6332l48712J64133M43989q3072m17816Q3341M64417
$$ 1118587 1287868 1719661 1633329 1284617 1448750 1892739 1809667 1391851 1475192 1939609
38308A939609O0194k01428L09455N81029p7947n75985m2419N37443K36005j27079
$$ 1939609 1999803 1798375 2107830 2688859 2610912 2034927 1992508 2529951 2765956 2638877
38298B638877K16583M31134o2050k12643N03859P51688j12464n38082L40515R52044
$$ 2638877 2855460 3286594 3224544 3011901 3515760 4267448 4154984 3616902 3957417 4909461
38288D909461L69580K04077J259015J596254M06167J26506J861877K795521J458528
$$ 4909461 5279041 5483118 6742133 8338387 8744554 8871060 10732937 13528458 14986986
38279A4986986R56695L060897M330065K834293K789511O667075R416866P850345
$$ 14986986 15943681 19004578 23334643 26168936 28958447 35625522 45042388 52892733
38271E2892733Q093046J4355488J9478887J9901568K9539328N7535322P8402474
$$ 52892733 60985779 75341267 94820154 114721722 144261050 201796372 280198846
38264B80198846N3103017j4939184p2268486p7133860m6127063k2483740j9321874
$$ 280198846 333301863 318362679 246094193 168960333 122833270 100349530 81027656
38257H1027656j8470801j0358059n091170p592665q531109l439948k30821k811153
$$ 81027656 62556855 52198796 47107626 39514961 30983852 27543904 27313083 24501930
38249B4501930m187977q88600P22572k328098l694433k99936J740045q11558k225246
$$ 24501930 20313953 19425353 20147925 17819827 14125394 13825458 15565503 14753945 12528699
38240A2528699O72211K356759k29121j536160J507677L280685P17576k78193L482002
$$ 12528699 13200910 15557669 15328548 13792388 15300065 18580750 19298326 19020133 22502135
38231B2502135N655829K757313J703637O527971R787347P043252O855146J4497899
$$ 22502135 28157964 30915277 32618914 39146885 48934232 55977484 62832630 77330529
38223G7330529K0099314J8728617K6905508N5589269P7655433N2971267j3798389
$$ 77330529 97429843 116158460 143063968 198653237 276308670 329279937 315481548
38216C15481548o9535440p4998225m6415064k3394681j8474378j7131730j0880221
$$ 315481548 245946108 170947883 124532819 101138138 82663760 65532030 54651809
38209E4651809o330569p090008p268169l977064j884009l214105l951803k032924
$$ 54651809 48321240 41231232 33963063 29985999 28101990 24887885 20936082 18903158
38201A8903158o82709j645984k247006j006106j27088p39535r01103J77156N52676
$$ 18903158 18220449 16574465 14327459 13321353 13194265 12454730 11553627 11730783 12283459
38192A2283459m50924q32872K39160R56391M33349K49216J230227J918896J509513
$$ 12283459 11832535 10999663 11238823 12195214 12628563 12877779 14108006 16026902 17536415
38183A7536415J382578K389981L170162K462355R14216n09742j891502l151143
$$ 17536415 18918993 21308974 24479136 26941491 27855707 27345965 25454463 22303320
38175B2303320l415328k599949j932268k031297k043938j408343q61781r35429
$$ 22303320 18887992 16288043 14355775 12324478 10280540 8872197 8010416 7074987
38167G074987r91266n56643k06016l42818m16819r0050N8998k95495n29846k30444
$$ 7074987 6083721 5527078 5321062 4978244 4561425 4471375 4530373 4234878 3705032 3474588
38157C474588O1207p7014j96157N1700K17719j0440j51414J36516L78563J90829
$$ 3474588 3535795 3458781 3262624 3314324 3532043 3521603 3370189 3506705 3885268 4076097
38147D076097K525K23253M96181M25053K94214M35198N82956M80506M58880Q06369
$$ 4076097 4078622 4301875 4798056 5223109 5517323 5952521 6535477 7015983 7474863 8281232
38137H281232J183028J254267J314009J694390K118223K206642K073231J833902
$$ 8281232 9464260 10718527 12032536 13726926 15845149 18051791 20125022 21958924
38129B1958924J096884l75203j945789k743842k711724k416956k131981j722962
$$ 21958924 23055808 22680605 20734816 17990974 15279250 12862294 10730313 9007351
38121I007351j221630q79960p33867n97947m39662l79932m01148l83537l47328
$$ 9007351 7785721 6905761 6171894 5573947 5134285 4754353 4353205 3969668 3622340
38112C622340l79932m19003l47480k00254q3779j6841n82p6073j79188j46955
$$ 3622340 3242408 2823405 2475925 2275671 2191892 2175051 2174469 2098396 1919208 1772253
38102A772253R024Q6790O7440J81005M34004M47219L2762m18176m67033k52730
$$ 1772253 1781277 1868067 1935507 2116512 2550516 2997735 3030497 2612321 2145288 1892558
38092A892558j98795l33012l33236j16547N1915J6407p0373m8197L4423O9967
$$ 1892558 1693763 1360751 1027515 910968 962883 979290 908917 860720 895143 965110
38082I65110M9247Q449l0987k9506M6432J39161J28887k5481k24733l20497k55096
$$ 965110 1014357 1022806 991819 962313 1008745 1147906 1276793 1251312 1026579 706082 450986
38071D50986j22886p5194j27539j16790O3855K63884K63054J02337K4186J01750
$$ 450986 328100 252906 125367 8577 72432 336316 599370 701707 725893 827643
38061H27643J57943P8818k6454m1684l187L6763J08750K06036K44871K09043J54915
$$ 827643 985586 1064404 1037950 996266 993079 1029842 1138592 1344628 1589499 1798542 1953457
38050A953457M2659k07802m55206m18918j17906P2789m8368k23300j72607j9845
$$ 1953457 1996116 1788314 1333108 914190 796284 869073 820705 597405 424798 404953
38040D04953j1543p7615l872J46904J46826K1518l784P4870L1966j55213k08309
$$ 404953 393410 315795 311923 458827 605653 627171 623387 698257 730223 575010 366701
38029C66701J3893K60657K36102M559j32799n1774Q0387O7936p5753j79787j31714
$$ 366701 380594 641251 877353 881912 749113 697339 777726 845662 769909 590122 458408
38018D58408N488Q5446N4272p428k2523l1244j08410k13084k16138q2120O3845
$$ 458408 463896 549342 603614 596186 573663 542419 434009 220925 4787 -77333 -13488
38007a3488R0734K0954k2051J4103O5009O8825N0518N5498O9261O3836O8207J07692
$$ -13488 77246 98200 76149 90252 155261 224086 274604 330102 399363 463199 531406 639098
37995F39098J15329J8188j01403o6605J42202L25050L09945J54258L9668P3095
$$ 639098 754427 772615 671212 604607 746809 1071859 1381804 1536062 1575730 1648825
37985A648825K48935M81375N92740M05307l4773m27417n24362l73549j76236m2306
$$ 1648825 1897760 2379135 2971875 3377182 3342409 2914992 2390630 2017081 1840845 1798539
37975A798539m436j08051l04557l87549k38682l3394j752r1427r2409L347L0409
$$ 1798539 1794103 1686052 1381495 993946 755264 721870 720118 628691 536282 539629 570038
37964E70038k2220N961J36014J81112L2962j87269l03576k50223o4706J21792
$$ 570038 547818 553779 689793 870905 903867 716598 413022 162799 98093 219885
37954B19885J18575j13788l22995k37763N5902K28455J59433L6820K8155J05341
$$ 219885 338460 224672 -98323 -336086 -280184 -51729 107704 144524 172679 278020
37944B78020J93538K47066J81027k2358j54319Q2K97354L96602K81276K70015
$$ 278020 471558 718624 899651 877293 722974 723056 1020410 1417012 1698288 1968303
37934A968303M61952N44651K75253j80748n34997o98911o79966m57789j34520
$$ 1968303 2430255 2974906 3250159 3069411 2534414 1835503 1155537 697748 563228
37925E63228N6716N7018N6567J45739J70592O2574m181M7760K5412j62814k76784
$$ 563228 619944 676962 733529 879268 1049860 1112434 1108253 1156013 1181425 1018611 741827
37914G41827j30271Q0620R5793k2848q3836r0913j10027o2367P4130J04869n5231
$$ 741827 611556 692176 787969 765121 681285 590372 480345 417978 492108 596977 541746
37903E41746j52145O030J88216J27333o733O6711J90149L3130k70899k87978n632
$$ 541746 389601 395631 583847 711180 704447 771158 961307 994437 723538 435560 429928
37892D29928J44405l634j30748j8779J15663M5190j01253j10819k9508j7170p6660
$$ 429928 574333 570699 439951 421172 536835 582025 480772 369953 340445 323275 246615
37881B46615j15532j17637j04611n4432K8138O8782L5342k387J6930N6684L9457
$$ 246615 131083 13446 -91165 -145597 -117459 -48677 -13335 -15722 1208 57892 97349
37870I7349o1893j84367j88543J3099K81760L37404J24562p0280k1784J03787
$$ 97349 35456 -148911 -337454 -324355 -42595 294809 419371 349091 327307 431094
37860D31094M3043j30357j61631n2365m07r029P4626J89168J12914j12832j85379
$$ 431094 474137 343780 182149 129784 129377 120348 194974 384142 497056 384224 198845
37849A98845o499J87835K07675J05010l7900j90692k21675j0755K48232K23607
$$ 198845 192346 380181 587856 692866 654966 464274 242599 231844 480076 703683
37839G03683k9360j14244O7599J60865l2391k36664k00391q1513q1291q8464J6494
$$ 703683 674323 560079 627678 788543 756152 519488 319097 237584 156293 67829 84323
37828H4323O0786r2753k31887j40609K7677N4335N0051J84553K89119J33966j14432
$$ 84323 145109 52356 -179531 -320140 -292463 -238128 -188077 -3524 285595 419561 305129
37817C05129j36660P233J5920j10269j02383P0850J54804N4013n7054p8611r3978
$$ 305129 168469 175702 191622 81353 -21030 49820 204624 258637 201583 122972 28994
37806B8994j17414n9884L0705L456r7644o7873J01500J93424J19509J5276m3727
$$ 28994 -88420 -148304 -117599 -114143 -211787 -279660 -178160 15264 134773 150049 106322
37795A06322j20648j76285o5361J58000K38313J10566l120J5518M177j31122j98418
$$ 106322 -14326 -190611 -255972 -97972 140341 250907 247787 263305 267482 136360 -62058
37784f2058m3818J63532J84422M7900o3386r7186j12899j19619r9097p1211j5582
$$ -62058 -105876 57656 242078 289978 226592 129406 16507 -103112 -202209 -273420 -289002
37773b89002J28553K81467K31046m4257k61263k06963l0866K6312o871J9779N4358
$$ -289002 -160449 121018 352064 307807 46544 -160419 -191285 -164973 -171844 -152065 -97707
37762i7707l8007j52092n7566J99827L05091J06378j95845l31388k37348j6380
$$ -97707 -135714 -287806 -345372 -145545 159546 265924 70079 -261309 -498657 -515037
37752e15037K00984K96199K09277J3085j38046j53733m7969J17323K38807J94507
$$ -515037 -314053 -17854 191423 204508 66462 -87271 -135240 -17917 220890 415397
37742D15397o500j57665q7109R8273J58646N0681p2232j32646j82384k09731j32049
$$ 415397 408897 251232 164123 262396 421042 471723 399491 266845 84461 -125270 -257319
37731b57319N413N4181J6381M4219J48549J58481L7721k5428M6971O8949o6623
$$ -257319 -251906 -197725 -181344 -137125 11424 169905 207626 182198 229169 298118 231495
37720B31495j50880J1988K48603K48309N798k20173k80493k24233j05278M9227
$$ 231495 80615 92603 341206 589515 595313 375140 94647 -129586 -234864 -185637
37710a85637J38190R5210M9791J44506K46715J15593j69694k58971m8340J60640
$$ -185637 -47447 47763 97554 242060 488775 604368 434674 175703 127363 288003
37700B88003J21034l0766o5792k2529n7998j36313j15366j8529K4179K4605Q5371
$$ 288003 409037 378271 312479 289950 231952 95639 -19727 -38256 -14077 10528 95899
37689I5899J47182M0897j93612k83844j00145J44298J87335N6725k9519J1732
$$ 95899 243081 283978 90366 -193478 -293623 -149325 38010 94735 65216 76948
37679G6948P5420Q6215R0166J16005J00835J5858m9935j6336N7626N9194j9895
$$ 76948 152368 238583 328749 444754 545589 561447 511512 495176 552802 611996 592101
37668E92101j01615j48383j66808j22856J7548J66721J66404o506j91174k31246
$$ 592101 490486 342103 175295 52439 69987 236708 403112 396606 205432 -25814
37658b5814j19380N4094J77932J43021n0865j88875l9145K87763M10770K09473
$$ -25814 -145194 -91100 86832 229853 178988 -9887 -49032 238731 649501 858974
37648H58974Q407N4813J21163o8239k93925j63040J94054K62203n3903k85271
$$ 858974 867381 922194 1043357 975118 681193 518153 712207 974410 920507 635236
37638F35236j46510P2055M9713q6067j05771j06783k42308l29576j26906K02253
$$ 635236 488726 560781 610494 524427 418656 311873 69565 -260011 -386917 -184664
37628a84664K95546J38022L3821R9144J29768k5205k44271l24735j95051O4906
$$ -184664 110882 248904 282725 381869 511637 486432 242161 -82574 -277625 -212719
37618b12719K61889K05790n0066j83412q108K23706J69190q3743j56451L6646
$$ -212719 49170 254960 204894 21482 13374 237080 406270 322527 166076 202722
37608B02722J95826J22804m4133j31524j49355j23638q07J69048K06226P4473
$$ 202722 398548 521352 477219 345695 196340 72702 71895 240943 447169 521642
37598E21642m2485l6415j9323o9655p3901L7824J16525K3132j41856k01065j48185
$$ 521642 479157 442742 423419 353764 279863 317687 434212 457344 315488 114423 -33762
37587c3762q3230k8321M6736J15919J35932J12941N2992n6849j63961j66775o2620
$$ -33762 -116992 -145313 -98577 17342 153274 266215 319207 262358 98397 -68378 -130998
37576a30998M9176J31397K14749K41257J26576n945O3395K47938J94341j52957
$$ -130998 -81822 49575 264324 505581 632157 626212 689607 937545 1131886 978929
37566I78929l87325k44285q876k8545j57770p3057J31237J19025q5282j42822
$$ 978929 591604 347319 338443 309898 152128 79071 210308 329333 244051 101229
37556A01229K8646J79353J99567K28993K69502J23324j88325l44790k06640k4344
$$ 101229 129875 309228 508795 737788 1007290 1130614 942289 597499 390859 366515
37546C66515p987k5833P1475J43496L0152j30142j35241p3015j41990k60671j73634
$$ 366515 358528 332695 404170 547666 577818 447676 312435 239420 97430 -163241 -336875
37535c36875J09516K80378J62986n8347j11048L6617K01096K24420J06613m4009
$$ -336875 -227359 53019 216005 157658 46610 83227 284323 508743 615356 571347
37525E71347j28504j36235j27652j45164j66037j52280j02545l0354N8491J32384
$$ 571347 442843 306608 178956 33792 -132245 -284525 -387070 -417424 -358933 -226549
37515b26549J32267M8651m7035q7512p1986j1872R7696J90032J19406j33251l26777
$$ -226549 -94282 -45631 -92666 -180178 -252164 -264036 -166340 23692 143098 9847 -316930
37504c16930k05619J38285L31799J88750o0671r8965P3326K04620J52461o098
$$ -316930 -522549 -384264 -52465 136285 75614 -23351 49975 254595 407056 400958
37494D00958j64967k81729k78427o8935K39707L67861K08785q352m5923J2407
$$ 400958 235991 -45738 -324165 -393100 -153393 214468 423253 414901 368978 381385
37484C81385m3105j67771j49540j735M1370p2406j27617l0106K7725p1728j37969
$$ 381385 338280 170509 20969 19234 60604 -11802 -139419 -169525 -141800 -213528 -351497
37473c51497q544J35010N6322j20546r2173J39392K75043J74047J1366l9891k9757
$$ -351497 -360041 -225031 -168709 -289255 -381428 -242036 33007 207054 218420 178529 148772
37462A48772o8072j34816j40979n7668P2564J72686J66685N1462p9294j40261
$$ 148772 80700 -54116 -195095 -252763 -180199 -7513 159172 210634 131340 -8921
37452h921j30682n8945Q5484K01113R8308j85429k97185m1207K52751J65609j58296
$$ -8921 -139603 -198548 -113064 88049 186357 928 -296257 -337464 -84713 80896 -77400
37441g7400k12332Q5558K78999R8242j66993j78775k1282O8063Q7852J25559J05154
$$ -77400 -289732 -204174 74825 173067 6074 -172701 -193983 -125920 -38068 87491 192645
37430A92645l3495j22092l806J86776K27052J30175L8096m5500j74768k58486
$$ 192645 159150 37058 33252 220028 447080 577255 615351 569851 395083 136597
37420A36597j85466m4976k65m2919o9388q1989j15958r9014R320P9450K7594Q815
$$ 136597 -48869 -93845 -94110 -137029 -206417 -288406 -404364 -503378 -494058 -414608 -387014 -378199
37408c78199J51844K78141J80053J1413M9176J97696J31956j37124k67516j49314
$$ -378199 -226355 51786 231839 243252 292428 490124 622080 484956 217440 68126
37398F8126l3706m9836k5406R6249Q5469j33908k55512n6047K27034K66294J27694
$$ 68126 34420 -15416 -40822 55427 140896 6988 -248524 -304571 -77537 188757 316451
37387C16451P4611J02735J2931j81581k58791j49940p864P1110J31384J55673
$$ 316451 391062 493797 506728 325147 66356 -83584 -91448 -20338 111046 266719
37377B66719L4776j94608k98558j45197R3966J62977M4898n7004j3145Q3525Q2574
$$ 266719 301495 106887 -191671 -336868 -242902 -79925 -35027 -92031 -105176 -21651 60923
37366F0923n536l7975M2007J18370P5526l1072o8960l0628j6463m7024m0081J8816
$$ 60923 55387 17412 59419 177789 253315 222243 153283 122655 106192 59168 19087 37903
37354C7903L7276j3250l7056J4023N4153K9478K3078Q4198R5041m1700j94169
$$ 37903 75179 61929 24873 38896 93049 122527 145605 229803 324844 283144 88975
37343H8975j57801M4068J91172J67395O5968J160k5285m5092n0203m6246p2034
$$ 88975 -68826 -24758 166414 333809 399777 400937 375652 330560 280357 234111 162077
37332A62077j14380q8932L9156J75655J87989M4089j59474k74854k09303r188
$$ 162077 47697 -41235 -2079 173576 361565 405654 246180 -28674 -237977 -247165
37322b47165J52545J30255l4221j56525j30939m3670k9174p8298o7558M3861J41045
$$ -247165 -94620 35635 1414 -155111 -286050 -329720 -358894 -437192 -504750 -460889 -319844
37311c19844J15666L3116N1143J83649K47200R6746j59234k70676j41712P8400
$$ -319844 -204178 -171062 -119919 63730 310930 407676 248442 -22234 -163946 -85546
37301h5546J88843J27111l3559j69873j71105k4506J21836Q3205j26550k84063
$$ -85546 103297 230408 196849 26976 -144129 -168635 -46799 36406 -90144 -374207
37291c74207k29618l8686J34887K43818K80699J86277j5774j24524p097J53310
$$ -374207 -603825 -642511 -507624 -263806 16893 203170 187396 62872 55775 209085
37281B09085Q6067j45425k15880l5262J10931N273j79810j65871K6902J59057
$$ 209085 295152 149727 -66153 -101415 9516 14789 -165021 -330892 -303990 -144933
37271a44933J25468K8247k8989l9139k5041k3041r0638j96845j71399P0813L17255
$$ -144933 -19465 8782 -20207 -59346 -84387 -107428 -198066 -394911 -566310 -495497 -178242
37260a78242K81744J7996j33673m1741M5025o7922j87076n3096K07355K51363
$$ -178242 103502 121498 -12175 -53916 -8891 -76813 -263889 -316985 -109630 141733
37250A41733M5337r6684k515J33037R8005k8961p4772o2501j03611j48433p2220
$$ 141733 187070 90386 87871 220908 318913 289952 215180 152679 49068 -99365 -171585
37239a71585O9072R5546n633n5235K8859J03585K6142j35558k00450r0997J10703
$$ -171585 -102513 -6967 -12600 -67835 -38976 64609 90751 -44807 -245257 -336254 -225551
37228b25551K56234K42843R6147l9623n8619l0488q6613j92271j79978k2290J03600
$$ -225551 30683 273526 369673 330050 271431 240943 154330 -37941 -217919 -240209 -136609
37217a36609Q5777L9637R4164J70594J20376k6701j10162p0247N227K2604l7286
$$ -136609 -50832 -11195 82969 253563 373939 347238 237076 166829 172056 194660 157374
37206A57374j34547j76815p5146J18886K14321J16590l4801p4717m1581n4271
$$ 157374 22827 -153988 -229134 -110248 104073 220663 185862 111145 69564 15293
37196A5293q4577m4705J121n9157j36894m7670J60559K37678J05212l9285l2026
$$ 15293 -69284 -113989 -112868 -172025 -308919 -356589 -196030 41648 146860 107575 75549
37185G5549O2505J16336R2349r767j55647j92458J025K37383J69067j96364m21712
$$ 75549 138054 254390 346739 336972 181325 -11133 -10108 227275 396342 199978 -221734
37174b21734k28232J25565K49871J40727M1912K5455J0511K5301J27573J78466
$$ -221734 -449966 -324401 -74530 66197 108109 133564 144075 169376 296949 475415
37164D75415J6398k12101k09233J6333J53600N8429p5427o3464K1359L5829k3454
$$ 475415 491813 279712 70479 86812 240412 298841 223414 159950 181309 217138 193684
37153A93684r9180j78372k19358j30857P5552K33514K06818L7552j32894j97491
$$ 193684 94504 -83868 -303226 -434083 -358531 -125017 81801 119353 -13541 -211032
37143b11032j24028K5134J05825M5165k6685N8762K31711K59785J02447l1432
$$ -211032 -335060 -309926 -204101 -158936 -185621 -126859 104852 364637 467084 435652
37133D35652k5021j6254j19434k08119j32564J9080N6222l0750q8270l1921P1662
$$ 435652 410631 394377 274943 66824 -65740 -46660 9562 -21188 -109458 -141379 -69717
37122f9717J12173M0137q8255j32443j9547J08323M2613j60491j92064P1189L42659
$$ -69717 42456 82593 -5662 -138105 -157652 -49329 -6716 -167207 -359271 -288082 54577
37111E4577K97852K919k16429k04567p4048L2392P4007N3371q12j6050L4337O9206
$$ 54577 352429 355348 138919 -65648 -139696 -107304 -33297 20074 19262 3212 37549 106755
37099A06755K7250k8412m1215p6675j66141j72406n74J81959J64406L1801K7293
$$ 106755 134005 105593 64378 -12297 -178438 -350844 -351418 -169459 -5053 26748 54041
37088E4041J41873J29068p8745k53893k21346p1610M7434J25455J81461J58295
$$ 54041 195914 324982 246237 -7656 -229002 -300612 -253178 -127723 53738 212033
37078B12033M1664o4017q2097o6124p4752n8758M3190J81747K38886J46266m9312
$$ 212033 253697 189680 107583 41459 -33293 -92051 -48861 132886 371772 518038 468726
37067D68726j90342j27293P9739J63853n843j94715j24935Q2506Q5035j22900
$$ 468726 278384 151091 230830 394683 388840 194125 69190 151696 236731 113831
37057A13831j95362p392J50014P0199n0012O202J08528N5516o3353p1919m1942
$$ 113831 -81531 -88923 61091 131290 81278 87480 196008 251524 188171 116252 74310
37046G4310j17013j93134r5919P1468Q1469k9196m5236M1399O0161J5959P2697
$$ 74310 -42703 -235837 -331756 -260288 -178819 -208015 -253251 -211852 -151691 -135732 -63035
37035f3035K00132J81082K811r0386j0621K2389j32373k80046j91823M8191J79989
$$ -63035 137097 318179 320990 230604 219983 242372 109999 -170047 -361870 -313679 -133690
37024a33690J07109n2451j43229q2503J02196K50880J92958l0288j84753j56349
$$ -133690 -26581 -79032 -222261 -304764 -202568 48312 241270 210982 26229 -130120
37014a30120r2672j31069j57520p943K19502K69922R8992p0923p0588J6963K9557
$$ -130120 -222792 -353861 -511381 -519324 -299822 -29900 69092 -1831 -72419 -55456 -25899
37003b5899m0580p4829j0109R7651J60441J36991L3855j07629k09651j96151p2209
$$ -25899 -66479 -141308 -151417 -53766 106675 243666 277521 169892 -39759 -235910 -308119
36992c08119O3399J21582J08399O6501j2248j25263j61152j4823K00622K38568
$$ -308119 -244720 -123138 -14739 51762 39514 -85749 -246901 -261724 -61102 177466
36982A77466O6201o9765k3922K1715j06105k23642o4920K33088K69878k2694k70824
$$ 177466 243667 173902 149980 171695 65590 -158052 -222972 10116 279994 257300 -13524
36971a3524j99676L3380J54539J33224P0987j4549r9907n9586J22580K12517K8678
$$ -13524 -213200 -179820 -25281 107943 178930 164381 64474 4888 127468 339985 368663
36960C68663k38731k53380j90K11944J80782J5675r7295j25941j29349j23214
$$ 368663 129932 -123448 -123638 88306 269088 284763 187468 61527 -67822 -191036
36950a91036q8254k1331P2686J73878K15589J37530j2742j08112r0677k3378J8385
$$ -191036 -279290 -300621 -227935 -54057 161532 299062 286320 178208 87531 64153 82538
36939H2538K7818J6788l1737j09883j43645p1947N7252J26625Q3329r656o4159
$$ 82538 110356 127144 95407 -14476 -158121 -230068 -172816 -46191 37138 27482 -36677
36928c6677o8667o9869q0919o2641J336O8019R7729J00004Q4374K8657n1084o8192
$$ -36677 -105344 -175213 -256132 -318773 -317437 -249418 -151689 -51685 32689 61346 10262 -57930
36916e7930J7010J07685R3918J0723l3394k3855o637M2680J45223J75115J1233
$$ -57930 -40920 66765 160683 171406 138012 114157 107520 150200 295423 470538 481771
36905D81771j94042j60545Q0884J82922l479k09628j88144o7015m7182l5463J18776
$$ 481771 287729 127184 208068 390990 387511 177883 -10261 -77276 -124458 -159921 -41145
36894d1145K57323J52083n0356k9298J49271J07676k00239l65772j63934R3068
$$ -41145 216178 368261 317905 288607 437878 545554 345315 -20457 -184391 -91323
36884i1323N6540j43147j66285L736J24101J27751J49290J80658M4832k42786
$$ -91323 -34783 -177930 -344215 -340479 -216378 -88627 60663 241321 286153 43367
36874D3367l82555j89055J30941K59303J73852Q8438Q5432L9444r4779j53004
$$ 43367 -339188 -528243 -397302 -137999 35853 124291 209723 249167 154388 1384
36864A384k6381J23594Q9249n5892o7731P6253J39054J1050j13794o3091L8201
$$ 1384 -24997 98597 187846 131954 64223 140476 279530 290580 176786 113695 151896
36853A51896L602q5018l0580J10856J00219p5442j50428Q278J87015J38380q1346
$$ 151896 155498 70480 39900 150756 250975 175533 25105 33383 220398 358778 277432
36842B77432k27859j89864n6148M8651O7617O986o5487n3929N2647J37291R5813
$$ 277432 49573 -140291 -196439 -147788 -80171 -73185 -138672 -192601 -139954 -2663 93150
36831I3150j8236o1153J8473J33609J74788J11353p793r7359q7819J2212J01979
$$ 93150 74914 13761 32234 165843 340631 451984 444191 346832 259013 271225 373204
36820C73204P8980m6226j54596j49488o0615N74k3473p4654o3637J1987P0386
$$ 373204 452184 405958 251362 101874 41259 41833 18360 -56294 -119931 -107944 -37558
36809c7558N5953o92m0281m2297j5362K8742N9844L4442m2493r3019m0665J07897
$$ -37558 18395 17703 -22578 -64875 -80237 -51495 8349 42791 298 -92721 -133386 -25489
36797b5489K64720L16018J95080l2414j77079j24679j2207n7972k14126j98779
$$ -25489 239231 555249 750329 717915 540836 416157 403950 345978 131852 -66927
36787f6927N8173K46788J18014j30260j50197M2338J44726N7247k3694J9280O3084
$$ -66927 -8754 238034 356048 225788 75591 117929 262655 319902 296208 315488 378572
36776C78572N158p3453q3494n8855m2318j8612j2286p6107j41629o8604J10264
$$ 378572 383730 310277 226783 167928 125610 106998 94712 18605 -123024 -191628 -81364
36765h1364J87220Q2097m2763m1628K3116L1872j3758m8187m2042J0201P6517
$$ -81364 105856 187953 145190 103562 126678 158550 144792 96605 54563 64764 141281
36754A41281N5373q2925j52523K2611K62774K10058j24468l33423k14374k7167
$$ 141281 196654 113729 -38794 -16183 246591 456649 332181 -1242 -215616 -242783
36744b42783k207J5974J88503L10217J53768r6827j22691K9564Q4261L948l9984
$$ -242783 -244990 -229016 -40513 269704 423472 326645 203954 233518 317779 321727 281743
36733B81743k9665p4710j24593n5952L3941l3415j53483p0140J71006K64692J33349
$$ 281743 252078 177368 52775 -3177 30764 -2651 -156134 -226274 -55268 209424 342773
36722C42773J2130K5012L2095m3523q0528m0224o1465j64127j58789J6535J50431
$$ 342773 354903 379915 412010 368487 287959 247735 186270 22143 -136646 -120111 30320
36711C0320R8325R990M7697J09898L0766j29782j94302j34360n5319j2719J1845
$$ 30320 128645 138635 186332 296230 326996 197214 2912 -131448 -186767 -199486 -187641
36700a87641K5286K2063J1764q692m0239k8681O2660J37548Q2292j4051L6117
$$ -187641 -162355 -140292 -128528 -137220 -177459 -206140 -143480 -5932 76360 62309 98426
36689I8426J81936J58186q5277k53337j41568N3396N2246r0866j22801L984J00696
$$ 98426 280362 438548 353271 99934 -41634 11762 64008 -26858 -149659 -145675 -44979
36678d4979M7787o4446q3171L6389J86679J92096J1540j41232l2394K26753K74485
$$ -44979 2808 -61638 -144809 -108420 78259 270355 281895 140663 108269 335022 609507
36667F09507J5317k30282k13490r7499j12653j64703o7773Q0767R3132O2755J75609
$$ 609507 624824 394542 181052 83553 -29100 -193803 -261576 -180809 -87677 -24922 150687
36656A50687K99353J65188j24198j93585N547J13903n4814k49730k28298j08062
$$ 150687 450040 615228 491030 297445 302992 416895 362081 112351 -115947 -224009
36646b24009q8516j19649o3277M6787J17820J82900K72833K71180R9529r4642
$$ -224009 -312525 -432174 -495451 -448664 -330844 -147944 124889 396069 495598 400956
36636D00956j34428p2275n5867o1804R760P7359j9062j99605k02852J3010J84508
$$ 400956 266528 194253 138386 76582 86342 163701 144639 -54966 -257818 -244808 -60300
36625f0300J36492K6278N8642J54979J05053p5302j66670q7849M151j4545o1160
$$ -60300 76192 102470 161112 316091 421144 345842 179172 91323 95474 80929 19769
36614A9769l1348J0041l5529r5378l8224P0500L1520j62971k67695j18955J37238
$$ 19769 -11579 -1538 -37067 -132445 -170669 -100169 -68649 -231620 -499315 -618270 -481032
36603d81032K57227K00260Q7716j7803j26008j85740j20027K2638J06583R8468
$$ -481032 -223805 -23545 64171 46368 -79640 -265380 -385407 -362769 -256186 -157718
36593a57718Q1762Q5498N1403q035J8135J45116K15183J13775m6890p7674K3923
$$ -157718 -75956 9542 60945 52910 71045 216161 431344 545119 498229 420555 444478
36582D44478Q0937k0588k00574k96487k28456m6182J25244J72318Q1440l3153
$$ 444478 525415 504827 304253 7766 -220690 -266872 -141628 30690 112130 78977
36572G8977l0127R6033J84428R1770j05642j69276R169K45874K75869P7268j28925
$$ 78977 48850 144883 329311 421081 315439 146163 155332 401206 677075 754343 625418
36561F25418j83581j47496j27771j12929p3995p8514j57606j75442j0788K06163
$$ 625418 441837 294341 166570 53641 -20354 -98868 -256474 -431916 -442704 -236541
36551b36541K34174O3414p9113o1244J4471K6477k804j3565o543K5740J03538
$$ -236541 -2367 61047 -18066 -79310 -64839 -38362 -41166 -54731 -61274 -35534 68004
36540F8004J42158J3053k04418k38052q011K06880J51426m7407j12861m1660l0612
$$ 68004 210162 223215 18797 -219255 -227266 -20386 131040 83633 -29228 -70888 -101500
36529a01500r2417m9757J10410J69017J3125j93480k49555j35393O2311K51338
$$ -101500 -193917 -243674 -133264 35753 48878 -144602 -394157 -529550 -467239 -215901
36519b15901L02913J31516j09404j29773Q4375J93397M505j95554o7009K29785
$$ -215901 87012 218528 109124 -20649 63726 257123 261628 66074 -935 228850
36509B28850K62152j257j53466o156J28754l1185k86156k93695r7116Q787k7472
$$ 228850 491002 489745 336279 330123 458877 427692 141536 -152159 -249275 -240488 -267960
36498b67960j1345P5242K6196j65762j93018R3163L69300K49228j55390l56227
$$ -267960 -279305 -204063 -177867 -343629 -536647 -443484 -74184 175044 19654 -336573
36488c36573j20705K59162L65060J35014j39892j90915l6993J02469Q6775J273
$$ -336573 -457278 -198116 166944 301958 162066 -28849 -65842 36627 123402 124675
36478A24675J2388J18076J38056k0953k02475j97366k3838J14183J01402O535
$$ 124675 137063 255139 393195 372242 169767 -27599 -51437 62746 164148 170683
36468A70683p5465j26274j34013o7189L1356M9958k9713q7383m8181M070j1782
$$ 170683 95218 -31056 -165069 -232258 -200902 -150944 -180657 -268040 -316221 -312151 -323933
36457c23933j4989R9469K44386K28535M1733j09937q5397J2939J1935q6490j35959
$$ -323933 -338922 -239453 4933 233468 275201 165264 79867 92806 104741 18251 -117708
36446a17708o9126K1605L1398j7358k4558M9597J47211J88328J33371j5710k13661
$$ -117708 -186834 -165229 -133831 -151189 -175747 -126150 21061 209389 342760 327050 113389
36435A13389l60623l56149k01585q157J23769J83486J85091J11701n812m3697
$$ 113389 -247234 -603383 -804968 -813125 -689356 -505870 -320779 -209078 -214890 -258587
36425b58587O0511J67119R4569j05171j94255p9631P3986J01534L4775k8904p9693
$$ -258587 -198076 -30957 63612 -41559 -235814 -315445 -241459 -139925 -105150 -134054 -213747
36414b13747j07905l0688J42088K11848M6809j75357j85098l715J11424N5450
$$ -213747 -321652 -352340 -210252 1596 48405 -126952 -312050 -315765 -204341 -148891
36404a48891l0195m2828m2535m9124L0102J71433J69407n0224k50433j96754J0514
$$ -148891 -179086 -221914 -264449 -313573 -283471 -112038 57369 7145 -243288 -440042 -429528
36393d29528J19629J05287J21609J68976R0776j01157j75831l8984R3336J5107
$$ -429528 -309899 -204612 -83003 85973 176749 75592 -100239 -139223 -45887 -30780
36383c0780j52329j41434O7662K24409J52503m4127j46817p9459N0680J03459
$$ -30780 -183109 -324543 -256881 -32472 120031 75904 -70913 -150372 -99692 3767
36373C767M5723l7323m4870K4706P5079M2558j1133J2873R6186J15947J9242r7691
$$ 3767 49490 12167 -32703 -7997 67082 109640 98507 111380 207566 323513 342755 245064
36361B45064j25460q7875q4349j30086j41116p3364Q228K7727m47j3037Q886M3990
$$ 245064 119604 31729 -52620 -182706 -323822 -397186 -388958 -361231 -361678 -374715 -365829 -321839
36349c21839Q7919J32160J09666l7265k17369k28943j1759K23709K29904L7317
$$ -321839 -233920 -101760 7906 -29359 -246728 -475671 -487430 -263721 -33817 3500
36339C500r7721m7439M6745L4711j1146M5754J43527J05224o6521j74898j17130
$$ 3500 -94221 -141660 -94915 -60204 -71350 -25596 117931 223155 156634 -18264 -135394
36328a35394k628O0152J08791J69366J33740n4313k26250j86739N48J12967R2401
$$ -135394 -138022 -77870 30921 200287 334027 279714 53464 -133275 -132727 -19760 72641
36317G2641O4004P0026K3579n6506j7470J40978J92541K9023j41273j17417k4684
$$ 72641 136645 206671 230250 173744 156274 297252 489793 518816 377543 260126 235442
36306B35442p3809j71782p9384J35916J54393p7991k29959q7198J34243J54476
$$ 235442 161633 -10149 -89533 46383 200776 122785 -107174 -194372 -60129 94347
36296I4347M8555N1968J34593O8007j57808k76419j30213J10296J83156L7612
$$ 94347 142902 194870 329463 397470 239662 -36757 -166970 -56674 126482 164094
36286A64094j67637k54962j58578M5308J90221J69411N9241K2927Q4789R8899
$$ 164094 -3543 -258505 -417083 -371775 -181554 -12143 47098 70025 154814 253713
36276B53713k7574j80748j73948K5639K61268L47527K39646O3904k3146k3087
$$ 253713 226139 45391 -128557 -102918 158350 505877 745523 809427 786281 763194
36266G63194q7590k66069l62285j90792R8031J69147k9475j98409j40651k0972
$$ 763194 675604 409535 47250 -143542 -45511 123636 94161 -104248 -244899 -265871
36256b65871m4073j25124q3055L9836R0539Q2808J10466J12166l531j01732L588
$$ -265871 -309944 -435068 -518123 -478287 -387748 -304940 -194474 -82308 -85839 -187571 -183983
36245a83983J79750J15515j72631l18872j51533P7523J20757P0883R4926J20460
$$ -183983 -4233 111282 -61349 -380221 -531754 -454231 -333474 -262591 -167665 -47205
36235d7205K1613j00455p7320L5897O6953J3997O579O0261P2947J3972n0049p0452
$$ -47205 -25592 -126047 -203367 -167470 -100517 -86520 -79941 -19680 53267 67239 17190 -53262
36223e3262l0401P7572J70994R5251j34712k53666r2415J37818J33551n5362j33666
$$ -53262 -83663 -6091 164903 260154 125442 -128224 -220639 -82821 50730 -4632 -138298
36212a38298j8587J04258J28611J23492R3223m6435k18957k12512k2429J05927
$$ -138298 -156885 -52627 75984 199476 292699 246264 27307 -185205 -207634 -101707
36202a01707N5180r099M7472J23926J07125M7187q430j02188j67060k6529K44336
$$ -101707 -46527 -55626 -8154 115772 222897 270084 261654 159466 -7594 -34123 210213
36191B10213K68690q5303m04849k90280M5320J13985j04033k00088k9703J08964
$$ 210213 478903 393600 -11249 -301529 -256209 -142224 -246257 -446345 -476048 -367084
36181c67084K9198n2118P0756K41245K19906N8511l1484n573K9761K9698J3404
$$ -367084 -337886 -390004 -319248 -78003 141903 200414 168930 163357 193118 222816 236220
36170B36220m8689j65042k11136p0656J45081J90682M676k09137k41671j00464
$$ 236220 187531 22489 -188647 -259303 -114222 76460 81136 -128001 -369672 -470136
36160d70136O1651J30903R0754j5076j00469p2353P0286J97464J81655N8539k0793
$$ -470136 -408485 -277582 -186828 -201904 -302373 -374726 -304440 -106976 74679 133218 112425
36149A12425L829L8203Q556p845Q0634J92008J59395j3265j34846r7527k0302
$$ 112425 116254 154457 163013 155168 235802 427810 587205 573940 439094 341567 321265
36138C21265m3552j04230m6286J14315J88815Q2764o6578p7752L1769P8637k7918
$$ 321265 277713 173483 127197 241512 430327 513091 446513 368761 400530 479167 451249
36127D51249j53637j23720J4503L4878j35474k67737j33533J52312K77183J65792
$$ 451249 297612 173892 188395 223273 87799 -179938 -313471 -161159 116024 281816
36117B81816L9189K8223o408j62323k58690j14890J16789J44707l7991j67277
$$ 281816 321005 349228 342820 180497 -78193 -193083 -76294 68413 30422 -136855
36107a36855r7522N5149J49892J84015J87807J41572N2515k4151q0587j52609
$$ -136855 -234377 -179228 -29336 154679 342486 484058 536573 512422 431835 279226
36097B79226k02641j39520J7556J24958J00921J2250m9636o2374k4191N8622J09509
$$ 279226 76585 -62935 -45379 79579 180500 192750 143114 80740 56549 115171 224680
36086B24680M0643r2762j33484n3631L756l6270o2798J8748J21476J22219M2037
$$ 224680 265323 172561 39077 -14554 -10798 -47068 -109866 -91118 30358 152577 194614
36075A94614k7963o0785m6369N7569J99296J95024j8541k17938j78682k1903l1314
$$ 194614 166651 105866 59497 117066 316362 511386 492845 274907 96225 74322 43008
36064D3008j91833k11358j9329Q4505q3818k50711p8603K96164M30237J94167
$$ 43008 -148825 -360183 -379512 -295007 -378825 -629536 -708139 -411975 18262 212429
36054B12429r5475j74054j36836j41450j07058O5776K02387Q4056j50358j58258
$$ 212429 116954 -57100 -193936 -335386 -442444 -376668 -174281 -90225 -240583 -398841
36044c98841Q4917K45964J52310J6617K8716M9797p9664k09115j33464L4935O2526
$$ -398841 -313924 -67960 84350 100967 129683 179480 99816 -109299 -242763 -207828 -145302
36033a45302J943O2134J85701J35592m3664n6324J20488J51040j03504l27773
$$ -145302 -143359 -81225 104476 240068 196404 140080 260568 411608 308104 -19669
36023a9669k42932j6637O3101L2768P9976J59817J13054N509J6817R7820O8591
$$ -19669 -262601 -279238 -216137 -183369 -103393 56424 169478 174987 191804 289624 358215
36012C58215j2907P2989K75637K72812k9983l18899l17270j38142k8799l761N2003
$$ 358215 345308 418297 693934 966746 936763 617864 300594 162452 133653 129892 181895
36001A81895R3773j0474j98902k46414p3748J53083K45784J71418j753j83656
$$ 181895 275668 265194 66292 -180122 -253870 -100787 144997 316415 314662 131006
35991A31006k50793j05861J66525L14976J93522n5114j80743j21147j3001K7431
$$ 131006 -119787 -225648 -59123 255853 449375 394261 213518 92371 79370 106801
35981A06801J689n5792j13085r9107K4994J46653J14031j5994l2895P9180Q0266
$$ 106801 108490 52698 -60387 -159494 -134500 12153 126184 110190 77295 156475 236741
35970B36741j27152k88166j80224K0834L2699o2837J3126K16627K27075o954j76068
$$ 236741 109589 -178577 -358801 -337967 -305268 -368105 -354979 -138352 88723 81769 -94299
35959i4299j27846p7575j61481j62345Q6865L44913K99627L3019j42843j37782
$$ -94299 -222145 -299720 -461201 -623546 -536681 -191768 107859 140878 -1965 -139747
35949a39747q4888l7079L7562N8147p0608k15271j53725O1127J48794K4742q2764
$$ -139747 -224635 -261714 -224152 -166005 -236613 -451884 -605609 -544482 -395688 -370946 -453710
35938d53710M920J65794J85858N1073p7186p9217R244N0219n0582k10294k20489
$$ -453710 -448790 -282996 -97138 -46065 -123251 -202468 -193224 -143005 -193587 -403881 -624370
35927f24370q376K18743K16107L7069l5023J21689L11692K92710O6234j61613
$$ -624370 -632746 -414003 -197896 -160827 -195850 -74161 237531 530241 596475 434862
35917D34862k20449j22704j6027j7413q7811r7896j6516N5374O3146P4394J07068
$$ 434862 214413 91709 75682 58269 -29542 -127438 -143954 -88580 -25434 48960 156028
35906A56028M8400j24747k14950q2864R3570P3039o1314m8851R7721J12277o3113
$$ 156028 204428 79681 -135269 -218133 -124563 -51524 -112838 -161689 -63968 48309 -14804
35895a4804j65434l0143J64079J88102O9438k4525k9790J2514N8584O3673q917
$$ -14804 -180238 -210381 -46302 141800 211238 186713 156923 169437 228021 291694 282777
35884B82777j14367j60679j38414j00885l0321J15983K45608K16431P5397r520
$$ 282777 168410 7731 -130683 -231568 -261889 -145906 99702 316133 391530 382010
35874C82010m7903j87783l62448l02521J0057K33611J64205J9748K8609N7397
$$ 382010 334107 146324 -216124 -518645 -508588 -274977 -110772 -91024 -62415 -5018
35864e018p3804j91216m0232K34478K63945J2158k00122j90199r6526n4859l983
$$ -5018 -78822 -270038 -310270 -75792 188153 200311 189 -190010 -286536 -341395 -345378
35853c45378J10426J91065J56736P7807M9550O0390N7000L4438O398l0088o4665
$$ -345378 -234952 -43887 112849 190656 240206 300596 357596 392034 398432 368344 303679
35842C03679p4215o1630l5876K0628R2551R1079k2177j23486p7635L4328L816
$$ 303679 229464 167834 131958 152586 245137 336216 314039 190553 112918 147246 151062
35831A51062j84601k97742j78794K5670P2918m2381r9787K7871J99615K06394
$$ 151062 -33539 -331281 -510075 -484405 -411487 -453868 -553655 -525784 -326169 -119775
35821a19775O4753n472R9716K06240J16096q2986j37114j0421O9898j8060j11004
$$ -119775 -55022 -60494 39222 245462 361558 278572 141458 131037 200935 182875 71871
35810G1871n5181L3887k0838j54315j69121m3249P3734J04402R4206O5021k894
$$ 71871 16690 50577 29739 -124576 -293697 -336946 -263212 -158810 -64604 417 -2477
35799b477o8639o8739l6229m2879n8059p451O8264O7115O824k253N7479R7773
$$ -2477 -71116 -139855 -176084 -218963 -277022 -284473 -216209 -149094 -142270 -144523 -87044 10729
35787A0729P2059J69j08395k07463j58094Q8908L09565K35189n4606k10729r9320
$$ 10729 82788 82957 -25438 -232901 -390995 -302087 7478 242667 188061 -22668 -121988
35776a21988M9524L1352o0236o7422l4268o5109r6709j1729J28630J54833M3976
$$ -121988 -72464 -41112 -101348 -168770 -203038 -268147 -364856 -376585 -247955 -93122 -49146
35765d9146m9194p371J10354J55240N9624q7346j31522m0270L8465k8237j51535
$$ -49146 -98340 -105711 4643 159883 219507 132161 639 -39631 -1166 -29403 -180938
35754a80938j35428K5807J30746P2888j7716k396O2821N7944k237k6003m465Q582
$$ -180938 -316366 -290559 -159813 -86925 -104641 -107037 -44216 13728 11491 -14512 -18977 -10395
35742a0395Q201K1563K9790j766n1351o4854j7628Q0587J82468J87015K8342j80344
$$ -10395 -2194 19369 49159 47393 -3958 -68812 -86440 -5853 176615 363630 391972 211628
35730B11628k15317k7756J60008J40249j2575q0907j1004O6969O1199O382m4272
$$ 211628 -3689 -31445 128563 268812 256237 175330 164326 231295 292494 298876 254604
35719B54604p5409n9673K6672J21290J08761l3009j87083k24563j33577r329M8906
$$ 254604 179195 119522 146194 267484 376245 343236 156153 -68410 -201987 -211316 -162410
35708a62410K1845k7916l3519J725L0366M5414P7908J08727O7022n0059j34141
$$ -162410 -140565 -168481 -202000 -200275 -169909 -124495 -46587 62140 129162 79103 -55038
35697e5038r2861L7872J47553J58772N8733r5094j74502q9297O4414Q8806k5880
$$ -55038 -147899 -110027 37526 196298 255031 159937 -14565 -103862 -39448 49358 23478
35686B3478n2907J20033K59404R8385k32833l34795p6506K25994K21952o2140
$$ 23478 -29429 90604 350008 448393 215560 -119235 -195741 30253 252205 190065
35676A90065l09418k88711n1067J79013K32008J34304M4458L8456O595j60497
$$ 190065 -119353 -408064 -459131 -280118 -48110 86194 130652 169108 175703 15206
35666A5206l37809k68786P7013L95742L82929Q3536j81792j84012Q970J67049
$$ 15206 -322603 -591389 -514376 -118634 264295 347831 166039 -17973 -9003 158046
35656A58046J50520Q640j21158j61551j33541q4568l7686j8111n4656j07487o6467
$$ 158046 308566 317206 196048 34497 -99044 -183612 -221298 -239409 -294065 -401552 -468019
35645d68019R8694K46757K27336Q9812N701J4655J539p6039j17555q3192q2776
$$ -468019 -369325 -122568 104768 194580 200281 214936 216475 140436 22881 -60311 -143087
35634a43087j63787j84436m6255R5621N0752q5773o7791R7176J45347j2727j29492
$$ -143087 -306874 -491310 -537565 -441944 -391192 -476965 -544756 -447580 -302233 -314960 -444452
35623d44452m667K01278K23974R1567L2740R3382J02347n724q5093m1480J8917
$$ -444452 -449119 -247841 -23867 67700 100440 193822 296169 290445 205352 163872 182789
35612A82789p175n1326k6625K173n6100j38940j26456l3372M3061R2728J50518
$$ 182789 175614 124288 97663 99836 43736 -95204 -221660 -255032 -211971 -119243 31275
35601C1275J49829J0582j52343j20652R6680K25888R9265j15576j73546q6781
$$ 31275 181104 191686 39343 -81309 15371 241259 340524 224948 51402 -35379
35591c5379m3985r8257j19447k4949J11597J98665K31956K16470J09846p0489
$$ -35379 -79364 -177621 -297068 -322017 -210420 -11755 220201 436671 546517 476028
35581D76028j76390q9026Q4925J10513o3272k19009j68141j0464L3689m2547n8313
$$ 476028 299638 210612 295537 406050 342778 123769 -44372 -54836 -21147 -63694 -122007
35570a22007K8039N0437n7242j20556j5795J10439R1036K0352N9189J17129J1795
$$ -122007 -93968 -43531 -100773 -221329 -237124 -126685 -35649 -15297 43892 161021 172816
35559A72816j62061j44775M8233J33617K5497m4715M8304J11911r615j63013j55219
$$ 172816 10755 -134020 -85787 47830 73327 28612 76916 188827 179212 16199 -139020
35548a39020m7787J5155N2809J13123R6460n4440j61704n3736J41232J82677P2697
$$ -139020 -186807 -171652 -118843 -5720 90740 36300 -125404 -179140 -37908 144769 217466
35537B17466k1534q2892k10078l42495k94425m8580K06174L15206K59990Q3206
$$ 217466 195932 113040 -97038 -439533 -733958 -782538 -576364 -261158 -1168 82038
35527H2038r7953r5917J06553K25592N0394j72009p2589K07538J66235k54007
$$ 82038 -15915 -111832 -5279 220313 270707 98698 26109 233647 399882 145875
35517A45875m96899k03116K54631L39918R4417o5659l5125n7111j87775j76201
$$ 145875 -351024 -554140 -299509 40409 134826 69167 34042 -23069 -210844 -387045
35507c87045O9911K69558J76372n4118j04060N2550J50572L7641j27080j30860
$$ -387045 -317134 -47576 128796 74678 -29382 23168 173740 211381 84301 -46559
35497d6559j3333J8783p9278j16334L7556K26827K04216l1570k30777k00084J997
$$ -46559 -59892 -41109 -120387 -236721 -199165 27662 231878 200308 -30469 -230553 -228556
35486b28556J67750J41277o6288k71269k57923j9144J94784J78912M4874L0722
$$ -228556 -60806 80471 14183 -257086 -515009 -534153 -339369 -160457 -115583 -84861
35476h4861J28488J31538N463o6401k1266o704o4523k6566J46149K14870M4313
$$ -84861 43627 175165 180628 114227 92961 86257 21734 -4832 141317 356187 400500
35465D00500j31237o2760J14354J11159o0315j63387j42407j37324j64150r8627
$$ 400500 269263 206503 320857 432016 371701 208314 65907 -71417 -235567 -334194
35455c34194L4632N7544m3751o6794P8672K29121K31750J34263K5890r8318k03396
$$ -334194 -299562 -242018 -285769 -352563 -273891 -44770 186980 321243 347133 248815 45419
35444D5419j48780Q4071K53389J29757j79788l43119j94751J10557L02448K45193
$$ 45419 -103361 -19290 234099 363856 184068 -159051 -353802 -243245 59203 304396
35434C04396Q375k13987k58726j31893J5909P7530R3059J20701J01231l5563j95478
$$ 304396 312771 98784 -159942 -291835 -275926 -198396 -105337 15364 116595 81032 -114446
35423a14446k05289o6478K8869k4884r4617j7743J47930K07898J05423k0818m1221
$$ -114446 -319735 -386213 -357344 -382228 -476845 -494588 -346658 -138760 -33337 -54155 -95376
35412i5376K5196R3674J23167R8420L045j20090j61317p9665J6318J1077n1757
$$ -95376 -70180 23494 146661 245081 248126 128036 -33281 -112946 -96628 -85551 -137308
35401a37308m9768K0647N7555M1047N7092J19044J19648J6660p5420o4954k8546
$$ -137308 -187076 -166429 -108874 -67827 -10735 108309 227957 244617 169197 104243 75697
35390G5697o5073j14553o8920J4076j4592j28984j24276P4004K60622K17742K0289
$$ 75697 10624 -103929 -172849 -158773 -173365 -302349 -426625 -352621 -91999 125743 146032
35379A46032o9642L3036J37556P1445p4730j05004k4161j8369j41888k08293p4850
$$ 146032 76390 109426 246982 318427 243697 138693 114532 96163 -45725 -254018 -328868
35368c28868J17038J30961k9402j44786r7314J1969O0615M9937J9955k7320o5455
$$ -328868 -211830 -80869 -110271 -255057 -352371 -340402 -279787 -229850 -209895 -237215 -302670
35357c02670l4441N1318J01801R5565R4109Q2206l5019k14749k52500q7101O1759
$$ -302670 -337111 -285793 -183992 -88427 5682 87888 52869 -161880 -414380 -501481 -439722
35346d39722J3428r8049o2553N6752N7633l9182m3654M9166N2899n9973q7354
$$ -439722 -426294 -524343 -586896 -530144 -472511 -511693 -555347 -506181 -453282 -513255 -600609
35335f00609O1871K10591J96464R4629L7215K081p0860j08061j8250J17787J33259
$$ -600609 -538738 -328147 -131683 -37054 161 2242 -68618 -176679 -194929 -77142 56117
35324E6117j371j65371k50920k28428r5776J13587K82700K79566R9079j18188
$$ 56117 54746 -110625 -361545 -589973 -685749 -572162 -289462 -9896 89183 -29005
35314b9005k19826j66820m0757M3315M6292M0150J02060J78928J39059j6717j07136
$$ -29005 -248831 -415651 -456408 -413093 -366801 -326651 -224591 -45663 93396 76679 -30457
35303c0457j5190J20516R1728o6045j15750K8630J68990J07033q6593j96963j49834
$$ -30457 -45647 74869 166597 100552 -15198 13432 182422 289455 202862 5899 -143935
35292a43935l6050P4118J75561K13159J04384q6135j62446o5573K7365j8276p3357
$$ -143935 -179985 -105867 69694 282853 387237 301102 138656 73083 100448 82172 8815
35281H815K6581J63998R4020j43722k46398j04370M0734j1868j32800j23682l7028
$$ 8815 35396 199394 293414 149692 -96706 -201076 -160342 -172210 -305010 -428692 -465720
35270d65720j8872j5898R7684K24085J62478k8787q2674N6050J42725L1382r8516
$$ -465720 -484592 -500490 -402806 -178721 -16243 -45030 -127704 -71654 71071 102453 3937
35259C937m1248J18280J52831J7190j40494k01619j63578o4253M4434Q1926J6172
$$ 3937 -37311 80969 233800 250990 110496 -91123 -254701 -318954 -274520 -192594 -176422
35248a76422o0879l3996O9806J10060K7806q0499j06906o4908k4627K0333J28269
$$ -176422 -237301 -271297 -201491 -91431 -63625 -144124 -251030 -315938 -340565 -320232 -191963
35237a91963K61555K69621Q2165j50330k12775r8796j0525p0353j58875j00534
$$ -191963 69592 339213 421378 271048 58273 -40523 -51048 -121401 -280276 -380810
35227c80810R7435K76578L13443J92690j8821j80850j55206K2269J37770P7998
$$ -380810 -283375 -6797 306646 499336 480515 299665 144459 166728 304498 382496
35217C82496n835M1855R9032k9962k36843k30078m579J22154o092j61019j03599
$$ 382496 376661 418516 517548 487586 250743 20665 16086 138240 132148 -28871 -132470
35206a32470Q1092J79758J63580J22691O0531n3119j48146j52746j30274j59850
$$ -132470 -51378 128380 291960 414651 475182 422063 273917 121171 -9103 -168953
35196a68953j74967q1636M9118Q0579M1573Q0029K08529K62630J33736p8315j84213
$$ -168953 -343920 -425556 -376438 -295859 -254286 -174257 34272 296902 430638 352323 168110
35185A68110j11970K7892O3388m1766j25238k7071J65317K05683L9006j13170
$$ 168110 56140 84032 147420 105654 -19584 -46655 118662 324345 363351 250181
35175B50181q9206j5769o3745j55773j13901L0395R3022K7572m7729o2838m5593
$$ 250181 160975 145206 81461 -74312 -188213 -157818 -64796 -37224 -84953 -147791 -193384
35164a93384k489O6951Q0932j5584j02961m4689O5841M7299l5275L4745K07600
$$ -193384 -195873 -128922 -47990 -63574 -166535 -211224 -145383 -98084 -133359 -98614 108986
35153A08986J82036q6315k39551n4825J87992J38218p8768q6573J22959J85992
$$ 108986 291022 204707 -34844 -89669 98323 236541 157773 71200 194159 380151
35143C80151l1586k04983n1598K25688K19043j12318l89007l04436J9620K23665
$$ 380151 348565 143582 91984 317672 536715 424397 35390 -269046 -249426 -25761
35133b5761J34686r1266j98618j06080O3317J54155J21939K5740n9114r6421q7538
$$ -25761 108925 17659 -180959 -287039 -223722 -69567 52372 78112 18998 -77423 -164961
35122a64961m6874J7052R7134J59537J38018k797j88657k66337j56607M3054J57014
$$ -164961 -211835 -194783 -97649 61888 199906 197109 8452 -257885 -414492 -371438 -214424
35111b14424J28721O2329N4077N9609l362q2842m8831Q1104J20295j6882j58122
$$ -214424 -85703 -23374 30703 90312 86950 4108 -44723 36381 156676 139794 -18328
35100a8328j08363O5069J47834J05205Q4204J11385L5175j67985k71139j25151
$$ -18328 -126691 -61622 86212 191417 275621 387006 422181 254196 -16943 -142094
35090a42094Q2571Q9380n9652j07816J5334J23095Q2046k2713o9554o5152n5548
$$ -142094 -59523 29857 -29795 -137611 -122277 818 82864 60151 -9403 -74555 -130103
$$ [...]
##END NTUPLES=NMR SPECTRUM
##END=
