##TITLE=31Pdec_2PEDM2307
 CDCl3, 24 sc
 24.7.2019
##JCAMPDX= 6.0         $$ Bruker NMR JCAMP-DX V2.0
##DATA TYPE= NMR SPECTRUM
##DATA CLASS= NTUPLES
##ORIGIN= UXNMR, Bruker Analytische Messtechnik GmbH
##OWNER= root
$$ XWIN-NMR		Version 3.5
$$ Wed Jul 24 14:21:35 2019 Russian Standard Time (UT+4h)  she@DPX200
##.OBSERVE FREQUENCY= 81.013821
##.OBSERVE NUCLEUS= ^31P
##.ACQUISITION MODE= SIMULTANEOUS
##.ACQUISITION SCHEME= undefined
##.AVERAGES= 24
##.DIGITISER RES= 17
##SPECTROMETER/DATA SYSTEM= spect
##.PULSE SEQUENCE= zgpg30
##.SOLVENT NAME= CDCl3
##.SHIFT REFERENCE= (INTERNAL, CDCl3, 0, 182.463)
##AUDIT TRAIL= $$ (NUMBER, WHEN, WHO, WHERE, WHAT)
$$ ##TITLE= Audit trail, XWIN-NMR		Version 3.5
$$ ##JCAMPDX= 5.01
$$ ##ORIGIN= Bruker BioSpin GmbH
$$ ##OWNER= she
$$ F:/spectra/data/she/nmr/P31/1/pdata/1/auditp.txt
$$ ##AUDIT TRAIL=  $$ (NUMBER, WHEN, WHO, WHERE, WHAT)
(   1,<2019-07-24 14:20:28.70 +0400>,<she>,<DPX200>,
      <created by zg, POWCHK disabled, PULCHK disabled
       configuration hash MD5:
       00 E9 B6 7A A2 85 ED C7 34 08 36 98 17 FE 4E 26
       data hash MD5: 32K
       98 49 E4 B1 13 65 EC F1 B5 B5 1A 13 AF D7 B5 F4>)
(   2,<2019-07-24 14:20:31.00 +0400>,<she>,<DPX200>,
      <Start of raw data processing
       efp BC_mod = 2 LB = 1 FT_mod = 6 PKNL = 1 PHC0 = -2634.096 PHC1 = 348.7993 SI = 64K 
       data hash MD5: 64K
       E4 22 A0 37 C3 5E 84 35 D6 AF D9 C7 60 29 60 55>)
(   3,<2019-07-24 14:20:58.43 +0400>,<she>,<DPX200>,
      <pk PHC0 = 55.83181 PHC1 = -180.2 
       data hash MD5: 64K
       A4 D4 F1 45 51 D2 69 52 67 9E C9 40 09 97 51 61>)
(   4,<2019-07-24 14:21:01.37 +0400>,<she>,<DPX200>,
      <abs ABSG = 5 
       data hash MD5: 64K
       BF F1 ED 99 83 7A BD A9 1C B0 F3 D6 4E D3 D6 1C>)
$$ ##END=
$$ 
$$ hash MD5
$$ FD 11 A1 B8 96 7E 35 D5 F4 9F F3 5A EC 20 E8 B8
##$RELAX= 
##$RELAX= 
##$RELAX= 
##$RELAX= 
##$RELAX= 
##$RELAX= 
##$RELAX= 
##$RELAX= 
$$ Bruker specific parameters
$$ --------------------------
##$DU= <F:/spectra>
##$EXPNO= 1
##$NAME= <P31>
##$PROCNO= 1
##$TYPE= <nmr>
##$USER= <she>
##$AMP= (0..31)
100 100 100 100 100 100 100 100 100 100 100 100 100 100 100 100 100 100 
100 100 100 100 100 100 100 100 100 100 100 100 100 100 
##$AQSEQ= 0
##$AQ_mod= 1
##$AUNM= <au_zg>
##$AUTOPOS= <>
##$BF1= 81.014009
##$BF2= 200.13
##$BF3= 200.13
##$BF4= 200.13
##$BF5= 200.13
##$BF6= 200.13
##$BF7= 200.13
##$BF8= 200.13
##$BYTORDA= 1
##$CFDGTYP= 0
##$CFRGTYP= 5
##$CHEMSTR= <none>
##$CNST= (0..31)
1 1 145 1 1 1 1 1 1 1 1 1 1 1 1 1 1 1 1 1 1 1 1 1 1 1 1 1 1 1 1 1 
##$CPDPRG= <waltz16>
##$CPDPRG1= <>
##$CPDPRG2= <waltz16>
##$CPDPRG3= <>
##$CPDPRG4= <mlev>
##$CPDPRG5= <mlev>
##$CPDPRG6= <mlev>
##$CPDPRG7= <mlev>
##$CPDPRG8= <mlev>
##$CPDPRGB= <>
##$CPDPRGT= <>
##$D= (0..31)
0 1 0 0 0 0 0 0 0 0 0 0.03 2e-05 3e-06 0 0 0 0 0 0 0 0 0 0 0 0 0 0 0 0 
0 0 
##$DATE= 1563963628
##$DBL= (0..7)
120 120 120 11 120 120 24 19 
##$DBP= (0..7)
150 150 150 150 150 150 150 150 
##$DBP07= 0
##$DBPNAM0= <>
##$DBPNAM1= <>
##$DBPNAM2= <>
$$ [...]
##$SUBNAM3= <"">
##$SUBNAM4= <"">
##$SUBNAM5= <"">
##$SUBNAM6= <"">
##$SUBNAM7= <"">
##$SUBNAM8= <"">
##$SUBNAM9= <"">
##$SW= 369.568048894756
##$SWIBOX= (0..15)
0 1 3 0 0 0 0 0 0 0 0 0 0 0 0 0 
##$SW_h= 29940.119760479
##$TD= 32768
##$TD0= 1
##$TE= 0
##$TE2= 300
##$TE3= 300
##$TEG= 300
##$TL= (0..7)
0 120 53 12 22 120 120 120 
##$TP= (0..7)
150 150 150 150 150 150 150 150 
##$TP07= 0
##$TPNAME0= <>
##$TPNAME1= <>
##$TPNAME2= <>
##$TPNAME3= <>
##$TPNAME4= <>
##$TPNAME5= <>
##$TPNAME6= <>
##$TPNAME7= <>
##$TPOAL= (0..7)
0.5 0.5 0.5 0.5 0.5 0.5 0.5 0.5 
##$TPOFFS= (0..7)
0 0 0 0 0 0 0 0 
##$TUNHIN= 0
##$TUNHOUT= 0
##$TUNXOUT= 0
##$USERA1= <user>
##$USERA2= <user>
##$USERA3= <user>
##$USERA4= <user>
##$USERA5= <user>
##$V9= 5
##$VALIST= <valist>
##$VCLIST= <CCCCCCCCCCCCCCC>
##$VD= 0
##$VDLIST= <DDDDDDDDDDDDDDD>
##$VPLIST= <PPPPPPPPPPPPPPP>
##$VTLIST= <TTTTTTTTTTTTTTT>
##$WBST= 1024
##$WBSW= 4
##$XGAIN= (0..3)
0 0 0 0 
##$XL= 0
##$YL= 0
##$YMAX_a= 85533
##$YMIN_a= -91586
##$ZGOPTNS= <>
##$ZL1= 120
##$ZL2= 120
##$ZL3= 120
##$ZL4= 120
##$ABSF1= 182.463
##$ABSF2= -187.1042
##$ABSG= 5
##$ABSL= 3
##$ALPHA= 0
##$AQORDER= 0
##$ASSFAC= 0
##$ASSFACI= 0
##$ASSFACX= 0
##$ASSWID= 0
##$AUNMP= <proc_1d>
##$AZFE= 0.1
##$AZFW= 0.5
##$BCFW= 0
##$BC_mod= 2
##$BYTORDP= 0
##$COROFFS= 0
##$CY= -3
##$DATMOD= 1
##$DC= 0
##$DFILT= <>
##$DTYPP= 0
##$F1P= 0
##$F2P= 0
##$FCOR= 1
##$FTSIZE= 65536
##$FT_mod= 6
##$GAMMA= 0
##$GB= 0
##$INTBC= 1
##$INTSCL= 5.30512e-09
##$ISEN= 30
##$LB= 1
##$LEV0= 0
##$LPBIN= 0
##$MAXI= 10000
##$MC2= 0
##$MEAN= 0
##$ME_mod= 0
##$MI= 50
##$NCOEF= 0
##$NC_proc= -2
##$NLEV= 6
##$NOISF1= 182.463
##$NOISF2= 159.3651
##$NSP= 0
##$NTH_PI= 0
##$NZP= 0
##$OFFSET= 182.463
##$PC= 4
##$PHC0= -2578.264
##$PHC1= 168.5993
##$PH_mod= 1
##$PKNL= yes
##$PPARMOD= 0
##$PSCAL= 0
##$PSIGN= 0
##$REVERSE= no
##$SF= 81.0140089999434
##$SI= 65536
##$SIGF1= 159.3651
##$SIGF2= -187.1042
##$SINO= 113.3802
##$SIOLD= 16384
##$SREGLST= <1H.CDCl3>
##$SSB= 0
##$STSI= 65536
##$STSR= 0
##$SW_p= 29940.119760479
##$SYMM= 0
##$S_DEV= 0
##$TDeff= 32768
##$TDoff= 0
##$TI= <>
##$TILT= no
##$TM1= 0
##$TM2= 0
##$TOPLEV= 0
##$USERP1= <user>
##$USERP2= <user>
##$USERP3= <user>
##$USERP4= <user>
##$USERP5= <user>
##$WDW= 1
##$XDIM= 65536
##$YMAX_p= 295784756
##$YMIN_p= -4112896
$$ End of Bruker specific parameters
$$ ---------------------------------
##NTUPLES= NMR SPECTRUM
##VAR_NAME=  FREQUENCY,     SPECTRUM/REAL,   SPECTRUM/IMAG
##SYMBOL=    X,             R,               I
##VAR_TYPE=  INDEPENDENT,   DEPENDENT,       DEPENDENT
##VAR_FORM=  AFFN,          ASDF,            ASDF
##VAR_DIM=   65536,         65536,           65536
##UNITS=     HZ,            ARBITRARY UNITS, ARBITRARY UNITS
##FACTOR=    0.456856943014862, 1,           1
##FIRST=     14782.0589164792, 0,            0
##LAST=      -15158.0608439998, 0,           0
##MIN=       -15158.0608439998, -4112896,    0
##MAX=       14782.0589164792, 295784756,    0
$$ Real data points
##PAGE= N=1
##DATA TABLE= (X++(R..R)), XYDATA
$$ [...]
$$ plain form
41535 -112604 -141606 -122744 -104231 -102991 -63355 18207 53628 -1045 -77043 -102398 -80305 -26376
41523 -26376 62719 140736 128685 53061 53624 182516 296330 235437 37898 -110747 -93680
41512 -93680 40026 158975 175028 106629 45781 44084 42227 -36343 -144899 -160014 -68191
41501 -68191 4763 -22983 -86334 -96122 -59209 -21042 10547 20220 -37773 -142585 -181104 -105558
41489 -105558 -27224 -51537 -101947 -33305 135220 239081 202406 123802 115058 162645 184897
41478 184897 148412 85374 40491 28128 15486 -52340 -175329 -259227 -212390 -84257 -36726
41467 -36726 -146195 -293116 -302000 -154198 5426 62579 56351 78308 118435 89786 -18034
41456 -18034 -104685 -103046 -76219 -114965 -198791 -234007 -193065 -133422 -94317 -60361 -32059 -49302
$$ packed form
41535a12604k9002J8862J8513J240L9636Q1562L5421n4673p5998k5355K2093N3929
41523b6376Q9095P8017j2051p5624N63J28892J13814o0893j97539j48645J7067
41512i3680J33706J18949J6053o8399o0848j697j857p8570j08556j5115R1823
41501f8191P2954k7746o3351r788L6913L8167L1589R673n7993j04812l8519P5546
41489a05558P8334k4313n0410O8642J68525J03861l6675p8604q744M7587K2252
41478A84897l6485o3038m4883j2363j2642o7826j22989q3898M6837J28133M7531
41467c6726j09469j46921q884J47802J59624N7153o228K1957M0127k8649j07820
41456a8034q6651J639K6827l8746q3826l5216M0942N9643L9105L3956K8302j7243
$$ plain form
41444 -49302 -115881 -164051 -133630 -48243 18495 28571 11403 26232 99317 186522 209325 146660
41432 146660 67533 42775 54935 37177 -32204 -126307 -223402 -297655 -290749 -174419 -20876
41421 -20876 67873 79535 62645 17674 -75615 -152802 -119154 -4343 70267 80607 109438
41410 109438 154869 104046 -48094 -131249 -48838 62088 44360 -43970 -58701 -19744 -49962
41399 -49962 -130221 -111013 34073 136513 58335 -129621 -248328 -211328 -79719 29675
41389 29675 50873 9988 -16421 11898 64092 99031 127075 178953 241595 266459 229137 153641
41377 153641 91655 90242 151056 210736 201637 141041 105440 105172 61747 -56344 -157668 -147392
41365 -147392 -56603 13710 24147 8957 6485 39843 119989 208969 229689 170363 121868 146665
$$ packed form
41444d9302o6579m8170L0421Q5387O6738J0076j7168J4829P3085Q7205K2803o2665
41432A46660p9127k4758J2160j7758o9381r4103r7095p4253O906J16330J53543
41421b0876Q8749J1662j6890m4971r3289p7187L3648J14811P4610J0340K8831
41410A09438M5431n0823j52140q3155Q2411J10926j7728q8330j4731L8957l0218
41399d9962q0259J9208J45086J02440p8178j87956j18707L7000J31609J09394
41389B9675K1198m0885k6409K8319N2194L4939K8044N1878O2642K4864l7322p5496
41377A53641o1986j413O0814N9680r099o0596l5601k68m3425j18091j01324J0276
41365a47392R0789P0313J0437j5190k472L3358Q0146Q8980K0720n9326m8495K4797
$$ plain form
41353 146665 176259 122377 29834 16151 96597 171675 169193 107558 32322 -24707 -32156 18479
41341 18479 84238 124857 158555 196545 166992 6459 -196383 -264665 -151003 7940 73517
41330 73517 50223 20631 22012 37094 47282 42709 13125 -30910 -47512 -3075 86760 172249
41318 172249 221692 248529 279040 294185 234058 94071 -15672 19133 155239 232595 188710
41307 188710 122641 107886 69984 -63488 -204001 -213917 -100838 19057 87671 112558 67910
41296 67910 -69855 -217382 -251331 -171812 -86959 -52841 -40751 -39043 -62710 -75995 -29884
41285 -29884 34226 41398 26439 83071 182175 195202 105585 36782 45003 45702 -11054 -52197
41273 -52197 -30248 -10432 -36978 -54621 -42646 -83906 -202559 -269014 -184521 -43268 16576
$$ packed form
41353A46665K9594n3882r2543j3683Q0446P5078k482o1635p5236n7029p449N0635
41341A8479O5759M0619L3698L7990k9553j60533k02842o8282J13662J58943O5577
41330G3517k3294k9592J381J5082J0188m573k9584m4035j6602M4437Q9835Q5489
41318A72249M9443K6837L0511J5145o0127j39987j09743L4805J36106P7356m3885
41307A88710o6069j4755l7902j33472j40513r916J13079J19895O8614K4887m4648
41296F7910j37765j47527l3949P9519Q4853L4118J2090J708k3667j3285M6111
41285b9884O4110P172j4959N6632R9104J3027q9617o8803Q221O99n6756m1143
41273e2197K1949J9816k6546j7643J1975m1260j18653o6455Q4493J41253N9844
$$ plain form
41262 16576 20932 82142 197778 270330 265739 213802 104189 -71396 -209325 -180960 -26078
41251 -26078 79392 58693 6238 4120 3596 -53504 -111180 -83953 8078 75998 91136 98042
41239 98042 121504 136466 130552 130519 147209 146194 106351 68034 74800 89714 32057 -97951 -193716
41226 -193716 -169669 -60973 42708 107964 142133 118540 11734 -108497 -120453 -9673
41216 -9673 97627 94226 14503 -44808 -61748 -84696 -129863 -151747 -112805 -36320 21939 33992
41204 33992 20932 19131 35831 52435 68261 107950 170892 212998 208521 187242 168015 105045
41192 105045 -33201 -171904 -200591 -116953 -22072 10633 -16016 -80034 -149942 -153562 -44656
41181 -44656 99817 153414 109532 64669 39172 -40134 -157451 -173281 -42551 79276 47646
$$ packed form
41262A6576M356O1210J15636P2552m591n1937j09613j75585j37929K8365J54882
41251b6078J05470k0699n2455k118n24n7100n7676K7227R2031O7920J5138O906
41239I8042K3462J4962n914l3J6690j015l9843l8317O766J4914n7657j30008r5765
41226a93716K4047J08696J03681O5256L4169k3593j06806j20231j1956J10780
41216i673J07300l401p9723n9311j6940k2948m5167k1884L8942P6485N8259J2053
41204C3992j3060j801J6700J6604J5826L9689O2942M2106m477k1279j9227o2970
41192A05045j38246j38703k8687Q3638R4881L2705k6649o4018o9908l620J08906
41181d4656J44473N3597m3882m4863k5497p9306j17317j5830J30730J21827l1630
$$ plain form
41170 47646 -71869 -123115 -77033 -13512 32177 80009 114899 100066 50367 4973 -38003
41159 -38003 -85932 -100640 -62369 -32192 -66833 -124928 -144844 -153713 -194803 -207390 -109848 35026
41147 35026 81265 19852 -3060 90004 195755 192488 109664 64050 93341 125886 89390 -1080
41135 -1080 -61778 -31048 56146 94459 24744 -95900 -166670 -158166 -116899 -83921 -61731 -45330
41123 -45330 -33787 -18994 -3721 -14201 -54933 -79025 -53779 -24297 -48802 -99127 -101319 -56646
41111 -56646 -37247 -64127 -76379 -37071 8681 8656 -27732 -64371 -87416 -91998 -69326 -33391
41099 -33391 -15006 -6499 36309 106064 112642 -6487 -178370 -257861 -191254 -66238 5804
41088 5804 10114 8779 38979 77539 97826 108415 112369 72431 -34922 -152937 -189165 -126144
$$ packed form
41170D7646j19515n1246M6082O3521M5689M7832L4890j4833m9699m5394m2976
41159c8003m7929j4708L8271L0177l4641n8095j9916q869m1090j2587R7542J44874
41147C5026M6239o1413k2912R3064J05751l267q2824m5614K9291L2545l6496r0470
41135a080o0698L0730Q7194L8313o9715j20644p0770Q504M1267L2978K2190J6401
41123d5330J1543J4793J5273j0480m0732k4092K5246K9482k4505n0325k192M4673
41111e6646J9399k6880j2252L9308M5752k5l6388l6639k3045m582K2672L5935
41099c3391J8385Q507M2808O9755O578j19129j71883p9491O6607J25016P2042
41088E804M310j335L0200L8560K0287J0589L954l9938j07353j18015l6228O3021
$$ plain form
41076 -126144 -38100 5091 -783 -32130 -73210 -96442 -72332 -28720 -36382 -97564 -115731 -30522
41064 -30522 79830 102852 49849 24257 59769 83995 49915 21010 83679 215399 288283
41053 288283 212067 52805 -26241 40917 133205 107262 13472 36887 217987 366514 317161
41042 317161 153678 75434 126828 183281 158592 100201 85769 125581 178869 202139 180977
41031 180977 157881 203931 316024 383554 317842 171179 59491 13670 -14938 -50162 -83521
41020 -83521 -130026 -194481 -217085 -152888 -71997 -71938 -119438 -100477 -10802 33935 -18509 -90990
41008 -90990 -113031 -103973 -93297 -72614 -64168 -127597 -247697 -311372 -254481 -151986 -104932 -108483
40996 -108483 -93622 -43422 -2043 1828 -11948 -9715 14149 29693 9607 -21443 -11234 24549
$$ packed form
41076a26144Q8044M3191n874l1347m1080k3232K4110M3612p662o1182j8167Q5209
41064c0522J10352K3022n3003k5592L5512K4226l4080k8905O2669J31720P2884
41053B88283p6216j59262p9046O7158R2288k5943r3790K3415J81100J48527m9353
41042C17161j63483p8244N1394N6453k4689n8391j4432L9812N3288K3270k1162
41031A80977k3096M6050J12093O7530o5712j46663j11688m5821k8608l5224l3359
41020h3521m6505o4455k2604O4197Q0891N9m7500J8961Q9675M4737n2444p2481
41008i0990k2041R058J0676K0683Q446o3429j20100o3675N6891J02495M7054l551
40996a08483J4861N0200M1379L871j3776K233K3864J5544k0086l1050J0209L5783
$$ plain form
40984 24549 -6163 -127409 -212285 -141157 13538 84322 53698 56804 146346 210881 159463
40973 159463 47516 -34384 -76938 -96711 -69874 8841 78607 79958 10019 -111833 -253810
40962 -253810 -334211 -277881 -136235 -44327 -34560 -16871 28338 -4269 -138780 -221904 -149571
40951 -149571 -49822 -91963 -219531 -241408 -127247 -42330 -100648 -226735 -282507 -227210 -122220
40940 -122220 -43627 -14532 6002 67222 152262 194266 174196 138346 101429 22503 -84764
40929 -84764 -126163 -78558 -54735 -121278 -164131 -66830 73885 75338 -50261 -122746 -75779
40918 -75779 -23561 -31128 -5175 118458 233586 213454 98179 27092 50040 103396 132399
40907 132399 143067 142847 108438 31030 -50682 -83684 -48767 32280 121126 181693 183459 111405
$$ packed form
40984B4549l0712j21246q4876P1128J54695P0784l0624L106Q9542O4535n1418
40973A59463j11947q1900m2554j9773K6837P8715O9766J351o9939j21852j41977
40962b53810q0401N6330J41646R1908R767J7689M5209l2607j34511q3124P2333
40951a49571R9749m2141j27568k1877J14161Q4917n8318j26087n5772N5297J04990
40940a22220P8593K9095K0534O1220Q5040M2004k0070l5850l6917p8926j07267
40929h4764m1399M7605K3823o6543m2853R7301J40715J453j25599p2485M6967
40918g5779N2218p567K5953J23633J15128k0132j15275p1087K2948N3356K9003
40907A32399J0668k20l4409p7408q1712l3002L4917Q1047Q8846O0567J766p2054
$$ plain form
40895 111405 -7119 -97325 -95405 -24636 16523 -37146 -144670 -214732 -208544 -159048 -110349
40884 -110349 -75574 -48929 -29549 -27381 -53725 -102038 -140203 -140614 -116090 -98192 -84057 -48545
40872 -48545 -10589 -24059 -77865 -72934 48120 199810 249410 182099 99511 69335 54702
40861 54702 6812 -41343 -18753 79978 183522 231607 231789 213354 164449 62703 -47617
40850 -47617 -77354 -11500 56541 49022 2570 -9325 11953 32096 75368 167061 225740 141371
40838 141371 -45254 -162869 -120569 10440 131496 211408 229700 157857 43822 914
40828 914 60006 128381 130087 82496 8764 -94763 -164837 -93554 89416 201441 153319 66753
40816 66753 57876 64013 7684 -26927 52893 147271 103717 -30875 -86907 -40592 -20695 -80022
$$ packed form
40895A11405j18524r0206J920P0769M1159n3669j07524p0062O188M9496M8699
40884a10349L4775K6645J9380K168k6344m8313l8165m11K4524J7898J4135L5512
40872d8545L7956j3470n3806M931J21054J51690M9600o7311q2588l0176j4633
40861E4702m7890m8155K2590R8731J03544M8085J82j8435m8905j01746j10320
40850d7617k9737O5854O8041p519m6452j1895K1278K0143M3272R1693N8679q4369
40838A41371j86625j17615M2300J31009J21056P9912J8292p1843j14035m2908
40828I14N9092O8375J706m7591p3732j03527p0074P1283J82970J12025m8122q6566
40816F6753q877O137n6329l4611P9820R4378m3554j34592n6032M6315J9897n9327
$$ plain form
40804 -80022 -136131 -134150 -114378 -106362 -81877 -29092 22925 59494 87429 102137 107128 126816
40792 126816 145704 104580 19210 1990 77913 98781 -38342 -211164 -261626 -241309 -280545
40781 -280545 -324896 -229962 -44954 42192 7666 146 58769 62778 -21502 -72796 -31559 23053
40769 23053 50910 104746 167602 138299 25675 -40031 -33721 -66056 -139435 -102913 68760
40758 68760 180415 111397 -9221 -47354 -72146 -167365 -234299 -170068 -80757 -117305 -223071
40747 -223071 -239132 -160601 -97580 -62011 14036 99695 89107 -16610 -107124 -131559 -132712
40736 -132712 -120034 -40568 104802 218155 210486 97222 -24388 -66382 -31896 -18932 -106498
40725 -106498 -237208 -281031 -213908 -129509 -63156 55382 226885 316839 256695 170805 188133
$$ packed form
40804h0022n6109J981J9772Q016K4485N2785N2017L6569K7935J4708M991J9688
40792A26816J8888m1124q5370j7220P5923K0868j37123j72822n0462K0317l9236
40781b80545m4351R4934J85008Q7146l4526p520N8623M009q4280n1294M1237N4612
40769B3053K7857N3836O2856k9303j12624o5706O310l2335p3379L6522J71673
40758F8760J11655o9018j20618l8133k4792r5219o6934O4231Q9311l6548j05766
40747b23071j6061P8531O3021L5569P6047Q5659j0588j05717r0514k4435j153
40736a32712J2678P9466J45370J13353p669j13264j21610m1994L4486J2964q7566
40725a06498j30710m3823O7123Q4399O6353J18538J71503Q9954o0144q5890J7328
$$ plain form
40714 188133 251079 236422 150576 67025 -23170 -146296 -224552 -181688 -96305 -91403 -141202
40703 -141202 -151936 -161556 -264173 -382152 -329851 -109076 59367 37383 -68654 -98299 -37191
40692 -37191 36728 78686 76745 23946 -45408 -66116 -31606 -2762 -1202 23511 88476 124718
40680 124718 75734 -19932 -89398 -113401 -115747 -112002 -101695 -78265 -32729 18877 18883 -65990 -166294
40667 -166294 -167694 -59371 41608 33963 -60329 -153779 -196481 -185820 -123966 -17008 98947
40656 98947 165420 142437 42965 -68688 -125132 -115317 -81923 -52740 -5331 85343 202669
40645 202669 310233 371330 331379 156764 -67427 -166987 -82669 31921 11424 -92843
40635 -92843 -105137 6631 98016 68792 -21919 -75427 -68120 -21492 36742 53284 -14285 -115105
$$ packed form
40714A88133O2946j4657q5846q3551r0195j23126p8256M2864Q5383M902m9799
40703a41202j0734r620j02617j17979N2301K20775J68443k1984j06037k9645O1108
40692c7191P3919M1958j941n2799o9354k0708L4510K8844J560K4713O4965L6242
40680A24718m8984r5666o9466k4003k346L745J0307K3430M5536N1606Oq4873j00304
40667a66294j400J08323J00979p645r4292r3450m2702J0661O1854J06958J15955
40656I8947O6473k2983r9472j11653n6444R815L3394K9183M7409R0674J17326
40645B02669J07564O1097l9951j74615k24191r9560Q4318J14590k0497j04267
40635i2843j2294J11768R1385k9224r0711n3508P307M6628N8234J6542o7569j00820
$$ plain form
40623 -115105 -147450 -101778 -64033 -57592 -570 132278 225605 184358 82807 50894 80191
40612 80191 58994 -31487 -76026 3157 126724 159245 79589 -6040 -6805 51219 84685 70966
40600 70966 55688 59439 48328 16804 28122 120576 227009 252755 197541 135992 109935 108044
40588 108044 119375 127988 81760 -41939 -154704 -141567 -29676 29521 -32089 -107708 -73343
40577 -73343 47110 133334 127073 77972 60625 94040 137581 147916 139668 171914 253628 300482
40565 300482 240062 126606 72595 85905 68433 -26185 -135297 -201960 -241591 -261247 -218330
40554 -218330 -116023 -45243 -58340 -79692 -24877 56755 54586 -31188 -91657 -68989 -19772
40543 -19772 -7555 -9705 36127 137984 232211 240682 137428 -18752 -116412 -88884 7223
$$ packed form
40623a15105l2345M5672L7745O441N7022J32848R3327m1247j01551l1913K9297
40612H0191k1197r0481m4539P9183J23567L2521p9656q5629p65N8024L3466j3719
40600G0966j5278L751j1111l1524J1318R2454J06433K5746n5214o1549k6057j891
40588A08044J1331Q613m6228j23699j12765J3137J11891N9197o1610p5619L4365
40577g3343J20453Q6224o261m9101j7347L3415M3541J0335q248L2246Q1714M6854
40565C00482o0420j13456n4011J3310j7472r4618j09112o6663l9631j9656M2917
40554b18330J02307P0780j3097k1352N4815Q1632k169q5774o0469K2668M9217
40543a9772J2217k150M5832J01857R4227Q471j03254j56180r7660K7528R6107
$$ plain form
40532 7223 39836 -50670 -174812 -197731 -105955 -23431 -51066 -142251 -178712 -128212 -57721 -7491
40520 -7491 58664 154915 206826 139325 -14725 -143116 -162268 -68955 72544 166041 157126
40509 157126 102301 107840 175126 189950 104447 19899 13681 1990 -107088 -228937 -223651 -122792
40497 -122792 -63588 -55169 -2146 73667 51232 -45567 -48650 60054 81007 -78319 -220710
40486 -220710 -148388 34381 86229 -22883 -115510 -86355 5038 89245 163968 209350 170926
40475 170926 64491 -5147 27207 107357 140120 95023 11016 -61721 -101445 -119803 -140007
40464 -140007 -162248 -159687 -119696 -69735 -46065 -57661 -94128 -139501 -162639 -133126 -72804 -52136
40452 -52136 -100668 -156874 -149601 -101554 -101646 -183391 -275358 -283660 -201765 -121096 -126052 -185304 -178691
$$ packed form
40532G223L2613r0506j24142k2919R1776Q2524k7635r1185l6461N0500P0491N0230
40520g491O6155R6251N1911o7501j54050j28391j9152R3313J41499R3497q915
40509A57126n4825N539O7286J4824q5503q4548o218j1691j09078j21849N286J00859
40497a22792N9204Q419N3023P5813k2435r6799l083J08704K0953j59326j42391
40486b20710P2322J82769N1848j09112r2627K9155R1393Q4207P4723M5382l8424
40475A70926j06435o9638L2354Q0150L2763m5097q4007p2737l9724j8358k0204
40464a40007k2241K561L9991M9961K3670j1596l6467m5373k3138K9513O0322K0668
40452e2136m8532n6206P273M8047r2q1745r1967q302Q1895Q0669m956n9252O613
$$ plain form
40439 -178691 -52711 90151 109201 5869 -84016 -69318 3606 45831 32977 -10929 -65410
40428 -65410 -106774 -101105 -45971 13254 33222 9555 -41269 -94238 -109222 -66577 -13342 -16411
40416 -16411 -69024 -108007 -117298 -130379 -132147 -67136 30978 33909 -102781 -255031 -290513 -228601
40404 -228601 -170196 -146988 -124482 -96686 -90398 -104112 -107847 -85888 -42811 4588 20679 -17849
40392 -17849 -66683 -48808 36114 103906 103889 66155 16340 -56934 -122216 -107191 -27143 5652
40380 5652 -41600 -62875 -4885 21384 -67749 -155498 -90339 72247 153833 111261 48396 12904
40368 12904 -52296 -160786 -232921 -213955 -131825 -25492 86723 159808 138437 40936 -44375
40357 -44375 -59812 -22446 24834 50527 36077 -4344 -22053 -1283 -798 -74872 -184249 -241151
$$ packed form
40439a78691J25980J42862J9050j03332q9885J4698P2924M2225j2854m3906n4481
40428f5410m1364N669N5134N9225J9968k3667n0824n2969j4984M2645N3235l069
40416a6411n2613l8983r291j3081j768O5011R8114K931j36690j52250l5482O1912
40404b28601N8405K3208K2506K7796O288j3714l735K1959M3077M7399J6091l8528
40392a7849m8834J7875Q4922O7792j7l7734m9815p3274o5282J5025Q0048L2795
40380E652m7252k1275N7990K6269q9133q7749O5159J62586Q1586m2572o2865l5492
40368A2904o5200j08490p2135J8966Q2130J06333J12215P3085k1371r7501q5311
40357d4375j5437L7366M7280K5693j4450m0421j7709K0770M85p4074j09377n6902
$$ plain form
40345 -241151 -211819 -127287 -36467 3146 -53629 -168346 -228373 -188432 -134048 -141428 -162960
40334 -162960 -135902 -107643 -141680 -188598 -179658 -167806 -230598 -302758 -266857 -161326 -131749
40323 -131749 -205763 -278539 -298144 -299283 -267486 -143934 27092 118714 104067 67792 33011
40312 33011 -54551 -157886 -151283 -34853 33901 -14845 -60777 -15352 26290 -32898 -108265
40301 -108265 -69621 48677 115763 109902 122867 197658 273603 278745 198146 63583 -65318
40290 -65318 -121891 -79511 24378 122681 160891 118992 37521 8285 76702 165100 164288 82864
40278 82864 15705 -15558 -72352 -152369 -168775 -102331 -43319 -40963 -37330 864 14202 -23499
40266 -23499 -37707 14247 64611 71806 113002 239038 350377 336408 243359 178456 130129
$$ packed form
40345b41151K9332Q4532R0820L9613n6775j14717o0027L9941N4384p380k1532
40334a62960K7058K8259l4037m6918Q940J1852o2792p2160L5901J05531K9577
40323a31749p4014p2776j9605j139L1797J23552J71026R1622j4647l6275l4781
40312C3011q7562j03335O603J16430O8754m8746m5932M5425M1642n9188p5367
40301a08265L8644J18298O7086n861J2965P4791P5945N142q0599j34563j28901
40290f5318n6573M2380J03889R8303L8210m1899q1471k9236O8417Q8398q12q1424
40278H2864o7159l1263n6794q0017j6406O6444N9012K356L633L8194J3338l7701
40266b3499j4208N1954N0364P195M1196J26036J11339j3969r3049o4903m8327
$$ plain form
40255 130129 20678 -124726 -205696 -209073 -210309 -230020 -213878 -154323 -119884 -149197 -205571
40244 -205571 -248815 -274535 -275646 -241088 -200856 -197504 -201820 -135131 -556 83952 32150 -84393
40232 -84393 -115735 -12036 135539 225084 253249 270697 282027 251578 190830 165808 200159
40221 200159 239213 246738 269322 344704 406617 363373 231974 109511 41955 7366 -2570
40210 -2570 15779 18030 -38431 -97566 -67581 29553 87776 85022 88837 99009 41571 -60896
40198 -60896 -84185 -18724 -18516 -149762 -253420 -176284 -3547 76058 36366 7530 72160
40187 72160 187386 260910 215972 42571 -139145 -150876 19432 157532 90905 -79493
40177 -79493 -140474 -67641 -11840 -50591 -122306 -180011 -244973 -298492 -262150 -119726 40094
$$ packed form
40255A30129j09451j45404q0970l377j236j9711J6142N9555L4439k9313n6374
40244b05571m3244k5720j111L4558M0232L352m316O6689J34575Q4508n1802j16543
40232h4393l1342J03699J47575Q9545K8165J7448J1330l0449o0748k5022L4351
40221B00159L9054P525K2584P5382O1913m3244j31399j22463o7556l4589r936
40210b570J8349K251n6461n9135K9985R7134N8223k754L815J0172n7438j02467
40198f0896k3289O5461K08j31246j03658P7136J72737P9605l9692k8836O4630
40187G2160J15226P3524m4938j73401j81716j1731J70308J38100o6627j70398
40177g9493o0981P2833N5801l8751p1715n7705o4962n3519L6342J42424J59820
$$ plain form
40166 40094 126703 121348 51443 -31686 -58612 -4530 62142 63543 20297 -1767 -16105 -84272
40154 -84272 -182808 -214478 -151991 -66385 -6930 45046 91211 90176 44111 15972 22564 -4154
40142 -4154 -102507 -203002 -223330 -186586 -181402 -235131 -286367 -276443 -220290 -172495 -151432 -125770
40130 -125770 -73078 -17059 17269 54476 126165 195246 188031 102851 18643 -13022 -11114 8277
40118 8277 55355 90768 33514 -100950 -173703 -108794 -13554 -23853 -112858 -155098 -110467 -35311
40106 -35311 34913 103022 147465 142791 115658 102114 91082 82228 131208 241496 285517 159365
40094 159365 -38148 -115874 -43583 38729 37187 -9358 -48660 -84833 -117831 -125030 -111780 -90329
40082 -90329 -28058 81508 132538 24488 -155691 -214329 -108979 21277 83022 121248 160826
$$ packed form
40166D0094Q6609n355o9905q3129k6926N4082O6672J401m3246k2064j4338o8167
40154h4272r8536l1670O2487Q5606N9455N1976M6165j035m6065k8139O592k6718
40142d154r8353j00495k0328L6744N184n3729n1236R924N6153M7795K1063K5662
40130a25770N2692N6019L4328L7207P1689O9081p215q5180q4208l1665J908J9391
40118H277M7078L5413n7254j34464p2753O4909R5240j0299q9005m2240M4631P5156
40106c5311P0224O8109M4443m674k7133j3544j1032q854M8980J10288M4021j26152
40094A59365j97513p7726P2291Q2312j542m6545l9302l6173l2998p199J3250K1451
40082i0329O2271J09566N1030j08050j80179n8638J05350J30256O1745L8226L9578
$$ plain form
40071 160826 129178 5259 -99049 -90670 -17878 30297 44820 50537 40040 22770 45402
40060 45402 94532 74885 -38354 -118831 -53218 90257 155337 99086 87 -85641 -165191
40049 -165191 -224125 -211960 -134031 -76576 -96891 -135443 -89302 39345 120105 46615 -120106
40038 -120106 -212049 -150005 -15771 78361 109143 97096 38253 -45224 -72087 -17694 9985
40027 9985 -78249 -193968 -195690 -110643 -72315 -78722 -479 171933 280746 237003 130720
40016 130720 56148 -4610 -61121 -48258 30499 48646 -50869 -150485 -156998 -164752 -282289 -419866
40004 -419866 -413130 -271000 -135469 -58831 10841 64983 34602 -45928 -42542 73016 156716
39993 156716 88769 -65402 -152769 -115488 -15466 66481 92706 63930 12231 -9368 27667
$$ packed form
40071A60826l1648j23919j04308Q379P2792M8175J4523N717j0497j7270K2632
40060D5402M9130j9647j13239q0477O5613J43475O5080n6251r8999q5728p9550
40049a65191n8934J2165P7929N7455k0315l8552M6141J28647Q0760p3490j66721
40038a20106r1943O2044J34234R4132L0782j2047n8843q3477k6863N4393K7679
40027I985q8234j15719j722Q5047L8328o407P8243J72412J08813m3743j06283
40016A30720p4572o0758n6511J2863P8757J8147r9515r9616o513p754j17537j37577
40004d19866O736J42130J35531P6638O9672N4142l0381q0530L386J15558Q3700
39993A56716o7947j54171q7367L7281J00022Q1947K6225k8776n1699k1599L7035
$$ plain form
39982 27667 89001 108607 60678 -17045 -71624 -84488 -65154 -23385 23785 36873 -7192 -62137
39970 -62137 -52529 18528 60683 24701 -22843 -21 76335 139509 178564 216114 227805 175424
39958 175424 89661 31591 -282 -37333 -52710 -11016 28206 -16732 -89918 -50566 105657
39947 105657 217419 181061 74240 13153 8372 20469 48388 88834 91511 25715 -65856
39936 -65856 -126815 -147541 -140347 -116084 -101830 -113970 -108603 -38234 47137 55713 6426 5531 65758
39923 65758 85308 25993 -36934 -77726 -170723 -315086 -368822 -249362 -63713 53480 102104
39912 102104 126493 103028 30272 2572 68262 127415 94321 45309 66758 72953 -53194
39901 -53194 -224571 -243710 -91573 52299 68631 24717 31520 101956 177172 203130 162463
$$ packed form
39982B7667O1334J9606m7929p7723n4579j2864J9334M1769M7170J3088m4065n4945
39970f2137R608P1057M2155l5982m7544K2822P6356O3174L9055L7550J1691n2381
39958A75424q5763n8070l1873l7051j5377M1694L9222m4938p3186L9352J56223
39947A05657J11762l6358j06821o1087m781J2097K7919M0446K677o5796r1571
39936f5856o0959k0726P194K4263J4254j2140N367P0369Q5371Q576m9287q95O0227
39923F5758J9550n9315o2927m0792r2997j44363n3736J19460J85649J17193M8624
39912A02104K4389k3465p2756k7700O5690N9153l3094m9012K1449O195j26147
39901e3194j71377j9139J52137J43872J6332m3914O803P0436P5216K5958m0667
$$ plain form
39890 162463 93598 76742 146780 236376 256702 208663 164723 172373 221120 267462 254528 156024
39878 156024 33555 -13890 11388 1127 -88427 -165618 -157084 -115732 -98193 -53769 62303
39867 62303 171734 183627 130139 80401 13527 -99495 -176360 -123517 10550 110142 160831
39856 160831 223435 298747 334862 317773 259192 162774 85542 126984 253879 266893 80981
39845 80981 -97595 -51474 117629 151178 22169 -79200 -78343 -77101 -108652 -87937 -22041
39834 -22041 -34018 -134105 -175652 -93332 -148 10460 -8978 7626 31299 25293 17544 34741
39822 34741 64656 105528 154514 156159 79468 21475 92445 224446 256981 189382 161032 190650
39810 190650 145737 -6987 -132095 -152476 -145105 -153501 -104096 16152 89696 63806 39219
$$ packed form
39890A62463o8865j6856P0038Q9596K0326m8039m3940P650M8747M6342j2934r8504
39878A56024j22469m7445K5278j0261q9554p7191Q534M1352J7539M4424J16072
39867F2303J09431J1893n3488m9738o6874j13022p6865N2843J34067R9592N0689
39856A60831O2604P5312L6115j7089n8581r6418p7232M1442J26895J3014j85912
39845H0981j78576M6121J69103L3549j29009j01369Q57J242l1551K0715O5896
39834b2041j1977j00087m1547Q2320R3184J0608j9438J6604K3673o006p749J7197
39822C4741K9915M0872M8986J645p6691n7993P0970J32001L2535o7599k8350K9618
39810A90650m4913j52724j25108k0381P371q396M9405J20248P3544k5890k4587
$$ plain form
39799 39219 73309 69843 -30432 -114487 -72482 30454 73314 49062 14774 -9781 -2681 79120
39787 79120 191075 199536 78600 -20208 12954 89929 85024 17146 -35259 -68488 -87985 -37618
39775 -37618 82691 149851 92234 14273 25447 70170 57692 26896 32432 5309 -94132 -116966
39763 -116966 60817 264873 212941 -63936 -239915 -141798 53594 117966 58958 16228
39753 16228 31421 43504 22696 1455 6542 25086 28028 7912 3261 64938 167073 194794
39741 194794 86288 -50554 -51357 93866 235262 261939 210169 163538 141622 123393 106235
39730 106235 95216 79958 57276 43940 45953 47404 44185 53390 73462 71149 31274 -9304
39718 -9304 -6353 28780 39752 -3328 -67800 -102801 -97397 -69386 -12325 96734 226082 284863
$$ packed form
39799C9219L4090l466j00275q4055M2005J02936M2860k4252l4288k4555P100Q1801
39787G9120J11955Q461j20936r8808L3162P6975m905o7878n2405l3229j9497N0367
39775c7618J20309O7160n7617p7961J1174M4723j2478l0796N536k7123r9441k2834
39763a16966J77783K04056n1932k76877j75979R8117J95392O4372n9008m2730
39753A6228J5193J2083k0808k1241N087J8544K942k0116m651O1677J02135K7721
39741A94794j08506j36842q03J45223J41396K6677n1770m6631k1916j8229j7158
39730A06235j1019j5258k2682j3336K013J451l219R205K0072k313l9875m0578
39718i304K951L5133J0972m3080o4472l5001N404K8011N7061J09059J29348N8781
$$ plain form
39706 284863 233965 156281 156358 222315 255061 208870 125890 49818 -5981 -10977 63893 166857
39694 166857 198265 148865 119602 173257 249037 262653 215150 158889 119862 94985 73872
39683 73872 35814 -23328 -51497 4844 100299 128409 71686 20389 25133 37963 29866 48896
39671 48896 107704 125239 52086 -40547 -68327 -43515 -10023 40087 107664 129767 69194 -8772
39659 -8772 -30117 -18059 -29546 -51852 -41634 -7237 23946 61645 102220 84057 -23425 -137110
39647 -137110 -150248 -69922 4047 3404 -62431 -145693 -192515 -172610 -118618 -97013 -115519 -116456
39635 -116456 -80135 -54295 -53158 -22789 48510 81940 26153 -65950 -131209 -174143 -199488 -168863
39623 -168863 -84422 -15591 12203 46487 78735 25554 -95562 -131562 -33659 29949 -70264
$$ packed form
39706B84863n0898p7684P7O5957L2746m6191q2980p6072n5799m996P4870J02964
39694A66857L1408m9400k9263N3655P5780J3616m7503n6261l9027k4877k1113
39683G3872l8058n9142k8169N6341R5455K8110n6723n1297M744J2830q097J9030
39671D8896N8808J7535p3153r2633k7780K4812L3492N0110O7577K2103o0573p7966
39659h772k1345J2058j1487k2306J0218L4397L1183L7699M0575j8163j07482j13685
39647a37110j3138Q0326P3969o43o5835q3262m6822J9905N3992K1605j8506r37
39635a16456L6321K5840J137L0369P1299L3430n5787r2103o5259m2934k5345L0625
39623a68863Q4441O8831K7794L4284L2248n3181j21116l6000R7903O3608j00213
$$ plain form
39612 -70264 -212794 -224024 -144317 -110799 -99799 -1996 128556 126593 -15926 -136422 -148541
39601 -148541 -121999 -112629 -82224 -13614 36982 40333 39736 65867 87157 63884 -5147 -88709
39589 -88709 -138300 -128066 -109097 -159644 -248094 -246001 -133050 -63467 -138584 -243499 -227577
39578 -227577 -120668 -31289 46690 162939 254460 236712 163590 126718 82730 -45503 -187771
39567 -187771 -234499 -236665 -296860 -346943 -255411 -85163 -10686 -34161 -24312 10484 -51078 -167025
39555 -167025 -153685 5554 131580 154510 191619 279566 284979 151614 493 -94799 -208051
39544 -208051 -352003 -393641 -283183 -164249 -143232 -137008 -64663 -5111 -28672 -36161 82173
39533 82173 252037 322064 272286 196042 151898 134675 129043 112430 58213 -16409 -63061 -77146
$$ packed form
39612g0264j42530j1230P9707L3518J1000R7803J30552j963j42519j20496j2119
39601a48541K6542R370L0405O8610N0596L351n97K6131K1290k3273o9031q3562
39589h8709m9591J0234J8969n0547q8450K093J12951O9583p5117j04915J5922
39578b27577J06909Q9379P7979J16249R1521j7748p3122l6872m3988j28233j42268
39567a87771m6728k166o0195n0083R1532J70248P4477k3475R849L4796o1562j15947
39555a67025J3340J59239J26026K2930L7109Q7947N413j33365j51121r5292j13252
39544b08051j43952m1638J10458J18934K1017O224P2345N9552k3561p489J18334
39533H2173J69864P0027m9778p6244m4144j7223n632j6613n4217p4622m6652j4085
$$ plain form
39521 -77146 -81155 -39311 98216 267068 335750 288875 230269 204823 169172 135656 165186
39510 165186 204603 127794 -29687 -81885 12982 78441 5864 -95158 -112098 -84756 -54668
39499 -54668 24592 117649 67300 -140701 -280886 -205218 -56646 -7312 6616 93206 147313
39488 147313 28158 -154412 -188291 -96817 -82873 -197982 -299150 -304014 -275074 -252543 -189820
39477 -189820 -75816 22288 58325 45047 -1881 -64784 -89486 -39568 39311 84457 104035
39466 104035 128697 136793 111325 105236 155747 194979 141725 26020 -65566 -105413 -99982 -26818
39454 -26818 102586 189377 163568 88810 51351 21064 -63711 -151294 -151362 -95976 -87596 -127368
39442 -127368 -130993 -89045 -78916 -123886 -156889 -130440 -71076 -22690 -9770 -46874 -114894 -142360
$$ packed form
39521g7146m009M1844J37527J68852O8682m6875n8606k5446l5651l3516K9530
39510A65186L9417p6809j57481n2198R4867O5459p2577j01022j6940K7342L0088
39499e4668P9260R3057n0349k08001j40185P5668J48572M9334J3928Q6590N4107
39488A47313j19155j82570l3879R1474J3944j15109j01168m864K8940K2531O2723
39477a89820J14004R8104L6037j3278m6928o2903k4702M9918P8879M5146J9578
39466A04035K4662Q096k5468o089N0511L9232n3254j15705r1586l9847N431P3164
39454b6818J29404Q6791k5809p4758l7459l0287q4775q7583o8N5386Q380l9772
39442a27368l625M1948J0129m4970l3003K6449N9364M8386J2920l7104o8020k7466
$$ plain form
39430 -142360 -75939 44380 134096 165302 169995 171964 165572 139161 84880 12879 -29112 1051
39418 1051 66174 82669 35862 -12576 -31449 -37483 -12414 69093 126033 42897 -123790 -189774
39406 -189774 -133096 -132849 -247050 -287084 -143969 -5777 -55917 -154749 -61302 174868 301610
39395 301610 251728 187829 202153 208371 138522 55341 37027 80147 130155 120232 7860 -146057
39383 -146057 -193859 -84791 45457 60332 -3135 -50085 -92683 -160316 -171889 -70235 23472
39372 23472 -24353 -130561 -122497 -12623 50305 30103 -1431 -50903 -165273 -254433 -180634
39361 -180634 -8032 57356 -19519 -59631 37759 154117 148662 35937 -83832 -148064 -146880
39350 -146880 -105044 -62227 -13476 89500 219158 253920 176515 159981 308065 444751 357233
$$ packed form
39430a42360O6421J20319Q9716L1206M693J969o392k6411n4281p2001m1991L0163
39418A051O5123J6495m6807m8438j8873o034K5069Q1507N6940q3136j66687o5984
39406a89774N6678K47j14201m0034J43115J38192n0140r8832R3447K36170J26742
39395C01610m9882o3899J4324O218o9849q3181j8314M3120N0008r923j12372j53917
39383a46057m7802J09068J30248J4875o3467m6950m2598o7633j1573J01654R3707
39372B3472m7825j06208Q064J09874O2928k0202l1534m9472j14370q9160P3799
39361a80634J72602O5388p6875m0112R7390J16358n455j12725j19769o4232J184
39350a46880M1836M2817M8751J02976J29658L4762p7405j6534J48084J36686q7518
$$ plain form
39339 357233 130362 13857 54157 104218 119542 174043 228849 163208 20787 -40127 -34784
39328 -34784 -123363 -294535 -358329 -278483 -226436 -254686 -203763 -17038 129676 130124 128331 256245
39316 256245 404726 409155 295068 199645 182175 220190 270641 255113 111540 -78684 -150750
39305 -150750 -86744 -32363 -48909 -32505 64364 125601 68403 -29744 -84822 -116988 -127938
39294 -127938 -43930 127002 246908 245866 206552 175397 75013 -99030 -188067 -107454 -5335
39283 -5335 -44484 -168056 -215529 -143641 -9433 143060 262848 278482 213438 198530 275524
39272 275524 320987 261565 212965 282261 378591 366395 283983 258914 308046 369766 448858
39261 448858 580752 710057 736021 645386 509746 392283 321341 297471 272967 193073 94982
$$ packed form
39339C57233k26871j16505M0300N0061J5324N4501N4806o5641j42421o0914N343
39328c4784q8579j71172o3794P9846N2047k8250N0923J86725J46714M48j793J27914
39316B56245J48481M429j14087r5423j7470L8015N0451j5528j43573j90224p2066
39305a50750O4006N4381j6546J6404R6869O1237n7198r8147n5078l2166j0950
39294a27938Q4008J70932J19906j042l9314l1155j00384j74043q9037Q0613J02119
39283e335l9149j23572m7473P1888J34208J52493J19788J5634o5044j4908P6994
39272B75524M5463n9422m8600O9296R6330j2196q2412k5069M9132O1720P9092
39261D48858J31894J29305K5964r0635j35640j17463p0942k3870k4504p9894r8091
$$ plain form
39250 94982 77238 142563 186497 174087 186874 246934 254679 175764 125485 167023 182869 70631
39238 70631 -70707 -86665 9719 90921 103756 91037 97167 140806 210583 231727 133267 -7799
39226 -7799 -17676 126265 246562 229653 173783 186916 210856 163091 93487 68837 43858 -23264
39214 -23264 -61310 -17457 34357 36508 58604 141338 178183 92159 -12900 -24197 -3528 -47573
39202 -47573 -102712 -81765 -38108 -57926 -96425 -82941 -73701 -140231 -222011 -248235 -281330 -372441
39190 -372441 -405718 -274056 -88942 -17775 -23842 26110 101680 82011 7621 24944 125324
39179 125324 158911 85563 12478 -7463 -33338 -89437 -114147 -64675 38387 157914 246555
39168 246555 251977 191060 144373 113428 7672 -147966 -168483 -1697 126840 44120 -83464
$$ packed form
39250I4982j7744O5325M3934j2410J2787O0060P745p8915n0279M1538J5846j12238
39238G0631j41338j5958R6384Q1202J2835j2719O130M3639O9777K1144r8460j41066
39226g799r877J43941J20297j6909n5870J3133K3940m7765o9604k4650k4979o7122
39214b3264l8046M3853N1814K151K2096Q2734L6845q6024j05059j1297K0669m4045
39202d7573n5139K0947M3657j9818l8499J3484R240o6530q1780k6224l3095r1111
39190c72441l3277J31662J85114P1167o067M9952P5570j9669p4390J7323J00380
39179A25324L3587p3348p3085j9941k5875n6099k4710M9472J03062J19527Q8641
39168B46555N422o0917m6687l0945j05756j55638k0517J66786J28537q2720j27584
$$ plain form
39157 -83464 -21014 151038 196873 128307 141326 243295 264619 200672 227011 369334 448279
39146 448279 384740 297835 255898 177381 41913 -25139 37660 114671 87528 -18543 -113387
39135 -113387 -144085 -95773 -6508 22350 -52503 -117531 -57526 46320 36296 -64767 -109269
39124 -109269 -85493 -103920 -156644 -129445 -51676 -90641 -265432 -394165 -375502 -311729 -294941
39113 -294941 -272342 -194339 -114521 -68717 -14907 45355 42028 -11595 895 108308 193165
39102 193165 184798 163407 201671 237208 181055 48023 -83446 -153978 -128803 -9310 135298
39091 135298 227624 274817 321407 341910 291694 226489 232380 262561 191796 17595 -139299
39080 -139299 -216573 -241670 -206979 -82976 56430 94987 57572 63276 102381 44397 -122355
$$ packed form
39157h3464O2450J72052M5835o8566J3019J01969K1324o3947K6339J42323P8945
39146D48279o3539q6905m1937p8517j35468o7052O2799P7011k7143j06071r4844
39135a13387l0698M8312Q9265K8858p4853o5028O0005J03846j0024j01063m4502
39124a09269K3776j8427n2724K7199P7769l8965j74791j28733J8663O3773J6788
39113b94941K2599P8003P9818M5804N3810O0262l327n3623J2490J07413Q4857
39102A93165q367k1391L8264L5537n6153j33032j31469p0532K5175J19493J44608
39091A35298R2326M7193M6590K0503n0216o5205N891L0181p0765j74201j56894
39080a39299p7274k5097L4691J24003J39406L8557l7415N704L9105n7984j66752
$$ plain form
39069 -122355 -244707 -227719 -140184 -72604 -42451 -54234 -100178 -93102 46809 235176 306927
39058 306927 250079 199120 213741 234051 232910 230538 183656 54668 -40496 31192 166417
39047 166417 148559 5070 -23329 123158 240903 215383 176797 228956 282915 253649 187235
39036 187235 102258 -66593 -272603 -327125 -169873 28073 117717 133118 128881 70936 -25339
39025 -25339 -52662 8270 54905 61837 105760 158704 106193 13600 85336 287253 327140 126110
39013 126110 -20663 82694 226255 177898 69494 132407 301391 375330 372836 428064 481117
39002 481117 367780 128663 -26785 -7691 108744 246175 362122 381538 275620 157292
38992 157292 153128 230743 266313 214467 114754 16486 -15793 74662 226589 286878 213948
$$ packed form
39069a22355j22352J6988Q7535O7580L0153j1783m5944P076J39911J88367P1751
39058C06927n6848n0959J4621K0310j141k372m6882j28988r5164P1688J35225
39047A66417j7858j43489k8399J46487J17745k5520l8586N2159N3959k9266o6414
39036A87235q4977j68851k06010n4522J57252J97946Q9644J5401m237n7945r6275
39025b5339k7323O0932M6635O932M3923N2944n2511r2593P1736K01917L9887k01030
39013A26110j46773J03357J43561m8357j08404O2913J68984P3939k494N5228N3053
39002D81117j13337k39117j55448J9094J16435J37431J15947J9416j05918j18328
38992A57292m164P7615L5570n1846r9713r8268l2279R0455J51927O0289p2930
$$ plain form
38981 213948 119227 52785 -67857 -235954 -277759 -124474 39724 50814 -1209 32342 114318
38970 114318 145253 162429 235242 309261 323213 339667 402638 414577 311697 208520 210262
38959 210262 237000 190707 133392 138364 134479 65513 28581 79695 85299 -44013 -157049 -101050
38947 -101050 23746 56366 38270 66373 73050 -6306 -30208 122777 294452 286093 195554
38936 195554 226482 312295 247570 78421 36067 154875 260874 281645 278603 228756 68523
38925 68523 -84355 -41829 139696 223701 156948 108087 152676 179214 125675 78270 107150
38914 107150 190428 301493 403989 396919 242618 92825 97875 164410 111728 -20467 -66873
38903 -66873 -54891 -139741 -268894 -223490 -3140 131720 55453 -54847 -27341 64647 73485
$$ packed form
38981B13948r4721o6442j20642j68097m1805J53285J64198J1090n2023L3551Q1976
38970A14318L0935J7176P2813P4019J3952J6454O2971J1939j02880j03177J742
38959B10262K6738m6293n7315M972l885o8966l6932N1114N604j29312j13036N5999
38947a01050J24796L2620j8096K8103O677p9356k3902J52985J71675q359r0539
38936A95554L0928Q5813o4725j69149m2354J18808J05999K0771l042m9847j60233
38925F8523j52878M2526J81525Q4005o6753m8861M4589K6538n3539m7405K8880
38914A07150Q3278J11065J02496p070j54301j49793N050O6535n2682j32195m6406
38903f6873J1982q4850j29153M5404K20350J34860p6267j10300K7506R1988Q838
$$ plain form
38892 73485 1331 -51888 -34992 35519 111455 136423 108136 100602 145843 156469 72819 -856
38880 -856 50780 154519 165427 97096 57726 42184 -18012 -75415 -42180 22172 2360 -58508
38868 -58508 -39291 36320 68161 94404 211506 349781 365350 294394 277314 292984 219638
38857 219638 102032 93228 174720 201247 182669 242178 326890 258711 70196 -7506 85969
38846 85969 165802 129223 81303 87459 67101 -986 -10629 66070 124779 136342 192795 293093
38834 293093 298590 170269 56689 74063 160556 203699 173942 101879 42868 58755 127593
38823 127593 131546 55454 76719 281042 438172 308894 39162 -51410 37120 44459 -72033
38812 -72033 -93464 41436 143654 133233 147875 237202 265525 183525 105068 58766 -51868
$$ packed form
38892G3485p2154n3219J6896P0511P5936K4968k8287p534M5241J0626q3650p3675
38880h56N1636J03739J0908o8331l9370j5542o0196n7403L3235O4352j9812o0868
38868e8508J9217P5611L1841K6243J17102J38275J5569p0956j7080J5670p3346
38857B19638j17606q804Q1492K6527j8578N9509Q4712o8179j88515p7702R3475
38846H5969P9833l6579m7920O156k0358o8087r643P6699N8709J1563N6453J00298
38834B93093N497j28321j13580J7374Q6493M3143k9757p2063n9011J5887O8838
38823A27593L953p6092K1265K04323J57130j29278k69732r0572Q8530P339j16492
38812g2033k1431J34900J02218j0421J4642Q9327K8323q2000p8457m6302j10634
$$ plain form
38801 -51868 -193095 -195027 -54612 36814 19130 35741 132103 168963 97855 47874 75030
38790 75030 85897 60794 94845 177358 185863 122855 101362 98740 4898 -105474 -64171 47362
38778 47362 -7339 -190248 -224479 -65419 55585 79209 190249 389113 426068 261022
38768 261022 171148 283936 404799 428261 525278 806650 1191974 1693495 2377455 2942310
38758 2942310 2856061 2111417 1355731 1043912 943448 723973 514312 521446 564937 417027
38748 417027 247596 317819 516358 571736 477254 377978 276547 147091 99754 163138 154787
38737 154787 10087 -44738 111619 245996 181001 120194 266987 448855 442148 352644 336591
38726 336591 256363 -23716 -286625 -278384 -115257 -24139 55603 248372 388990 282046
$$ packed form
38801e1868j41227j932J40415R1426j7684J6611R6362L6860p1108m9981K7156
38790G5030J0867k5103L4051Q2513Q505o3008k1493k622r3842j10372M1303J11533
38778D7362n4701j82909l4231J59060J21004K3624J11040J98864L6955j65046
38768B61022q9874J12788J20863K3462R7017K81372L85324N01521O83960N64855
38758B942310q6249p44644p55686l11819j00464k19475k09661P134M3491j47910
38748D17027j69431P0223J98539N5378r4482r9276j01431j29456m7337O3384q351
38737A54787j44700n4825J56357J34377o4995o0807J46793J81868o707q9504j6053
38726C36591q0228k80079k62909Q241J63127R1118P9742J92769J40618j06944
$$ plain form
38716 282046 79043 16255 960 -164108 -365916 -377072 -262596 -212925 -171436 -6565
38706 -6565 145569 101619 7607 101157 270278 247135 86327 50435 149083 178791 111919
38695 111919 82296 84548 23919 -39242 -3094 42880 -11919 -54946 31095 94818 -23774
38684 -23774 -160271 -89157 79806 113518 56505 63361 52045 -90115 -175585 -6301 213909
38673 213909 186673 35188 61110 185982 127620 -36950 -9346 151966 123362 -87209
38663 -87209 -154527 -11716 87061 70795 138709 320350 392226 278492 149526 97736 66081
38652 66081 84041 222058 343970 258852 75627 58041 192530 256460 230987 270987 355158
38641 355158 353456 345210 471306 580064 442405 204387 177313 292936 247031 75563 67939
$$ packed form
38716B82046k03003o2788j5295j65068k01808j1156J14476M9671M1489J64871
38706f565J52134m3950r4012R3550J69121k3143j60808l5892R8648K9708o6872
38695A11919k9623K252o0629o3161L6148M5974n4799m3027Q6041O3723j18592
38684b3774j36497P1114J68963L3712n7013O856j1316j42160q5470J69284K20210
38673B13909k7236j51485K5922J24872n8362j64570K7604J61312k8604k10571
38663h7209o7318J42811R8777j6266O7914J81641P1876j13734j28966n1790l1655
38652F6081J7960J38017J21912q5118j83225j7586J34489O3930k5473M0000Q4171
38641C55158j702q246J26096J08758j37659k38018k7074J15623m5905j71468p624
$$ plain form
38630 67939 188902 138881 -48738 -34114 202707 320760 239687 250843 438037 524536 399891
38619 399891 292519 304096 255139 109754 84213 210402 242763 119307 75009 183150
38609 183150 224692 131881 122966 267753 347698 281308 270733 388593 426892 300669 214307
38598 214307 284237 358355 334978 316963 351798 355044 352531 451690 547962 437989 226884
38587 226884 204111 321815 267139 59635 53156 289882 398245 238594 108536 163548
38577 163548 167087 -2352 -104300 -1557 95057 45865 5283 49094 20488 -83602 -20316
38566 -20316 233883 368290 252439 123538 111924 45010 -118591 -140333 36884 151245
38556 151245 117193 177359 390661 470602 321445 227394 307805 300050 98448 -16282 80197
$$ packed form
38630F7939J20963n0021j87619J4624K36821J18053q1073J1156J87194Q6499j24645
38619C99891j07372J1577m8957j45385k5541J26189L2361j23456m4298J08141
38609A83150M1542r2811q915J44787P9945o6390j0575J17860L8299j26223q6362
38598B14307O9930P4118k3377j8015L4835L246k513R9159R6272j09973k11105
38587B26884k2773J17704n4676k07504o479K36726J08363j59651j30058N5012
38577A63548L539j69439j01948J02743R6614m9192m0582M3811k8606j04090O3286
38566b0316K54199J34407j15851j28901j1614o6914j63601k1742J77217J14361
38556A51245l4052O0166K13302P9941j49157r4051Q0411p755k01602j14730R6479
$$ plain form
38545 80197 108575 -69012 -176850 -58050 39153 -27622 -22642 153065 209833 32104 -41146
38534 -41146 179154 372942 292353 181104 259553 306416 132247 -23227 45907 120663 5832
38523 5832 -91915 -1950 60381 -52944 -93189 92444 220875 102082 16407 176515 315958
38512 315958 220932 159824 348176 496364 351952 192877 301227 437790 335109 223284
38502 223284 345916 436200 224503 4525 120341 324583 234477 19130 37237 171866
38492 171866 126556 31324 155041 335330 276303 113382 128063 205294 115500 20631 153862
38481 153862 311279 212338 56361 171142 414197 470241 435583 555364 686024 576518
38471 576518 390103 400343 465506 341421 200815 294136 417409 277558 64562 97344
$$ packed form
38545H0197K8378j77587j07838J18800R7203o6775M980J75707N6768j77729p3250
38534d1146K20300J93788q0589j11249P8449M6863j74169j55474O9134P4756j14831
38523E832r7747Q9965O2331j13325m0245J85633J28431j18793q5675J60108J39443
38512C15958r5026o1108J88352J48188j44412j59075J08350J36563j02681j11825
38502B23284J22632R0284k11697k19978J15816K04242r0106k15347J8107J34629
38492A71866m5310r5232J23717J80289n9027j62921J4681P7231q9794r4869J33231
38481A53862J57417r8941j55977J14781K43055N6044l4658J19781J30660j09506
38471E76518j86415J0240O5163j24085j40606R3321J23273j39851k12996L2782
$$ plain form
38461 97344 231732 190416 133784 308183 479206 336911 119549 195502 372140 287107
38451 287107 140322 322074 624715 570314 264802 182654 320669 300756 130928 144573
38441 144573 325932 370866 288325 318279 401533 321110 191067 237441 315182 203804 108146
38430 108146 279482 453237 292422 60996 187285 490393 548423 511367 803815 1313044
38420 1313044 1616070 1726862 1882148 1899656 1520156 1075020 1021553 1125282 906134 558842
38410 558842 575775 790359 702425 446760 500829 715730 603926 326689 401619 668021
38400 668021 566218 238393 304260 709304 857790 767454 1025322 1662078 2097963 2158396
38390 2158396 2162053 2086340 1641372 1081916 942785 1062983 869968 493167 542902 924300
$$ packed form
38461I7344J34388m1316n6632J74399J71023j42295k17362P5953J76638q5033
38451B87107j46785J81752L02641n4401l05512q2148J38015j9913j69828J3645
38441A44573J81359M4934q2541K9954Q3254q0423j30043M6374P7741j11378r5658
38430A08146J71336J73755j60815k31426J26289L03108N8030l7056K92448N09229
38420A313044L03026J10792J55286J7508l79500m45136n3467J03729k19148l47292
38410E58842J6933K14584q7934k55665N4069K14901j11804k77237P4930K66402
38400F68021j01803l27825O5867M05044J48486r0336K57868O36756M35885O0433
38390B158396L657p5713m44968n59456j39131J20198j93015l76801M9735L81398
$$ plain form
38380 924300 980681 715399 751615 1159728 1441402 1576883 1935608 2255801 1923572 1190134
38370 1190134 885359 999779 814164 344437 302198 660800 675735 354505 458744 965859
38360 965859 1010483 505776 332084 704517 845538 537318 497723 895596 982514 568880
38350 568880 405383 710959 772577 405687 350314 787214 921684 500008 292761 606523
38340 606523 760748 506109 500361 906514 1000206 641765 628006 1108994 1214039 739775
38330 739775 596067 1053184 1212689 783190 660748 1125615 1231820 676355 470862 999452
38320 999452 1241731 752757 556586 1163043 1558878 1151342 862632 1263244 1471027 979245
38310 979245 720273 1201267 1450994 952257 714681 1263619 1528580 947960 650975 1259768
$$ packed form
38380I24300N6381k65282L6216M08113K81674J35481L58725L20193l32229p33438
38370A190134l04775J14420j85615m69727m2239L58602J4935l21230J04239N07115
38360I65859M4624n04707j73692L72433J41021l08220l9595L97873Q6918m13634
38350E68880j63497L05576O1618l66890n5373M36900J34470m21676k07247L13762
38340F06523J54225k54639n748M06153R3692l58441j3759M80988J05045m74264
38330G39775j43708M57117J59505m29499j22442M64867J06205n55465k05493N28590
38320I99452K42279m88974j96171O06457L95835m07536k88710M00612K07783m91782
38310I79245k58972M80994K49727m98737k37576N48938K64961n80620k96985O08793
$$ plain form
38300 1259768 1607856 1019574 713327 1455430 2009927 1511650 1156142 1834487 2347776
38291 2347776 1782255 1372441 2082823 2651658 2064847 1620142 2390961 3038928 2413423
38282 2413423 1873552 2630440 3302001 2654401 2172101 3183314 4122862 3571130 3212344
38273 3212344 4607260 5941918 5454092 5079455 6879063 8940286 9017479 9046866 11425377
38264 11425377 14165042 14953158 16537529 22165975 29328245 34854395 42342418 56456323
38256 56456323 74483954 94731035 128985839 189273255 259000017 294791085 268802368
38249 268802368 199860663 132275162 91390107 70768997 55624968 42403745 33999655
38242 33999655 29219106 24320968 19150354 16018604 15002349 14026317 12230656 10624960
$$ packed form
38300A259768L48088n88282l06247P42103N54497m98277l55508O78345N13289
38291B347776n65521m09814P10382N68835n86811m44705P70819O47967o25505
38282B413423n39871P56888O71561o47600m82300J011213R39548n51732l58786
38273C212344J394916J334658m87826l74637J799608K061223P7193K9387K378511
38264A1425377K739665P88116J584371N628446P162270N526150P488023J4113905
38256E6456323J8027631K0247081L4254804O0287416O9726762L5791068k5988717
38249B68802368o8941705o7585501m0885055k0621110j5144029j3221223q404090
38242C3999655m780549m898138n170614l131750j016255r76032j795661j605696
$$ plain form
38234 10624960 9904837 9405103 8389966 7344245 7259446 7932689 8084703 7510343 7629418
38225 7629418 8940980 9829314 9578507 10280539 13242144 16153888 17279910 19425336 25161803
38216 25161803 31610681 36089574 42954923 56578815 72387155 87674273 117453774
38209 117453774 179079973 255647638 295784756 265875061 190046681 122113290 87647845
38202 87647845 71777464 55821131 41169116 34496109 31398045 25217345 18678190 16662370
38194 16662370 16403052 13330407 9587479 9129080 10058983 8702639 6525913 6701477 7846802
38185 7846802 7015338 5441664 5877551 7220394 6865462 5766034 6386051 7943038 8191373
38176 8191373 7887163 9212978 11569728 12981642 14082946 16820521 20500991 22700657
$$ packed form
38234A0624960p20123m99734j015137j045721q4799O73243J52014n74360J19075
38225G629418J311562Q88334k50807P02032K961605K911744J126022K145426N736467
38216B5161803O448878M478893O865349J3623892J5808340J5287118K9779501
38209A17453774O1626199P6567665M0137118k9909695p5828380o7933391l4465445
38202H7647845j5870381j5956333j4652015o673007l098064o180700o539155k015820
38194A6662370k59318l072645l742928m58399R29903j356344k176726J75564J145325
38185G846802q31464j573674M35887J342843l54932j099428O20017J556987K48335
38176H191373l04210J325815K356750J411914J101304K737575L680470K199666
$$ plain form
38168 22700657 22953685 22328723 20624903 17201913 13442040 11260116 10122608 8362474
38160 8362474 6356621 5573703 5566607 4815973 3642371 3453314 3902056 3540770 2591714
38151 2591714 2414923 2849728 2651519 2002779 2096067 2722476 2684333 2149845 2264861 2851983
38141 2851983 2780944 2243567 2425414 3246179 3593367 3496650 3947231 4831119 5136372 5000566
38131 5000566 5523288 6722777 7641045 8309660 9691819 11821917 13852768 15734692 17933485
38122 17933485 19662308 19399310 17195599 14641979 12541093 10398320 8181259 6678471
38114 6678471 5934129 5080632 3959628 3314513 3211267 2844929 2085391 1683695 1771964
38105 1771964 1647224 1201841 1095820 1348001 1217632 669298 525183 960384 1230270
$$ packed form
38168B2700657K53028o24962j703820l422990l759873k181924j137508j760134
38160H362474k005853p82918p096p50634j173602j89057M48742l61286r49056
38151B591714j76791M34805j98209o48740R3288O26409l8143n34488J15016N87122
38141B851983p1039n37377J81847Q20765L47188r6717M50581Q83888L05253j35806
38131E000566N22722J199489R18268O68615J382159K130098K030851J881924K198793
38122A7933485J728823k62998k203711k553620k100886k142773k217061j502788
38114F678471p44342q53497j121004o45115j03246l66338p59538m01696Q8269
38105A771964j24740m45383j06021K52181j30369n48334j44115M35201K69886
$$ plain form
38096 1230270 1078355 1048046 1223593 1042180 556785 516185 963974 1102052 778422 767550
38086 767550 1308959 1695791 1616884 1613446 1875937 1847378 1377516 1072282 1150371 1103864 799900
38075 799900 760916 1049052 1036720 602792 406896 657777 754873 471440 339898 531491
38065 531491 518212 203259 212952 668671 835217 427603 123158 308786 449274 203076
38055 203076 54708 288402 400572 111860 -54078 214752 411071 202893 71755 351673
38045 351673 576142 430038 446284 1052552 1733527 1841790 1530431 1243748 967082 591654
38035 591654 373065 445175 473907 285537 220246 427379 490425 195867 -32052 83122
38025 83122 175892 -2951 -78347 195130 407752 255440 110144 283331 422884 213996
$$ packed form
38096A230270j51915l0309J75547j81413m85395m0600M47789J38078l23630j0872
38086G67550N41409L86832p8907l438K62491k8559m69862l05234P8089m6507l03964
38075G99900l8984K88136j2332m33928j95896K50881R7096k83433j31542J91593
38065E31491j3279l14953R693M55719J66546m07614l04445J85628J40488k46198
38055B03076j48368K33694J12170k88712j65938K68830J96319k08178j31138K79918
38045C51673K24469j46104J6246O06268O80975J08263l11359k86683k76666l75428
38035E91654k18589P2110K8732j88370o5291K07133O3046k94558k27919J15174
38025H3122R2770j78843p5396K73477K12622j52312j45296J73187J39553k08888
$$ plain form
38015 213996 1937 129215 298479 183355 51718 194901 338282 203526 75415 234154
38005 234154 393052 266525 131251 258791 356319 143809 -69022 43238 217774 142274
37995 142274 47058 181125 250145 -19460 -290595 -203190 -30865 -129793 -249890 -46459
37985 -46459 214786 140299 -55928 20481 197460 95772 -143660 -160599 -57979 -134090
37975 -134090 -256799 -139775 58853 27735 -96586 -9770 166371 146928 54327 154883
37965 154883 306185 232832 79880 132442 252844 154322 -24725 25246 202385 205753 93784
37954 93784 105548 158174 37211 -138668 -136868 -61647 -114929 -164886 -24410 117980 27038
37943 27038 -109075 -27738 94734 -8446 -145004 -8229 226401 216567 88615 178710
$$ packed form
38015B13996k12059J27278J69264j15124j31637J43183J43381j34756j28111J58739
38005B34154J58898j26527j35274J27540R7528k12510k12831J12260J74536p5500
37995A42274r5216J34067O9020k69605k71135Q7405J72325r8928j20097K03431
37985d6459K61245p4487j96227P6409J76979j01688k39432j6939J02620p6111
37975a34090j22709J17024J98628l1118j24321Q6816J76141j9443r2601J00556
37965A54883J51302p3353j52952N2562J20402r8522j79047M9971J77139L368j11969
37954I3784J1764N2626j20963j75879J800P5221n3282m9957J40476J42390r0942
37943B7038j36113Q1337J22472j03180j36558J36775K34630r834j27952R0095
$$ plain form
37933 178710 392753 407941 280824 276923 317294 171543 -14808 35261 173083 96618 -34121
37922 -34121 137047 472749 542202 354417 273834 339903 288078 139130 155093 285943 246853
37911 246853 81028 83600 233320 249559 141563 154653 247385 175022 20320 80553 285577
37900 285577 290701 103140 54213 181030 201627 95162 142790 367826 473314 377557 306933
37889 306933 319855 227871 27775 -59478 -16154 -45184 -144998 -112915 21732 17346 -121507
37878 -121507 -148603 -38442 -2480 -50177 19669 192415 243686 165262 151195 181835 65954
37867 65954 -131111 -156941 -38614 -19017 -71427 33834 218354 173200 -61564 -122536 57431
37856 57431 178784 145996 171869 267047 173439 -103245 -216494 -44369 150340 212987 266645
$$ packed form
37933A78710K14043J5188j27117l901M0371j45751j86351N0069J37822p6465j30739
37922c4121J71168L35702O9453j87785q0583O6069n1825j48948J5963J30850l9090
37911B46853j65825K572J49720J6239j07996J3090R2732p2363j54702O0233K05024
37900B85577N124j87561m8927J26817K0597j06465M7628K25036J05488r5757p0624
37889C06933J2922r1984k00096q7253M3324k9030r9814L2083J34647m386j38853
37878a21507k7096J10161L5962m7697O9846J72746N1271p8424j4067L0640j15881
37867F5954j97065k5830J18327J9597n2410J05261J84520m5154k34764o0972J79967
37856E7431J21353l2788K5873R5178r3608k76684j13249J72125J94709O2647N3658
$$ plain form
37845 266645 313153 173076 -73323 -91026 139075 240885 58657 -130205 -140792 -126969
37835 -126969 -163514 -78710 128529 183562 27505 -46918 72090 109753 -76253 -227047
37825 -227047 -146242 -1833 49440 121726 265745 280633 90246 -65723 -31734 28939 -10516
37814 -10516 -15497 92472 157633 113534 126060 244265 276141 170498 133265 203644 131779
37803 131779 -138808 -299579 -199334 -104529 -199659 -261469 -105927 57612 26058 -28269
37793 -28269 91161 237846 230593 202014 311849 411292 316334 146222 86503 73793 2640
37782 2640 -17335 99434 174497 56930 -85276 -51669 44528 2607 -112722 -132788 -102307
37771 -102307 -152614 -225855 -188767 -82078 -33826 -54426 -91915 -142377 -165069 -64986 117269
$$ packed form
37845B66645M6508j40077k46399j7703K30101J01810j82228j88862j0587J3823
37835a26969l6545Q4804K07239N5033j56057p4423J19008L7663j86006j50794
37825b27047Q0805J44409N1273P2286J44019J4888j90387j55969L3989O0673l9455
37814a0516m981J07969O5161m4099J2526J18205L1876j05643l7233P0379p1865
37803A31779k70587j60771J00245R4805r5130o1810J55542J63539l1554n4327
37793b8269J19430J46685p253k8579J09835R9443r4958j70112n9719j2710p1153
37782B640j9975J16769P5063j17567j42206L3607R6197m1921j15329k0066L0481
37771a02307n0307p3241L7088J06689M8252k0600l7489n0462k2692J00083J82255
$$ plain form
37760 117269 198512 136274 85280 90523 17769 -112607 -68792 171359 305093 192978 93540
37749 93540 196415 298850 206836 91815 146304 219601 120192 -19561 -6882 59300 19602
37738 19602 -24996 59804 147101 95612 43332 140151 231236 126251 -51425 -100374 -87128
37727 -87128 -137453 -131184 48404 197822 94323 -97071 -90332 40580 28227 -111351 -157948
37716 -157948 -109697 -144891 -256918 -278474 -197770 -142623 -126801 -88006 -80126 -163179 -215446
37705 -215446 -114071 21389 14723 -81113 -127701 -157259 -224213 -195094 18699 206223 147956
37694 147956 -17399 -35175 43659 25614 -28004 51811 155850 62850 -125103 -119927 59116
37683 59116 123706 -3168 -120638 -130529 -127356 -126503 -40440 76925 68339 -49199 -118178 -122711
$$ packed form
37760A17269Q1243o2238n0994N243p2754j30376M3815K40151J33734j12115r9438
37749I3540J02875J02435r2014j15021N4489P3297r9409j39753J2679O6182l9698
37738A9602m4598Q4800Q7297n1489n2280R6819R1085j04985j77676m8949J3246
37727h7128n0325O269J79588J49418j03499j91394O739J30912j2353j39578m6597
37716a57948M8251l5194j12027k1556Q0704N5147J5822L8795P880q3053n2267
37705b15446J01375J35460o666r5836m6588k9558o6954K9119K13793J87524n8267
37694A47956j65355j7776P8834j8045n3618P9815J04039r3000j87953N176J79043
37683E9116O4590j26874j17470r891L173Q53Q6063J17365q586j17538o8979m533
$$ plain form
37671 -122711 -171635 -246397 -232888 -153286 -108040 -55782 89676 231597 232893 188020 264223
37660 264223 375288 322679 165262 125845 214414 267069 270310 309147 282997 40045 -268630
37649 -268630 -340964 -189192 -91830 -122443 -103293 -6081 -7145 -122213 -152271 -32876 93717
37638 93717 177360 303516 425133 386933 239503 199722 279460 285505 200262 207563 310202
37627 310202 288662 100341 -35664 -25736 -27330 -105171 -105440 24065 114540 88067 80435 143466
37615 143466 129474 -9964 -105590 -76114 -70813 -178858 -266113 -233204 -180121 -183308 -154904
37604 -154904 -55462 -12498 -93819 -177082 -166597 -136649 -151902 -148147 -93710 -71653 -106430 -101503
37592 -101503 -34386 -22006 -113326 -202676 -213760 -185083 -129251 -8061 116877 123839 53378
$$ packed form
37671a22711m8924p4762J3509P9602M5246N2258J45458J41921J296m4873P6203
37660B64223J11065n2609j57417l9417Q8569N2655L241L8837k6150k42952l08675
37649b68630p2334J51772R7362l0613J9150R7212j064j15068l0058J19395J26593
37638I3717Q3643J26156J21617l8200j47430l9781P9738O045q5243P301J02639
37627C10202k1540j88321j36005R928j594p7841k69J29505R0475k6473p632O3031
37615A43466j3992j39438r5626K9476N301j08045q7255L2909N3083l187K8404
37604a54904R9442M2964q1321q3263J0485K9948j5253L755N4437K2057l4777M927
37592a01503O7117J2380r1320q9350j1084K8677N5832J21190J24938O962p0461
$$ plain form
37581 53378 65755 153092 144810 29739 -6040 78626 86455 -77510 -239903 -242231 -148357 -68270
37569 -68270 -5766 25519 -38589 -150106 -162956 -75413 -34039 -55365 -4518 105063 87906
37558 87906 -65448 -127684 -23096 37424 -62119 -139648 -54971 41790 -9685 -110820 -107434
37547 -107434 -35366 14240 64522 128236 119195 31674 671 56432 43619 -90390 -171099
37536 -171099 -98866 -24166 -68569 -121608 -82394 -57789 -140610 -222209 -204576 -175551 -201581
37525 -201581 -174473 -38404 60430 25998 -18132 16088 3900 -127809 -212075 -122849 3411
37514 3411 36842 86685 235606 308560 174932 31847 90673 207513 143569 -6949 8807
37503 8807 156377 191288 78742 5451 35521 57017 40266 84437 215454 348044 431557
$$ packed form
37581E3378J2377Q7337q282j15071l5779Q4666P829j63965j62393k328R3874Q0087
37569f8270O2504L1285o4108j11517j2850Q7543M1374k1326N0847J09581j7157
37558H7906j53354o2236J04588O0520r9543p7529Q4677R6761n1475j01135L386
37547a07434P2068M9606N0282O3714r041q7521l1003N5761j2813j34009q0709
37536a71099P2233P4700m4403n3039L9214K4605q2821q1599J7633K9025k6030
37525b01581K7108J36069R8834l4432m4130L4220j2188j31709q4266Q9226J26260
37514C411L3431M9843J48921P2954j33628j43085N8826J16840o3944j50518J5756
37503H807J47570L4911j12546p3291L0070K1496j6751M4171J31017J32590Q3513
$$ plain form
37492 431557 467709 431871 325872 237148 209183 151732 12217 -92157 -59978 17183 18709
37481 18709 -10746 12065 47620 59181 121107 230775 213671 12873 -141901 -82447 3212
37470 3212 -107297 -269464 -207634 27189 173002 187319 215791 245192 148319 3848 14633
37459 14633 136248 122890 -57431 -166955 -80524 56870 91583 37292 -43333 -120870 -141623
37448 -141623 -70560 14061 34596 72510 226331 382757 352622 178169 68749 72293 50207
37437 50207 -48598 -126180 -135034 -119400 -73127 33443 109022 36288 -110414 -145261 -38698
37426 -38698 89110 185308 259790 232790 38634 -163326 -142011 64312 209580 213471 210149
37415 210149 245309 210225 94904 34134 60652 57985 -3778 -20460 24538 21064 -53148 -101748
$$ packed form
37492D31557L6152l5838j05999q8724k7965n7451j39515j04374L2179P7161J526
37481A8709k9455K2811L5555J1561O1926J09668j7104k00798j54774N9454Q5659
37470C212j10509j62167O1830K34823J45813J4317K8472K9401r6873j44471J0785
37459A4633J21615j3358j80321j09524Q6431J37394L4713n4291q0625p7537k0753
37448a41623P1063Q4621K0535L7914J53821J56426l0135j74453j09420L544k2086
37437E0207r8805p7582q854J5634M6273J06570P5579p2734j46702l4847J06563
37426c8698J27808R6198P4482k7000j94156k01960K1315K06323J45268L891l322
37415B10149L5160l5084j15321o0770K6518k667o1763j6682M4998l474p4212m8600
$$ plain form
37403 -101748 -115203 -176130 -241300 -167034 12795 86826 -2809 -75504 -21490 46904 33031
37392 33031 13881 65752 136799 181026 228514 248237 135914 -84650 -235892 -232745 -171397
37381 -171397 -119028 -22274 109552 153132 96616 101488 227375 300718 189781 21580 -28069
37370 -28069 -1753 -52277 -182561 -252402 -181312 -28353 90403 99849 26982 -12258 50987
37359 50987 130750 113111 54216 100515 235534 296517 250126 241349 326265 372121 304136 248940
37347 248940 317298 412278 381061 228541 65197 -49039 -106098 -88702 -3553 88824 139220
37336 139220 150152 131994 93513 75030 96719 88664 -11534 -114376 -75010 79388 174824
37325 174824 136815 50116 -19317 -84737 -121421 -75987 -3493 -11556 -63461 -29641 70290 96063
$$ packed form
37403a01748j3455o0927o5170P4266J79829P4031q9635p2695N4014O8394j3873
37392C3031j9150N1871P1047M4227M7488J9723j12323k20564j51242L147O1348
37381a71397N2369R6754J31826M3580n6516M872J25887P3343j10937j68201m9649
37370b8069K6316n0524j30284o9841P1090J52959J18756R446p2867l9240O3245
37359E0987P9763j7639n8895M6299J35019O0983m6391q777Q4916M5856o7985n5196
37347B48940O8358R4980l1217j52520j63344j14236n7059J7396Q5149R2377N0396
37336A39220J0932j8158l8481j8483K1689q055j00198j02842L9366J54398R5436
37325A74824l8009q6699o9433o5420l6684M5434P2494q063n1905L3820R9931K5773
$$ plain form
37313 96063 55430 94776 202441 195460 53834 -17708 53499 79915 -37374 -121052 -42520
37302 -42520 36696 -46774 -163392 -116383 25100 59386 -18625 -51314 13192 87942 117015
37291 117015 115197 94194 73674 98783 149876 127308 16262 -49386 11185 85997 48714
37280 48714 -44302 -63736 -8896 28158 13286 -27434 -78758 -119347 -113105 -82817 -95626 -127665
37268 -127665 -72808 61665 125677 63181 6012 39063 54157 -37636 -120975 -57339 87230
37257 87230 148142 86446 -23316 -125440 -189486 -187389 -158732 -189103 -253205 -219885 -80254
37246 -80254 3332 -41218 -82564 -39536 -33271 -145201 -235327 -173945 -61937 -38553 -52684
37235 -52684 -13937 9168 -57184 -113835 -72081 -43698 -128755 -188708 -76958 67837 32006
$$ packed form
37313I6063m0633L9346J07665o981j41626p1542P1207K6416j17289q3678P8532
37302d2520P9216q3470j16618M7009J41483L4286p8011l2689O4506P4750K9073
37291A17015j818k1003k0520K5109N1093k2568j11046o5648O0571P4812l7283
37280D8714r3016j9434N4840L7054j4872m0720n1324m0589O242L0288j2809l2039
37268a27665N4857J34473O4012o2496n7169L3051J5094r1793q3339O3636J44569
37257H7230O0912o1696j09762j02124o4046K097K8657l0371o4102L3320J39631
37246h0254Q3586m4550m1346M3028O265j11930r0126O1382J12008K3384j4131
37235e2684L8747K3105o6352n6651M1754K8383q5057n9953J11750J44795l5831
$$ plain form
37224 32006 -106391 -109563 25758 98781 57129 32409 66465 72548 47342 73603 127211 112476
37212 112476 71767 134539 271975 322070 249533 170421 130760 71900 6190 12047 52090
37201 52090 6546 -100532 -113351 -5590 64135 -7633 -146551 -249356 -294405 -272609 -158366
37190 -158366 11507 145951 203491 196274 123638 15062 -17382 85576 197657 170477 72786
37179 72786 83553 196701 241335 172499 123698 161439 193272 148287 65271 -27478 -148638
37168 -148638 -255968 -268297 -216920 -212786 -248711 -205062 -69254 31193 45527 68585 147128
37157 147128 192355 147827 86883 74944 74916 52968 46426 64003 43181 -29785 -72576 -41568
37145 -41568 -8291 -40169 -100722 -130768 -148075 -203302 -290032 -344199 -305795 -176183 -42914
$$ packed form
37224C2006j38397l172J35321P3023m1652k4720L4056O083k5206K6261N3608j4735
37212A12476m0709O2772J37436N0095p2537p9112l9661n8860o5710N857M0043
37201E2090m5544j07078j2819J07761O9725p1768j38918j02805m5049K1796J14243
37190a58366J69873J34444N7540p217p2636j08576l2444J02958J12081k7180r7691
37179G2786J0767J13148M4634o8836m8801L7741L1833m4985q3016r2749j21160
37168a48638j07330j2329N1377M134l5925M3649J35808J00447J4334K3058P8543
37157A47128M5227m4528o0944j1939k8k1948o542J7577k0822p2966m2791L1008
37145d1568L3277l1878o0553l0046j7307n5227q6730n4167L8404J29612J33269
$$ plain form
37134 -42914 -18081 -106186 -182154 -159989 -110858 -126898 -153020 -80298 61499 147882 147425 124242
37122 124242 96931 40908 -4668 22157 86140 106848 90586 83725 58818 -7049 -17331 106202
37110 106202 242630 224446 108990 84359 153949 147381 22277 -80385 -80956 -36867 27800
37099 27800 143716 241135 203256 91356 88095 197271 237027 158386 117476 179160 203931
37088 203931 111261 17013 10431 11830 -45656 -94952 -96505 -127506 -206194 -208999 -69877 97803
37076 97803 170002 153596 93714 1402 -68101 -35576 49515 49977 -28067 -38236 44497 90662
37064 90662 78318 128745 225021 184563 6287 -58805 81069 183748 86469 -10670 96478
37053 96478 254613 227644 99111 94458 180583 157888 29180 -27062 22995 49735 15210
$$ packed form
37134d2914K4833q8105p5968K2165M9131j6040k6122P2722J41797Q6383m57k3183
37122A24242k7311n6023m5576K6825O3983K0708j6262o861k4907o5867j0282J23533
37110A06202J36428j8184j15456k4631O9590o568j25104j02662n71M4089O4667
37099B7800J15916R7419l7879j11900l261J09176L9756p8641m0910O1684K4771
37088B03931r2670r4248o582J399n7486m9296j553l1001p8688k805J39122J67680
37076I7803P2199j6406n9882r2312o9503L2525Q5091M62p8044j0169Q2733M6165
37064I0662j2344N0427R6276m0458j78276o5092J39874J02679r7279r7139J07148
37053I6478J58135k6969j28533m653Q6125k2695j28708n6242N0057K6740l4525
$$ plain form
37042 15210 2661 21421 1041 -38105 -247 111379 195223 205054 166047 80340 -46129
37031 -46129 -131252 -108894 -49125 -62829 -139748 -197473 -223451 -245585 -233290 -156370 -76195 -57333
37019 -57333 -59630 -33547 -36356 -125416 -221553 -214149 -124843 -39910 32818 109589 133183 77583
37007 77583 55103 159231 286375 279962 173527 117444 132028 113932 39422 -14871 -23421
36996 -23421 -26349 -20712 19791 50457 18345 -17890 35928 154126 239459 277132 309341 310434
36984 310434 228485 108486 42053 36077 45906 73572 111610 75369 -61470 -149487 -50065
36973 -50065 134046 193525 113840 51396 58561 37021 -51704 -122264 -118379 -67449 17263 140078
36961 140078 239331 246605 211466 220762 223156 98970 -114202 -239639 -206445 -113817 -45386
$$ packed form
37042A5210j2549J8760k0380l9146L7858J11626Q3844R831l9007q5707j26469
37031d6129q5123K2358N9769j3704p6919n7725k5978k2134J2295P6920Q0175J8862
37019e7333k297K6083k809q9060r6137P404Q9306Q4933P2728P6771K3594n5600
37007G7583k2480J04128J27144o413j06435n6083J4584j8096p4510n4293q550
36996b3421k928N637M0503L0666l2112l6235N3818J18198Q5333L7673L2209J093
36984C10434q1949j19999o6433n976R829K7666L8038l6241j36839q8017R9422
36973e0065J84111N9479p9685o2444P165k1540q8725p0560L885N0930Q4712J22815
36961A40078R9253P274l5139R296K394j24186k13172j25437L3194R2628O8431
$$ plain form
36950 -45386 18139 80739 79385 -5721 -102625 -142965 -127357 -96635 -106260 -193729 -299881 -291894
36938 -291894 -151105 -37570 -54750 -79312 15593 109393 28301 -124572 -100091 102270 247803
36927 247803 243212 218945 237435 204726 107971 68720 101008 72187 -28177 -36068 84640
36916 84640 140848 26433 -95104 -61557 44634 74852 51369 65198 90682 63241 22068
36905 22068 30593 52848 29306 -17032 -50212 -97203 -162720 -173884 -100659 -25234 -4417 24227
36893 24227 107814 167026 123861 33825 -16354 -44394 -96892 -128411 -70523 45497 131845
36882 131845 150324 102973 -5372 -121126 -145610 -67735 -9137 -53900 -122079 -105153 -37308
36871 -37308 -19761 -47403 -34925 26340 53450 -562 -92333 -154723 -153428 -86281 23153 133499
$$ packed form
36950d5386O3525O2600j354q5106r6904m0340J5608L0722r625q7469j06152P987
36938b91894J40789J13535j7180k4562R4905R3800q1092j52873K4481K02361J45533
36927B47803m591k4267J8490l2709r6755l9251L2288k8821j00364p891J20708
36916H4640N6208j14415j21537L3547J06191L0218k3483J3829K5484k7441m1173
36905B2068Q525K2255k3542m6338l3180m6991o5517j1164P3225P5425K0817K8644
36893B4227Q3587N9212m3165r0036n0179k8040n2498l1519N7888J16020Q6348
36882A31845J8479m7351j08345j15754k4484P7875N8598m4763o8179J6926O7845
36871c7308J7547k7642J2478O1265K7110n4012r1771o2390J295O7147J09434J10346
$$ plain form
36859 133499 208608 221668 147367 -868 -134869 -166182 -120369 -99787 -132952 -155621 -144864
36848 -144864 -154068 -188715 -170998 -77673 -704 -11550 -64662 -91372 -91162 -74311 -14730 79101
36836 79101 141202 152174 168756 198895 161774 38361 -56736 -39059 17543 8319 -46398 -69473
36824 -69473 -58804 -48963 -23714 30273 57964 27567 16016 93132 181591 149071 651 -129645
36812 -129645 -157657 -126871 -119741 -164338 -220216 -208034 -76588 119221 244179 228500 147606
36801 147606 117583 158099 201077 187903 113243 11512 -63990 -81796 -69274 -70125 -70752 -33059
36789 -33059 11050 -10265 -84237 -122792 -104913 -98061 -125431 -135278 -121370 -139864 -181429 -174469
36777 -174469 -148189 -223142 -383462 -440554 -312417 -162095 -144314 -181693 -128651 -6556 75269
$$ packed form
36859A33499P5109J3060p4301j48235j34001l1313M5813K0582l3165k2669J0757
36848a44864r204l4647J7717R3325P6969j0846n3112k6710K10J6851N9581R3831
36836G9101O2101J0972J6582L0139l7121j23413r5097J7677N6602r224n4717k3075
36824f9473J0669R841K5249N3987K7691l0397j1551P7116Q8459l2520j48420j30296
36812a29645k8012L0786P130m4597n5878J2182J31446J95809J24958j5679q0894
36801A47606l0023M0516M2978j3174p4660j01731p5502j7806J2522q51o27L7693
36789c3059M4109k1315p3972l8555J7879O852k7370r847J3908j8494m1565O960
36777a74469K6280p4953j60320n7092J28137J50322J7781l7379N3042J22095Q1825
$$ plain form
36766 75269 102368 107580 62339 -29477 -45385 81915 207317 160872 2178 -85563 -71597
36755 -71597 -63974 -89419 -82608 -55508 -85929 -147780 -124404 1866 118423 148352 122615 84531
36743 84531 38597 -743 -9596 -6465 -24635 -46548 -34746 977 28858 40654 18216 -69357
36731 -69357 -174146 -179340 -82057 -40876 -131087 -192351 -70434 124380 187389 132273 121294
36720 121294 174341 180362 139832 156212 212606 188667 93270 58269 96122 80990 -14117 -74051
36708 -74051 -56239 -38000 -25680 61732 178382 151845 -32128 -165591 -128337 -51607 -69086
36697 -69086 -114612 -101600 -105566 -195352 -244792 -113425 91726 137508 -2533 -116356 -48567
36686 -48567 116172 191383 115212 -3826 -31759 32095 64354 -2377 -67739 -10620 105626
$$ packed form
36766G5269K7099N212m5241r1816j5908J27300J25402m6445j58694q7741J3966
36755g1597P623k5445O811K7100l0421o1851K3376J26270J16557K9929k5737l8084
36743H4531m5934l9340q853L131j8170k1913J1802L5723K7881J1796k2438q7573
36731f9357j04789n194R7283M1181r0211o1264J21917J94814O3009n5116j0979
36720A21294N3047O021m0530J6380N6394k3939r5397l5001L7853j5132r5107n9934
36708g4051J7812J8239J2320Q7412J16650k6537j83973j33463L7254P6730j7479
36697f9086m5526J3012l966q9786m9440J31367K05151M5782j40041j13823O7789
36686d8567J64739P5211p6171j19038k7933O3854L2259o6731o5362N7119J16246
$$ plain form
36675 105626 112565 4568 -44433 35847 95801 18526 -81899 -47495 73726 124735 91881
36664 91881 88166 135894 138712 65672 9919 30598 54865 -7838 -131383 -208811 -180504 -84663
36652 -84663 -2551 18063 -3743 -7985 41579 111636 127063 56314 -34975 -37865 76582 208982
36640 208982 242909 189256 159196 192923 201383 114636 -1772 -48660 -33857 -22048 -12016
36629 -12016 27331 51835 -880 -79230 -73412 5864 32972 -40540 -121418 -122910 -66550 -9937
36617 -9937 25111 24301 -24277 -77485 -63834 13780 79548 99016 109514 134116 154761 168665
36605 168665 176263 127678 -3298 -110222 -63541 75422 116834 33535 -56 90226 142144
36594 142144 25692 -138458 -173193 -105883 -68752 -56186 31238 165996 200147 83070 -66539
$$ packed form
36675A05626O939j07997m9001Q0280N9954p7275j00425L4404J21221N1009l2854
36664I1881l715M7728K818p3040n5753K0679K4267o2703j23545p7428K8307R5841
36652h4663Q2112K0614k1806m242M9564P0057J5427p0749r1289k890J14447J32400
36640B08982L3927n3653l0060L3727Q460q6747j16408m6888J4803J1809J0032
36629a2016L9347K4504n2715p8350N818P9276K7108p3512q0878j492N6360N6613
36617i937L5048q10m8578n3208J3651P7614O5768J9468J0498K4602K0645J3904
36605A68665P598m8585j30976j06924M6681J38963M1412q3299l3591R0282N1918
36594A42144j16452j64150l4735O7310L7131J2566Q7424J34758L4151j17077j49609
$$ plain form
36583 -66539 -114382 -39545 86260 167775 143845 44691 -21059 11535 84753 112144 105179 137873
36571 137873 223229 298979 315532 279565 230177 214630 256260 309955 295608 213126 161065
36560 161065 191755 225157 182247 129103 182235 318598 397679 357948 281816 255804 261572
36549 261572 236274 169625 98102 41557 -16682 -96607 -184705 -232507 -199902 -105392 -20134
36538 -20134 -3944 -56344 -125394 -145038 -78007 40568 113017 78868 -5350 -39511 -14908
36527 -14908 1310 4750 69529 203041 295788 272755 202260 181144 187428 135082 26486 -42264
36515 -42264 -15875 51350 71287 27653 -11322 17112 77064 64789 -47677 -155054 -161047
36504 -161047 -115471 -114735 -125104 -44805 90320 134775 74774 59309 143695 185142 81504
$$ packed form
36583f6539m7843P4837J25805Q1515k3930r9154o5750L2594P3218K7391o965L2694
36571A37873Q5356P5750J6553l5967m9388j5547M1630N3695j4347q2482n2061
36560A61065L0690L3402m2910n3144N3132J36363P9081l9731p6132k6012N768
36549B61572k5298o6649p1523n6545n8239p9925q8098m7802L2605R4510Q5258
36538b0134J6190n2400o9050j9644O7031J18575P2449l4149q4218l4161K4603
36527a4908J6218L440O4779J33512R2747k3033p0495k1116O284n2346j08596o8750
36515d2264K6389O7225J9937m3634l8975K8434N9952j2275j12466j07377n993
36504a61047M5576P36j0369Q0299J35125M4455o0001j5465Q4386M1447j03638
$$ plain form
36493 81504 -51020 -55635 44220 124931 148909 144931 102312 14762 -48598 -34360 3445 4473
36481 4473 10651 66240 101606 42280 -47405 -60028 -9823 29541 74513 171837 256101 227270
36469 227270 124798 67715 59227 11849 -63374 -68492 -14880 -29683 -136457 -190807 -92286
36458 -92286 69219 145494 110275 45047 18047 32872 51600 35200 -12181 -42563 -41909 -73744
36446 -73744 -179337 -272688 -231203 -74344 50569 61098 17379 -4826 -16052 -50406 -84302
36435 -84302 -73715 -27114 5490 554 -5645 45045 152215 221474 156361 -529 -83563 -354
36423 -354 152583 219958 165345 60613 -25551 -53362 -2138 77655 77131 -12451 -40602 83217
36411 83217 200792 97301 -175714 -352137 -307835 -183269 -135217 -143675 -121653 -68594 -31525
$$ packed form
36493H1504j32524m615R9855Q0711K3978l978m2619q7550o3360J4238L7805J028
36481D473O178N5589L5366n9326q9685j2623N0205L9364M4972R7324Q4264k8831
36469B27270j02472n7083q488m7378p5223n118N3612j4803j06774n4350R8521
36458i2286J61505P6275l5219o5228k7000J4825J8728j6400m7381l0382O54l1835
36446g3744j05593r3351M1485J56859J24913J0529m3719k2205j1226l4354l3896
36435h4302J0587M6601L2604m936o199N0690J07170O9259o5113j56890q3034Q3209
36423c54J52937O7375n4613j04732q6164k7811N1224P9793n24q9582k8151J23819
36411H3217J17575j03491k73015j76423M4302J24566M8052q458K2022N3059L7069
$$ plain form
36400 -31525 -14844 -5642 -21487 -74952 -137832 -174928 -172476 -120415 -15507 107449 189736 196767
36388 196767 126187 -1976 -126428 -168036 -129395 -112062 -167749 -209405 -160739 -102324 -136559
36377 -136559 -188843 -114450 43892 92445 -28126 -171333 -210573 -168656 -99542 -6351 81692
36366 81692 101853 75982 99845 170938 164431 31648 -110508 -148102 -109457 -81345 -98950
36355 -98950 -167852 -279785 -357114 -300077 -144715 -59608 -128429 -244819 -275387 -213656 -119177
36344 -119177 -23815 38867 27383 -19929 -5464 59466 36390 -115291 -231607 -165791 3139
36333 3139 99554 85287 41137 3879 -43003 -77766 -71706 -74967 -152658 -257198 -271116 -171250
36321 -171250 -60353 -27834 -47099 -27679 70634 190450 231856 152603 4921 -134693 -235545
$$ packed form
36400c1525J6681R202j5845n3465o2880l7096K452N2061J04908J22956Q2287P031
36388A96767p0580j28163j24452m1608L8641J7333n5687m1656M8666N8415l4235
36377a36559n2284P4393J58342M8553j20571j43207l9240M1917O9114R3191Q8043
36366H1692K0161k5871K3863P1093o507j32783j42156l7594L8645K8112j7605
36355i8950o8902j11933p7329N7037J55362Q5107o8821j16390l0568O1731R4479
36344a19177R5362O2682j1484m7312J4465O4930k3076j51681j16316O5816J68930
36333C139R6415j4267m4150l7258m6882l4763O060l261p7691j04540j3918R9866
36321a71250J10897L2519j9265J9420R8313J19816M1406p9253j47682j39614j00852
$$ plain form
36310 -235545 -281812 -235851 -110787 -19643 -38939 -73479 910 102853 39390 -171420 -282457
36299 -282457 -166070 23421 108606 109104 101608 57394 -41805 -97816 -61991 -56415 -164431 -242256
36287 -242256 -128719 74550 139959 47962 -27725 -18787 -31177 -119539 -185955 -140370 -20154
36276 -20154 86635 131989 103897 24507 -38153 -37041 -21902 -73011 -175036 -239716 -240756 -241066
36264 -241066 -288327 -356432 -392299 -366855 -285618 -186815 -109810 -42749 54064 155245 177642
36253 177642 112959 56232 51985 25528 -58624 -96700 -15311 74927 34543 -88696 -146807
36242 -146807 -117814 -90303 -84903 -53740 -16156 -36348 -91042 -104155 -87122 -103333 -123023 -65084
36230 -65084 36343 61414 -5397 -59660 -46434 -4910 45926 116212 145260 53486 -95402
$$ packed form
36310b35545m6267M5961J25064R1144j9296l4540P4389J01943o3463k10810j11037
36299b82457J16387J89491Q5185M98p496m4214r9199n6011L5825N576j08016p7825
36287b42256J13537K03269O5409r1997p5687Q938j2390q8362o6416M5585J20216
36276b0154J06789M5354k8092p9390o2660J112J5139n1109j02025o4680j040l10
36264b41066m7261o8105l5867K5444Q1237R8803P7005O7061R6813J01181K2397
36253A77642o4683n6727m247k6457q4152l8076Q1389R0238m0384j23239n8111
36242a46807K8993K7511N400L1163L7584k0192n4694j3113J7033j6211j9690N7939
36230f5084J01427K5071o6811n4263J3226M1524N0836P0286K9048r1774j48888
$$ plain form
36219 -95402 -144288 -75200 -30464 -71043 -85343 573 85566 59933 -20050 -27759 56394 155246
36207 155246 210774 211089 159441 81923 21937 -15084 -63512 -118429 -117957 -35623 70705 132130
36195 132130 136094 103177 59138 44117 79028 105475 34129 -122666 -237643 -214837 -86729
36184 -86729 52360 141633 162283 119381 44885 -27650 -97793 -161368 -162462 -61908 65888
36173 65888 106306 69240 69518 140244 193085 187484 199966 267010 288278 175983 3814 -88302
36161 -88302 -67982 -2529 61370 119160 151929 139307 114377 133832 192307 215925 148774 19464
36149 19464 -84912 -106110 -76525 -79323 -134328 -157648 -74118 65668 141683 111794 33709
36138 33709 -35972 -81725 -84242 -30382 30456 29259 -18071 -35676 -16473 -25198 -64236 -49311
$$ packed form
36219i5402m8886O9088M4736m0579j4300Q5916Q4993k5633p9983p709Q4153R8852
36207A55246N5528L15n1648p7518n9986l7021m8428n4917M72Q2334J06328O1425
36195A32130L964l2917m4039j5021L4911K6447p1346j56795j14977K2806J28108
36184h6729J39089Q9273K0650m2902p4496p2535p0143o3575j094J00554J27796
36173F5888M0418l7066K78P0726N2841n601J2482O7044K1268j12295j72169r2116
36161h8302K0320O5453O3899N7790L2769j2622k4930J9455N8475K3618o7151j29310
36149A9464j04376k1198K9585k798n5005k3320Q3530J39786P6015k9889p8085
36138C3709o9681m5753k517N3860O0838j197m7330j7605J9203q725l9038J4925
$$ plain form
36126 -49311 48633 142229 155219 121431 105860 104979 78783 21339 -44878 -98163 -118431 -107588
36114 -107588 -111707 -161192 -200343 -160009 -84186 -73570 -110025 -72823 53681 135553 94786
36103 94786 13802 -25065 -56380 -104387 -84601 50619 186686 197244 129198 109410 144397
36092 144397 147884 110314 100919 127416 119166 46106 -45721 -117221 -171668 -204961 -188687 -110000
36080 -110000 11445 134806 200781 165716 74715 48355 134861 219777 155594 -46614 -225905
36069 -225905 -258459 -174688 -91829 -77809 -93681 -54594 58415 165260 188973 157127 141000
36058 141000 128861 60022 -32315 -44982 11884 1428 -118331 -204452 -142473 -15780 40558
36047 40558 31536 28056 15115 -44947 -92131 -67070 -58062 -187269 -397377 -513379 -488445 -428616
$$ packed form
36126d9311R7944R3596J2990l3788j5571q81k6196n7444o6217n3285k0268J0843
36114a07588m119m9485l9151M0334P5823J0616l6455L7202J26504Q1872m0767
36103I4786q0984l8867l1315m8007J9786J35220J36067J0558o8046j9788L4987
36092A44397L487l7570r395K6497q250p3060r1827p1500n4447l3293J6274P8687
36080a10000J21445J23361O5975l5065r1001k6360Q6506Q4916o4183k02208j79291
36069b25905l2554Q3771Q2859J4020j5872L9087J13009J06845K3713l1846j6127
36058A41000j2139o8839r2337j2667N6866j0456j19759q6121O1979J26693N6338
36047D0558r022l480j2941o0062m7184K5061R008j29207k10108j16002K4934N9829
$$ plain form
36035 -428616 -387627 -305529 -170772 -85961 -116777 -191642 -208778 -156944 -86134 -34005 -20305
36024 -20305 -49883 -88005 -84271 -38942 4426 33829 71959 103465 78389 5656 -35733 -11271
36012 -11271 14527 -17969 -67040 -56563 2547 30845 13633 44927 199165 395645 456551
36001 456551 314656 104509 -2927 -9918 -53685 -181225 -275430 -233898 -115926 -45710 -46095
35990 -46095 -46845 -9514 30907 26316 -30968 -94230 -82076 42321 196642 252131 201100 163643
35978 163643 197488 215840 156475 107846 161315 240990 210850 81323 -19580 -32190 -3643
35967 -3643 18926 23721 -1226 -41528 -37512 19989 39467 -27361 -76292 -11978 71648 35983
35955 35983 -53486 -22111 111566 147170 22699 -87371 -38573 104542 215580 265305 264591
$$ packed form
36035d28616M0989Q2098J34757Q4811l0816p4865j7136N1834P0810N2129J3700
36024b0305k9578l8122L734M5329M3368K9403L8130L1506k5076p2733m1389K4462
36012a1271K5798l2496m9071J0477N9110K8298j7212L1294J54238J96480O0906
36001D56551j41895k10147j07436o991m3767j27540r4205M1532J17972P0216l85
35990d6095p50L7331M0421m591n7284o3262J2154J24397J54321N5489n1031l7457
35978A63643L3845J8352n9365m8629N3469P9675l0140j29527j00903j2610K8547
35967c643K2569M795k4947m0302M016N7501J9478o6828m8931O4314Q3626l5665
35955C5983q9469L1375J33677L5604j24471j10070M8798J43115J11038M9725p14
$$ plain form
35944 264591 202406 120674 115069 180097 179737 55203 -63158 -49323 27138 21108 -61548 -84065
35932 -84065 16782 153965 206773 143172 30939 -32174 -6310 61785 116540 175278 270330
35921 270330 339516 286259 153375 107211 205969 306438 267748 135935 41286 11932 -5739
35910 -5739 -15957 21765 94668 140409 130059 79096 4123 -68308 -84618 -25235 43909 45912
35898 45912 -4351 -32519 -14705 9971 17886 22731 23791 -2870 -52687 -85014 -84100 -87561 -131563
35885 -131563 -192481 -208025 -150387 -61017 -6375 -7164 -25443 -20807 4647 29820 55578 93074
35873 93074 127633 126995 82227 22041 -6106 34143 126727 184916 125025 -20329 -122169 -117105
35861 -117105 -73067 -49748 5715 138485 260292 269234 219930 228110 260985 190739 33448
$$ packed form
35944B64591o2185q1732n605O5028l60j24534j18361J3835P6461o030q2656k2517
35932h4065J00847J37183N2808o3601j12233o3113K5864O8095N4755N8738R5052
35921B70330O9186n3257j32884m6164R8758J00469l8690j31813r4649k9354j7671
35910e739j0218L7722P2903M5741j0350n0963p4973p2431j6310N9383O9144K003
35898D5912n0263k8168J7814K4676P915M845J060k6661m9817l2327R14l461m4002
35885a31563o0918j5544N7638Q9370N4642p89j8279M636K5454K5173K5758L7496
35873I3074L4559o38m4768o0186k8147M0249R2584N8189n9891j45354j01840N064
35861a17105M4038K3319N5463J32770J21807Q942m9304Q180L2875p0246j57291
$$ plain form
35850 33448 -42399 39021 166364 221402 208311 166675 94501 5570 -57926 -110880 -209736
35839 -209736 -326796 -366993 -332726 -328160 -368224 -341492 -210908 -86955 -38155 1775 60759
35828 60759 42822 -77287 -148428 -66813 49229 53889 -969 5362 42405 15117 -43657 -55608
35816 -55608 -74897 -182918 -279650 -193999 34413 188105 175640 114922 112018 141089 168027
35805 168027 220793 287291 286816 200411 114352 84887 64593 12404 -21032 19818 95170 120202
35793 120202 76489 25668 25345 53902 25492 -104061 -253597 -293163 -214689 -146528 -166909
35782 -166909 -204735 -185592 -158676 -177695 -167133 -43586 116831 180056 149769 108035 35647
35771 35647 -125191 -284159 -286042 -162627 -96681 -133270 -137691 -65538 -53794 -173578 -291507
$$ packed form
35850C3448p5847Q1420J27343N5038j3091m1636p2174q8931o3496n2954r8856
35839b09736j17060m0197L4267M566m0064K6732J30584J23953M8800L9930N8984
35828F0759j7937j20109p1141Q1615J16042M660n4858O331L7043k7288n8774j1951
35816e5608j9289j08021r6732Q5651K28412J53692j2465o0718k904K9071K6938
35805A68027N2766O6498m75q6405q6059k9465k0294n2189l3436M0850P5352K5032
35793A20202m3713n0821l23K8557k8410j29553j49536l9566P8474O8161k0381
35782a66909l7826J9143K6916j9019J0562J23547J60417O3225l0287m1734p2388
35771C5647j60838j58968j883J23415O5946l6589m421P2153J1744j19784j17929
$$ plain form
35760 -291507 -273587 -160136 -43412 67286 152604 113757 -67725 -224448 -197095 -41350
35750 -41350 82357 134529 181499 233728 241849 209357 182805 157144 96092 20207 -19024 -24452
35738 -24452 -26459 -6710 59917 120982 102317 26475 -18734 -12488 -8236 -23662 -24220 -15862 -51212
35725 -51212 -122892 -142694 -63207 52724 122898 145330 165379 193253 201157 171497 108303 22644
35713 22644 -61278 -105676 -96881 -68683 -57022 -44010 15856 116387 189574 191420 159180 147967
35701 147967 140815 81081 -12284 -39013 37670 108047 48766 -99729 -175961 -111232 -11812
35690 -11812 -3956 -75854 -122683 -91871 -22643 26363 29473 -10322 -63486 -74602 -10120 84788
35678 84788 116824 50559 -44700 -76803 -38469 -3125 -22903 -69142 -85723 -65270 -39520 -17603
$$ packed form
35760b91507J7920J13451J16724J10698Q5318l8847j81482j56723K7353J55745
35750d1350J23707N2172M6970N2229Q121l2492k6552k5661o1052p5885l9231n428
35738b4452k007J9749O6627O1065j8665p5842m5209O246M252j5426n58Q358l5350
35725e1212p1680j9802P9487J15931P0174K2432K0049K7874P904k9660o3194q5659
35713B2644q3922m4398Q795K8198J1661J3012N9866J00531P3187J846l2240j1213
35701A47967p152n9734r3365k6729P6683P0377n9281j48495p6232O4729R9420
35690a1812P856p1898m6829L0812O9228M9006L110l9795n3164j1116O4482R4908
35678H4788L2036o6265r5259l2103L8334L5344j9778m6239j6581K0453K5750K1917
$$ plain form
35666 -17603 16370 46335 20925 -68241 -148516 -145758 -77682 -30229 -53927 -115262 -142561 -94240
35654 -94240 11971 116980 170721 172026 147503 98357 7313 -97317 -141587 -100828 -45905
35643 -45905 -53680 -110828 -147364 -127160 -64092 9386 43104 -15685 -148898 -244251 -204171 -53256
35631 -53256 104490 194674 198020 129960 57059 69235 159162 192649 83406 -73499 -142036
35620 -142036 -136776 -142298 -121055 20258 215110 286391 212164 150040 174239 185542 132095
35609 132095 116199 189791 232704 162288 101168 179147 293613 241805 15150 -201012 -275292
35598 -275292 -233191 -146061 -60079 -30694 -101548 -225238 -288836 -236879 -116150 -5544 45286
35587 45286 25239 -29326 -45752 10995 83381 81849 -12764 -139478 -227044 -245434 -218699 -211938
$$ packed form
35666a7603L3973K9965k5410q9166q0275K758O8076M7453k3698o1335k7299M8321
35654i4240J06211J05009N3741J305k4523m9146r1044j04630m4270M0759N4923
35643d5905p775n7148l6536K0204O3068P3478L3718n8789j33213r5353M0080J50915
35631e3256J57746R0184L346o8060p2901J2176Q9927L3487j09243j56905o8537
35620a42036N260n522K1243J41313J94852P1281p4227o2124K4199J1303n3447
35609A32095j5896P3592M2913p0416o1120P7979J14466n1808k26655k16162p4280
35598b75292M2101Q7130Q5982K9385p0854j23690o3598N1957J20729J10606N0830
35587D5286k0047n4565j6426N6747P2386j532r4613j26714q7566j8390K6735O761
$$ plain form
35575 -211938 -266399 -328324 -298939 -176912 -73295 -47358 -21328 76674 179972 188089 126686
35564 126686 93234 100457 88332 50526 30565 14406 -59269 -185013 -282512 -302555 -264120
35553 -264120 -200170 -144310 -147514 -220268 -280426 -250095 -177709 -161351 -181573 -139880 -50209 -39355
35541 -39355 -129513 -168693 -42731 163185 290303 292831 218032 92221 -70550 -204681 -241831
35530 -241831 -201686 -159291 -142872 -127945 -107802 -99289 -90832 -51817 7728 46400 63114 100307
35518 100307 162466 190893 153506 113960 159603 279354 365330 339413 234032 131412 63697
35507 63697 7174 -53309 -102183 -128983 -143864 -152300 -147120 -130605 -117293 -115812 -134087 -188489
35495 -188489 -267781 -307297 -257968 -165405 -104240 -46933 95274 291017 382830 319338 258215
$$ packed form
35575b11938n4461o1925K9385J22027J03617K5937K6030R8002J03298Q117o1403
35564A26686l3452P223j2125l7806j9961j6159p3675j25744r7499k0043L8435
35553b64120O3950N5860l204p2754o0158L0331P2386J6358k0222M1693Q9671J0854
35541c9355r0158l9180J25962K05916J27118K528p4799j25811j62771j34131l7150
35530b41831M0145M2395J6419J4927K0143Q513Q457L9015N9545L8672J6714L7193
35518A00307O2159K8427l7387l9546M5643J19751Q5976k5917j05381j02620o7715
35507F3697n6523o0483m8874k6800j4881q436N180J6515J3312J481j8275n4402
35495a88489p9292l9516M9329R2563O1165N7307J42207J95743R1813o3492o1123
$$ plain form
35484 258215 332671 431172 358583 143595 13168 77681 205816 239618 191431 165729 193196
35473 193196 224873 230233 224778 221473 205506 157381 82040 12151 -23089 -32750 -42306 -35093 26673
35460 26673 97152 46472 -160915 -358671 -357074 -187183 -50147 -46968 -87504 -70860 -22967
35449 -22967 -14196 -47178 -81997 -99527 -98310 -88701 -112618 -202827 -306812 -324986 -240519 -134589
35437 -134589 -62760 -7183 34168 18633 -44931 -74763 -37181 8239 29202 78371 170881
35426 170881 214652 142775 17282 -81633 -168245 -258220 -271620 -157911 -30160 -25674 -94487
35415 -94487 -85571 -4627 -11788 -160380 -305075 -310732 -212734 -112920 -35957 38997 99462 132946
35403 132946 172951 238955 277859 227725 105563 -15068 -79319 -67330 18479 135213 208621
$$ packed form
35484B58215P4456R8501p2589k14988j30427O4513J28135L3802m8187k5702K7467
35473A93196L1677N360n455l305j5967m8125p5341o9889l5240r661r556P213O1766
35460B6673P0479n0680k07387j97756J597J69891J37036L179m0536J6644M7893
35449b2967Q771l2982l4819j7530J217R609k3917r0209j03985j8174Q4467J05930
35437a34589P1829N5577M1351j5535o3564k9832L7582M5420K0963M9169R2510
35426A70881M3771p1877j25493r8915q6612q9975j3400J13709J27751M486o8813
35415i4487Q916Q0944p161j48592j44695n657R7998R9814P6963P4954O0465L3484
35403A32946M0005O6004L8904n0134j22162j20631o4251J1989Q5809J16734P3408
$$ plain form
35392 208621 211221 200015 231192 273992 263131 202067 147571 114472 69071 8072 -33641 -60602
35380 -60602 -123027 -219832 -268821 -217401 -121599 -61130 -29557 24215 88821 106701 72501 28160
35368 28160 -27386 -125447 -220515 -208983 -92023 -8461 -37787 -74364 3273 127055 137170
35357 137170 32214 -29362 34642 142824 215961 278159 336874 304133 138127 -37328 -70762
35346 -70762 18124 82060 47647 -28046 -78950 -108988 -146333 -193011 -230243 -228261 -162285 -62830
35334 -62830 -18677 -67075 -115151 -54069 72349 112880 19335 -92183 -105863 -30949 64261
35323 64261 139157 160665 104140 36368 90741 273051 393363 307131 137265 108741 221550
35312 221550 263977 135868 -29880 -102434 -126016 -175382 -199536 -132069 -35080 3992 25426
$$ packed form
35392B08621K600j1206L1177M2800j0861o1064n4496l3099m5401o0999m1713k6961
35380f0602o2425r6805m8989N1420R5802O0469L1573N3772O4606J7880l4200m4341
35368B8160n5546r8061r5068J1532J16960Q3562k9326l6577P7637J23782J0115
35357A37170j04956o1576O4004J08182P3137O2198N8715l2741j66006j75455l3434
35346g0762Q8886O3936l4413p5693n0904l0038l7345m6678l7232J982O5976R9455
35334f2830M4153m8398m8076O1082J26418M0531r3545j11518j3680P4914R5210
35323F4261P4896K1508n6525o7772N4373J82310J20312q6232j69866k8524J12809
35312B21550M2427j28109j65748p2554k3582m9366k4154O7467R6989L9072K1434
$$ plain form
35301 25426 104618 186734 174807 124140 166699 266855 247390 73715 -83179 -118901 -139258
35290 -139258 -239445 -316975 -242622 -80672 19138 48309 92648 133457 76921 -47223 -89713
35279 -89713 5828 138525 217007 257110 280095 238109 101374 -67610 -182992 -220194 -201995
35268 -201995 -162559 -146912 -177116 -195775 -116649 37996 124426 45976 -123117 -225542 -187344
35257 -187344 -63536 36686 34984 -68957 -202417 -289130 -316887 -310616 -264377 -165092 -67299
35246 -67299 -53428 -109178 -127705 -59124 33544 92852 139020 178254 146314 21488 -93686
35235 -93686 -98690 -40960 -38550 -101370 -130127 -71784 20533 85342 129132 182816 236649 248963
35223 248963 200181 125118 92696 141469 230313 274515 236946 157745 92982 61437 53178 43415
$$ packed form
35301B5426P9192Q2116j1927n0667M2559J00156j9465j73675j56894l5722k0357
35290a39258j00187p7530P4353J61950R9810K9171M4339M0809n6536j24144m2490
35279h9713R5541J32697P8482M0103K2985m1986j36735j68984j15382l7202J8199
35268b01995L9436J5647l0204j8659P9126J54645Q6430p8450j69093j02425L8198
35257a87344J23808J00222j702j03941j33460q6713k7757O271M6239R9285R7793
35246f7299J3871n5750j8527O8581R2668N9308M6168L9234l1940j24826j15174
35235i3686n004N7730K410o2820k8757N8343R2317O4809M3790N3684N3833J2314
35223B48963m8782p5063l2422M8773Q8844M4202l7569p9201o4763l1545q259r763
$$ plain form
35211 43415 -4666 -94267 -151206 -100014 7246 29765 -67790 -161580 -156355 -118675 -146887 -209780
35199 -209780 -217374 -172134 -136020 -109532 -61202 -25213 -43679 -52551 36769 162721 165430 17808
35187 17808 -135284 -190378 -197524 -216706 -205276 -130398 -72290 -101021 -132793 -37285 151131
35176 151131 254494 182635 36680 -41920 -34109 -8339 3698 22547 46827 42488 8943
35165 8943 -6380 22408 65618 95058 122198 144734 112369 6035 -94985 -104862 -61681 -75827
35153 -75827 -160714 -215072 -179362 -104454 -42810 15800 56833 9031 -121726 -193395 -111034
35142 -111034 10743 -4906 -135588 -182214 -47170 135146 178508 64439 -69014 -105965
35132 -105965 -66909 -51367 -96940 -126394 -59030 52255 65670 -59002 -196785 -222378 -159266
$$ packed form
35211D3415m8081q9601n6939N1192J07260K2519r7555r3790N225L7680k8212o2893
35199b09780p594M5240L6114K6488M8330L5989j8466q872Q9320J25952K709j47622
35187A7808j53092n5094p146j9182J1430P4878N8108k8731l1772R5508J88416
35176A51131J03363p1859j45955p8600P811K5770J2037J8849K4280m339l3545
35165H943j5323K8788M3210K9440K7140K2536l2365j06334j01020r877M3181j4146
35153g5827q4887n4358L5710P4908O1644N8610M1033m7802j30757p1669Q2361
35142a11034J21777j5649j30682m6626J35044J82316M3362j14069j33453l6951
35132a05965L9056J5542m5573k9454O7364J11285J3415j24672j37783k5593O3112
$$ plain form
35121 -159266 -107454 -97152 -89898 -66300 -32238 17808 71453 77574 23016 -21011 1397 44996
35109 44996 53462 62993 117530 151135 77921 -50537 -105593 -63559 -2750 45408 106147 149165
35097 149165 115248 50059 67362 171646 254480 275356 301784 350555 340375 245266 156563
35086 156563 138470 144733 128849 114681 104997 45357 -57115 -100285 -44119 15054 5381 -2113
35074 -2113 69341 154518 149944 83469 61388 101103 125662 89808 19203 -48715 -87246 -71966
35062 -71966 -14707 25321 20524 24905 88005 165025 179132 133329 89836 67711 29784 -44039
35050 -44039 -125189 -168372 -143050 -57452 23245 21898 -57005 -120814 -102554 -29078 50069 129082
35038 129082 195773 194041 109565 33357 59605 160568 232785 225402 151393 18980 -154916
$$ packed form
35121a59266N1812J0302P254K3598L4062N0046N3645O121n4558m4027K2408M3599
35109D4996Q466R531N4537L3605p3214j28458n5056M2034O0809M8158O0739M3018
35097A49165l3917o5189J7303J04284Q2834K0876K6428M8771j0180r5109q8703
35086A56563j8093O263j5884j4168r684n9640j02472m3170N6166N9173r673p494
35074b113P1454Q5177m574o6475k2081L9715K4559l5854p0605o7918l8531J5280
35062g1966N7259M0028m797M381O3100P7020J4107m5803m3493k2125l7927p3823
35050d4039q1150m3183K5322Q5598Q0697j347p8903o3809J8260P3476P9147P9013
35038A29082O6691j732q4476p6208K6248J00963P2217p383p4009j32413j73896
$$ plain form
35027 -154916 -287461 -284921 -165301 -55187 -46721 -105764 -134389 -86119 -3247 40701 22792
35016 22792 -10666 -14616 -11738 -47205 -95747 -86937 -28632 -18647 -99179 -179807 -158102 -52616
35004 -52616 37737 50954 -8634 -97322 -138069 -64060 83703 160061 77871 -85584 -197422
34993 -197422 -221745 -203918 -171153 -125644 -83556 -49742 -2876 37607 2224 -100044 -129361
34982 -129361 7203 195475 246937 141385 23197 -3752 35901 73992 63148 -15855 -111596
$$ packed form
35027a54916j32545K540J19620J10114Q466n9043k8625M8270Q2872M3948j7909
35016B2792l3458l950K878l5467m8542Q810N8305R985q0532q0628K1705J05486
35004e2616R0353J3217n9588q8688m0747P4009J47763P6358q2190j63455j11838
34993a97422k4323J7827L2765M5509M2088L3814M6866M0483l5383j02268k9317
34982a29361J36564J88272N1462j05552j18188k6949L9653L8091j0844p9003r5741
$$ [...]
##END NTUPLES=NMR SPECTRUM
##END=
