##TITLE=31Pdec_2PEDM2
 CDCl3, 24 sc
 26.7.2019
##JCAMPDX= 6.0         $$ Bruker NMR JCAMP-DX V2.0
##DATA TYPE= NMR SPECTRUM
##DATA CLASS= NTUPLES
##ORIGIN= UXNMR, Bruker Analytische Messtechnik GmbH
##OWNER= root
$$ XWIN-NMR		Version 3.5
$$ Fri Jul 26 14:08:39 2019 Russian Standard Time (UT+4h)  she@DPX200
##.OBSERVE FREQUENCY= 81.013821
##.OBSERVE NUCLEUS= ^31P
##.ACQUISITION MODE= SIMULTANEOUS
##.ACQUISITION SCHEME= undefined
##.AVERAGES= 24
##.DIGITISER RES= 17
##SPECTROMETER/DATA SYSTEM= spect
##.PULSE SEQUENCE= zgpg30
##.SOLVENT NAME= CDCl3
##.SHIFT REFERENCE= (INTERNAL, CDCl3, 0, 182.463)
##AUDIT TRAIL= $$ (NUMBER, WHEN, WHO, WHERE, WHAT)
$$ ##TITLE= Audit trail, XWIN-NMR		Version 3.5
$$ ##JCAMPDX= 5.01
$$ ##ORIGIN= Bruker BioSpin GmbH
$$ ##OWNER= she
$$ F:/spectra/data/she/nmr/P31/1/pdata/1/auditp.txt
$$ ##AUDIT TRAIL=  $$ (NUMBER, WHEN, WHO, WHERE, WHAT)
(   1,<2019-07-26 14:07:56.43 +0400>,<she>,<DPX200>,
      <created by zg, POWCHK disabled, PULCHK disabled
       configuration hash MD5:
       00 E9 B6 7A A2 85 ED C7 34 08 36 98 17 FE 4E 26
       data hash MD5: 32K
       C2 78 76 D9 D6 E2 B2 F7 E9 33 73 77 DA E5 E5 9F>)
(   2,<2019-07-26 14:07:59.01 +0400>,<she>,<DPX200>,
      <Start of raw data processing
       efp BC_mod = 2 LB = 1 FT_mod = 6 PKNL = 1 PHC0 = -373.732 PHC1 = 51.39999 SI = 64K 
       data hash MD5: 64K
       90 0A B8 6A 61 85 08 74 CC E8 09 58 41 02 B8 0A>)
(   3,<2019-07-26 14:08:09.54 +0400>,<she>,<DPX200>,
      <pk PHC0 = 0.9425753 PHC1 = 0 
       data hash MD5: 64K
       69 94 A8 F6 69 2D 94 21 9D 3E 7B 38 4E FD E4 4F>)
(   4,<2019-07-26 14:08:12.42 +0400>,<she>,<DPX200>,
      <abs ABSG = 5 
       data hash MD5: 64K
       41 E6 E4 06 C6 65 7E 8E DA CE 36 26 17 68 17 B4>)
$$ ##END=
$$ 
$$ hash MD5
$$ 2C B3 46 38 E5 0A A1 3A 05 12 C7 AF 64 96 8C D1
##$RELAX= 
##$RELAX= 
##$RELAX= 
##$RELAX= 
##$RELAX= 
##$RELAX= 
##$RELAX= 
##$RELAX= 
$$ Bruker specific parameters
$$ --------------------------
##$DU= <F:/spectra>
##$EXPNO= 1
##$NAME= <P31>
##$PROCNO= 1
##$TYPE= <nmr>
##$USER= <she>
##$AMP= (0..31)
100 100 100 100 100 100 100 100 100 100 100 100 100 100 100 100 100 100 
100 100 100 100 100 100 100 100 100 100 100 100 100 100 
##$AQSEQ= 0
##$AQ_mod= 1
##$AUNM= <au_zg>
##$AUTOPOS= <>
##$BF1= 81.014009
##$BF2= 200.13
##$BF3= 200.13
##$BF4= 200.13
##$BF5= 200.13
##$BF6= 200.13
##$BF7= 200.13
##$BF8= 200.13
##$BYTORDA= 1
##$CFDGTYP= 0
##$CFRGTYP= 5
##$CHEMSTR= <none>
##$CNST= (0..31)
1 1 145 1 1 1 1 1 1 1 1 1 1 1 1 1 1 1 1 1 1 1 1 1 1 1 1 1 1 1 1 1 
##$CPDPRG= <waltz16>
##$CPDPRG1= <>
##$CPDPRG2= <waltz16>
##$CPDPRG3= <>
##$CPDPRG4= <mlev>
##$CPDPRG5= <mlev>
##$CPDPRG6= <mlev>
##$CPDPRG7= <mlev>
##$CPDPRG8= <mlev>
##$CPDPRGB= <>
##$CPDPRGT= <>
##$D= (0..31)
0 1 0 0 0 0 0 0 0 0 0 0.03 2e-05 3e-06 0 0 0 0 0 0 0 0 0 0 0 0 0 0 0 0 
0 0 
##$DATE= 1564135675
##$DBL= (0..7)
120 120 120 11 120 120 24 19 
##$DBP= (0..7)
150 150 150 150 150 150 150 150 
##$DBP07= 0
##$DBPNAM0= <>
##$DBPNAM1= <>
##$DBPNAM2= <>
$$ [...]
##$SUBNAM3= <"">
##$SUBNAM4= <"">
##$SUBNAM5= <"">
##$SUBNAM6= <"">
##$SUBNAM7= <"">
##$SUBNAM8= <"">
##$SUBNAM9= <"">
##$SW= 369.568048894756
##$SWIBOX= (0..15)
0 1 3 0 0 0 0 0 0 0 0 0 0 0 0 0 
##$SW_h= 29940.119760479
##$TD= 32768
##$TD0= 1
##$TE= 0
##$TE2= 300
##$TE3= 300
##$TEG= 300
##$TL= (0..7)
0 120 53 12 22 120 120 120 
##$TP= (0..7)
150 150 150 150 150 150 150 150 
##$TP07= 0
##$TPNAME0= <>
##$TPNAME1= <>
##$TPNAME2= <>
##$TPNAME3= <>
##$TPNAME4= <>
##$TPNAME5= <>
##$TPNAME6= <>
##$TPNAME7= <>
##$TPOAL= (0..7)
0.5 0.5 0.5 0.5 0.5 0.5 0.5 0.5 
##$TPOFFS= (0..7)
0 0 0 0 0 0 0 0 
##$TUNHIN= 0
##$TUNHOUT= 0
##$TUNXOUT= 0
##$USERA1= <user>
##$USERA2= <user>
##$USERA3= <user>
##$USERA4= <user>
##$USERA5= <user>
##$V9= 5
##$VALIST= <valist>
##$VCLIST= <CCCCCCCCCCCCCCC>
##$VD= 0
##$VDLIST= <DDDDDDDDDDDDDDD>
##$VPLIST= <PPPPPPPPPPPPPPP>
##$VTLIST= <TTTTTTTTTTTTTTT>
##$WBST= 1024
##$WBSW= 4
##$XGAIN= (0..3)
0 0 0 0 
##$XL= 0
##$YL= 0
##$YMAX_a= 55769
##$YMIN_a= -54901
##$ZGOPTNS= <>
##$ZL1= 120
##$ZL2= 120
##$ZL3= 120
##$ZL4= 120
##$ABSF1= 182.463
##$ABSF2= -187.1042
##$ABSG= 5
##$ABSL= 3
##$ALPHA= 0
##$AQORDER= 0
##$ASSFAC= 0
##$ASSFACI= 0
##$ASSFACX= 0
##$ASSWID= 0
##$AUNMP= <proc_1d>
##$AZFE= 0.1
##$AZFW= 0.5
##$BCFW= 0
##$BC_mod= 2
##$BYTORDP= 0
##$COROFFS= 0
##$CY= -3
##$DATMOD= 1
##$DC= 0
##$DFILT= <>
##$DTYPP= 0
##$F1P= 0
##$F2P= 0
##$FCOR= 1
##$FTSIZE= 65536
##$FT_mod= 6
##$GAMMA= 0
##$GB= 0
##$INTBC= 1
##$INTSCL= 5.30512e-09
##$ISEN= 30
##$LB= 1
##$LEV0= 0
##$LPBIN= 0
##$MAXI= 10000
##$MC2= 0
##$MEAN= 0
##$ME_mod= 0
##$MI= 50
##$NCOEF= 0
##$NC_proc= -3
##$NLEV= 6
##$NOISF1= 182.463
##$NOISF2= 159.3651
##$NSP= 0
##$NTH_PI= 0
##$NZP= 0
##$OFFSET= 182.463
##$PC= 4
##$PHC0= -372.7894
##$PHC1= 51.39999
##$PH_mod= 1
##$PKNL= yes
##$PPARMOD= 0
##$PSCAL= 0
##$PSIGN= 0
##$REVERSE= no
##$SF= 81.0140089999434
##$SI= 65536
##$SIGF1= 159.3651
##$SIGF2= -187.1042
##$SINO= 113.3802
##$SIOLD= 16384
##$SREGLST= <1H.CDCl3>
##$SSB= 0
##$STSI= 65536
##$STSR= 0
##$SW_p= 29940.119760479
##$SYMM= 0
##$S_DEV= 0
##$TDeff= 32768
##$TDoff= 0
##$TI= <>
##$TILT= no
##$TM1= 0
##$TM2= 0
##$TOPLEV= 0
##$USERP1= <user>
##$USERP2= <user>
##$USERP3= <user>
##$USERP4= <user>
##$USERP5= <user>
##$WDW= 1
##$XDIM= 65536
##$YMAX_p= 390777906
##$YMIN_p= -1326210
$$ End of Bruker specific parameters
$$ ---------------------------------
##NTUPLES= NMR SPECTRUM
##VAR_NAME=  FREQUENCY,     SPECTRUM/REAL,   SPECTRUM/IMAG
##SYMBOL=    X,             R,               I
##VAR_TYPE=  INDEPENDENT,   DEPENDENT,       DEPENDENT
##VAR_FORM=  AFFN,          ASDF,            ASDF
##VAR_DIM=   65536,         65536,           65536
##UNITS=     HZ,            ARBITRARY UNITS, ARBITRARY UNITS
##FACTOR=    0.456856943014862, 1,           1
##FIRST=     14782.0589164792, 0,            0
##LAST=      -15158.0608439998, 0,           0
##MIN=       -15158.0608439998, -1326210,    0
##MAX=       14782.0589164792, 390777906,    0
$$ Real data points
##PAGE= N=1
##DATA TABLE= (X++(R..R)), XYDATA
$$ [...]
$$ plain form
41382 30490 40667 -98088 -269673 -273604 -113506 -5487 -93849 -285097 -384608 -309154 -150519
41371 -150519 -84010 -198183 -371073 -366888 -118275 154685 196874 31785 -82172 28449
41361 28449 281056 469684 477860 356281 243714 212780 192294 92682 -10973 47493 243905
41350 243905 332265 186356 -7274 -40544 11520 -19874 -64879 50570 229654 180900 -124862
41339 -124862 -367722 -320498 -126906 -32158 -53825 -67851 -58368 -110397 -237738 -356216 -388574
41328 -388574 -309896 -134101 71221 193379 160171 3566 -179660 -299814 -312716 -249273
41318 -249273 -212850 -281639 -404340 -452898 -376172 -234090 -92520 27995 100130 77234 -53182
41307 -53182 -264193 -514838 -709815 -699489 -455459 -199153 -179278 -331363 -352118 -134547
$$ packed form
41382C0490J0177j38755j71585l931J60098J08019q8362j91248r9511P5454J58635
41371a50519O6509j14173j72890M185K48613K72960M2189j65089j13957J10621
41361B8449K52607J88628Q176j21579j12567l0934k0486r9612j03655N8466J96412
41350B43905Q8360j45909j93630l3270N2064l1394m5005J15449J79084m8754l05762
41339a24862k42860M7224J93592R4748k1667j4026R483n2029j27341j18478l2358
41328c88574P8678J75795K05322J22158l3208j56605j83226j20154j2902O3443
41318b49273L6423o8789j22701m8558P6726J42082J41570J20515P2135k2896j30416
41307e3182k11011k50645j94977J0326K44030K56306J9875j52085k0755K17571
$$ plain form
41297 -134547 79105 45338 -178326 -378536 -451479 -400004 -234824 -33206 38719 -75421
41287 -75421 -208674 -207546 -167975 -256731 -401188 -382491 -195598 -83655 -184824 -339690 -321094
41276 -321094 -113755 115897 230161 220838 156146 91202 20303 -92866 -230344 -308660 -300002
41265 -300002 -302913 -395583 -467559 -340262 -55526 111388 -13817 -283504 -429704 -386632
41255 -386632 -297104 -265285 -250651 -207722 -188889 -238317 -279332 -216635 -110628 -122658 -265926
41244 -265926 -334543 -161994 142294 335407 363295 388318 502989 586409 501984 291182
41234 291182 79557 -88724 -215055 -255051 -198562 -159846 -239452 -349247 -325018 -176059
41224 -176059 -65569 -65293 -101296 -141570 -239095 -337629 -238177 113854 456961 490899 244955
$$ packed form
41297a34547K13652l3767k23664k00210p2943N1475J65180K01618P1925j14140
41287g5421j33253J128L9571q8756j44457J8697J86893J11943j01169j54866J8596
41276c21094K07339K29652J14264r323o4692o4944p0899j13169j37478p8316Q658
41265c00002k911r2670p1976J27297K84736J66914j25205k69687j46200M3072
41255c86632Q9528L1819J4634M2929J8833m9428m1015O2697J06007j2030j43268
41244b65926o8617J72549L04288J93113K7888K5023J14671Q3420q4425k10802
41234B91182k11625j68281j26331l9996N6489L8716p9606j09795K4229J48959
41224a76059J10490K76l6003m0274r7525r8534R9452L52031L43107L3938k45944
$$ plain form
41213 244955 18807 3471 110993 171446 151645 128328 141151 145672 82430 -46933 -166039
41202 -166039 -188003 -117343 -71412 -148258 -277090 -272971 -69147 175380 258283 165307 33832
41191 33832 -67793 -187905 -311498 -303696 -134372 -13701 -126345 -321968 -301626 -85406
41181 -85406 -15016 -222535 -397430 -275403 -93366 -240068 -615645 -733774 -445290 -165969
41171 -165969 -266807 -571079 -664258 -456392 -187862 -42962 -21167 -98472 -254401 -357633
41161 -357633 -254098 -4359 141819 60765 -86027 -64263 154374 374437 379770 131621
41151 131621 -191387 -349778 -274991 -121191 -58808 -90076 -129588 -157387 -162804 -36792 281073
41140 281073 587517 569518 204546 -187375 -345975 -338111 -343842 -369421 -320245 -219054 -170800
$$ packed form
41213B44955k26148j5336J07522O0453j9801k3317J2823M521o3242j29363j19106
41202a66039k1964P0660M5931p6846j28832M119K03824K44527Q2903r2976j31475
41191C3832j01625j20112j23593P802J69324J20671j12644j95623K0342K16220
41181h5406P0390k07519j74895J22027J82037j46702l75577j18129K88484K79321
41171a65969j00838l04272r3179K07866K68530J44900K1795p7305j55929j03232
41161c57633J03535K49739J46178q1054j46792K1764K18637K20063N333k48149
41151A31621l23008j58391P4787J53800O2383l1268l9512k7799n417J26012L17865
41140B81073L06444j7999l64972l91921j58600P864n731k5579M9176J01191M8254
$$ plain form
41129 -170800 -171282 -104889 82478 317424 496795 569044 529242 406613 263071 160308 116622
41118 116622 95716 23008 -159502 -399328 -526230 -430410 -226077 -122774 -154265 -184123
41108 -184123 -166298 -195116 -262980 -206732 3773 156098 121887 72105 182029 338894 373295
41097 373295 369334 451238 449082 149169 -236541 -271227 52207 277172 171687 44952 220609
41086 220609 550997 684820 549820 326776 142154 15341 -39695 -61305 -159633 -320980
41076 -320980 -337218 -104819 154671 169524 -16734 -157248 -160603 -121238 -89549 -41335 -14532
41065 -14532 -58347 -88073 6916 148369 160776 43216 -50964 -76282 -124691 -206238 -220852
41054 -220852 -162747 -137056 -139550 -35069 182577 312999 224597 38279 -61523 -51252 -4842
$$ packed form
41129a70800m82O6393J87367K34946J79371P2249l9802j22629j43542j02763m3686
41118A16622k0906p2708j82510k39826j26902R5820K04333J03303l1491k9858
41108a84123J7825k8818o7864N6248K10505J52325l4211m9782J09924J56865L4401
41097C73295l961Q1904k156k99913l85710l4686L23434K24965j05485j26735J75657
41086B20609L30388J33823j35000k23044j84622j26813n5036k1610r8328j61347
41076c20980j6238K32399K59490J4853j86258j40514l355L9365L1689M8214K6803
41065a4532m3815k9726R4989J41453J2407j17560r4180k5318m8409q1547j4614
41054b20852N8105K5691k494J04481K17646J30422q8402j86318r9802J0271M6410
$$ plain form
41043 -4842 56736 138080 196578 205930 213957 249743 248925 153072 14694 -72245 -86276 -59733
41031 -59733 -7108 68304 148329 221895 277084 254691 102042 -98714 -173307 -82877 12521
41020 12521 -2285 -17545 116911 331598 412865 277798 28680 -221324 -421009 -504473
41010 -504473 -421378 -277765 -282455 -468641 -594922 -438812 -106455 84286 -3175 -187188
41000 -187188 -242730 -179119 -157249 -220759 -248253 -164310 -61262 -45603 -54899 66420 335543
40989 335543 574548 606599 442911 235686 86390 -40524 -209772 -378807 -431952 -344447
40979 -344447 -230719 -187112 -173959 -144641 -198977 -435973 -697363 -689866 -405012 -176132 -205833
40968 -205833 -279736 -142090 65441 24377 -240794 -389413 -270815 -96951 -87990 -216154
$$ packed form
41043d842O1578Q1344N8498R352Q027L5786q18r5853j38378q6939j4031K6543
41031e9733N2625P5412Q0025P3566N5189k2393j52649k00756p4593R0430R5398
41020A2521j4806j5260J34456K14687Q1267j35067k49118k50004j99685q3464
41010e04473Q3095J43613m690j86186j26281J56110L32357J90741q7461j84013
41000a87188n5542O3611K1870o3510k7494Q3943J03048J5659r296J21319K69123
40989C35543K39005L2051j63688k07225j49296j26914j69248j69035n3145Q7505
40979c44447J13728M3607J3153K9318n4336k36996k61390P497K84854K28880k9701
40968b05833p3903J37646K07531m1064k65171j48619J18598J73864Q961j28164
$$ plain form
40958 -216154 -349597 -403429 -289306 39334 408063 521919 349611 188262 233430 315735
40948 315735 218755 36760 3722 127752 223173 206095 148014 95941 27121 -43864 -64368
40937 -64368 -42447 -45172 -117018 -258917 -431167 -530786 -465088 -308356 -262028 -381468 -483664
40926 -483664 -421142 -282126 -188647 -76662 136912 328425 336181 235629 208285 230990 148696
40915 148696 -12032 -74088 -26920 -39751 -143949 -164997 -25969 117938 130631 78599 69535
40904 69535 78457 32967 -64061 -179130 -298042 -371199 -327257 -191469 -72005 6223 114940
40893 114940 231160 198374 -39390 -309706 -415470 -348245 -212136 -62563 67567 91541
40883 91541 -42504 -240062 -345705 -308106 -190768 -69617 7832 9463 -57331 -128136 -133152
$$ packed form
40958b16154j33443n3832J14123L28640L68729J13856j72308j61349M5168Q2305
40948C15735r6980j81995l3038J24030R5421j7078n8081n2073o8820p0985k0504
40937f4368K1921k725p1846j41899j72250r9619O5698J56732M6328j19440j02196
40926d83664O2522J39016R3479J11985K13574J91513P756j00552k7344K2705q2294
40915A48696j60728o2056M7168j2831j04198k1048J39028J43907J2693n2032r064
40904F9535Q922m5490r7028j15069j18912p3157M3942J35788J19464P8228J08717
40893A14940J16220l2786k37764k70316j05764O7225J36109J49573J30130K3974
40883I1541j34045j97558j05643L7599J17338J21151P7449J631o6794p0805n016
$$ plain form
40872 -133152 -49155 102159 249189 265134 67987 -239142 -423866 -368897 -172257 33062
40862 33062 233886 433325 526886 429177 250883 190649 270132 319026 233722 115383 100484
40851 100484 169043 216485 245389 354580 536510 621550 508133 353497 393053 603163
40841 603163 715110 593598 415751 376535 398601 309258 161619 140930 224971 203389 37119
40830 37119 -62155 19684 103004 -7221 -218372 -275699 -94247 155899 242107 73279 -240265
40819 -240265 -490017 -572132 -572747 -586410 -529470 -297040 -39770 -33324 -260688 -394082 -260007
40808 -260007 -48516 47092 105700 221721 262737 132536 29053 135119 244208 42403
40798 42403 -355079 -513526 -287678 19513 125733 85344 71236 112363 152228 159360 78159
$$ packed form
40872a33152Q3997J51314J47030J5945j97147l07129j84724N4969J96640K05319
40862C3062K00824J99439R3561r7709j78294o0234P9483M8894q5304j18339j4899
40851A00484O8559M7442K8904J09191J81930Q5040j13417j54636L9556K10110
40841F03163J11947j21512j77847l9216K2066q9343j47639k0689Q4041k1582j66270
40830C7119r9274Q1839Q3320j10225k11151n7327J81452K50146Q6208j68828l13544
40819b40265k49752q2115o15j3663N6940K32430K57270O446k27364j33394J34075
40808b60007K11491R5608N8608J16021M1016j30201j03483J06066J09089k01805
40798D2403l97482j58447K25848L07191J06220m0389j4108M1127L9865P132q1201
$$ plain form
40787 78159 -162940 -504786 -752417 -783573 -655981 -486470 -346694 -280149 -277433 -235083 -92734
40776 -92734 7144 -115128 -365559 -456962 -310722 -128117 -26811 105886 307591 391953
40766 391953 264858 111372 68246 -20788 -271527 -438917 -265044 42614 70354 -164681
40756 -164681 -248167 -33746 133840 -41099 -398481 -621812 -650309 -586681 -437780 -200565
40746 -200565 -41082 -117568 -304111 -329719 -156296 -1300 6141 -23186 33611 129210 175909
40735 175909 201398 259272 292424 215099 72312 -6695 6931 16981 -25597 -26057 120686
40724 120686 348985 443629 257237 -112922 -385030 -346218 -54351 219277 247412 30548
40714 30548 -264124 -485877 -587259 -586628 -525727 -452899 -376360 -235150 10922 261547 340079
$$ packed form
40787G8159k41099l41846k47631l1156J27592J69511J39776O6545K716M2350J42349
40776i2734R9878j22272k50431r1403J46240J82605J01306J32697K01705Q4362
40766C91953j27095j53486m3126q9034k50739j67390J73873L07658K7740k35035
40756a64681q3486K14421J67586j74939l57382k23331k8497O3628J48901K37215
40746b00565J59483p6486j86543k5608J73423J54996P441k9327N6797R5599M6699
40735A75909K5489N7874L3152p7325j42787p9007J3626J0050m2578m60J46743
40724A20686K28299R4644j86392l70159k72108L8812K91867K73628K8135k16864
40714C0548k94672k21753j01382O31O0901P2828P6539J41210K46072K50625P8532
$$ plain form
40703 340079 207408 17364 -90703 -149635 -228697 -249397 -92288 165371 303878 268465
40693 268465 245233 362490 477798 386309 124893 -85288 -135009 -107321 -89173 -68405 -40414
40682 -40414 -64498 -147727 -193461 -153414 -135126 -245864 -389265 -347988 -67883 247450 360618
40671 360618 249006 85728 17558 22211 -11089 -110452 -190139 -198678 -221043 -346707 -477415
40660 -477415 -411063 -149619 31381 -75125 -325047 -430242 -341184 -224390 -128706 65467
40650 65467 343760 473338 337745 141487 121546 223714 246270 166061 108270 83312 -13167
40639 -13167 -167120 -233716 -178890 -143855 -220303 -321766 -345275 -327337 -355155 -417868 -431068
40628 -431068 -356860 -241282 -166001 -191784 -314275 -457291 -535814 -524153 -444215 -325278 -214976
$$ packed form
40703C40079j32671j90044j08067n8932p9062k0700J57109K57659J38507l5413
40693B68465k3232J17257J15308r1489k61416k10181m9721K7688J8148K0768K7991
40682d0414k4084q3229m5734M0047J8288j10738j43401M1277K80105L15333J13168
40671C60618j11612j63278o8170M653l3300r9363p9687q539k2365j25664j30708
40660d77415O6352K61444J81000j06506k49922j05195Q9058J16794R5684J94173
40650F5467K78293J29578j35593j96258j9941J02168K2556q0209n7791k4958r6479
40639a3167j53953o6596N4826L5035p6448j01463k3509J7938k7818o2713j3200
40628d31068P4208J15578P5281k5783j22491j43016p8523J1661P9938J18937J10302
$$ plain form
40617 -214976 -175338 -207313 -235891 -230034 -252195 -310873 -287835 -144326 -64233 -194518 -362405
40606 -362405 -308616 -117743 -102739 -288029 -364692 -215438 -114633 -258033 -434209 -387864
40596 -387864 -226794 -197422 -271961 -246123 -96855 29804 78284 84587 15568 -156104 -303207
40585 -303207 -300077 -243551 -286338 -338080 -196084 82778 222192 135061 34659 110455 316065
40574 316065 510851 608967 557432 360130 160046 123623 215346 245360 141313 360
40564 360 -113572 -219296 -270036 -184201 -46356 -45693 -176605 -237468 -173309 -157005 -249877 -264521
40552 -264521 -106422 16702 -74292 -215350 -151878 61876 165868 86539 -17485 -44398
40542 -44398 -61978 -138706 -231606 -252765 -140392 113033 413156 596278 602445 547297 528741
$$ packed form
40617b14976L9638l1975k8578N857k2161n8678K3038J43509Q0093j30285j67887
40606c62405N3789J90873J5004j85290p6663J49254J00805j43400j76176M6345
40596c87864J61070K9372p4539K5838J49268J26659M8480O303o9019j71672j47103
40585c03207L130N6526m2787n1742J41996K78862J39414q7131j00402P5796K05610
40574C16065J94786R8116n1535j97302k00084l6423R1723L0014j04047j40953
40564C60j13932j05724n0740Q5835J37845O63j30912o0863O4159J6304r2872j4644
40552b64521J58099J23124r0994j41058O3472K13754J03992p9329j04024k6913
40542d4398j7580p6728r2900k1159J12373K53425L00123J83122O167n5148j8556
$$ plain form
40531 528741 468168 281285 95995 101625 241691 272862 117465 -56742 -132739 -203762 -357290
40520 -357290 -490322 -471287 -351468 -268226 -226017 -127398 21260 87771 6288 -130060 -200642
40509 -200642 -188332 -144901 -113487 -131674 -223954 -323099 -284076 -76144 107424 59742 -162265
40498 -162265 -315824 -300871 -234304 -194109 -108178 31347 68788 -57025 -152307 -55487 80612
40487 80612 21093 -166570 -218431 -76890 87337 203216 348935 470715 362255 6345
40477 6345 -321827 -397680 -281407 -125831 22739 123225 67295 -133870 -266716 -179216
40467 -179216 6706 80098 9380 -98376 -181980 -245900 -297839 -360114 -437690 -420531 -174923
40456 -174923 201241 408044 330140 194718 224355 351544 433503 515148 658358 717299
$$ packed form
40531E28741o0573j86883j85290N630J40066L1171j55397j74207p5997p1023j53528
40520c57290j33032J9035J19819Q3242M2209R8619J48658O6511q1483j36348p0582
40509b00642J2310M3431L1414j8187r2280r9145L9023K07932J83568m7682k22007
40498a62265j53559J4953O6567M0195Q5931J39525L7441j25813r5282R6820J36099
40487H0612n9519j87663n1861J41541J64227J15879J45719J21780j08460l55910
40477F345l28172p5853J16273J55576J48570J00486n5930k01165j32846Q7500
40467a79216J85922P3392p0718j07756q3604o3920n1939o2275p7576J7159K45608
40456a74923L76164K06803p7904j35422K9637J27189Q1959Q1645J43210N8941
$$ plain form
40446 717299 551341 308578 221737 236755 120637 -145634 -357301 -414776 -398731 -348673
40436 -348673 -220337 -55423 38590 78480 164889 263909 243797 118209 24756 -42647 -235663
40425 -235663 -539641 -692469 -515509 -161662 61774 10356 -206822 -354951 -267775 -3929
40415 -3929 192148 163285 23061 -31100 8026 22110 -3109 -26042 -138069 -438919 -761000
40404 -761000 -798095 -519047 -189464 34118 246216 481709 569604 420024 204547 111566
40394 111566 127418 170916 226806 225824 23071 -344924 -586085 -511028 -293195 -204397 -259060
40383 -259060 -299081 -270385 -210209 -91142 99359 208713 68787 -230533 -394118 -251907
40373 -251907 78750 346254 386793 214570 -30184 -220903 -339850 -398946 -325198 -70220
$$ packed form
40446G17299j65958k42763q6841J5018j16118k66271k11667n7475J6045N0058
40436c48673J28336J64914R4013L9890Q6409R9020k0112j25588r3453o7403j93016
40425b35663l03978j52828J76960L53847K23436n1418k17178j48129Q7176K63846
40415c929J96077k8863j40224n4161L9126J4084k5219k2933j12027l00850l22081
40404g61000l7095K79048L29583K23582K12098K35493Q7895j49580k15477r2981
40394A11566J5852M3498N5890r82k02753l67995k41161P5057K17833Q8798n4663
40383b59060m0021K8696O0176J19067J90501J09354j39926k99320j63585J42211
40373b51907L30657K67504M0539j72223k44754j90719j18947n9096P3748K54978
$$ plain form
40363 -70220 199257 240672 91777 35412 136948 114425 -172199 -410442 -281592 28450
40353 28450 95750 -130492 -335805 -360237 -345752 -385841 -374277 -254201 -131731 -70772 -15044
40342 -15044 25533 -51525 -204563 -214566 2471 244413 299568 203850 102430 13126 -127188
40331 -127188 -296232 -415253 -478026 -530996 -568480 -542287 -445811 -319996 -201634 -110670 -55841
40320 -55841 -17563 43580 139634 244123 323813 341141 251785 70780 -85861 -119943 -93157
40309 -93157 -143662 -278432 -378704 -404684 -436150 -486777 -452913 -310507 -192343 -170857 -123022
40298 -123022 54060 224937 176633 -85114 -355268 -487529 -489653 -410649 -283550 -157753
40288 -157753 -53411 96555 328239 500592 432109 188114 54472 171334 353651 363978
$$ packed form
40363g0220K69477M1415j48895n6365J01536k2523k86624k38243J28850L10042
40353B8450O7300k26242k05313k4432J4485m0089J1564J20076J22470O0959N5728
40342a5044M0577p7058j53038j0003K17037K41942N5155r5718j01420q9304j40314
40331a27188j69044j19021o2773n2970l7484K6193R6476J25815J18362R0964N4829
40320e5841L8278O1143R6054J04489P9690J7328q9356j81005j56641l4082K6786
40309i3157n0505j34770j00272k5980l1466n0627L3864J42406J18164K1486M7835
40298a23022J77082J70877m8304k61747k70154j32261k124P9004J27099J25797
40288a57753J04342J49966K31684J72353o8483k43995j33642J16862J82317J0327
$$ plain form
40278 363978 221460 112259 98680 80385 5935 -38933 15244 96064 81536 -41616 -173204
40267 -173204 -231506 -241050 -279186 -359799 -400736 -322156 -155005 -9764 56280 77237 67868
40256 67868 -38291 -269122 -500490 -574494 -506627 -455918 -484115 -474461 -336516 -167638 -117340
40245 -117340 -178000 -221559 -191890 -145333 -122433 -91843 -30766 29811 63683 89542 135319
40234 135319 207435 290763 331859 250627 45432 -139491 -155723 -51462 -8462 -65916 -54048
40223 -54048 135277 353249 380588 205927 -9722 -166686 -274094 -309220 -203788 6462
40213 6462 165330 191758 186091 269154 398856 434776 330654 165923 11147 -131681 -237829
40202 -237829 -211901 -7698 253112 372776 288084 116672 -17856 -120959 -238752 -317820
$$ packed form
40278C63978j42518j09201j3579j8295p4450m4868N4177Q0820j4528j23152j31588
40267a73204n8302r544l8136q0613m0937P8580J67151J45241O6044K0957r369
40256F7868j06159k30831k31368p4004O7867N0709k8197R654J37945J68878N0298
40245a17340o0660m3559K9669M6557K2900L0590O1077O0577L3872K5859M5777
40234A35319P2116Q3328M1096q1232k05195j84923j6232J04261M3000n7454J1868
40223e4048J89325K17972K7339j74661k15649j56964j07408l5126J05432K10250
40213F462J58868K6428n667Q3063J29702L5920j04122j64731j54776j42828j06148
40202b37829K5928K04203K60810J19664q4692j71412j34528j03103j17793p9068
$$ plain form
40192 -317820 -257258 -74432 83572 104743 11479 -109505 -189523 -173735 -35047 157795
40182 157795 270433 263375 246657 302118 330482 185866 -84298 -265260 -245820 -147282 -140019
40171 -140019 -218823 -228740 -73896 161976 303964 270507 167153 191413 424128 719412
40161 719412 833721 668561 352612 82024 -66876 -139629 -179539 -174097 -107391 7534
40151 7534 155764 310063 375612 236842 -69826 -300339 -230361 83452 372928 474505
40141 474505 450438 388119 244590 -23040 -308625 -469369 -502683 -486496 -421505 -278773
40131 -278773 -147419 -167294 -327118 -477944 -540398 -548980 -496347 -313634 -46664 117285
40121 117285 73718 -83752 -241154 -415706 -636544 -806508 -811666 -683956 -535654 -394877
$$ packed form
40192c17820O0562J82826J58004K1171r3264j20984q0018J5788J38688J92842
40182A57795J12638p058j6718N5461K8364j44616k70164j80962J9440R8538P263
40171a40019p8804r917J54844K35872J41988l3457j03354K4260K32715K95284
40161G19412J14309j65160l15949k70588j48900p2753l9910N442O6706J14925
40151G534J48230J54299O5549j38770l06668k30513O9978L13813K89476J01577
40141D74505k4067o2319j43529k67630k85585j60744l3314J6187O4991J42732
40131b78773J31354j9875j59824j50826o2454q582N2633J82713K66970J63949
40121A17285m3567j57470j57402j74552k20838j69964n158J27710J48302J40777
$$ plain form
40111 -394877 -218010 -18795 126065 184734 200841 221519 249705 262320 246472 228818 264301
40100 264301 351977 382001 255851 57064 -15713 85554 182645 112180 -77221 -233442
40090 -233442 -287287 -250378 -140027 -454 96020 151674 245232 355748 320585 83221 -154020
40079 -154020 -178486 -54922 8488 -15732 9588 100646 107879 -27841 -162909 -146478 9208
40068 9208 197945 336773 363818 229714 -30949 -280179 -396052 -389204 -361086 -362017 -335142
40057 -335142 -226134 -116868 -160684 -344527 -428437 -249825 4547 31760 -133520 -165871
40047 -165871 32469 173719 58025 -112972 -99540 -7511 -24959 -24053 213116 532621 565880
40036 565880 283529 21338 -36378 -45921 -141289 -216911 -165921 -59014 20631 95856 162795
$$ packed form
40111c94877J76867J99215J44860N8669J6107K0678K8186J2615j5848j7654L5483
40100B64301Q7676L0024j26150j98787p2777J01267R7091p0465j89401j56221
40090b33442n3845L6909J10351J39573R6474N5654R3558J10516l5163k37364k37241
40079a54020k4466J23564O3410k4220K5320R1058P233j35720j35068J6431J55686
40068I208J88737J38828K7045j34104k60663k49230j15873O848K8118r31K6875
40057c35142J09008J09266m3816j83843q3910J78612K54372K7213j65280l2351
40047a65871J98340J41250j15694j70997J3432R2029j7448R06K37169L19505L3259
40036E65880k82351k62191n7716r543r5368p5622N0990J06907P9645P5225O6939
$$ plain form
40025 162795 146545 58841 -2050 -57940 -230559 -458353 -489390 -259611 -33750 -35992 -163565
40014 -163565 -216097 -194002 -187162 -153617 -18904 136250 186095 160348 160718 169414 114871 47920
40002 47920 68421 126709 80369 -67119 -152694 -93613 4196 17695 -35775 -81210 -133570
39991 -133570 -253707 -383716 -352412 -110822 124007 92081 -162674 -327800 -241169 -92010
39981 -92010 -97237 -167076 -91052 86068 134075 15962 -72350 -32418 23990 20560 26922 60027
39969 60027 4093 -175177 -327576 -331454 -253130 -207948 -207847 -222182 -249282 -258189 -192712 -91465
39957 -91465 -73652 -160882 -241954 -237724 -162944 -30352 132203 183434 7224 -243060 -280183
39946 -280183 -86457 77361 95308 126206 243938 282504 172600 106129 183980 208348 45383
$$ packed form
40025A62795j6250q7704o0891n5890j72619k27794l1037K29779K25861k242j27573
40014a63565n2532K2095O840L3545J34713J55154M9845k5747L70Q696n4543o6951
40002D7920K0501N8288m6340j47488q5575N9081R7809J3499n3470m5435n2360
39991a33570j20137j30009L1304K41590K34829l1926k54755j65126Q6631J49159
39981i2010n227o9839P6024J77120M8007j18113q8312L9932N6408l430O362L3105
39969F0027n5934j79270j52399l878P8324M5182J01j4335k7100q907O5477J01247
39957i1465J7813q7230q1072M230P4780J32592J62555N1231j76210k50284l7123
39946b80183J93726J63818J7947L0898J17732L8566j09904o6471P7851K4368j62965
$$ plain form
39935 45383 -94688 -2141 155189 86826 -178709 -380268 -393136 -263043 -31299 221081
39925 221081 301972 137482 -49067 -20097 141520 203117 140622 82505 37224 -59022 -137923
39914 -137923 -100365 -19044 1721 49681 234019 416621 396812 258963 237859 317992 272787
39903 272787 55882 -140561 -195329 -160095 -77524 48439 128127 78408 8865 77592 205424
39892 205424 180549 -971 -157206 -232066 -310544 -363605 -268960 -73115 46439 73788 141784
39881 141784 246076 251472 167507 132094 141259 96108 87701 286015 547054 516759 180458
39870 180458 -79616 -69587 -32846 -170387 -309330 -274615 -239432 -411989 -634348 -600781
39860 -600781 -304124 7292 190441 280925 297979 200324 2320 -216119 -384000 -442289
$$ packed form
39935D5383j40071R2547J57330o8363k65535k01559j2868J30093K31744K52380
39925B21081Q0891j64490j86549K8970J61617O1597o2495n8117m5281r6246p8901
39914a37923L7558Q1321K0765M7960J84338J82602j9809j37849k1104Q0133m5205
39903B72787k16905j96443n4768L5234Q2571J25963P9688m9719o9543O8727J27832
39892B05424k4875j81520j56235p4860p8478n3061R4645J95845J19554K7349O7996
39881A41784J04292N396q3965l5413R165m5151q407J98314K61039l0295l36301
39870A80458k60074J0029L6741j37541j38943L4715L5183j72557k22359L3567
39860f00781K96657L11416J83149R0484J7054r7655j98004k18439j67881n8289
$$ plain form
39850 -442289 -354860 -192414 -99285 -97066 -40686 143940 310542 293427 146610 58842 105832
39839 105832 195213 209447 121516 -5698 -95209 -145596 -223911 -330412 -342870 -186328 31617
39828 31617 184976 317809 486578 539469 317714 -6900 -109765 1736 13653 -175876
39818 -175876 -319212 -262582 -165923 -159301 -121244 32258 139407 62244 -91116 -185045 -251239
39807 -251239 -309712 -259731 -118860 -93523 -214924 -189848 142985 473358 421468 64827
39797 64827 -225954 -296516 -261750 -201970 -107460 -30363 -26247 -13827 91130 189886 147359
39786 147359 16559 -83738 -191823 -383427 -548607 -529899 -393540 -326228 -330756 -248759
39776 -248759 -32637 207584 375775 430084 329842 128464 33648 171421 364079 352032
$$ packed form
39850d42289Q7429J62446R3129K219N6380J84626J66602j7115j46817q7768M6990
39839A05832Q9381J4234q7931j27214q9511n0387p8315j06501j2458J56542K17945
39828C1617J53359J32833J68769N2891k21755l24614j02865J11501J1917j89529
39818a75876j43336N6630R6659O622L8057J53502J07149p7163j53360r3929o6194
39807b51239n8473M9981J40871K5337j21401K5076L32833L30373n1890l56641
39797F4827k90781p0562L4766N9780R4510P7097M116J2420J04957R8756m2527
39786A47359j30800j00297j08085j91604j65180J8708J36359O7312m528Q1997
39776b48759K16122K40221J68191N4309j00242k01378r4816J37773J92658j2047
$$ plain form
39766 352032 176560 127083 336093 618669 709421 516947 166510 -100210 -120414 9476
39756 9476 43954 -57399 -67381 106598 203741 7927 -265625 -277532 -86984 -35105 -213707
39745 -213707 -389366 -407948 -354246 -316262 -278291 -260735 -312653 -352411 -244045 -35179 92954
39734 92954 96140 75535 51465 -36120 -130920 -116873 -64154 -165709 -413112 -573326 -514159
39723 -514159 -337720 -176693 -71618 -58725 -161708 -281082 -294803 -264835 -334123 -443216
39713 -443216 -394377 -187142 -26192 13918 57928 137313 116649 -21541 -90727 10086 163372
39702 163372 273887 401717 563955 643404 603704 573365 606348 573948 406401 230262
39692 230262 148363 90716 3881 -25998 23204 -1559 -169160 -292539 -210201 -66839 -90173
$$ packed form
39766C52032j75472m9477K09010K82576R0752j92474l50437k66720k0204J29890
39756I476L4478j01353r982J73979R7143j95814k73552j1907J90548N1879j78602
39745b13707j75659j8582N3702L7984L7971J7556n1918l9758J08366K08866J28133
39734I2954L186k0605k4070q7585r4800J4047N2719j01555k47403j60214N9167
39723e14159J76439J61027J05075J2893j02983j19374j3721K9968o9288j09093
39713d43216M8839K07235J60950M0110M4010P9385k0664j38190o9186J00813J53286
39702A63372J10515J27830J62238P9449l9700l0339L2983l2400j67547j76139
39692B30262q1899n7647q6835k9879M9202k4763j67601j23379Q2338J43362k3334
$$ plain form
39681 -90173 -214399 -169566 105790 363696 375404 199244 66629 93451 171553 131297 -35432
39670 -35432 -166217 -143834 -32965 49781 92123 113885 67868 -28751 5137 258152 477904
39659 477904 361840 32580 -101975 49516 157345 20553 -150462 -133763 -30000 1346
39649 1346 39802 198400 357064 344964 204575 58973 -101408 -283977 -333941 -159461
39639 -159461 34673 -767 -186073 -241925 -98515 78552 203280 345362 502326 531238
39629 531238 346209 25043 -292416 -481403 -436338 -161155 143913 238478 111459 -17071
39619 -17071 27090 198487 343231 383028 361954 373634 454543 516439 414667 132006 -148977
39608 -148977 -225590 -99250 38258 14783 -175508 -399443 -505908 -447725 -322755 -265432
$$ packed form
39681i0173j24226M4833K75356K57906J1708j76160j32615K6822P8102m0256j66729
39670c5432j30785K2383J10869Q2746M2342K1762m6017r6619L3888K53015K19752
39659D77904j16064l29260j34555J51491J07829j36792j71015J6699J03763L1346
39649A346L8456J58598J58664j2100j40389j45602j60381j82569m9964J74480
39639a59461J94134l5440j85306n5852J43410J77067J24728J42082J56964K8912
39629E31238j85029l21166l17459j88987M5065K75183L05068R4565j27019j28530
39619a7071M4161J71397J44744L9797k1074J1680Q0909O1896j01772k82661k80983
39608a48977p6613J26340J37508k3475j90291k23935j06465N8183J24970N7323
$$ plain form
39598 -265432 -280539 -242419 -87347 64568 35810 -201207 -487421 -627896 -567626 -437181
39588 -437181 -404153 -456210 -403343 -159556 89022 131811 34976 -9681 -38102 -228447 -498389
39577 -498389 -536279 -302929 -155985 -317412 -530354 -471214 -239974 -159601 -271887 -329845
39567 -329845 -192135 38511 219726 297263 267201 190360 202718 351804 472402 379840
39557 379840 137293 -22635 -1253 87082 105645 27391 -107213 -250835 -370473 -469426
39547 -469426 -555538 -562731 -403289 -147759 -21082 -130311 -319779 -394462 -359627 -330443 -335236
39536 -335236 -335756 -330759 -323575 -293594 -284922 -379325 -498347 -425389 -143380 65678 14746 -121203
39524 -121203 -119651 -41919 -2546 133818 483646 777748 671114 304552 136557 257642
$$ packed form
39598b65432j5107L8120J55072J51915k8758k37017k86214j40475O0270J30445
39588d37181L3028n2057N2867K43787K48578M2789r6835m4657k8421j90345k69942
39577d98389l7890K33350J46944j61427k12942N9140K31240Q0373j12286n7958
39567c29845J37710K30646J81215P7537l0062p6841J2358J49086J20598r2562
39557C79840k42547j59928K1382Q8335J8563p8254j34604j43622j19638r8953
39547d69426q6112p193J59442K55530J26677j09229j89468p4683L4835K9184m793
39536c35236n20M997P184K9981Q672r4403j19022P2958K82009K09058n0932j35949
39524a21203J552P7732L9373J36364L49828K94102j06634l66562j67995J21085
$$ plain form
39514 257642 296730 45395 -236388 -263281 -127910 -82386 -175762 -297357 -396203 -482350 -529885
39503 -529885 -513347 -458813 -377553 -235224 -47043 87414 106800 78086 116171 250738 384717
39492 384717 364737 133375 -154961 -249117 -90897 109636 160361 114630 108510 133204 128442
39481 128442 142874 200007 153992 -80157 -283343 -198072 56490 133208 -35793 -188259
39471 -188259 -172539 -132961 -219730 -380923 -500044 -526584 -438037 -263015 -137468 -145001 -143067
39460 -143067 32472 258547 289039 160628 118370 180728 137081 -24793 -72791 42363
39450 42363 98485 20268 -576 86448 61682 -124569 -177146 61337 315293 315256 197702
39439 197702 182197 156731 -84006 -429983 -625651 -665020 -696228 -685727 -497302 -197920
$$ packed form
39514B57642L9088k51335k81783k6893J35371M5524r3376j21595r8846q6147m7535
39503e29885J6538N4534Q1260J42329J88181J34457J9386k8714L8085J34567J33979
39492C84717j9980k31362k88336r4156J58220K00533N0725m5731o120K4694m762
39481A28442J4432N7133m6015k34149k03186Q5271K54562P6718j69001j52466
39471a88259J5720L9578q6769j61193j19121k6540Q8547J75022J25547p533J934
39460a43067J75539K26075L0492j28411m2258O2358m3647j61874m7998J15154
39450D2363N6122p8217k0844Q7024k4766j86251n2577K38483K53956l7j17554
39439A97702j5505k5466k40737l45977j95668l9369l1208J0501J88425K99382
$$ plain form
39429 -197920 8576 75297 90679 56644 -62053 -155910 -95495 24723 9660 -120441 -168331
39418 -168331 -73906 29809 47131 5053 -65594 -147869 -168498 -88991 -29799 -123488 -286228
39407 -286228 -328501 -259294 -268471 -406284 -488209 -361935 -102064 116668 216903 245390 291607
39396 291607 397199 480497 382969 80722 -203474 -230142 -52598 51272 -43624 -147260
39386 -147260 -12628 351252 689742 781491 660442 545586 544820 491804 189735 -220706
39376 -220706 -353535 -105234 151782 78324 -146884 -119365 171002 355016 267758 151204
39366 151204 210193 303495 240497 114921 109000 144494 -718 -301107 -469309 -354177 -136559
39355 -136559 -45084 -52018 883 86856 11394 -258410 -484037 -469920 -337740 -339546 -494623
$$ packed form
39429a97920K06496O6721J5382l4035j18697r3857O0415J20218j5063j30101m7890
39418a68331R4425J03715J7322m2078p0647q2275k0629P9507N9192r3689j62740
39407b86228m2273O9207r177j37813q1925J26274K59871K18732J00235K8487M6217
39396B91607J05592Q3298r7528l02247k84196k6668J77544J03870r4896j03636
39386a47260J34632L63880L38490R1749j21049j14856p66n3016l02069m10441
39376b20706j32829K48301K57016p3458k25208K7519K90367J84014q7258j16554
39366A51204N8989R3302o2998j25576n921L5494j45212l00389j68202J15132K17618
39355a36559R1475o934N2901Q5973p5462k69804k25627J4117J32180j806j55077
$$ plain form
39344 -494623 -591744 -509359 -341385 -198172 -74183 30633 27944 -125730 -329496 -448868
39334 -448868 -429729 -261180 42487 362465 518533 473548 371231 303450 189594 -26932
39324 -26932 -228219 -289695 -248438 -173267 -19414 232884 439966 476576 440245 493737 611442
39313 611442 669080 679120 724840 742372 595407 323479 104466 -2084 -76843 -135650 -108466
39302 -108466 -13200 49718 82445 180210 322886 359110 227315 31234 -125604 -223364 -233000
39291 -233000 -115243 53002 116841 55824 9737 46671 53686 -79427 -293791 -440097 -422081
39280 -422081 -225990 82429 354794 460321 420280 349096 268966 118791 -53673 -88971
39270 -88971 40799 155113 122812 57388 143802 369689 537121 483610 220920 -88541
$$ packed form
39344d94623r7121Q2385J67974J43213J23989J04816k689j53674k03766j19372
39334d48868J9139J68549L03667L19978J56068m4985j02317o7781j13856k16526
39324b6932k01287o1476M1257P5171J53853K52298K07082L6610l6331N3492J17705
39313F11442N7638J0040M5720J7532j46965k71928k19013j06550p4759n8807K7184
39302a08466R5266O2918L2727R7765J42676L6224j31795j96081j56838r7760r636
39291b33000J17757J68245O3839o1017m6087L6934P015j33113k14364j46306J8016
39280d22081J96091L08419K72365J05527m0041p1184q0130j50175j72464l5298
39270h8971J29770J14314l2301o5424Q6414K25887J67432n3511k62690l09461
$$ plain form
39260 -88541 -245803 -172406 8649 114139 125603 164370 241908 209666 23941 -124362 -81746
39249 -81746 16490 -50227 -233663 -277599 -95802 123722 215748 240642 305996 348224 234234
39238 234234 -9298 -224366 -350995 -474070 -612424 -608693 -335767 72720 336767 355958
39228 355958 289406 291517 307523 214249 54809 -3981 87557 196456 200698 141570 126239
39217 126239 147705 87532 -106137 -312046 -352838 -198217 1472 93058 73026 24830 -32000
39206 -32000 -145046 -309396 -441281 -478739 -436578 -360812 -297564 -294876 -353904 -395017 -363126
39195 -363126 -335566 -407779 -509987 -495335 -383671 -320809 -300414 -168264 53384 117455 -59306
39184 -59306 -219881 -141149 57898 177884 268742 440503 549230 387283 62331 -127314
$$ packed form
39260h8541j57262P3397J81055J05490J1464L8767P7538l2242j85725j48303M2616
39249h1746R8236o6717j83436m3936J81797K19524R2026K4894O5354M2228j13990
39238B34234k43532k15068j26629j23075j38354L731K72926M08487K64047J9191
39228C55958o6552K111J6006r3274j59440n8790R1538J08899M242n9128j5331
39217A26239K1466o0173j93669k05909m0792J54621J99689R1586k0032m8196n6830
39206c2000j13046j64350j31885l7458M2161P5766O3248K688n9028m1113L1891
39195c63126K7560p2213j02208J4652J11664O2862K0395J32150K21648O4071j76761
39184e9306j60575P8732J99047J19986R0858J71761J08727j61947l24952j89645
$$ plain form
39174 -127314 -124898 -127853 -214698 -254908 -188627 -125263 -137314 -185896 -264488 -392693 -460906 -318335
39162 -318335 -38758 135712 147109 177786 309874 386918 309906 231591 315554 488492 578535
39151 578535 554011 485958 393480 266397 159813 138371 164529 132408 1830 -141695 -158835
39140 -158835 -7059 160866 124824 -103915 -213846 39724 487225 743827 688614 534222
39130 534222 461183 425211 333563 173909 -66464 -381925 -607743 -535294 -231548 -7521
39120 -7521 8150 11185 130182 172023 -43541 -320237 -314890 -10416 275917 301066 120740
39109 120740 -71833 -175349 -232683 -336492 -487920 -538082 -339868 21747 264356 231059
39099 231059 67705 5347 78924 156629 147701 65285 -49996 -156007 -191905 -124477 -3693
$$ packed form
39174a27314K416k955q6845m0210O6281O3364j2051m8582p8592j28205o8213J42571
39162c18335K79577J74470J1397L0677J32088P7044p7012p8315Q3963J72938R0043
39151E78535k4524o8053r2478j27083j06584k1442K6158l2121j30578j43525j7140
39140a58835J51776J67925l6042k28739j09931K53570M47501K56602n5213j54392
39130E34222p3039l5972r1648j59654k40373l15461k25818P2449L03746K24027
39120g521J5671L035J18997M1841k15564k76696N347L04474K86333K5149j80326
39109A20740j92573j03516n7334j03809j51428n0162J98214L61615K42609l3297
39099B31059j63354o2358P3577P7705q928q2416j15281j06011l5898O7428J20784
$$ plain form
39088 -3693 73605 43735 -85634 -233218 -280100 -170638 15985 150602 198042 213385 228377
39077 228377 229072 212327 170792 70251 -55475 -68655 69616 157717 14867 -200127 -182671
39066 -182671 57236 214874 154857 40662 -21835 -122599 -244386 -180969 79967 225679
39056 225679 88692 -49143 110250 395474 426467 187242 12624 89828 265653 328335
39046 328335 248746 130799 83404 145999 243220 251428 174321 152803 226375 236440 89061
39035 89061 -49744 6397 171092 233160 186329 191256 280577 326655 280588 243139 285624
39024 285624 358081 394113 380818 307273 149016 -67245 -244948 -283199 -153700 52600
39014 52600 157042 53710 -143980 -215774 -115391 -18754 -60960 -169535 -215402 -180013 -97157
$$ packed form
39088c693P7298k9870j29369j47584m6882J09462J86623J34617M7440J5343J4992
39077B28377O95j6745m1535j00541j25726j3180J38271Q8101j42850k14994J7456
39066a82671K39907J57638o0017j14195o2497j00764j21787O3417K60936J45712
39056B25679j36987j37835J59393K85224L0993k39225j74618P7204J75825O2682
39046C28335p9589j17947m7395O2595R7221Q208p7107k1518P3572J0065j47379
39035H9061j38805N6141J64695O2068m6831M927Q9321M6078m6067l7449M2485
39024B85624P2457L6032j3295p3545j58257k16261j77703l8251J29499K06300
39014E2600J04442j03332j97690p1794J00383R6637m2206j08575m5867L5389Q2856
$$ plain form
39003 -97157 24936 136732 140914 38694 -48212 -67452 -94391 -140035 -92681 57146 139985
38992 139985 83211 65103 239260 481836 574657 484532 315184 145203 56382 142352 328335
38981 328335 361658 150825 -63575 -43734 132826 273621 368212 466615 471211 308143 132726
38970 132726 107501 139425 92941 84021 266040 484632 478461 309509 257220 361757 406721
38959 406721 317223 253933 307769 379710 382272 330414 231375 86177 -23096 -32239 -21700
38948 -21700 -58877 -13833 245695 580460 745850 725737 641177 455756 93785 -248548
38938 -248548 -280133 -69786 34659 -59229 -90531 88305 300529 378745 388339 413015 400475
38927 400475 336692 327179 394227 411266 331103 264432 240831 110623 -195599 -493686 -563087
$$ packed form
39003i7157J22093J11796M182j02220q6906j9240k6939m5644M7354J49827Q2839
38992A39985n6774j8108J74157K42576R2821r0125j69348j69981q8821Q5970J85983
38981C28335L3323k10833k14400J9841J76560J40795R4591R8403M596j63068j75417
38970A32726k5225L1924m6484q920J82019K18592o171j68952n2289J04537M4964
38959D06721q9498o3290N3836P1941K562n1858r9039j45198j09273r143J0539
38948b1700l7177M5044K59528L34765J65390k0113q4560j85421l61971l42333
38938b48548l1585K10347J04445r3888l1302J78836K12224P8216R594K4676j2540
38927D00475o3783r513O7048J7039q0163o6671k3601j30208l06222k98087o9401
$$ plain form
38916 -563087 -410025 -214799 -117012 -124419 -157735 -143368 -103514 -127111 -204630 -193902 -51586
38905 -51586 38043 -70710 -224937 -189486 -6989 94422 53810 -13250 -69826 -157150 -214276
38894 -214276 -169073 -139008 -263170 -407840 -338747 -119520 -17367 -65759 -63157 28306 49722
38883 49722 12828 127482 408778 593130 514930 274653 -3111 -278611 -441621 -365865
38873 -365865 -155747 -38579 -5267 117823 261084 170807 -107225 -233109 -127497 -77992
38863 -77992 -181424 -141015 190488 492601 452377 206550 59842 68075 141600 285988 497725
38852 497725 644983 651543 599575 519680 322026 48947 -91536 -73120 -127226 -336268 -484101
38841 -484101 -472989 -527544 -762826 -899688 -688961 -326087 -155819 -208539 -297801 -351077
$$ packed form
38916e63087J53062J95226R7787p407l3316J4367L9854k3597p7519J0728J42316
38905e1586Q9629j08753j54227L5451J82497J01411m0612o7060n6576q7324n7126
38894b14276M5203L0065j24162j44670O9093K19227J02153m8392K602R1463K1416
38883D9722l6894J14654K81296J84352p8200k40277k77764k75500j63010P5756
38873c65865K10118J17168L3312J23090J43261r0277k78032j25884J05612M9505
38863g7992j03432M0409L31503L02113m0224k45827j46708Q233P3525J44388K11737
38852D97725J47258O560n1968p9895j97654k73079j40483J8416n4106k09042j47833
38841d84101J1112n4555k35282j36862K10727L62874J70268n2720q9262n3276
$$ plain form
38831 -351077 -380053 -322914 -162349 -28456 10107 65731 181689 202551 69287 -22740 40452
38820 40452 77943 -35705 -91758 107331 375338 407869 217118 33143 -37817 -9366 130752
38809 130752 315789 347073 184756 85974 216620 352800 234531 -5833 -61779 94806
38799 94806 273007 398260 495039 495569 361900 264470 359023 504081 457681 238235 51439
38788 51439 -15887 826 108141 283677 368181 261628 115888 125935 250163 331399 364151
38777 364151 448686 598141 754818 884733 959602 1014400 1268879 1899054 2590097 2691814
38767 2691814 2025953 1181297 758058 681564 559576 340055 217182 184422 106158 26882
38757 26882 45350 79577 72142 186975 482289 669002 550004 401583 519045 687015
$$ packed form
38831c51077k8976N7139J60565J33893L8563N5624J15958K0862j33264r2027O3192
38820D0452L7491j13648n6053J99089K68007L2531j90751j83975p0960K8451J40118
38809A30752J85037L1284j62317r8782J30646J36180j18269k40364n5946J56585
38799I4806J78201J25253R6779N30j33669r7430R4553J45058m6400k19446j86796
38788E1439o7326J6713J07315J75536Q4504j06553j45740J0047J24228Q1236L2752
38777C64151Q4535J49455J56677J29915P4869N4798K54479O30175O91043J01717
38767B691814o65861q44656m23239p6494j21988k19521j22873l2760p8264p9276
38757B6882J8468L4227p435J14833K95314J86713j18998j48421J17462J67970
$$ plain form
38747 687015 558932 282807 239608 386698 391095 236728 166267 158841 -708 -228154 -228674
38736 -228674 -15020 134270 159754 206267 218185 28874 -227124 -272322 -176255 -202660 -268107
38725 -268107 -90418 201652 201519 -43539 -48274 294210 515412 339810 89815 103952 235888
38714 235888 195562 4868 -140960 -176420 -136746 -66623 -75946 -246972 -422287 -347179 -58404
38703 -58404 154197 192122 238612 380151 472518 437623 378910 348112 290399 248705 325526
38692 325526 434675 400348 290839 318074 426733 362630 154214 118366 330469 482494
38682 482494 364643 138119 30311 73902 231282 478608 688075 692948 523989 360192
38672 360192 270913 240618 339679 560442 621062 322143 -26068 20874 344224 440270 225177
$$ packed form
38747F87015j28083k76125m3199J47090M397j54367p0461p426j59549k27446n20
38736b28674K13654J49290K5484M6513J1918j89311k55998m5198R6067k6405o5447
38725b68107J77689K92070j33k45058m735L42484K21202j75602k49995J4137J31936
38714B35888m0326j90694j45828l5460L9674P0123r323j71026j75315P5108K88775
38703e8404K12601L7925M6490J41539R2367l4895n8713l0798n7713m1694P6821
38692C25526J09149l4327j09509K7235J08659o4103k08416l5848K12103J52025
38682D82494j17851k26524j07808M3591J57380K47326K09467M873j68959j63797
38672C60192q9279l0295R9061K20763O0620k98919l48211M6942L23350R6046k15093
$$ plain form
38661 225177 107011 255498 376620 300079 248305 381133 551946 650738 744289 765560
38651 765560 514016 78875 -174517 -140103 -64438 -47498 70051 250495 210928 -48983
38641 -48983 -181036 -82670 -45966 -174433 -188215 7777 99158 -64995 -178816 -14724
38631 -14724 205839 227005 123697 31830 -76621 -158481 -60673 110934 24415 -311949 -478102
38620 -478102 -299331 -86623 -52213 -11106 128910 122755 -106723 -228029 -37278 235088
38610 235088 385192 511771 620846 501266 239754 286671 717374 999630 813797 524338
38600 524338 482904 454888 161155 -160623 -196790 -76978 -14466 112717 395192 552882
38590 552882 384914 147728 110102 153018 140775 209079 350076 241553 -146938 -335790
$$ packed form
38661B25177j18166J48487J21122p6541n1774J32828J70813R8792R3551K1271
38651G65560k51544m35141k53392L4414P5665J6940J17549J80444l9567k59911
38641d8983j32053R8366L6704j28467j3782J95992R1381j64153j13821J64092
38631a4724K20563K1166j03308r1867j08451q1860R7808J71607q6519l36364j66153
38620d78102J78771K12708L4410M1107J40016o155k29478j21306J90751K72366
38610B35088J50104J26579J09075j19580k61512M6917M30703K82256j85833k89459
38600E24338m1434k8016k93733l21778l6167J19812O2512J27183K82475J57690
38590E52882j67968k37186l7626M2916j2243O8304J40997j08523l88491j88852
$$ plain form
38580 -335790 -108227 88213 -74450 -255651 -154399 -95304 -334876 -435382 3983 573504
38570 573504 706004 571367 614976 720723 582311 434052 628100 892575 784261 500633
38560 500633 471322 513176 194823 -285491 -398934 -181548 -41374 50989 369874 687445
38550 687445 556986 151587 6735 99418 -4656 -250596 -190430 124654 199830 9539
38540 9539 33668 365036 563502 457894 357378 381517 276870 16425 -55936 180801
38530 180801 427823 464582 371338 221145 3759 -153975 -121228 -47909 -107979 -123995 99383
38519 99383 304364 178999 -29510 86779 336339 253484 -32013 2783 352265 525066
38509 525066 414239 370222 460065 396489 188503 156502 307522 358154 332724 477140 665031
$$ packed form
38580c35790K27563J96440j62663j81201J01252N9095k39572j00506M39365N69521
38570E73504J32500j34637M3609J05747j38412j48259J94048K64475j08314k83628
38560E00633k9311M1854l18353m80314j13443K17386J40174R2363L18885L17571
38550F87445j30459m05399j44852R2683j04074k45940O0166L15084P5176j90291
38540I539K4129L31368J98466j05608j00516K4139j04647k60445p2361K36737
38530A80801K47022L6759r3244j50193k17386j57734L2747P3319o0070j6016K23378
38519I9383K04981j25365k08509J16289K49560q2855k85497L4796L49482J72801
38509E25066j10827m4017Q9843o3576k07986l2001J51020N0632k5430J44416J87891
$$ plain form
38498 665031 583739 400063 499874 690743 481005 53571 63929 485949 595322 186850
38488 186850 -117502 49009 283056 220774 69272 63369 93283 108027 247407 403051
38478 403051 282542 17740 40836 288865 268225 -17968 -18082 363093 551609 307652
38468 307652 114931 291458 492017 412916 272494 267906 219401 59369 50857 251215 359129
38457 359129 308526 394994 633686 653671 410957 317397 470316 464098 178545 38007 253631
38446 253631 506441 604325 750046 950197 892745 633383 654421 1007246 1159960 948878
38436 948878 901449 1322136 1814766 2013857 2055609 2038619 1759139 1271819 990622 974311
38426 974311 835061 550845 564333 874951 908310 536076 324475 492342 553400 306556
$$ packed form
38498F65031q1292j83676R9811J90869k09738m27434J0358M22020J09373m08472
38488A86850l04352J66511K34047o2282j51502n903K9914J4744J39380J55644
38478D03051j20509k64802K3096K48029k0640k86193j14L81175J88516k43957
38468C07652j92721J76527K00559p9101j40422m588m8505j60032q512K00358J07914
38457C59129n0603Q6468K38692J9985k42714r3560J52919o218k85553j40538K15624
38446B53631K52810R7884J45721K00151n7452k59362K1038L52825J52714k11082
38436I48878m7429M20687M92630J99091M1752j6990k79480m87320k81197j6311
38426I74311j39250k84216J3488L10618L3359l72234k11601J67867O1058k46844
$$ plain form
38416 306556 224492 498362 656231 519486 570372 955047 1104298 795361 610049 871351
38406 871351 1115728 1096173 1278378 1827126 2161846 2080063 2229280 2837069 3092133 2512710
38396 2512710 1838410 1765389 1850574 1526950 1185438 1318628 1529781 1352273 1204312 1590642
38386 1590642 2142147 2333828 2377098 2548631 2441529 1758959 1072386 934104 997931 818419
38376 818419 695690 914184 1013619 671756 441256 746632 1036689 802639 516408 668495
38366 668495 836376 635578 595313 1103761 1495721 1216968 869975 1044491 1181206 728877
38356 728877 332733 648839 1060573 861466 633717 1088713 1602676 1347751 860180 998889
38346 998889 1335692 1103818 770072 1086836 1521774 1236029 713327 814894 1147415 986693
$$ packed form
38416C06556q2064K73870J57869j36745N0886L84675J49251l08937j85312K61302
38406H71351K44377j9555J82205N48748L34720q1783J49217O07789K55064n79423
38396B512710o74300p3021Q5185l23624l41512J33190K11153j77508j47961L86330
38386A590642N51505J91681M3270J71533j07102o82570o86573j38282O3827j79512
38376H18419j22729K18494R9435l41863k30500L05376K90057k34050k86231J52087
38366F68495J67881k00798m0265N08448L91960k78753l46993J74516J36715m52329
38356G28877l96144L16106M11734j99107k27749M54996N13963k54925m87571J38709
38346I98889L36803k31874l33746L16764M34938k85745n22702J01567L32521j60722
$$ plain form
38336 986693 825619 1308900 1676315 1083281 421783 893304 1799282 1795526 1333963 1672293
38326 1672293 2395748 2232919 1519250 1499487 1917188 1665917 1131057 1471247 2247766 2214882
38316 2214882 1777236 2144887 2774494 2318326 1413967 1710852 2754994 2769767 1948419
38307 1948419 1924654 2527892 2271889 1567694 2065966 3211843 2996246 1818744 1908254
38298 1908254 3148386 3370959 2636150 3080200 4528929 4648112 3614826 4038514 5922578
38289 5922578 6551841 5838280 6588723 8820365 9423067 8405672 9429485 12844566 14707055
38280 14707055 14374961 15967370 20160471 22477221 22594162 26483141 35452572 43061281
38272 43061281 48095365 58999829 78329063 97642848 120614024 173976315 270011105
$$ packed form
38336I86693j61074M83281L67415n93034o61498M71521R05978l756m61563L38330
38326A672293P23455j62829p13669j9763M17701k51271n34860L40190P76519l2884
38316B214882m37646L67651O29607m56168r04359K96885J044142J4773q21348
38307A948419k3765O03238k56003p04195M98272J145877k15597j177502Q9510
38298A908254J240132K22573p34809M44050J448729J19183j033286M23688J884064
38289E922578O29263p13561P50443K231642O02702j017395J023813L415081J862489
38280A4707055l32094J592409M193101K316750J16941L888979Q969431P608709
38272D3061281N034084J0904464J9329234J9313785K2971176N3362291R6034790
$$ plain form
38265 270011105 365716774 390777906 323954142 218386213 140600087 105585915 86232733
38258 86232733 64716322 47960244 41600465 36930027 27650271 19985911 19215382 19947430
38250 19947430 16677504 13041569 13479818 14583057 11994660 8720098 9222060 11063885
38242 11063885 9780733 7313482 8125659 10724830 10687192 9200596 10720734 14204983
38234 14204983 14903835 13692218 15960084 21405715 24110400 23742415 26937601 35259019
38226 35259019 42329716 46874479 56949446 75056443 93058691 113491307 160617778
38219 160617778 247357868 336981430 365253629 308891327 212568208 137800151 102446434
38212 102446434 83949406 64340789 47940634 40639859 36262080 28797187 22022232
$$ packed form
38265B70011105R5705669K5061132o6823764j05567929p7786126l5014172j9353182
38258H6232733k1516411j6756078o359779m670438r279756p664360p70529P32048
38250A9947430l269926l635935M38249J103239k588397l274562N01962J841825
38242A1063885j283152k467251Q12177K599171l7638j486596J520138L484249
38234A4204983O98852j211617K267866N445631K704685l67985L195186Q321418
38226C5259019P070697M544763J0074967J8106997J8002248K0432616M7126471
38219A60617778Q6740090Q9623562K8272199n6362302r6323119p4768057l5353717
38212A02446434j8497028j9608617j6400155p300775m377779p464893o774955
$$ plain form
38205 22022232 19974527 18889194 14903478 11103171 10934225 11612030 9700246 7380999
38197 7380999 7798995 9118122 8372215 7032443 7784520 9316028 9047892 8057313 8813109
38188 8813109 10592505 11367052 11966861 14345671 17729360 20311333 22846931 26712719
38180 26712719 30079578 29918726 26601938 22943067 19806864 16156245 12430548 10278052
38172 10278052 9463616 8266346 6565350 5651446 5457141 4786612 3843859 3789368 4200412
38163 4200412 3663582 2520285 2358181 3075538 3096698 2297861 2095948 2709078 2889549
38154 2889549 2428530 2467748 3170027 3408470 2979614 2928651 3461654 3637616 3334905 3475600
38144 3475600 4107917 4290112 4068829 4543259 5738807 6454051 6515991 7169604 8856861
$$ packed form
38205B2022232k047705j085333l985716l800307j68946O77805j911784k319247
38197G380999M17996J319127p45907j339772P52077J531508k68136r90579P55796
38188H813109J779396P74547N99809K378810L383689K581973K535598L865788
38180B6712719L366859j60852l316788l658871l136203l650619l725697k152496
38172A0278052q14436j197270j700996r13904j94305o70529r42753n4491M11044
38163D200412n36830j143297j62104P17357K1160p98837k01913O13130J80471
38154B889549m61019L9218P02279K38443m28856n0963N33003J75962l02711J40695
38144C475600O32317J82195k21283M74430J195548P15244O1940O53613J687257
$$ plain form
38135 8856861 10594765 12009032 14037482 17039071 19988684 22086411 23443133 23713454
38127 23713454 21921621 18335509 14796389 12436937 10608850 8675140 7182903 6481439
38119 6481439 5801393 4650177 3716930 3484132 3257011 2479933 1778422 1763069 1927991
38110 1927991 1664256 1348217 1515088 1844062 1804932 1530669 1331283 1090155 757034 696376
38100 696376 1020605 1323359 1473721 1825139 2287173 2188125 1487256 1067214 1307476 1438786
38090 1438786 915007 356720 412630 670796 498577 107875 -12573 18411 -94045 -169575
38080 -169575 -9638 109797 -8381 -52697 157069 256021 45461 -77324 119197 236091
38070 236091 30867 -81933 166787 352884 158519 -16752 201588 522425 627270 731704
$$ packed form
38135H856861J737904J414267K028450L001589K949613K097727J356722K70321
38127B3713454j791833l586112l539120k359452j828087j933710j492237p01464
38119F481439o80046j151216r33247k32798k27121p77078p01511j5353J64922
38110A927991k63735l16039J66871L28974l9130k74263j99386k41128l33121o0658
38100F96376L24229L02754J50362L51418M62034r9048p00869m20042K40262J31310
38090A438786n23779n58287N5910K58166j72219l90702j20448L0984j12456p5530
38080a69575J59937J19435j18178m4316K09766R8952k10560j22785J96521J16894
38070B36091k05224j12800K48720J86097j94365j75271K18340L20837J04845J04434
$$ plain form
38060 731704 983126 1036219 765968 652704 915331 1048394 794532 743391 1298647 1865555
38050 1865555 1808467 1454280 1362541 1326210 944498 539145 612735 924905 949851 780944
38040 780944 783366 802292 512856 154843 146970 315746 217815 -97165 -291034 -357073 -426023
38029 -426023 -324522 71821 420105 422070 358641 555724 758304 621281 364492 323266
38019 323266 307788 55770 -130528 120830 537549 658104 593614 665064 704913 439502
38009 439502 174631 346340 717426 755655 511618 404251 428083 300408 130184 210465
37999 210465 367093 214986 -134583 -281364 -240017 -292477 -358710 -169529 133155 207199
37989 207199 129021 192517 307216 215848 89199 265746 596556 671730 504163 387150
$$ packed form
38060G31704K51422N3093k70251j13264K62627J33063k53862n1141N55256N66908
38050A865555n7088l54187r1739l6331l81712m05353P3590L12170K4946j68907
38040G80944K422J8926k89436l58013p873J68776r7931l14980j93869o6039o8950
38029d26023J01501L96343L48284J965o3429J97083K02580j37023k56789m1226
38019C23266j5478k52018j86298K51358M16719J20555o4490P1450L9849k65411
38009D39502k64871J71709L71086L8229k44037j07367K3832j27675j70224Q0281
37999B10465J56628j52107l49569j46781M1347n2460o6233J89181L02684P4044
37989B07199p8178O3496J14699r1368j26649J76547L30810P5174j67567j17013
$$ plain form
37979 387150 295444 44290 -188965 -134352 15946 -44510 -102860 180621 528721 448292
37969 448292 129811 137877 390048 298789 -161688 -384880 -126203 232518 447794 673982
37959 673982 886067 788968 438327 282153 435817 515023 312140 68374 -33367 -96696
37949 -96696 -140110 -30836 126404 53669 -174650 -181743 71444 206956 61933 -100814
37939 -100814 -93979 -35703 8312 159421 409331 560589 533496 389955 105560 -293776
37929 -293776 -480368 -181956 300464 428235 189710 11560 13682 -54947 -195746 -112832
37919 -112832 185816 344030 283350 308293 506388 588311 431610 283734 314234 403933
37909 403933 446081 453018 364323 156249 70661 288410 504496 347209 58793 142215 477911
$$ packed form
37979C87150r1706k51154k33255N4613J50298o0456n8350K83481L48100q0429
37969D48292l18481Q066K52171r1259m60477k23192K58677L58721K15276K26188
37959F73982K12085r7099l50641j56174J53664P9206k02883k43766j01741o3329
37949i6696m3414J09274J57240p2735k28319p093K53187J35512j45023j62747
37939a00814O835N8276M4015J51109K49910J51258k7093j43541k84395l99336
37929b93776j86592K98412M82420J27771k38525j78150K122o8629j40799Q2914
37919a12832K98648J58214o0680K4943J98095Q1923j56701j47876L0500Q9699
37909D03933M2148O937q8695k08074q5588K17749K16086j57287k88416Q3422L35696
$$ plain form
37898 477911 508542 220525 156371 435045 562850 328636 113826 146621 185187 131017
37888 131017 234574 477209 460547 151609 42891 317691 549686 497275 475530 621694
37878 621694 529379 26066 -373152 -265117 -7295 -78740 -334663 -390696 -267589 -170701
37868 -170701 -55801 135393 205778 81253 63383 317902 519961 396816 206477 267852
37858 267852 418367 361886 177525 60521 -81808 -355310 -545646 -474029 -357184 -413010
37848 -413010 -443055 -217336 58641 93050 14495 89574 215589 142098 -43247 -86564 -22145
37837 -22145 -49354 -135194 -112211 -11424 27750 12885 -12803 -131829 -341108 -417217 -253912
37826 -253912 -76878 -72032 -98978 -36672 -66702 -295436 -445410 -285277 -38128 10573 -21650
$$ packed form
37898D77911L0631k88017o4154K78674J27805k34214k14810L2795L8566n4170
37888A31017J03557K42635j6662l08938j08718K74800K31995n2411k1745J46164
37878F21694r2315n03313l99218J08035K57822p1445k55923n6033J23107R6888
37868a70701J14900J91194P0385j24525j7870K54519K02059j23145j90339O1375
37858B67852J50515n6481j84361j17004j42329k73502j90336P1617J16845n5826
37848d13010l0045K25719K75977L4409p8555P5079J26015p3491j85345m3317O4419
37837b2145k7209q5840K2983J00787L9174j4865k5688j19026k09279p6109J63305
37826b53912J77034M846k6946O2306l0030k28734j49974J60133K47149M8701l2223
$$ plain form
37815 -21650 64506 109250 -76231 -256034 -136091 86381 45636 -153054 -135629 87722
37805 87722 194215 129605 102939 104191 -63499 -316454 -329798 -47138 249883 377987 405450
37794 405450 397153 341822 299427 316528 257769 12510 -237684 -274876 -240438 -412371 -694859
37783 -694859 -728826 -460542 -211590 -188926 -278318 -335993 -359921 -339481 -216186 -31418 105520
37772 105520 193175 293805 369875 357055 313561 303216 255922 155831 197769 486055 748098
37761 748098 672793 396545 297467 404296 388925 115503 -165312 -205000 -47604 119857
37751 119857 186949 154016 100892 112737 143091 55372 -102994 -68235 236379 503203 472173
37740 472173 313851 304115 364891 266257 66948 -21563 -31303 -116904 -198965 -117922 2866
$$ packed form
37815b1650Q6156M4744j85481j79803J19943K22472m0745j98690J7425K23351
37805H7722J06493o4610k6666J252j67690k52955j3344K82660K97021J28104K7463
37794D05450q297n5331m2395J7101n8759k45259k50194l7192L4438j71933k82488
37783f94859l3967K68284K48952K2664q9392n7675k3928K0440J23295J84768J36938
37772A05520Q7655J00630P6070j2820m3494j0345m7294j00091M1938K88286K62043
37761G48098p5305k76248r9078J06829j5371k73422k80815l9688J57396J67461
37751A19857O7092l2933n3124J1845L0354q7719j58366L4759L04614K66824l1030
37740D72173j58322r736O0776r8634j99309q8511r740q5601q2061Q1043J20788
$$ plain form
37729 2866 -50358 -162706 -84259 82239 42265 -127210 -53930 308675 592418 571138 391919
37718 391919 216193 26748 -153187 -213705 -194753 -250924 -348099 -302149 -123193 -3288
37708 -3288 28383 104944 196011 141346 3969 14991 151027 146665 -35068 -123245 11500
37697 11500 189637 266683 288981 245441 32837 -245564 -311073 -148213 -65422 -197884 -290106
37686 -290106 -121118 167539 336535 374319 395526 432688 460929 450474 329636 88390
37676 88390 -73291 46246 286156 265926 -72496 -380687 -416868 -310016 -225343 -113795
37666 -113795 57743 138544 40456 -91858 -116390 -83646 -60782 15996 181629 333349 401513
37655 401513 451935 527548 566558 549247 544618 556982 511064 421593 379496 357878 255696
$$ packed form
37729B866n3224j12348P8447J66498l9974j69475P3280L62605K83743k1280j79219
37718C91919j75726j89445j79935o0518J8952n6171r7175M5950J78956J19905
37708c288L1671P6561R1067n4665j37377J1022J36036m362j81733q8177J34745
37697A1500J78137P7046K2298m3540k12604k78401o5509J62860Q2791j32462r2222
37686b90106J68988K88657J68996L7784K1207L7162K8241j0455j20838k41246
37676H8390j61681J19537K39910k0230l38422l08191l6181J06852Q4673J11548
37666a13795J71538Q0801r8088j32314k4532L2744K2864P6778J65633J51720O8164
37655D01513N0422P5613L9010j7311m629J2364m5918q9471m2097k1618j02182
$$ plain form
37644 255696 137221 171084 315912 344413 216479 145635 240431 356051 364072 303233 206479
37633 206479 46676 -90078 -42470 162889 334651 414031 478013 471280 271565 14993
37623 14993 -20496 125700 154111 46123 92678 312154 343413 78757 -98203 51682
37613 51682 214398 54817 -243102 -303608 -99518 155335 369686 532585 566932 495508
37603 495508 500198 581104 456087 60077 -188903 37369 426812 434140 24713 -368446
37593 -368446 -472205 -391005 -298867 -246534 -233445 -223433 -132524 27198 90209 -25079 -165533
37582 -165533 -184769 -160904 -203245 -236409 -175129 -123423 -180387 -215918 -58823 233600 481124
37571 481124 608531 611685 478351 305860 297906 470560 563353 406762 154425 -7357
$$ packed form
37644B55696j18475L3863J44828K8501j27934p0844R4796J15620Q021o0839r6754
37633B06479j59803j36754M7608K05359J71762P9380O3982o733j99715k56572
37623A4993l5489J46196K8411j07988M6555K19476L1259k64656j76960J49885
37613E1682J62716j59581k97919o0506K04090K54853K14351J62899L4347p1424
37603D95508M690Q0906j25017l96010k48980K26272L89443P328m09427l93159
37593c68446j03759Q1200R2138N2333J3089J0012R0909J59722O3011j15288j40454
37582a65533j9236K3865m2341l3164O1280N1706n6964l5531J57095K92423K47524
37571D81124J27407L154j33334j72491p954J72654R2793j56591k52337j61782
$$ plain form
37561 -7357 -109015 -168980 -29374 316032 520730 326373 -31518 -166366 -71574 -5941
37551 -5941 -60880 -151832 -242408 -275493 -89501 285705 469963 210551 -190142 -282158 -98544
37540 -98544 7325 -37519 -18901 106901 186014 216081 314584 401157 302847 124656 131883
37529 131883 301702 365214 262199 177060 141803 -9752 -272735 -424688 -399186 -378978
37519 -378978 -463723 -544562 -555731 -562156 -544034 -367464 -39641 232417 293497 176732 -4242
37508 -4242 -124838 -67403 129189 215993 47568 -159299 -131822 26923 22454 -138477 -205321
37497 -205321 -149606 -174809 -291657 -285749 -124658 -14228 -12683 39004 152482 132664 -37986
37486 -37986 -114750 8688 150261 198182 295521 539702 791822 914001 936427 889836 736823
$$ packed form
37561g357j01658n9965J39606L45406K04698j94357l57891j34848R4792O5633
37551e941n4939r0952r0576l3085J85992L75206J84258k59412m00693r2016J83614
37540i8544J05869m4844J8618J25802P9113L0067R8503Q6573r8310j78191P227
37529A31883J69819O3512j03015q5139l5257j51555k62983j51953K5502K0208
37519c78978q4745q0839j1169o425J8122J76570L27823K72058O1080j16765j80974
37508d242j20596N7435J96592Q6804j68425k06867K7477J58745m469j60931o6844
37497b05321N5715k5203j16848N908J61091J10430J545N1687J13478j9818j70650
37486c7986p6764J23438J41573M7921R7339K44181K52120J22179K2426m6591j53013
$$ plain form
37475 736823 554617 506666 544991 430267 140354 -47351 5230 87734 13202 -104128
37465 -104128 -111862 -76302 -86439 -57717 66870 143273 52316 -94451 -151255 -151432 -160216 -114167
37453 -114167 9987 53282 -96865 -284203 -281533 -94852 92743 170847 148894 59665 -43274
37442 -43274 -74042 -9797 77451 149047 251279 378872 416406 294122 96655 -35096 -12577
37431 -12577 185255 456832 556870 332376 -23304 -184523 -157739 -236923 -459923 -474866
37421 -474866 -101672 314943 357555 80582 -157101 -193697 -127602 -44162 38652 50995 -50376
37410 -50376 -144992 -98399 10831 7580 -92751 -111562 5294 114384 101896 31932 24569
37399 24569 84553 107391 22727 -109503 -174519 -172733 -236155 -413696 -541379 -459366 -266575
$$ packed form
37475G36823j82206m7951L8325j14724k89913j87705N2581Q2504p4532j17330
37465a04128p734L5560j0137K8722J24587P6403r0957j46767n6804j77q784M6049
37453a14167J24154M3295j50147j87338K670J86681J87595P8104k1953q9229j02939
37442d3274l0768O4245Q7248P1596J02232J27593L7534j22284j97467j31751K2519
37431a2577J97832K71577J00038k24494l55680j61219K6784p9184k23000j4943
37421d74866L73194M16615M2612k76973k37683l6596O6095Q3440Q2814J2343j01371
37410e0376r4616M6593J09230l251j00331j8811J16856J09090j2488o9964p363
37399B4569N9984K2838q4664j32230o5016J786o3422j77541j27683Q2013J92791
$$ plain form
37388 -266575 -169400 -147713 -12747 235388 386149 370845 349074 393315 389150 337502 436005
37377 436005 709145 862440 706575 454919 367673 349460 177646 -67155 -107847 102202
37367 102202 331456 386335 255172 40 -289829 -481191 -507734 -460361 -437522 -383429
37357 -383429 -216231 -27126 17358 -84897 -184089 -192661 -155903 -136759 -134109 -96192 38552
37346 38552 263275 440288 416475 234190 101468 111785 140779 70971 -50130 -143402 -210840
37335 -210840 -233694 -139089 42374 163977 185070 210573 246114 159265 -28783 -99398 -14903
37324 -14903 -32302 -257217 -402681 -237123 27884 89912 19895 38829 73416 -81843 -332344
37313 -332344 -401200 -268462 -138863 -67455 37736 121708 38832 -145808 -232262 -218467 -252335
$$ packed form
37388b66575R7175K1687J34966K48135J50761j5304k1771M4241m165n1648R8503
37377D36005K73140J53295j55865k51656q7246j8213j71814k44801m0692K10049
37367A02202K29254N4879j31163k55132k89869j91362k6543M7373K2839N4093
37357c83429J67198J89105M4484j02255r9192q572L6758J9144K650L7917J34744
37346C8552K24723J77013k3813j82285j32722J0317K8994o9808j21101r3272o7438
37335b10840k2854R4605J81463J21603K1093K5503L5541q6849j88048p0615Q4495
37324a4903j7399k24915j45464J65558K65007O2028p0017J8934L4587j55259k50501
37313c32344o8856J32738J29599P1408J05191Q3972q2876j84640q6454J3795l3868
$$ plain form
37302 -252335 -306658 -222821 -44724 9607 -102175 -219163 -275841 -333123 -342816 -198423 -8517
37291 -8517 4314 -116426 -105495 82304 207846 166778 133067 202378 218569 79799 -66062
37280 -66062 -70691 4569 47126 49596 9428 -119509 -282396 -327480 -231718 -128800 -58484
37269 -58484 91134 327064 473444 443827 374658 387588 418411 377695 293418 207181 106961
37258 106961 30853 56007 134459 131380 53970 23791 14496 -106113 -248765 -150511 173115
37247 173115 380217 333775 304211 450210 486364 159908 -277215 -427766 -321353 -258728
37237 -258728 -296708 -279442 -223357 -258631 -280204 -72365 242180 277173 -47570 -365291 -378984
37226 -378984 -211221 -124627 -164178 -221053 -234448 -178779 -17453 195701 309429 284683 271916
$$ packed form
37302b52335n4323Q3837J78097N4331j11782j16988n6678n7282r693J44393J89906
37291h517J2831j20740J0931J87799J25542m1068l3711O9311J6191j38770j45861
37280f6062m629P5260M2557K470m0168j28937j62887m5084R5762J02918P0316
37269e8484J49618K35930J46380k9617o9169J2930L0823m0716q4277q6237j00220
37258A06961p6108K5154P8452l079p7410l0179r295j20609j42652R8254L23626
37247A73115K07102m6442k9564J45999L6154l26456m37123j50551J06413O2625
37237b58728l7980J7266N6085l5274k1573K07839L14545L4993l24743l17721j3693
37226c78984J67763Q6594l9551n6875j3395N5669J61326K13154J13728k4746j2767
$$ plain form
37215 271916 363481 419506 297470 128301 157845 369582 480416 331821 93626 -2100
37205 -2100 28956 22674 -26225 42288 250933 378878 260047 32930 -70022 -76442 -200212
37194 -200212 -448616 -557303 -385080 -144246 -95139 -192795 -225495 -170437 -180377 -276528 -293901
37183 -293901 -150842 27848 114381 144033 205857 298169 370746 404176 376990 259933 116765
37172 116765 93843 209233 268106 121318 -99537 -180445 -167644 -273166 -467594 -459351 -161585
37161 -161585 104322 57580 -118785 -63616 207743 342324 179268 -74935 -215029 -277599
37151 -277599 -333662 -317644 -199988 -104601 -101776 -78745 28807 71031 -64874 -216451 -178317
37140 -178317 -27241 24026 -16369 31881 185247 272590 225757 149756 95929 -7587 -165186
$$ packed form
37215B71916R1565N6025j22036j69169K9544K11737J10834j48595k38195r5726
37205b100L1056o282m8899O8513K08645J27945j18831k27117j02952o420j23770
37194b00212k48404j08687J72223K40834M9107r7656l2700N5058r940r6151j7373
37183b93901J43059J78690Q6533K9652O1824R2312P2577L3430k7186j17057j43168
37172A16765k2922J15390N8873j46788k20855q0908J2801j05522j94428Q243K97766
37161a61585K65907m6742j76365N5169K71359J34581j63056k54203j40094o2570
37151b77599n6063J6018J17656R5387K825K3031J07552M2224j35905j51577L8134
37140a78317J51076N1267m0395M8250J53366Q7343m6833p6001n3827j03516j57599
$$ plain form
37129 -165186 -255655 -219319 -143646 -117276 -129567 -132429 -73786 121081 448658 713871 687707
37118 687707 394981 92049 -47633 -66574 -48560 -3967 41648 29216 -14227 2819 59111
37107 59111 28033 -104609 -201480 -193139 -163886 -173588 -171814 -144429 -165904 -237991 -250344 -175759
37095 -175759 -135045 -189171 -233122 -179041 -82063 1290 117499 286342 419242 457202 447526
37084 447526 412328 301294 146046 80887 123337 121100 14318 -48316 27276 104067 43019
37073 43019 -84139 -167657 -257250 -411092 -521369 -480677 -371587 -309811 -253250 -151022 -113163
37062 -113163 -217210 -305398 -212279 -49794 -12937 -44149 17266 73418 -99139 -408007 -497927
37051 -497927 -274052 -41221 -39926 -141829 -132625 -37336 5942 -1459 21372 54331 28141
$$ packed form
37129a65186r0469L6336P5673K6370j2291k862N8643J94867L27577K65213k6164
37118F87707k92726l02932j39682j8941J8014M4593M5615j2432m3443J7046N6292
37107E9111l1078j32642r6871Q341K9253r702J774K7385k1475p2087j2353P4585
37095a75759M0714n4126m3951N4081R6978Q3353J16209J68843J32900L7960r676
37084D47526l5198j11034j55248o5159M2450k237j06782o2634P5592P6791o1048
37073D3019j27158q3518q9593j53842j10277M0692J09090O1776N6561J02228L7859
37062a13163j04047q8188R3119J62485L6857l1212O1415N6152j72557l08868q9920
37051d97927K23875K32831J295j01903R204R5289M3278p401K2831L2959k6190
$$ plain form
37040 28141 -27135 -34832 -16112 -45307 -89722 -20447 205907 470373 627734 655170 622563
37029 622563 562011 440322 260839 112566 67167 81878 72023 31703 -4110 -66920 -198029
37018 -198029 -312802 -276368 -120433 -20050 -24314 12182 165907 291009 230405 30326
37008 30326 -158833 -257440 -239272 -94030 84814 131547 41509 5894 97775 131087 -5235
36997 -5235 -103572 32396 219713 164004 -52533 -95735 85760 210236 146281 97593 224784
36986 224784 379629 353577 176959 28344 -10289 8883 9981 -36817 -90248 -60581 69223
36975 69223 165936 100457 -45540 -67409 73638 192661 123595 -107655 -359945 -503814
36965 -503814 -468338 -285601 -104649 -63537 -144047 -220742 -207110 -77544 157031 374589
$$ packed form
37040B8141n5276p697J8720k9195m4415O9275K26354K64466J57361K7436l2607
37029F22563o0552j21689j79483j48273m5399J4711r855m0320l5813o2810j31109
37018a98029j14773L6434J55935J00383m264L6496J53725J25102o0604k00079
37008C0326j89159r8607J8168J45242J78844M6733r0038l5615R1881L3312j36322
36997e235r8337J35968J87317n5709k16537m3202J81495J24476o3955m8688J27191
36986B24784J54845k6052j76618j48615l8633J9172J098m6798n3431K9667J29804
36975F9223R6713o5479j45997k1869J41047J19023o9066k31250k52290j43869
36965e03814L5476J82737J80952M1112q0510p6695J3632J29566K34575K17558
$$ plain form
36955 374589 364447 99138 -131349 -71902 121170 121057 -42435 -31605 233227 412665 244548
36944 244548 -99631 -290017 -231648 -46934 133133 224402 193665 113569 83699 55051 -94297
36933 -94297 -287568 -292228 -96501 25716 -55422 -100902 112174 417456 498243 323756 110669
36922 110669 -27027 -154198 -303437 -392749 -351325 -208261 -67035 -38631 -131180 -181867
36912 -181867 -25688 236493 313688 123445 -100459 -188962 -268320 -449144 -554229 -409199
36902 -409199 -184060 -141693 -212307 -150257 7735 10046 -140917 -177636 -51627 -42538 -268797
36891 -268797 -443460 -320864 -101167 -120400 -325000 -352941 -62060 295819 435545 348120
36881 348120 191148 54712 -49622 -83947 -10114 115812 191269 207716 244768 309237 286070
$$ packed form
36955C74589j0142k65309k30487N9447J93072j13j63492J0830K64832J79438j68117
36944B44548l44179j90386N8369J84714J80067R1269l0737q0096k9870k8648j49348
36933i4297j93271m660J95727J22217q1138m5480K13076L05282Q0787j74487k13087
36922A10669j37696j27171j49239q9312M1424J43064J41226K8404r2549n0687
36912a81867J56179K62181P7195j90243k23904q8503p9358j80824j05085J45030
36902d09199K25139M2367p0614O2050J57992K311j50963l6719J26009R089k26259
36891b68797j74663J22596K19697j9233k04600k7941K90881L57879J39726q7425
36881C48120j56972j36436j04334l4325P3833J25926P5457J6447L7052O4469k3167
$$ plain form
36870 286070 106623 -121820 -239175 -220713 -145612 -35717 141464 327137 374973 239341
36860 239341 55903 -7548 91987 275634 416478 408215 258760 111639 64281 -2293 -239885
36849 -239885 -498987 -434958 -22095 314421 259185 61480 171521 592889 913818 908259
36839 908259 770501 720047 681490 492777 213092 42741 46578 106726 95530 -15005 -179617
36828 -179617 -324046 -379483 -339067 -269886 -224857 -167008 -34054 143139 257485 267840 252228
36817 252228 280083 295736 208983 67563 25974 123676 212627 173397 96430 138181 279622
36806 279622 367610 340864 253541 105177 -161686 -474439 -632034 -562721 -421499 -352601
36796 -352601 -305546 -181949 -22354 72220 91766 75926 22372 -57082 -92840 -76553 -108870
$$ packed form
36870B86070j79447k28443j17355J8462P5101J09895J77181J85673M7836j35632
36860B39341j83438o3451R9535J83647J40844q263j49455j47121m7358o6574k37592
36849b39885k59102O4029M12863L36516n5236j97705J10041M21368L20929n559
36839I08259j37758n0454l8557j88713k79685j70351L837O0148j1196j10535j64612
36828a79617j44429n5437M0416O9181M5029N7849J32954J77193J14346J0355j5612
36817B52228K7855J5653q6753j41420m1589R7702Q8951l9230p6967M1751J41441
36806B79622Q7988k6746q7323j48364k66863l12753j57595O9313J41222O8898
36796c52601M7055J23597J59595R4574J9546j5840n3554p9454l5758J6287l2317
$$ plain form
36785 -108870 -210245 -216724 -23684 188552 172518 -30072 -168223 -158816 -137954 -147199 -39959
36774 -39959 221930 414463 338097 95719 -71323 -111242 -161511 -285339 -375528 -319557 -130887
36763 -130887 106857 323816 458041 457635 346399 223140 139861 46840 -71209 -90315 84667
36752 84667 298147 282082 36151 -137907 -62193 77498 69032 24282 136452 267815 135108
36741 135108 -167135 -227674 47454 244100 36704 -347315 -476900 -279637 -11312 146568
36731 146568 201328 181304 91941 -18272 -118033 -253281 -417077 -465149 -305064 -59448
36721 -59448 103601 178973 213257 139227 -75857 -249639 -188010 18437 124289 78432 22735
36710 22735 18975 14067 16462 57192 14296 -261879 -649456 -830140 -690737 -432695 -260471
$$ packed form
36785a08870j01375o479J93040K12236j6034k02590j38151R407K0862r245J07240
36774c9959K61889J92533p6366k42378j67042l9919n0269j23828r0189N5971J88670
36763a30887K37744K16959J34225m06j11236j23259q3279r3021j18049j9106J74982
36752H4667K13480j6065k45931j74058P5714J39691q466m4750J12170J31363j32707
36741A35108l02243o0539K75128J96646k07396l84019j29585J97263K68325J57880
36731A46568N4760k0024q9363j10213r9761j35248j63796m8072J60085K45616
36721e9448J63049P5372L4284p4030k15084j73782O1629K06447J05852m5857n5697
36710B2735l760m908K395M0730m2896k76175l87577j80684J39403K58042J72224
$$ plain form
36699 -260471 -177367 -120964 -82373 -32097 84757 221519 260093 201538 160554 151207 69407
36688 69407 -74945 -111136 36907 228670 321131 342788 367614 361362 255166 73403 -86687
36677 -86687 -134671 -29330 167396 288603 234494 128134 155353 275920 279270 122922 2862
36666 2862 50632 166548 216007 202016 173217 139489 148675 267808 410244 359297 58574
36655 58574 -274344 -406512 -321414 -141652 9391 13514 -179448 -411660 -427050 -208257
36645 -208257 -19497 -35958 -141266 -185333 -204022 -248295 -234259 -133049 -84173 -131242 -72662
36634 -72662 199053 427164 331893 44336 -93676 -20568 64395 101345 213530 398552
36624 398552 504773 519026 574761 646565 535950 230638 -2625 4215 92667 60925 -41450
$$ packed form
36699b60471Q3104N6403L8591N0276J16854J36762L8574n8555m0984r347q1800
36688F9407j44352l6191J48043J91763R2461K1657K4826o252j06196j81763j60090
36677h6687m7984J05341J96726J21207n4109j06360K7219J20567L350j56348j20060
36666B862M7770J15916M9459j3991k8799l3728R186J19133J42436n0947l00723
36655E8574l32918j32168Q5098J79762J51043M123j92962k32212j5390K18793
36645b08257J88760j6461j05308m4067j8689m4273J4036J01210M8876m7069N8580
36634g2662K71715K28111r5271k87557j38012P3108Q4963L6950J12185J85022
36624C98552J06221J4253N5735P1804j10615l05312k33263O840Q8452l1742j02375
$$ plain form
36613 -41450 -68879 -53814 -122765 -242247 -255393 -147375 -99326 -235354 -426009 -420087 -142889
36602 -142889 197947 330974 218911 83048 125784 309699 461267 501860 464997 349605
36592 349605 124911 -105799 -118085 156659 472218 515721 277190 45258 25135 93387
36582 93387 20362 -164920 -209920 -41577 73874 -92599 -354946 -336400 -2964 293201
36572 293201 323910 260673 326332 425719 330867 61097 -157414 -209539 -145731 4854 237308
36561 237308 417770 370718 149762 13856 80288 186261 164154 75025 60423 111587 129922
36550 129922 122169 178897 288245 308533 156856 -56389 -131847 3883 222979 341306
36540 341306 313304 247387 234817 233624 168023 78153 75787 170336 242425 213749 156521 181771
$$ packed form
36613d1450k7429J5065o8951j19482j3146J08018M8049j36028j90655N922K77198
36602a42889L40836J33027j12063j35863M2736J83915J51568M0593l6863j15392
36592C49605k24694k30710j2286K74744L15559M3503k38531k31932k0123O8252
36582I3387p3025j85282m5000J68343J15451j66473k62347J8546L33436K96165
36572B93201L0709o3237O5659R9387r4852k69770k18511n2125O3808J50585K32454
36561B37308J80462m7052k20956j35906O6432J05973k2107q9129j4602N1164J8335
36550A29922p753N6728J09348K0288j51677k13245p5458J35730K19096J18327
36540C41306k8002o5917j2570j193o5601q9870k366R4549P2089k8676n7228K5250
$$ plain form
36528 181771 274951 308439 203058 27303 -75356 -35878 78844 151119 143791 128985 187827
36517 187827 307570 395231 381170 293342 228670 250128 310707 297923 169926 19719 -32490
36506 -32490 13157 46748 -6758 -105551 -145812 -55570 142705 314499 302646 108478 -67733
36495 -67733 -67338 3663 -69147 -280022 -418485 -401066 -369310 -415117 -430584 -325394 -195721
36484 -195721 -157626 -184261 -225328 -311990 -416027 -394488 -228996 -123691 -175564 -149297 172620
36473 172620 591710 740959 601353 451180 392256 284547 121501 85086 168287 110554
36463 110554 -153765 -307596 -108398 231983 361526 282565 269269 413610 523002 440286
36453 440286 240259 76941 -3277 -44002 -83963 -140489 -228354 -340567 -426473 -423995 -327846
$$ packed form
36528A81771R3180L3488j05381j75755j02659L9478J14722P2275p328j4806N8842
36517A87827J19743Q7661j4061q7828o4672K1458O0579j2784j27997j50207n2209
36506c2490M5647L3591n3506r8793m0261R0242J98275J71794j1853j94168j76211
36495f7733L95P1001p2810k10875j38463J7419L1756m5807j5467J05190J29673
36484a95721L8095k6635m1067q6662j04037K1539J65492J05305n1873K6267L21917
36473A72620M19090J49249j39606j50173n8924j07709j63046l6415Q3201n7733
36463A10554k64319j53831J99198L40381J29543p8961j3296J44341J09392q2716
36453D40286k00027j63318q0218m0725l9961n6526q7865j12213q5906K478R6149
$$ plain form
36442 -327846 -214928 -168726 -167237 -97878 74749 218839 193878 45366 -72606 -132648 -243768
36431 -243768 -421686 -511726 -400503 -171490 27962 160328 250573 272121 196659 86415
36421 86415 18573 -36154 -146417 -267882 -283383 -186896 -97487 -64346 13265 202147 381672
36410 381672 389394 253413 138866 86708 -26705 -229086 -324928 -153149 150733 312902
36400 312902 269151 180937 149480 112759 28866 -39459 -65760 -102973 -136445 -82653 3113
36389 3113 -72038 -328408 -514137 -450080 -270528 -159170 -56977 148845 329908 280631
36379 280631 61214 -85196 -81266 -43663 -37304 -40713 -91350 -225996 -335909 -317536 -290723
36368 -290723 -401596 -492292 -295682 76589 207970 -17651 -237635 -141890 134941 293917
$$ packed form
36442c27846J12918M6202J489O9359J72627J44090k4961j48512j17972o0042j11120
36431b43768j77918r0040J11223K29013J99452J32366R0245K1548p5462j10244
36421H6415o7842n4727j10263j21465j5501R6487Q9409L3141P7611J88882J79525
36410C81672P722j35981j14547n2158j13413k02381r5842J71779L03882J62169
36400C12902m3751q8214l1457l6721q3893o8325k6301l7213l3472N3792Q5766
36389C113p5151k56370j85729O4057J79552J11358J02193K05822J81063m9277
36379B80631k19417j46410L930L7603O359l409n0637j34646j09913J8373K6813
36368b90723j10873r0696J96610L72271J31381k25621k19984R5745K76831J58976
$$ plain form
36358 293917 265037 152048 17074 -99431 -118376 -37355 28533 20023 -2848 -36118 -170568
36347 -170568 -364267 -395333 -176737 72645 114053 -22737 -167842 -256468 -306063 -311503 -311049
36336 -311049 -415069 -631664 -792800 -769623 -627976 -479875 -347796 -270124 -338153 -499922
36326 -499922 -535740 -382808 -276377 -394188 -573231 -585447 -486216 -445275 -422174 -294691
36316 -294691 -159992 -196057 -315611 -268729 -51218 77815 -14143 -181088 -257627 -246618
36306 -246618 -214490 -194972 -241307 -409035 -631767 -731128 -591899 -263519 93336 295809
36296 295809 238445 2126 -191520 -215314 -147056 -82880 9153 134533 151898 -9024 -170590
36285 -170590 -167694 -133326 -261442 -416776 -300975 56505 303094 253376 63754 -106570
$$ packed form
36358B93917k8880j12989j34974j16505j8945Q1021O5888q510k2871l3270j34450
36347a70568j93699l1066K18596K49382M1408j36790j45105q8626m9595n440M54
36336c11049j04020k16595j61136K3177J41647J48101J32079P7672o8029j61769
36326d99922l5818J52932J06431j17811j79043j2216R9231M0941K3101J27483
36316b94691J34699l6065j19554M6882K17511J29033r1958j66945p6539J1009
36306b46618L2128J9518m6335j67728k22732r9361J39229L28380L56855K02473
36296B95809n7364k36319j93646k3794O8258O4176R2033J25380J7365j60922j61566
36285a70590K896L4368j28116j55334J15801L57480K46589m9718j89622j70324
$$ plain form
36275 -106570 -293590 -504633 -582474 -434990 -201945 -73211 -92931 -215318 -388105 -513265
36265 -513265 -495184 -398068 -388909 -461127 -401166 -117275 187442 295474 266282 294848 397010
36254 397010 405090 232607 9016 -60975 84105 291620 342892 192218 22901 15697 125104
36243 125104 176829 112880 5269 -102422 -190360 -156081 69018 316000 329364 138285
36233 138285 28630 99566 121571 -58880 -245868 -204113 -20795 59741 2060 -43612 -17783
36222 -17783 16237 47212 114847 166010 98034 -58161 -154115 -129015 -64089 -23221 27139
36211 27139 101492 110636 -35761 -292252 -496122 -510987 -338821 -107065 46152 82141 60766
36200 60766 39083 -2045 -116952 -300065 -456865 -485665 -396280 -323219 -371988 -462949 -414125
$$ packed form
36275a06570j87020k11043p7841J47484K33045J28734j9720j22387j72787j25160
36265e13265J8081R7116R159p2218N9961K83891L04717J08032k9192K8566J02162
36254C97010Q080j72483k23591o9991J45080K07515N1272j50674j69317p204J09407
36243A25104N1725o3949j07611j07691q7938L4279K25099K46982J3364j91079
36233A38285j09655P0936K2005j80451j86988M1755J83318Q0536n7681m5672K5829
36222a7783L4020L0975O7635N1163o7976j56195r5954K5100O4926M0868N0360
36211B7139P4353R144j46397k56491k03870j4865J72166K31756J53217L5989k1375
36200F0766k1683m1128j14907j83113j56800k8800Q9385P3061m8769r0961M8824
$$ plain form
36189 -414125 -197864 -508 31807 -28302 -72768 -168577 -393892 -578084 -465741 -110161
36179 -110161 161053 196207 170364 220151 210948 26169 -153457 -94554 115825 194770 93437
36168 93437 55806 229152 419062 326735 -79401 -531036 -760077 -741505 -617843 -460736
36158 -460736 -214106 120855 378662 411625 296465 226617 246914 238387 136906 7346
36148 7346 -98050 -195289 -263749 -237529 -132515 -43946 6493 81251 171575 193156 160867
36137 160867 191387 286717 292285 133554 -69381 -182156 -190360 -112259 36111 143055 81595
36126 81595 -50343 -5007 221373 339044 226327 138278 263309 373073 190113 -149916
36116 -149916 -334576 -377384 -512950 -709969 -680149 -352688 6503 181425 219090 212314
$$ packed form
36189d14125K16261J97356L2315o0109m4466r5809k25315j84192J12343L55580
36179a10161K71214L5154k5843M9787r203j84779j79626N8903K10379P8945j01333
36168I3437l7631J73346J89910r2327m06136m51635k29041J8572J23662J57107
36158d60736K46630L34961K57807L2963j15160o9848K0297q527j01481j29560
36148G346j05396r7239o8460K6220J05014Q8569N0439P4758R0324K1581l2289
36137A60867L0520R5330N568j58731k02935j12775q204P8101J48370J06944o1460
36126H1595j31938M5336K26380J17671j12717q8049J25031J09764j82960l40029
36116a49916j84660m2808j35566j97019K9820L27461L59191J74922L7665o776
$$ plain form
36106 212314 141730 13119 -71758 -70761 -60411 -84452 -99338 -102928 -152113 -218868 -195739 -84680
36094 -84680 -19365 -57981 -111733 -121634 -143664 -202404 -217713 -147136 -61044 -10657 38116 72586
36082 72586 -6768 -189718 -264549 -72583 236202 360905 228574 71881 115190 298585
36072 298585 373031 208806 -66610 -232599 -206942 -74088 58324 140081 136387 26897
36062 26897 -120422 -183877 -145346 -103547 -80356 38297 269548 402086 266274 17149
36052 17149 -52724 90406 218150 189546 90951 31353 1811 -27646 -38872 -34048 -40708 -29621
36040 -29621 48529 149276 191523 208167 283488 366419 335576 239129 252216 376971 420009
36029 420009 323469 273929 379318 473256 395004 262491 272883 376436 354582 141713 -108138
$$ packed form
36106B12314p0584j28611q4877R97J0350k4041j4886l590m9185o6755K3129J11059
36094h4680O5315l8616n3752r901k2030n8740j5309P0577Q6092N0387M8773L4470
36082G2586p9354j82950p4831J91966L08785J24703j32331j56693M3309J83395
36072B98585P4446j64225k75416j65989K5657J32854J32412Q1757l694j09490
36062B6897j47319o3455L8531M1799K3191J18653K31251J32538j35812k49125
36052A7149o9873J43130J27744k8604r8595n9598k9542k9457j1226M824o660J1087
36040b9621P8150J00747M2247J6644P5321Q2931l0843r6447J3087J24755M3038
36029D20009r6540m9540J05389R3938p8252j32513J0392J03553k1854k12869k49851
$$ plain form
36018 -108138 -228355 -172670 13629 224193 318862 229123 29396 -156350 -281834 -363538
36008 -363538 -403390 -395751 -362428 -324946 -287724 -276841 -323040 -382284 -367158 -280418 -203061 -137026
35996 -137026 -25657 37101 -149191 -522749 -681099 -383680 66237 209155 46285 -47656
35986 -47656 65075 132598 -10771 -178264 -166504 -64315 -47297 -89193 -78680 -54435 -112975
35975 -112975 -201390 -208425 -176846 -219600 -283593 -214524 -41328 20373 -119728 -304731 -376219
35964 -376219 -358161 -312237 -191675 24814 200356 211326 151006 184932 278967 268339 151511
35953 151511 92550 127784 104493 -27633 -91735 30310 182465 164263 21770 -67811 -76400
35942 -76400 -93507 -108500 -37366 84952 145964 160336 229028 311178 259501 100082 44245
$$ packed form
36018a08138j20217N5685J86299K10564R4669q9739j99727j85746j25484q1704
36008c63538l9852P639L3323L7482L7222J0883m6199n9244J5126Q6740P7357O6035
35996a37026J11369O2758j86292l73558j58350K97419M49917J42918j62870r3941
35986d7656J12731O7523j43369j67493J1760J02189J7018m1896J0513K4245n8540
35975a12975q8415p035L1579m2754o3993O9069J73196O1701j40101j85003p1488
35964c76219J8058M5924J20562K16489J75542J0970o0320L3926R4035j0628j16828
35953A51511n8961L5234k3291j32126o4102J22045J52155j8202j42493q9581q589
35942g6400j7107j4993P1134J22318O1012J4372O8692Q2150n1677j59419n5837
$$ plain form
35931 44245 156679 231756 107707 -90024 -159538 -118175 -124861 -218403 -296491 -286900 -198206
35920 -198206 -51825 111326 202731 182960 143910 179314 218824 125329 -68316 -169570 -88613
35909 -88613 46758 86304 50443 51980 112861 161183 168052 176308 186437 118987 -49729 -189679
35897 -189679 -156851 -6976 45874 -94316 -285186 -357604 -328788 -301479 -258807 -119834 57513
35886 57513 110481 5248 -129636 -218646 -318723 -444269 -488150 -398791 -286717 -258267 -273409
35875 -273409 -266534 -274604 -323705 -313302 -164271 14032 66586 30519 59272 157445 176396
35864 176396 66590 -49425 -91802 -145081 -287845 -429139 -419676 -250431 -39917 132815
35854 132815 281382 405550 431552 311685 132937 49949 105298 183017 175694 133601 171332
$$ packed form
35931D4245J12434P5077j24049j97731o9514M1363o686r3542p8088R591Q8694
35920a98206J46381J63151R1405j9771l9050L5404L9510r3495j93645j01254Q0957
35909h8613J35371L9546l5861J537O0881M8322O869Q256J0129o7450j68716j39950
35897a89679L2828J49875N2850j40190j90870p2418K8816K7309M2672J38973J77347
35886E7513N2968j05233j34884q9010j00077j25546m3881Q9359J12074K8450j5142
35875b73409O875q070m9101J0403J49031J78303N2554l6067K8753R8173J8951
35864A76396j09806j16015m2377n3279j42764j41294R463J69245K10514J72732
35854A32815J48567J24168K6002j19867j78748q2988N5349P7719p323m2093L7731
$$ plain form
35843 171332 269531 286839 179447 87601 141911 277768 330354 249729 120085 2464 -124054
35832 -124054 -252879 -289677 -168486 26044 133218 107521 60711 85201 113530 37020 -89283
35821 -89283 -97556 32979 125157 71691 -11876 -15079 -43475 -214795 -382070 -311912 -69081
35810 -69081 48300 -57163 -185995 -201442 -200329 -252815 -255401 -172071 -165319 -318154 -441602
35799 -441602 -341630 -96877 101758 210880 260029 205706 64228 15524 147398 253689
35789 253689 130377 -75188 -83405 75542 144352 79623 81694 205539 265072 167351 60035
35778 60035 72229 143754 186815 208764 202973 113954 -14087 -38346 52113 76528 -78956
35767 -78956 -290925 -373344 -295541 -151440 -31298 3240 -75920 -209703 -281290 -245562 -165452
$$ packed form
35843A71332R8199J7308j07392r1846N4310J35857N2586q0625j29644j17621j26518
35832a24054j28825l6798J21191J94530J07174k5697m6810K4490K8329p6510j26303
35821h9283q273J30535R2178n3466q3567l203k8396j71320j67275P0158K42831
35810f9081J17381j05463j28832j5447J113n2486k586Q3330O752j52835j23448
35799d41602R9972K44753J98635J09122M9149n4323j41478m8704J31874J06291
35789B53689j23312k05565q217J58947O8810o4729K071J23845N9533r7721j07316
35778F0035J2194P1525M3061K1949n791q9019j28041k4259R0459K4415j55484
35767g8956k11969q2419P7803J44101J20142L4538p9160j33783p1587L5728Q0110
$$ plain form
35756 -165452 -113623 -117018 -180244 -263780 -274063 -197264 -187296 -355479 -528639 -434544 -106580
35745 -106580 141899 161156 118365 151484 148580 -4051 -198558 -291449 -318873 -371359 -426973
35734 -426973 -455554 -513976 -582432 -486985 -172230 112382 115076 -54590 -88192 86861 260816
35723 260816 274508 178764 74180 -13722 -76736 -86959 -48089 4368 48447 56249 -16955
35712 -16955 -138073 -161182 961 230364 341316 302814 210846 115934 17555 -38261 -15452
35701 -15452 3755 -74424 -177318 -156573 -26497 60560 58056 56424 65188 -32230 -249075 -403742
35689 -403742 -356386 -203610 -134986 -194094 -279523 -310228 -293791 -265801 -233455 -175114 -76862
35678 -76862 14300 -5619 -182548 -411659 -541177 -558633 -576574 -637912 -660941 -603401 -543232
$$ packed form
35756a65452N1829l395o3226q3536j0283P6799R968j68183j73160R4095L27964
35745a06580K48479J9257m2791L3119k904j52631j94507r2891k7424n2486n5614
35734d26973k8581n8422o8456R5447L14755K84612K694j69666l3602J75053J73955
35723B60816J3692r5744j04584q7902o3014j0223L8870N2457M4079P802p3204
35712a6955j21118k3109J62143K29403J10952l8502r1968r4912r8379n5816K2809
35701a5452J9207p8179j02894K0745J30076Q7057k504j632Q764r7418k16845j54667
35689d03742M7356J52776O8624n9108q5429l0705J6437K7990L2346N8341R8252
35678g6862R1162j9919j76929k29111j29518j7456j7941o1338k3029N7540O0169
$$ plain form
35667 -543232 -527303 -464611 -277606 -69818 -12526 -104614 -169967 -96645 24219 37191 -60647
35656 -60647 -99612 61813 342371 486409 338700 38895 -126592 -56258 75469 74677 -41729
35645 -41729 -139357 -176685 -199052 -196819 -124837 -39593 -52944 -126387 -74417 154163 343141
35634 343141 277892 44986 -83096 -5111 121358 133357 50927 -13766 -4806 69777 174564
35623 174564 237325 189258 58696 -60678 -161524 -317895 -476933 -418065 -51957 365199
35613 365199 487207 275777 -16186 -188351 -232486 -177399 -22731 147493 189230 100565
35603 100565 36776 68012 89465 41347 37010 156730 271720 223413 64500 -33958 -36901
35592 -36901 -53431 -136503 -218387 -239227 -232239 -268862 -372971 -478068 -451467 -226630 58337
$$ packed form
35667e43232J5929O2692J87005K07788N7292r2088o5353P3322J20864J2972r7838
35656f0647l8965J61425K80558J44038j47709k99805j65487P0334J31727p92j16406
35645d1729r7628l7328k2367K233P1982Q5244j3351p3443N1970K28580J88978
35634C43141o5249k32906j28082P7985J26469J1999q2430o4693Q960P4583J04787
35623A74564O2761m8067j30562j19374j00846j56371j59038N8868L66108M17156
35613C65199J22008k11430k91963j72165m4135N5087J54668J70224M1737q8665
35603A00565o3789L1236K1453m8118m337J19720J14990m8307j58913r8458k943
35592c6901j6530q3072q1884k0840O988l6623j04109j05097K6601K24837K84967
$$ plain form
35581 58337 158620 27295 -90819 26536 277645 386828 271102 94673 5158 -17621
35571 -17621 -59301 -165400 -344642 -551044 -659628 -586574 -442223 -433483 -587469 -697863
35561 -697863 -590398 -327274 -85517 69638 203979 365065 505623 559004 544146 563738
35551 563738 680180 807012 786937 604904 441457 442082 513926 467587 301802 194976 229112
35540 229112 284545 239004 123379 21371 -54525 -105623 -75621 62767 225540 321111 383223
35529 383223 504427 671910 764982 708399 553311 406791 343645 386457 503868 605144
35519 605144 586631 420992 185221 -11986 -111236 -113264 -60064 -35098 -127536 -321822 -446078
35508 -446078 -330380 -38914 154029 75359 -150947 -295007 -301859 -251918 -141104 89564
$$ packed form
35581E8337J00283j31325j18114J17355K51109J09183j15726j76429q9515k2779
35571a7621m1680j06099j79242k06402j08584P3054J44351Q740j53986j10394
35561f97863J07465K63124K41757J55155J34341J61086J40558N3381j4858J9592
35551E63738J16442J26832k0075j82033j63447O25P1844m6339j65785j06826L4136
35540B29112N5433m5541j15625j02008p5896n1098L0002J38388J62773R5571O2112
35529C83223J21204J67483R3072n6583j55088j46520o3146M2812J17411J01276
35519F05144j8513j65639k35771j97207r9250k028N3200K4966r2438j94286j24256
35508d46078J15698K91466J92943p8670k26306j44060o852M9941J10814K30668
$$ plain form
35498 89564 330164 344557 97798 -160331 -228352 -185101 -183408 -204304 -168939 -122900 -121753
35487 -121753 -75466 88601 231735 198476 99788 148334 286252 257174 19316 -202300
35477 -202300 -286206 -341434 -409222 -337948 -78803 155287 188944 130039 147395 192913 133730
35466 133730 1883 -92200 -173616 -323959 -477540 -499592 -407888 -321557 -231875 -28043 251587
35455 251587 393111 286327 85849 24860 161143 358350 444447 344864 117313 -100161
35445 -100161 -200886 -190148 -149892 -145388 -187118 -241878 -241036 -129952 31707 78332 -66532
35434 -66532 -255505 -287531 -171445 -79538 -56620 39767 253215 369564 193976 -128814
35424 -128814 -262242 -114571 56483 6080 -198016 -324057 -288730 -183709 -70624 83857
$$ packed form
35498H9564K40600J4393k46759k58129o8021M3251J693k0896L5365M6039J147
35487a21753M6287J64067J43134l3259r8688M8546J37918k9078k37858k21616
35477b02300q3906n5228o7788P1274K59145K34090L3657n8905J7356M5518n9183
35466A33730j31847r4083q1416j50343j53581k2052R1704Q6331Q9682K03832K79630
35455B51587J41524j06784k00478o0989J36283J97207Q6097r9583k27551k17474
35445a00161j00725J0738M0256M504m1730n4760Q42J11084J61659M6625j44864
35434f6532j88973l2026J16086R1907K2918R6387K13448J16349j75588l22790
35424a28814j33428J47671J71054n0403k04096j26041L5327J05021J13085J54481
$$ plain form
35414 83857 272754 391619 356832 188566 -42794 -253119 -316654 -141752 168041 363495
35404 363495 344047 271489 290628 296740 151561 -14033 33905 229819 254059 -850 -279971
35393 -279971 -362174 -351284 -423608 -502319 -400681 -158265 733 258 -3089 120711 299093
35382 299093 385184 334359 190232 -6025 -203919 -298619 -209370 -17568 63234 -74469
35372 -74469 -267349 -249582 15836 283000 337058 242311 192624 233257 273242 286630 317558
35361 317558 321343 194463 -28225 -186145 -229507 -266649 -334873 -312698 -140351 44394 96957
35350 96957 51031 9886 -11949 -27772 10044 111366 173879 137964 112018 200576 297948
35339 297948 219498 -5766 -134176 -9452 240965 339297 145091 -192983 -376033 -285439
$$ packed form
35414H3857J88897J18865l4787j68266k31360k10325o3535J74902L09793J95454
35404C63495j9448p2558J9139O112j45179j65594M7938J95914K4240k54909k79121
35393b79971q2203J0890p2324p8711J01638K42416J58998m75l347J23800J78382
35382B99093Q6091n0825j44127j96257j97894r4700Q9249J91802Q0802j37703
35372g4469j92880J7767K65418K67164N4058r4747m9687M0633L9985J3388L0928
35361C17558L785j26880k22688j57920m3362l7142o8224K2175J72347J84745N2563
35350I6957m5926m1145k1835j5823L7816J01322O2513l5915k5946Q8558R7372
35339B97948p8450k25264j28410J24724K50417R8332j94206l38074j83050R0594
$$ plain form
35329 -285439 -139700 -215225 -446973 -494733 -226411 95404 200239 146210 112977 81570
35319 81570 -48818 -185034 -140981 68487 259551 343477 361170 325184 234171 187834 281495
35308 281495 425632 454939 365131 263618 166995 55683 35568 186868 322503 191638
35298 191638 -105940 -218678 -60769 93765 80286 66988 197583 331787 314136 229788
35288 229788 196393 135334 -35912 -183379 -157582 -54645 -46235 -83133 -12771 105741 67420
35277 67420 -127821 -231958 -86965 179091 342504 328210 211352 90467 28848 50478
35267 50478 122981 168229 139207 87638 116436 231977 273414 79239 -253665 -404645 -222884
35256 -222884 38278 50868 -130478 -186924 -52310 7230 -134897 -264644 -241809 -277681
$$ packed form
35329b85439J45739p5525k31748m7760K68322L21815J04835n4029l3233l1407
35319H1570j30388j36216M4053K09468J91064Q3926J7693l5986r1013m6337R3661
35308B81495J44137K9307q9808j01513r6623j11312k0115J51300J35635j30865
35298A91638k97578j12738J57909J54534j3479j3298J30595J34204j7651q4348
35288B29788l3395o1059j71246j47467K5797J02937Q410l6898P0362J18512l8321
35277F7420j95241j04137J44993K66056J63413j4294j16858j20885o1619K1630
35267E0478P2503M5248k9022n1569K8798J15541M1437j94175l32904j50980J81761
35256b22884K61162J2590j81346n6446J34614N9540j42127j29747K2835l5872
$$ plain form
35246 -277681 -544750 -784719 -643430 -224660 48952 42213 21678 181737 398041 507071
35236 507071 527928 504581 387607 203004 119323 200252 272706 188318 47211 -96 -9783
35225 -9783 -99387 -176542 -63937 165694 244994 116733 30247 151507 304438 252574 64539
35214 64539 -3510 112482 245367 303215 385452 548271 652542 547605 268251 -48526
35204 -48526 -312260 -436303 -295663 90405 425768 400233 70144 -202145 -188765 -4780
35194 -4780 131385 152133 95893 -14321 -139837 -194262 -148591 -91879 -112783 -186453 -222787
35183 -222787 -150873 61615 359867 553648 470241 206846 65640 162180 278060 207370
35173 207370 47505 -18848 -34499 -127960 -217781 -143794 -9933 -84815 -361763 -515886 -368499
$$ packed form
35246b77681k67069k39969J41289M18770K73612o739k0535J60059K16304J09030
35236E07071K0857k3347j16974j84603q3681Q0929P2454q4388j41107m7307r687
35225i783q9604p7155J12605K29631P9300j28261q6486J21260J52931n1864j88035
35214F4539o8049J15992J32885N7848Q2237J62819J04271j04937k79354l16777
35204d8526k63734j24043J40640L86068L35363k5535l30089k72289J3380J83985
35194d780J36165K0748n6240j10214j25516n4425M5671N6712k0904p3670l6334
35183b22787P1914K12488K98252J93781q3407k63395j41206R6540J15880p0690
35173B07370j59865o6353j5651r3461q9821P3987J33861p4882k76948j54123J47387
$$ plain form
35162 -368499 -134576 -90099 -206361 -268940 -206862 -135194 -152628 -235155 -291038 -234327 -52070
$$ packed form
35162c68499K33923M4477j16262o2579O2078P1668j7434q2527n5883N6711J82257
$$ [...]
##END NTUPLES=NMR SPECTRUM
##END=
