##TITLE=31Pdec_2PEDM1
 CDCl3, 24 sc
 26.7.2019
##JCAMPDX= 6.0         $$ Bruker NMR JCAMP-DX V2.0
##DATA TYPE= NMR SPECTRUM
##DATA CLASS= NTUPLES
##ORIGIN= UXNMR, Bruker Analytische Messtechnik GmbH
##OWNER= root
$$ XWIN-NMR		Version 3.5
$$ Fri Jul 26 13:50:06 2019 Russian Standard Time (UT+4h)  she@DPX200
##.OBSERVE FREQUENCY= 81.013821
##.OBSERVE NUCLEUS= ^31P
##.ACQUISITION MODE= SIMULTANEOUS
##.ACQUISITION SCHEME= undefined
##.AVERAGES= 24
##.DIGITISER RES= 17
##SPECTROMETER/DATA SYSTEM= spect
##.PULSE SEQUENCE= zgpg30
##.SOLVENT NAME= CDCl3
##.SHIFT REFERENCE= (INTERNAL, CDCl3, 0, 182.463)
##AUDIT TRAIL= $$ (NUMBER, WHEN, WHO, WHERE, WHAT)
$$ ##TITLE= Audit trail, XWIN-NMR		Version 3.5
$$ ##JCAMPDX= 5.01
$$ ##ORIGIN= Bruker BioSpin GmbH
$$ ##OWNER= she
$$ F:/spectra/data/she/nmr/P31/1/pdata/1/auditp.txt
$$ ##AUDIT TRAIL=  $$ (NUMBER, WHEN, WHO, WHERE, WHAT)
(   1,<2019-07-26 13:49:11.64 +0400>,<she>,<DPX200>,
      <created by zg, POWCHK disabled, PULCHK disabled
       configuration hash MD5:
       00 E9 B6 7A A2 85 ED C7 34 08 36 98 17 FE 4E 26
       data hash MD5: 32K
       6E 76 9F C4 D3 56 D5 46 8F 06 6D 12 24 88 79 48>)
(   2,<2019-07-26 13:49:18.84 +0400>,<she>,<DPX200>,
      <Start of raw data processing
       efp BC_mod = 2 LB = 1 FT_mod = 6 PKNL = 1 PHC0 = -369.4774 PHC1 = 51.39999 SI = 64K 
       data hash MD5: 64K
       87 4D 32 3D C2 6D F9 1B 5B E2 B0 CC 60 56 82 7A>)
(   3,<2019-07-26 13:49:35.50 +0400>,<she>,<DPX200>,
      <pk PHC0 = -1.475429 PHC1 = 0 
       data hash MD5: 64K
       04 BA 03 E9 BE FB 4C EE 79 FA 73 14 D2 DA 2A E1>)
(   4,<2019-07-26 13:49:38.39 +0400>,<she>,<DPX200>,
      <abs ABSG = 5 
       data hash MD5: 64K
       34 10 EB 2A E7 03 C9 53 EC A2 1D 21 B7 16 C6 6F>)
$$ ##END=
$$ 
$$ hash MD5
$$ E6 81 53 8A 8D 11 74 4E 70 F0 9C 3B AB 4D 3C 97
##$RELAX= 
##$RELAX= 
##$RELAX= 
##$RELAX= 
##$RELAX= 
##$RELAX= 
##$RELAX= 
##$RELAX= 
$$ Bruker specific parameters
$$ --------------------------
##$DU= <F:/spectra>
##$EXPNO= 1
##$NAME= <P31>
##$PROCNO= 1
##$TYPE= <nmr>
##$USER= <she>
##$AMP= (0..31)
100 100 100 100 100 100 100 100 100 100 100 100 100 100 100 100 100 100 
100 100 100 100 100 100 100 100 100 100 100 100 100 100 
##$AQSEQ= 0
##$AQ_mod= 1
##$AUNM= <au_zg>
##$AUTOPOS= <>
##$BF1= 81.014009
##$BF2= 200.13
##$BF3= 200.13
##$BF4= 200.13
##$BF5= 200.13
##$BF6= 200.13
##$BF7= 200.13
##$BF8= 200.13
##$BYTORDA= 1
##$CFDGTYP= 0
##$CFRGTYP= 5
##$CHEMSTR= <none>
##$CNST= (0..31)
1 1 145 1 1 1 1 1 1 1 1 1 1 1 1 1 1 1 1 1 1 1 1 1 1 1 1 1 1 1 1 1 
##$CPDPRG= <waltz16>
##$CPDPRG1= <>
##$CPDPRG2= <waltz16>
##$CPDPRG3= <>
##$CPDPRG4= <mlev>
##$CPDPRG5= <mlev>
##$CPDPRG6= <mlev>
##$CPDPRG7= <mlev>
##$CPDPRG8= <mlev>
##$CPDPRGB= <>
##$CPDPRGT= <>
##$D= (0..31)
0 1 0 0 0 0 0 0 0 0 0 0.03 2e-05 3e-06 0 0 0 0 0 0 0 0 0 0 0 0 0 0 0 0 
0 0 
##$DATE= 1564134551
##$DBL= (0..7)
120 120 120 11 120 120 24 19 
##$DBP= (0..7)
150 150 150 150 150 150 150 150 
##$DBP07= 0
##$DBPNAM0= <>
##$DBPNAM1= <>
##$DBPNAM2= <>
$$ [...]
##$SUBNAM3= <"">
##$SUBNAM4= <"">
##$SUBNAM5= <"">
##$SUBNAM6= <"">
##$SUBNAM7= <"">
##$SUBNAM8= <"">
##$SUBNAM9= <"">
##$SW= 369.568048894756
##$SWIBOX= (0..15)
0 1 3 0 0 0 0 0 0 0 0 0 0 0 0 0 
##$SW_h= 29940.119760479
##$TD= 32768
##$TD0= 1
##$TE= 0
##$TE2= 300
##$TE3= 300
##$TEG= 300
##$TL= (0..7)
0 120 53 12 22 120 120 120 
##$TP= (0..7)
150 150 150 150 150 150 150 150 
##$TP07= 0
##$TPNAME0= <>
##$TPNAME1= <>
##$TPNAME2= <>
##$TPNAME3= <>
##$TPNAME4= <>
##$TPNAME5= <>
##$TPNAME6= <>
##$TPNAME7= <>
##$TPOAL= (0..7)
0.5 0.5 0.5 0.5 0.5 0.5 0.5 0.5 
##$TPOFFS= (0..7)
0 0 0 0 0 0 0 0 
##$TUNHIN= 0
##$TUNHOUT= 0
##$TUNXOUT= 0
##$USERA1= <user>
##$USERA2= <user>
##$USERA3= <user>
##$USERA4= <user>
##$USERA5= <user>
##$V9= 5
##$VALIST= <valist>
##$VCLIST= <CCCCCCCCCCCCCCC>
##$VD= 0
##$VDLIST= <DDDDDDDDDDDDDDD>
##$VPLIST= <PPPPPPPPPPPPPPP>
##$VTLIST= <TTTTTTTTTTTTTTT>
##$WBST= 1024
##$WBSW= 4
##$XGAIN= (0..3)
0 0 0 0 
##$XL= 0
##$YL= 0
##$YMAX_a= 55494
##$YMIN_a= -54541
##$ZGOPTNS= <>
##$ZL1= 120
##$ZL2= 120
##$ZL3= 120
##$ZL4= 120
##$ABSF1= 182.463
##$ABSF2= -187.1042
##$ABSG= 5
##$ABSL= 3
##$ALPHA= 0
##$AQORDER= 0
##$ASSFAC= 0
##$ASSFACI= 0
##$ASSFACX= 0
##$ASSWID= 0
##$AUNMP= <proc_1d>
##$AZFE= 0.1
##$AZFW= 0.5
##$BCFW= 0
##$BC_mod= 2
##$BYTORDP= 0
##$COROFFS= 0
##$CY= -3
##$DATMOD= 1
##$DC= 0
##$DFILT= <>
##$DTYPP= 0
##$F1P= 0
##$F2P= 0
##$FCOR= 1
##$FTSIZE= 65536
##$FT_mod= 6
##$GAMMA= 0
##$GB= 0
##$INTBC= 1
##$INTSCL= 5.30512e-09
##$ISEN= 30
##$LB= 1
##$LEV0= 0
##$LPBIN= 0
##$MAXI= 10000
##$MC2= 0
##$MEAN= 0
##$ME_mod= 0
##$MI= 50
##$NCOEF= 0
##$NC_proc= -3
##$NLEV= 6
##$NOISF1= 182.463
##$NOISF2= 159.3651
##$NSP= 0
##$NTH_PI= 0
##$NZP= 0
##$OFFSET= 182.463
##$PC= 4
##$PHC0= -370.9528
##$PHC1= 51.39999
##$PH_mod= 1
##$PKNL= yes
##$PPARMOD= 0
##$PSCAL= 0
##$PSIGN= 0
##$REVERSE= no
##$SF= 81.0140089999434
##$SI= 65536
##$SIGF1= 159.3651
##$SIGF2= -187.1042
##$SINO= 113.3802
##$SIOLD= 16384
##$SREGLST= <1H.CDCl3>
##$SSB= 0
##$STSI= 65536
##$STSR= 0
##$SW_p= 29940.119760479
##$SYMM= 0
##$S_DEV= 0
##$TDeff= 32768
##$TDoff= 0
##$TI= <>
##$TILT= no
##$TM1= 0
##$TM2= 0
##$TOPLEV= 0
##$USERP1= <user>
##$USERP2= <user>
##$USERP3= <user>
##$USERP4= <user>
##$USERP5= <user>
##$WDW= 1
##$XDIM= 65536
##$YMAX_p= 376694449
##$YMIN_p= -2480754
$$ End of Bruker specific parameters
$$ ---------------------------------
##NTUPLES= NMR SPECTRUM
##VAR_NAME=  FREQUENCY,     SPECTRUM/REAL,   SPECTRUM/IMAG
##SYMBOL=    X,             R,               I
##VAR_TYPE=  INDEPENDENT,   DEPENDENT,       DEPENDENT
##VAR_FORM=  AFFN,          ASDF,            ASDF
##VAR_DIM=   65536,         65536,           65536
##UNITS=     HZ,            ARBITRARY UNITS, ARBITRARY UNITS
##FACTOR=    0.456856943014862, 1,           1
##FIRST=     14782.0589164792, 0,            0
##LAST=      -15158.0608439998, 0,           0
##MIN=       -15158.0608439998, -2480754,    0
##MAX=       14782.0589164792, 376694449,    0
$$ Real data points
##PAGE= N=1
##DATA TABLE= (X++(R..R)), XYDATA
$$ [...]
$$ plain form
41329 106794 168249 179268 193213 235165 242870 158492 33544 -33653 -40392 -75453 -168497 -227813
41317 -227813 -169609 -42769 46238 88937 153834 218702 157556 -42788 -174251 -41203 265345
41306 265345 468316 446314 327281 251493 209268 152695 109026 99892 67651 -28442 -133431
41295 -133431 -187662 -205952 -196521 -103499 80775 242277 289845 292795 360209 450958 435156
41284 435156 309736 222021 272377 393121 449144 395486 304361 259434 245181 164440 -14141
41273 -14141 -172163 -180240 -85990 -47418 -91697 -91177 -4624 27417 -94925 -262254 -309595 -215548
41261 -215548 -55234 118134 244594 244744 156895 164303 358455 589054 669113 599786 464684
41250 464684 260010 3549 -140576 -63004 84313 107571 84622 202923 374182 312033
$$ packed form
41329A06794O1455J1019J3945M1952P705q4378j24948o7197o739l5061r3044n9316
41317b27813N8204J26840Q9007M2699O4897O4868o1146k00344j31463J33048L06548
41306B65345K02971k2002j19033p5788m2225n6573m3669r134l2241r6093j04989
41295a33431n4231j8290R431R3022J84274J61502M7568K950O7414R0749j5802
41284D35156j25420q7715N0356J20744N6023n3658r1125m4927j4253q0741j78581
41273a4141j58022q077R4250L8572m4279N20Q6553L2041j22342j67329m7341R4047
41261b15548J60314J73368J26460J50q7849P408J94152K30599Q0059o9327j35102
41250D64684k04674k56461j44125P7572J47317K3258k2949J18301J71259o2149
$$ plain form
41240 312033 -18513 -309900 -307310 -67257 207860 377435 374106 217360 58169 30750
41230 30750 49884 -52502 -207933 -177416 54280 232687 234746 220431 288575 291346 152626
41219 152626 73198 186243 260779 37897 -318918 -429843 -257527 -139026 -269400 -442323
41209 -442323 -376787 -88427 172212 219351 68599 -150283 -324360 -411419 -414961 -346153 -239683
41198 -239683 -181760 -241562 -357032 -373297 -231829 -39847 83356 125519 95397 -52282
41188 -52282 -300609 -486820 -471439 -324167 -214049 -179533 -153896 -165457 -320961 -569152
41178 -569152 -659304 -431157 -46316 167520 59424 -227128 -445223 -476191 -368031 -214119
41168 -214119 -54351 107264 240370 288286 227073 100586 -5460 -22331 43919 102989
$$ packed form
41240C12033l30546k91387K590K40053K75117J69575l329j56746j59191k7419
41230C0750J9134j02386j55431L0517K31696J78407K059j4315O8144K771j38720
41219A52626p9428J13045P4536k22882l56815j10925J72316J18501j30374j72923
41209d42323O5536K88360K60639M7139j50752k18882j74077q7059l542O8808J06470
41198b39683N7923n9802j15470j6265J41468J91982J23203M2163l0122j47679
41188e2282k48327j86211J5381J47272J10118L4516K5637j1561j55504k48191
41178e69152r0152K28147L84841K13836j08096k86552k18095l0968J08160J53912
41168b14119J59768J61615J33106M7916o1213j26487j06046j6871O6250N9070
$$ plain form
41158 102989 70837 -8559 5906 156014 297619 287398 170088 64329 -48582 -246189
41148 -246189 -430497 -396589 -151222 58226 93867 92710 183589 248341 122868 -125544 -302688
41137 -302688 -356605 -366442 -346605 -242417 -84299 4196 -54725 -234160 -438366 -525593 -386380
41126 -386380 -104695 55685 -45216 -229134 -258043 -186341 -255978 -502012 -692182 -666070
41116 -666070 -525788 -436551 -406640 -344054 -217577 -91777 -64682 -186538 -374202 -430506
41106 -430506 -250703 14767 125179 55238 -5688 54257 146130 164614 120125 41506 -80870
41095 -80870 -184032 -130370 82811 251885 213248 38393 -118657 -228638 -307007 -268552
41085 -268552 -60862 139460 87128 -182432 -358563 -239795 53591 292504 395968 395153
$$ packed form
41158A02989l2152p9396J4465J50108J41605j0221j17310j05759j12911j97607
41148b46189j84308L3908K45367K09448L5641j157R0879O4752j25473k48412j77144
41137c02688n3917r837J9837J04188J58118Q8495n8921j79435k04206q7227J39213
41126c86380K81685J60380j00901j83918k8909P1702o9637k46034j90170K6112
41116f66070J40282Q9237K9911O2586J26477J25800K7095j21856j87664n6304
41106d30506J79803K65470J10412o9941o0926N9945R1873J8484m4489p8619j22376
41095h0870j03162N3662K13181J69074l8637j74855j57050j09981p8369L8455
41085b68552K07690K00322n2332k69560j76131J18768K93386K38913J03464q15
$$ plain form
41075 395153 297221 120207 -34683 -90213 -116782 -212582 -305114 -236269 -41698 37087 -120137
41064 -120137 -337121 -395979 -319501 -250893 -179781 -1629 211883 247526 73507 -104665
41054 -104665 -176834 -285063 -522395 -694888 -590676 -331660 -211215 -266010 -268686 -127274
41044 -127274 -27020 -108766 -229708 -176535 25322 158031 97640 -60098 -135547 -56809
41034 -56809 72618 68114 -149693 -452314 -624117 -582527 -424549 -270322 -153513 -77128
41024 -77128 -66506 -111121 -139383 -118763 -116219 -193344 -300665 -351922 -356575 -388703 -443727 -421781
41012 -421781 -279726 -133187 -151831 -365702 -614437 -699847 -568609 -331666 -134573 -52469
41002 -52469 -89054 -193650 -257039 -178932 2743 123024 94253 15031 -11968 -66829 -264118
$$ packed form
41075C95153r7932j77014j54890n5530k6569r5800r2532O8845J94571P8785j57224
41064a20137k16984n8858P6478O8608P1112J78152K13512L5643j74019j78172
41054a04665p2169j08229k37332j72493J04212K59016J20445n4795k676J41412
41044a27274J00254q1746j20942N3173K01857J32709o0391j57738p5449P8738
41034e6809J29427m504k17807l02621j71803M1590J57978J54227J16809P6385
41024g7128J0622m4615k8262K0620K544p7125j07321n1257m653l2128n5024K1946
41012d21781J42055J46539j8644k13871k48735q5410J31238K36943J97093Q2104
41002e2469l6585j04596o3389P8107J81675J20281k8771p9222k6999n4861j97289
$$ plain form
40991 -264118 -490398 -496665 -255934 -27293 -8974 -108078 -142034 -103696 -99020 -145624 -178681
40980 -178681 -183769 -197701 -227241 -266722 -339302 -425062 -416428 -258257 -69460 6314 23062
40969 23062 153906 407238 583275 544495 387499 283216 260171 230429 148924 47709
40959 47709 -48935 -147421 -222206 -209158 -98246 13019 17526 -55445 -58458 71622 191711
40948 191711 124636 -73716 -150262 7567 202708 187226 -19672 -197268 -218941 -124605
40938 -124605 37984 239728 342139 170289 -205289 -452731 -370624 -136459 -13612 34930
40928 34930 219651 510542 630000 471544 261675 210262 225623 131830 -12789 -26398
40918 -26398 76881 115592 57633 75139 242830 386099 328943 143213 29963 55285 127781
$$ packed form
40991b64118k26280o267K40731K28641J8319r9104l3956L8338M676m6604l3057
40980a78681n088j3932k9540l9481p2580q5760Q634J58171J88797P5774J6748
40969B3062J30844K53332J76037l8780j56996j04283k3045k9742q1505j01215
40959D7709r6644r8486p4785J3048J10912J11265M507p2971l013J30080J20089
40948A91711o7075j98352p6546J57829J95141j5482k06898j77596k1673R4336
40938a24605J62589K01744J02411j71850l75578k47442Q2107K34165J22847M8542
40928C4930J84721K90891J19458j58456k09869n1413J5361r3793j44619j3609
40918b6398J03279L8711n7959J7506J67691J43269n7156j85730j13250K5322P2496
$$ plain form
40907 127781 170111 188100 198668 193799 173229 147953 125570 133137 204185 287065 240978 21066
40895 21066 -194390 -188404 14360 180802 165184 32774 -108637 -238784 -344676 -364130
40885 -364130 -293363 -235957 -257681 -288020 -249767 -193773 -211213 -294858 -385270 -472225 -538019
40874 -538019 -481930 -247541 23332 120893 37654 -38259 3682 87381 133293 177258 239232
40863 239232 236832 143004 94840 197391 319069 259095 63686 -20834 89421 197896 128874
40852 128874 -35133 -125250 -139559 -166077 -163956 -23525 194753 289819 215942 160211 246101
40841 246101 321348 168840 -175995 -456022 -485079 -294344 -33220 155239 185601 77941
40831 77941 -40312 -68692 -56446 -95010 -117446 42493 361509 557503 417991 98739
$$ packed form
40907A27781M2330J7989J0568m869k0570k5276k2383P567P1048Q2880m6087k19912
40895B1066k15456N986K02764J66442j5618j32410j41411j30147j05892j9454
40885c64130P0767N7406k1724l0339L8253N5994j7440q3645r0412q6955o5794
40874e38019N6089K34389K70873R7561q3239p5913M1941Q3699M5912M3965O1974
40863B39232k400r3828m8164J02551J21678n9974j95409q4520J10255J08475o9022
40852A28874j64007r0117j4309k6518K121J40431K18278R5066p3877n5731Q5890
40841B46101P5247j52508l44835k80027k9057J90735K61124J88459L0362j07660
40831G7941j18253k8380J2246l8564k2436J59939L19016J95994j39512l19252
$$ plain form
40821 98739 -41089 130728 379012 406590 194659 -25876 -78789 -18306 1370 -66131 -145726
40810 -145726 -170028 -128110 -22712 104561 122154 -67118 -328439 -394824 -231867 -112718
40800 -112718 -209585 -318742 -194930 33183 75346 -25025 28015 247978 314502 122839
40790 122839 -17545 93351 193139 2564 -271899 -234374 83845 277503 164825 -14648
40780 -14648 -11162 120371 185460 110965 -37807 -144700 -93598 136873 393201 474993 357130
40769 357130 177503 23596 -127515 -269413 -333472 -319322 -312464 -345593 -372568 -387410 -425633
40758 -425633 -447932 -390900 -338401 -443732 -651365 -718405 -579508 -453262 -472890 -457247 -231601
40747 -231601 40385 86595 -67643 -186622 -212055 -284402 -425159 -482660 -414604 -369586 -424274
$$ packed form
40821I8739j39828J71817K48284K7578k11931k20535n2913O0483J9676o7501p9595
40810a45726k4302M1918J05398J27273J7593j89272k61321o6385J62957J19149
40800a12718r6867j09157J23812K28113M2163j00371N3040K19963O6524j91663
40790A22839j40384J10896R9788j90575k74463L7525L18219J93658j12678j79473
40780a4648L486J31533O5089p4495j48772j06893N1102K30471K56328Q1792j17863
40769C57130j79627j53907j51111j41898o4059J4150O858l3129k6975j4842l8223
40758d25633k2299N7032N2499j05331k07633o7040J38897J26246j9628J5643K25646
40747b31601K71986M6210j54238j18979k5433p2347j40757n7501O8056M5018n4688
$$ plain form
40736 -424274 -458467 -377621 -268260 -225071 -183541 -45914 147407 284218 320386 263647 125198
40725 125198 -17433 -23954 125023 250449 208438 103019 120047 242651 309432 282797 248279
40714 248279 182872 -30669 -322540 -409343 -163739 168246 259898 92642 -76697 -40766
40704 -40766 191219 474037 649458 635182 488883 347169 247609 95164 -135070 -295068
40694 -295068 -279334 -208878 -235868 -283965 -194492 -42262 -44667 -179305 -171606 80193 321071
40683 321071 293434 70643 -102015 -136737 -119310 -113999 -110677 -103822 -99852 -83145 -54954 -58463
40671 -58463 -108415 -162986 -214441 -317369 -465796 -542255 -468160 -313873 -180900 -70254 45054
40660 45054 114262 81811 -7244 -67609 -72908 -26766 70101 149575 92433 -84872 -185151
$$ packed form
40736d24274l4193Q0846J09361M3189M1530J37627J93321J36811L6168n6739j38449
40725A25198j42631o521J48977J25426m2011j05419J7028J22604O6781k6635l4518
40714B48279o5407k13541k91871q6803K45604L31985R1652j67256j69339L5931
40704d0766K31985K82818J75421j4276j46299j41714r9560j52445k30234j59998
40694b95068J5734P0456k6990m8097Q9473J52230k405j34638P699K51799K40878
40683C21071k7637k22791j72658l4722J7427N311L322O855L970J6707K8191l509
40671e8463m9952n4571n1455j02928j48427p6459P4095J54287J32973J10646J15308
40660D5054O9208l2451q9055o0365n299M6142R6867P9474n7142j77305j00279
$$ plain form
40649 -185151 -97220 17700 -39884 -200752 -235965 -89439 87117 172826 165266 75106 -76456
40638 -76456 -176188 -112309 58629 190869 265501 364548 472907 505037 507053 609689 764114
40627 764114 752853 524263 304770 279728 339282 263397 28927 -191207 -251300 -154055 600
40616 600 118517 188153 270295 380591 422943 321515 168818 118163 165619 184909 149130
40605 149130 142226 154816 63260 -149938 -329949 -356719 -269087 -146012 -19828 59371 41296
40594 41296 -124 71672 228928 291806 209664 135867 167042 213252 197883 174936 167368 111393
40582 111393 48528 122544 274165 225429 -61923 -213274 24800 352924 345209 88447
40572 88447 10955 203090 323837 172695 -28637 -16234 145827 207327 58280 -195350
$$ packed form
40649a85151Q7931J14920n7584j60868l5213J46526J76556Q5709p560r0160j51562
40638g6456r9732O3879J70938J32240P4632R9047J08359L2130K016J02636J54425
40627G64114j1261k28590k19493k5042N9554p5885k34470k20134o0093R7245J54655
40616F00J17917O9636Q2142J10296M2352j01428j52697n0655M7456J9290l5779
40605A49130o904J2590r1556k13198j80011k6770Q7632J23075J26184P9199j8075
40594D1296m1420P1796J57256O2878q2142p3797L1175M6210j5369k2947p568n5975
40582A11393o2865P4016J51621m8736k87352j51351K38074L28124p715k56762
40572H8447p7492J92135J20747j51142k01332J2403J62061O1500j49047k53630
$$ plain form
40562 -195350 -368406 -352656 -217126 -150955 -228626 -292550 -182151 14198 105420 108652 196400
40551 196400 380784 484267 421153 293266 200220 160517 219457 409277 587142 552411
40541 552411 362478 281927 355370 303211 -32403 -393923 -448986 -231558 -38174 -27017
40531 -27017 -130722 -270119 -436535 -588473 -642901 -587009 -494806 -433811 -425225 -464597 -508471
40520 -508471 -479136 -358905 -242633 -222829 -262403 -262179 -220062 -227878 -313510 -371608 -283953 -69582
40508 -69582 117106 140754 31094 -47136 12361 129122 146412 29864 -122461 -236466
40498 -236466 -316651 -349904 -289895 -178828 -160204 -294718 -456044 -488213 -392303 -284416 -242009
40487 -242009 -271289 -355114 -434423 -394590 -184292 65574 142531 -12132 -239762 -355812
$$ packed form
40562a95350j73056J5750J35530O6171p7671o3924J10399J96349R1222L232Q7748
40551A96400J84384J03483o3114j27887r3046l9703N8940J89820J77865l4731
40541E52411j89933q0551P3443n2159l35614l61520n5063K17428J93384J1157
40531b7017j03705j39397j66416j51938n4428N5892R2203O0995Q586l9372m3874
40520e08471K9335J20231J16272J9804l9574K24M2117p816q5632n8098Q7655K14371
40508f9582J86688K3648j09660p8230N9497J16761J7290j16548j52325j14005
40498b36466q0185l3253O0009J11067J8624j34514j61326l2169R5910J07887M2407
40487b42009k9280q3825p9309L9833K10298K49866P6957j54663k27630j16050
$$ plain form
40477 -355812 -345404 -331243 -386036 -439366 -388810 -257523 -176276 -207839 -263572 -230422 -108588
40466 -108588 33527 161935 248871 224063 78732 -46651 -28395 36582 -32707 -198993
40456 -198993 -253994 -162152 -107858 -152317 -115256 81476 216299 104958 -88644 -117928 -51493
40445 -51493 -125577 -315150 -352911 -134534 173992 429800 644675 788885 727063 449624
40435 449624 165063 47935 45591 25290 -34168 -92407 -150636 -201177 -194532 -156230 -212055
40424 -212055 -378765 -448965 -238836 126063 332182 250208 45123 -66376 -29166 87213
40414 87213 207154 282091 292596 273009 290293 366163 446882 456774 354771 156050 -53370
40403 -53370 -147950 -88134 -10537 -98191 -337657 -503576 -435810 -234907 -98911 -58805 -10802
$$ packed form
40477c55812J0408J4161n4793n3330N0556J31287Q1247l1563n5733L3150J21834
40466a08588J42115J28408Q6936k4808j45331j25383J8256O4977o9289j66286
40456a98993n5001R1842N4294m4459L7061J96732J34823j11341j93602k9284O6435
40445e1493p4084j89573l7761K18377L08526K55808K14875J44210o1822k77439
40435D49624k84561j17128k344k0301n9458n8239n8229n0541O645L8302n5825
40424b12055j66710p0200K10129L64899K06119q1974k05085j11499L7210J16379
40414H7213J19941P4937J0505j9587J7284P5870Q0719R892j02003j98721k09420
40403e3370r4580N9816P7597q7654k39466j65919O7766K00903J35996M0106M8003
$$ plain form
40392 -10802 47089 -775 -143942 -180867 -9671 171090 127898 -42870 -44758 148463 217736
40381 217736 -20843 -309205 -311090 -98099 -7635 -113401 -153530 -5555 86986 -89265
40371 -89265 -344721 -339630 -62903 183708 206200 86630 -45659 -172485 -274661 -272680 -172424
40360 -172424 -111897 -164211 -225755 -196433 -137665 -131198 -106062 36362 212767 245856 114453
40349 114453 -48536 -176984 -318157 -465403 -526283 -493717 -484767 -548794 -582453 -507792 -397124
40338 -397124 -330434 -256849 -112042 34747 82677 65446 76063 90411 23487 -69995 -22772
40327 -22772 193634 392915 408360 286268 166785 68491 -91723 -307422 -445613 -433390
40317 -433390 -377828 -415181 -500420 -468267 -297896 -171005 -202686 -258538 -174875 -44301 -79858
$$ packed form
40392a0802N7891m7864j43167l6925J71196J80761m3192j70768j888J93221O9273
40381B17736k38579k88362j885K12991R0464j05766m0129J47975R2541j76251
40371h9265k55456N091K76727K46611K2492j19570j32289j26826j02176J981J00256
40360a72424O0527n2314o1544K9322N8768O467K5136J42424J76405L3089j31403
40349A14453j62989j28448j41173j47246o0880L2566Q950o4027l3659P4661J10668
40338c97124O6690P3585J44807J46789M7930j7231J0617J4348o6924r3482M7223
40327b2772K16406J99281J5445j22092j19483r8294j60214k15699j38191J2223
40317d33390N5562l7353q5239L2153J70371J26891l1681n5852Q3663J30574l5557
$$ plain form
40306 -79858 -252935 -310137 -167374 -37537 -83610 -181051 -162609 -91074 -111475 -202864 -269233
40295 -269233 -329580 -416386 -426251 -297047 -203923 -322478 -505515 -482701 -299652 -236465 -333973
40284 -333973 -362507 -280789 -335772 -589068 -712113 -463095 -76532 69718 -44398 -164376
40274 -164376 -171508 -146675 -137513 -114413 -102999 -149973 -191872 -134637 -31764 -22772 -118779 -193240
40262 -193240 -168315 -87742 -24960 -24076 -100240 -201587 -216587 -119486 -53819 -159162 -363105
40251 -363105 -461470 -368174 -179088 -26094 28997 -7758 -73625 -91122 -69615 -103666 -206287
40240 -206287 -250978 -176471 -118365 -194371 -291112 -254881 -176718 -246658 -398192 -370581 -115997
40229 -115997 116038 130302 -15011 -195510 -358479 -411386 -235827 66124 179500 -4370
$$ packed form
40306g9858j73077n7202J42763J29837m6073r7441J8442P1535k0401r1389o6369
40295b69233o0347q6806r865J29204R3124j18555j83037K2814J83049O3187r7508
40284c33973k8534Q1718n4983k53296j23045K49018L86563J46250j14116j19978
40274a64376p132K4833R162K3100J1414m6974m1899N7235J02873Q992r6007p4461
40262a93240K4925Q0573O2782Q84p6164j01347j5000R7101O5667j05343k03943
40251c63105r8365R3296J89086J52994N5091l6755o5867j7497K1507l4051j02621
40240b06287m4691P4507N8106p6006r6741L6231P8163o9940j51534K7611K54584
40229a15997K32035J4264j45313j80499j62969n2907J75559L01951J13376j83870
$$ plain form
40219 -4370 -178426 -21405 356766 584329 516996 330704 209590 182674 243450 392715
40209 392715 523307 462275 209066 -14011 -36879 42403 4035 -217696 -497314 -694728
40199 -694728 -769877 -747962 -660746 -533822 -385178 -232533 -121087 -106617 -163392 -155249 11671
40188 11671 225798 271717 112465 -51456 -62579 -20425 -102596 -273365 -336926 -242279 -156807
40177 -156807 -213305 -337428 -381045 -301749 -146344 33958 178344 217399 152965 68671 13986
40166 13986 -41551 -106150 -131335 -128673 -189038 -313924 -371777 -318804 -303143 -407135 -443666
40155 -443666 -210013 170105 388039 369483 319405 373521 439419 408133 314599 232917 179180
40144 179180 165790 201927 205970 75693 -116681 -170249 -55951 -184 -176148 -459626 -601296
$$ packed form
40219d370j74056J57021L78171K27563o7333j86292j21114k6916O0776J49265
40209C92715J30592o1032k53209k23077k2868P9282l8368k21731k79618j97414
40199f94728p5149K1915Q7216J26924J48644J52645J11446J4470n6775Q143J66920
40188A1671K14127M5919j59252j63921j1123M2154q2171j70769o3561R4647Q5472
40177a56807n6498j24123m3617P9296J55405J80302J44386L9055o4434q4294n4685
40166A3986n5537o4599k5185K662o0365j24886n7853N2973J5661j03992l6531
40155d43666K33653L80118K17934j8556n0078N4116O5898l1286r3534q1682n3737
40144A79180j3390L6137M043j30277j92374n3568J14298N5767j75964k83478j41670
$$ plain form
40133 -601296 -522784 -332546 -152851 -50469 -61385 -163813 -266015 -306912 -328128 -375722
40123 -375722 -384857 -252689 -768 216700 271965 189197 109433 146334 268973 333124 251990
40112 251990 112186 68928 150252 242066 254687 207036 133412 11715 -162502 -300708 -284087
40101 -284087 -84340 196957 398159 427610 355425 338951 418957 459515 358585 222572
40091 222572 207701 274401 268026 181875 138284 137944 52579 -125415 -260881 -340981 -509522
40080 -509522 -747259 -773764 -433375 19111 210533 93148 -74491 -77517 87063 297818
40070 297818 409618 339087 174660 119504 216564 247271 38613 -259834 -385366 -337658
40060 -337658 -328575 -426674 -490052 -443003 -388927 -401257 -396557 -297810 -175253 -128218 -133295 -108816
$$ packed form
40133f01296P8512J90238J79695J02382j0916j02428j02202m0897k1216m7594
40123c75722r135J32168K51921K17468N5265q2768p9764L6901J22639O4151q1134
40112B51990j39804m3258Q1324R1814J2621m7651p3624j21697j74217j38206J6621
40101b84087J99747K81297K01202K9451p2185j6474Q0006M0558j00930j36013
40091B22572j4871O6700o375q6151m3591l40q5365j77994j35466q0100j68541
40080e09522k37737k6505L40389M52486J91422j17385j67639l026J64580K10755
40070B97818J11800p0531j64427n5156R7060L0707k08658k98447j25532M7708
40060c37658R083r8099o3378M7049N4076j2330M700R8747J22557M7035n077K4479
$$ plain form
40048 -108816 -58674 -49657 -75060 -37198 111925 274437 306662 198770 87922 72032 85353
40037 85353 20891 -96137 -161227 -164005 -177735 -209179 -208229 -203216 -249063 -252291 -69418 191884
40025 191884 225816 -26610 -244489 -184325 -16650 -2777 -75561 -21753 96543 31831 -221207
40014 -221207 -401648 -367252 -230135 -103222 32703 173414 232882 203576 191379 234271
40004 234271 245026 179321 109604 86240 64312 14659 -15066 9294 60955 115235 161694
39993 161694 156916 76589 1318 26084 103091 114624 78254 108697 180304 123728 -99448
39982 -99448 -302253 -324406 -223792 -134839 -73464 17383 127786 185480 150121 48605 -44894
39971 -44894 -54920 12839 52784 5097 -14875 141408 399596 497039 296439 -64572 -363223
$$ packed form
40048a08816N0142R017k5403L7862J49123J62512L2225j07892j10848j5890J3321
40037H5353o4462j17028o5090k778j3730l1444R50N013m5847l228J82873K61302
40025A91884L3932k52426k17879O0164J67675J3873p2784N3808J18296o4712k53038
40014b21207j80441L4396J37117J26913J35925J40711N9468k9306j2197M2892
40004B34271J0755o5705o9717k3364k1928m9653k9725K4360N1661N4280M6459
39993A61694m778q0327p5271K4766P7007J1533l6370L0443P1607n6576k23176
39982i9448k02805k2153J00614Q8953O1375R0847J10403N7694l5359j01516r3499
39971d4894j0026O7759L9945m7687j9972J56283K58188R7443k00600l61011k98651
$$ plain form
39960 -363223 -507063 -531132 -501000 -461912 -399075 -240660 11613 186569 114597 -121099
39950 -121099 -258803 -186889 -45664 722 -70683 -211721 -359957 -404869 -279181 -112021
39940 -112021 -105406 -232923 -270315 -161690 -109037 -211115 -267054 -92061 180243 292255
39930 292255 208791 103758 117067 259944 452685 545544 418716 155034 -18184 -33113
39920 -33113 -53365 -159349 -188889 -37920 112035 75171 -32979 -18671 29408 -115525 -425088
39909 -425088 -652039 -698197 -678938 -652822 -541282 -319685 -70593 155873 338525 361029
39899 361029 116067 -253394 -441684 -361101 -237184 -254756 -294858 -140287 181865 394709
39889 394709 274555 -112058 -476075 -599773 -548708 -538554 -604133 -544021 -257671 40634
$$ packed form
39960c63223j43840k4069L0132L9088O2837J58415K52273J74956p1972k35696
39950a21099j37704P1914J41225M6386p1405j41038j48236m4912J25688J67160
39940a12021O615j27517l7392J08625N2653j02078n5939J74993K72304J12012
39930B92255q3464j05033J3309J42877J92741R2859j26828k63682j73218j4929
39920c3113k0252j05984k9540J50969J49955l6864j08150J4308M8079j44933l09563
39909d25088k26951m6158J9259K6116J11540K21597K49092K26466J82652K2504
39899C61029k44962l69461j88290Q0583J23917j7572m0102J54571L22152K12844
39889C94709j20154l86613l64017j23698N1065J0154o5579O0112K86350K98305
$$ plain form
39879 40634 103492 2091 -12509 104750 185604 164379 141695 143783 72821 -72754 -163134
39868 -163134 -172879 -230596 -366460 -425815 -328079 -211773 -200835 -199257 -62081 158481 283802
39857 283802 243017 114901 -7764 -97783 -169751 -237009 -272973 -214122 -56237 78338 71195
39846 71195 -15105 -23226 45788 30552 -117534 -234072 -171277 27801 238589 374238 336384
39835 336384 41106 -391271 -640561 -523772 -205268 49066 194157 344409 516771 609846
39825 609846 576836 476559 385183 345268 350450 325777 213439 117795 213867 440160 477943
39814 477943 173127 -213920 -365299 -333175 -381655 -557820 -695007 -731472 -724177 -610215
39804 -610215 -276281 135338 298496 130902 -113545 -226488 -255169 -276442 -246744 -180750
$$ packed form
39879D0634O2858j01401j4600J17259Q0854k1225k2684K088p0962j45575r0380
39868a63134r745n7717j35864n9355R7736J16306J0938J578J37176K20562J25321
39857B83802m0785j28116j22665r0019p1968o7258l5964N8851J57885J34575p143
39846G1195q6300q121O9014j5236j48086j16538O2795J99078K10788J35649l7854
39835C36384k95278m32377k49290J16789L18504K54334J45091J50252J72362R3075
39825F09846l3010j00277r1376l9915N182k4673j12338r5644R6072K26293L7783
39814D77943l04816l87047j51379L2124m8480j76165j37187l6465P295J13962
39804f10215L33934M11619J63158j67594k44447j12943k8681k1273K9698O5994
$$ plain form
39794 -180750 -209427 -327005 -334052 -181711 -111848 -262242 -387839 -229175 58973 151298
39784 151298 64984 90817 296009 442524 397371 303884 290842 294796 263077 282611 380083
39773 380083 400662 232509 -5329 -139531 -176626 -223918 -287332 -289563 -209076 -72335 124817
39762 124817 365141 536226 531353 390353 241767 145550 85559 63310 84409 87543 130
39751 130 -157152 -313383 -445266 -519208 -407137 -42552 359190 448730 165842 -168860
39741 -168860 -269995 -220900 -266968 -437165 -560858 -567354 -554123 -570653 -527534 -366283 -176333
39730 -176333 -78278 -89083 -153282 -215515 -211637 -84958 116159 240483 218012 165622 204862
39719 204862 245063 99185 -203405 -391785 -295669 -72310 5414 -114798 -260287 -296168
$$ packed form
39794a80750k8677j17578p047J52341O9863j50394j25597J58664K88148R2325
39784A51298q6314K5833K05192J46515m5153r3487j3042L954l1719J9534R7472
39773C80083K0579j68153k37838j34202l7095m7292o3414k231Q0487J36741J97152
39762A24817K40324J71085m873j41000j48586r6217n9991k2249K1099L134q7413
39751A30j57282j56231j31883p3942J12071L64585M01742Q9540k82888l34702
39741a68860j01135M9095m6068j70197j23693o496J3231j6530M3119J61251J89950
39730a76333R8055j0805o4199o2233L878J26679K01117J24324k2471n2390L9240
39719B04862M0201j45878l02590j88380R6116K23359P7724j20212j45489l5881
$$ plain form
39709 -296168 -249606 -190896 -133156 -80115 -58354 -51153 7291 114526 160842 77283 -54484
39698 -54484 -128632 -183816 -324113 -502301 -524582 -305874 -6792 156389 168282 197294 353472
39687 353472 546675 596192 422374 101828 -223581 -442665 -500125 -402530 -242132 -170390
39677 -170390 -275035 -475548 -588391 -510080 -302913 -100300 21077 59375 31240 -61025
39667 -61025 -214847 -383949 -445596 -265351 137455 536215 719644 739375 793817 885351
39657 885351 801442 485174 187012 108736 108795 -36694 -256027 -317427 -219236 -162370 -196283
39646 -196283 -180604 -89825 -78304 -207875 -357030 -440227 -479416 -424924 -176465 145260 228077
39635 228077 -9701 -283299 -361429 -356483 -423911 -450480 -298192 -132171 -190947 -367607 -336931
$$ packed form
39709b96168M6562N8710N7740N3041K1761P201N8444J07235M6316q3559j31767
39698e4484p4148n5184j40297j78188k2281K18708K99082J63181J1893K9012J56178
39687C53472J93203M9517j73818l20546l25409k19084n7460R7595J60398P1742
39677a70390j04645k00513j12843P8311K07167K02613J21377L8298k8135r2265
39667f1025j53822j69102o1647J80245M02806L98760J83429J9731N4442R1534
39657H85351q3909l16268k98162p8276N9j45489k19333o1400R8191N6866l3913
39646a96283J5679R0779J1521j29571j49155q3197l9189N4492K48459L21725Q2817
39635B28077k37778k73598p8130M946o7428k6569J52288J66021n8776j76660L0676
$$ plain form
39624 -336931 -38018 256053 333307 256618 173586 131599 112980 80693 -31671 -228160 -354293
39613 -354293 -252113 -11914 93582 -55108 -299805 -432849 -407119 -291422 -153637 -42191
39603 -42191 8657 -345 -54146 -155536 -285441 -376581 -396911 -397186 -400579 -345164 -239599 -233535
39591 -233535 -360578 -363773 -39805 354559 379064 61178 -114884 57715 188201 -88462
39581 -88462 -516041 -578814 -242392 48741 36533 -63109 5375 133915 60701 -205600 -390743
39570 -390743 -327388 -136181 -12842 14101 27586 31448 -41868 -165146 -210727 -139226 -56600
39559 -56600 -28033 25059 155340 261037 258012 250857 365169 515464 531107 424817 321451
39548 321451 198056 -43638 -283863 -267633 -20872 112238 -49588 -273871 -287082 -153157
$$ packed form
39624c36931K98913K94071P7254p6689q3032m1987j8619l2287j12364j96489j26133
39613c54293J02180K40199J05496j48690k44697j33044K5730J15697J37785J11446
39603d2191N0848r002n3801j01390j29905r1140k0330k75l393N5415J05565O064
39591b33535j27043l195L23968L94364K4505l17886j76062J72599J30486k76663
39581h8462m27579o2773L36422K91133j2208r9642O8484J28540p3214k66301j85143
39570c90743O3355J91207J23339K6943J3485L862p3316j23278m5581P1501Q2626
39559e6600K8567N3092J30281J05697l025p155J14312J50295J5643j06290j03366
39548C21451j23395k41694k40225J6230K46761J33110j61826k24283j3211J33925
$$ plain form
39538 -153157 -89938 -111548 -84298 -1846 32984 26758 78008 173042 194125 135937 144824 300513
39526 300513 482470 515083 376612 208613 143975 166106 151454 34847 -117668 -224414
39516 -224414 -299459 -365657 -334992 -128517 119011 166044 1920 -111731 -4418 175673
39506 175673 194226 31011 -166415 -283965 -270418 -103405 129472 235675 156006 85804
39496 85804 193947 335681 255907 1075 -120222 14183 169337 98349 -135752 -294404
39486 -294404 -282411 -200620 -157114 -156379 -155363 -122777 -30657 124778 254314 205167 -54654
39475 -54654 -317791 -318401 -50299 207637 232921 105281 24968 21772 3532 -12450 62533
39464 62533 156567 77616 -184944 -405772 -425801 -326272 -241505 -179279 -104538 -33170 41120
$$ packed form
39538a53157O3219k1610K7250Q2452L4830o226N1250R5034K1083n8188Q887J55689
39526C00513J81957L2613j38471j67999o4638K2131j4652j16607j52515j06746
39516b24414p5045o6198L0665K06475K47528M7033j64124j13651J07313J80091
39506A75673J8553j63215j97426j17550J3547J67013K32877J06203p9669p0202
39496H5804J08143J41734p9774k54832j21297J34405J55154p0988k34101j58652
39486b94404J1993Q1791M3506P35J016L2586R2120J55435J29536m9147k59821
39475e4654k63137o10K68102K57936K5284j27640q0313l196j8240j5982P4983
39464F2533R4034p8951k62560k20828k0029R9529Q4767O2226P4741P1368P4290
$$ plain form
39453 41120 157012 250712 183054 -16380 -117447 -7116 143873 153027 80513 68210 102411
39442 102411 106761 118103 192664 268839 290638 334800 445319 479860 308203 36017 -160717
39431 -160717 -295990 -462969 -592777 -562852 -446961 -407359 -407162 -278860 -31800 154846
39421 154846 217532 243854 235188 84442 -176986 -333952 -254337 -34269 168431 294430
39411 294430 336005 271318 107079 -93239 -248878 -289494 -190664 -41652 6697 -58122 -73505
39400 -73505 42502 151848 141068 116718 176417 197829 102567 104309 356849 559921 352445
39389 352445 -36127 -39294 375038 636799 456682 213743 251407 322703 93020 -236286
39379 -236286 -259398 -36558 40671 -94752 -117307 129414 390566 386621 160590 -54940
$$ packed form
39453D1120J15892R3700o7658j99434j01067J10331J50989R154p2514j2303L4201
39442A02411M350J1342P4561P6175K1799M4162J10519L4541j71657k72186j96734
39431a60717j35273j66979j29808K9925J15891L9602J97J28302K47060J86646
39421A54846O2686K6322q666j50746k61428j56966P9615K20068K02700J25999
39411B94430M1575o4687j64239k00318j55639m0616R8830J49012M8349o4819j5383
39400g3505J16007J09346j0780k4350N9699K1412r5262J742K52540K03072k07476
39389C52445l88572l167M14332K61761j80117k42939L7664P1296k29683l29306
39379b36286k3112K22840P7229j35423k2555K46721K61152l945k26031k15530
$$ plain form
39369 -54940 -125317 -81514 -27456 -47643 -135828 -190225 -130627 -10510 40753 -32557 -165837
39358 -165837 -245961 -194891 -27729 141490 205198 186965 182120 175488 57599 -136851 -178445
39347 -178445 52441 346840 407558 224470 56045 85767 245818 366658 366099 270362 150741
39336 150741 80449 96611 168814 226695 233769 226759 276872 405140 537812 583366 576507 684384
39324 684384 1004278 1413141 1714772 1883684 2028098 2140473 2059613 1718279 1275261 925763
39314 925763 692873 485267 271437 107504 36794 27890 4665 -73365 -151372 -139871 -72200
39303 -72200 -121590 -369194 -636543 -685140 -519532 -335722 -228668 -142900 -74262 -94529 -164138
39292 -164138 -137304 6803 130617 168169 193353 229409 202966 131170 130395 177059 93094
$$ packed form
39369e4940p0377M3803N4058k0187q8185n4397N9598J20117N1263p3310j33280
39358a65837q0124N1070J67162J69219O3708j8233m845o632j17889j94450m1594
39347a78445K30886K94399O0718j83088j68425K9722J60051J20840n59r5737j19621
39336A50741p0292J6162P2203N7881P074p010N0113J28268J32672M5554o859J07877
39324F84384L19894M08863L01631J68912J44414J12375q0860l41334m43018l49498
39314I25763k32890k07606k13830j63933p0710q904k3225p8030p8007J1501O7671
39303g2200m9390k47604k67349m8597J65608J83810J07054Q5768O8638k0267o9609
39292a64138K6834J44107J23814L7552K5184L6056k6443p1796p75M6664q3965
$$ plain form
39281 93094 -142884 -302409 -241203 -113210 -119967 -233880 -297484 -228737 -25134 255308 430114
39270 430114 324106 65302 8014 233382 388558 195024 -146731 -279755 -174708 -36311
39260 -36311 58566 138192 116947 -96453 -371006 -494543 -455775 -364299 -215188 14918 160127
39249 160127 43826 -209182 -314860 -228560 -138558 -119463 -74746 3794 6110 -57539 -53021
39238 -53021 19462 18335 -50948 862 214331 346135 194256 -109100 -262285 -148776 78638
39227 78638 207072 179136 115339 145715 234646 236264 135595 101094 213904 297769 175899
39216 175899 -32014 -77539 36421 75496 -56506 -194099 -173233 -24818 134362 249524
39206 249524 322759 371779 415945 425446 316513 91699 -80668 -61223 47900 43473 -75800
$$ packed form
39281I3094k35978j59525O1206J27993o757j13913o3604O8747K03603K80442J74806
39270D30114j06008k58804n7288K25368J55176j93534l41755j33024J05047J38397
39260c6311R4877P9626k1245k13400k74553j23537L8768R1476J49111K30106J45209
39249A60127j16301k53008j05678Q6300R0002J9095M4717P8540K316o3649M518
39238e3021P2483j127o9283N1810K13469J31804j51879l03356j53185J13509K27414
39227G8638J28434k7936o3797L0376Q8931J618j00669l4501J12810Q3865j21870
39216A75899k07913m5525J13960L9075j32002j37593K0866J48415J59180J15162
39206B49524P3235M9020M4166R501j08933k24814j72367J9445J09123m427j19273
$$ plain form
39195 -75800 -125812 -34562 60402 29956 -80607 -133676 -46585 142776 279228 205011 -40517
39184 -40517 -215316 -178917 -95086 -181661 -377987 -464570 -414043 -374233 -353598 -192787 134106
39173 134106 427018 522189 465933 384398 333886 308915 264972 125525 -113132 -309272 -334303
39162 -334303 -248084 -168580 -52360 193368 451249 490262 299558 94021 -3518 -56294
39152 -56294 -98056 -71605 -7938 -31426 -142117 -205543 -198768 -255104 -415706 -539526 -520064
39141 -520064 -414861 -311295 -223986 -155005 -107751 -43210 29796 -25437 -271040 -490525 -442936
39130 -442936 -254942 -250797 -430218 -479686 -323701 -264255 -460584 -651216 -577660 -357241
39120 -357241 -216818 -134496 13080 166827 186187 73402 -93854 -300492 -498873 -537429
$$ packed form
39195g5800n0012R1250R4964l0446j10563n3069Q7091J89361J36452p4217k45528
39184d0517j74799L6399Q3831q6575j96326q6583N0527L9810K0635J60811L26893
39173A34106K92912R5171n6256q1535n0512k4971m3943j39447k38657j96140k5031
39162c34303Q6219P9504J16220K45728K57881L9013j90704k05537r7539n2776
39152e6294m1762K6451O3667k3488j10691o3426O775n6336j60602j23820J9462
39141e20064J05203J03566Q7309O8981M7254O4541P3006n5233k45603k19485M7589
39130d42936J87994M145j79421m9468J55985N9446j96329j90632P3556K20419
39120c57241J40423Q2322J47576J53747J9360j12785j67256k06638j98381l8556
$$ plain form
39110 -537429 -354074 -98179 86145 242048 418812 481789 292540 -42863 -279976 -308895
39100 -308895 -202157 -90615 -93075 -254677 -458694 -514185 -404108 -309281 -327370 -346671 -276680
39089 -276680 -197551 -163052 -62030 163983 338110 259712 -19657 -271191 -336941 -210696
39079 -210696 99 114505 26976 -121759 -97538 60062 64776 -142908 -241949 -13555
39069 -13555 297995 333437 108780 -78901 -60400 115980 351612 541121 577185 491256
39059 491256 458874 526838 518595 356934 243281 312784 358647 163615 -116813 -206323 -155705
39048 -155705 -209849 -372661 -446595 -405438 -389161 -390269 -271276 -60736 75527 137876 266117
39037 266117 415600 372382 135971 -4626 127349 353737 413737 297619 187493 185105
$$ packed form
39110e37429J83355K55895J84324J55903J76764O2977j89249l35403k37113k8919
39100c08895J06738J11542k460j61602k04017n5491J10077R4827j8089j9301O9991
39089b76680P9129L4499J01022K26013J74127p8398k79369k51534o5750J26245
39079b10696K10795J14406q7529j48735K4221J57600M714k07684r9041K28394
39069a3555L11550L5442k24657j87681J8501J76380K35632J89509L6064q5929
39059D91256l2382O7964q243j61661j13653O9503M5863j95032k80428q9510N0618
39048a55705n4144j62812p3934M1157J6277j108J18993K10540J36263O2349J28241
39037B66117J49483m3218k36411j40597J31975K26388O0000j16118j10126k388
$$ plain form
39027 185105 212001 136329 -61176 -250700 -296753 -225976 -171814 -158507 -89824 22276 30740
39016 30740 -60070 -31873 164504 228125 -43846 -364720 -336546 -42246 105218 -5268
39006 -5268 -92732 3972 110536 71867 -11626 -15715 1137 -48023 -112321 -110837 -69149 -56815
38994 -56815 -85193 -117978 -107452 -12912 142034 256504 275606 270375 307475 330399 285740
38983 285740 256881 321440 386517 342421 273427 312353 375686 264215 -33039 -341229 -545496
38972 -545496 -636339 -584808 -391089 -195407 -122924 -78341 92663 316907 402891 351683 295377
38961 295377 202572 -53016 -368336 -469321 -302794 -86470 40027 126486 161253 23035
38951 23035 -247454 -412569 -371264 -286096 -290591 -300672 -210633 -63604 70898 201599 311309
$$ packed form
39027A85105K6896p5672j97505j89524m6053P0777N4162J3307O8683J12100Q464
39016C0740r0810K8197J96377O3621k71971l20874K8174K94300J47464j10486
39006e268q7464R6704J06564l8669q3493m089J6852m9160o4298J484M1688J2334
38994e6815k8378l2785J0526R4540J54946J14470J9102n231L7100K2924m4659
38983B85740k8859O4559O5077m4096o8994L8926O3333j11471k97254l08190k04267
38972e45496r0843N1531J93719J95682P2483M4583J71004K24244Q5984n1208n6306
38961B95377r2805k55588l15320j00985J66527K16324J26497Q6459L4767j38218
38951B3035k70489j65115M1305Q5168m495j0081R0039J47029J34502J30701J09710
$$ plain form
38940 311309 321565 238744 179707 195348 218896 220081 242616 262651 194353 74974 63790
38929 63790 212714 405289 552688 672072 739705 659356 439952 243100 188471 232370
38919 232370 269506 245830 174103 143081 263286 480478 535224 278273 -79844 -243949
38909 -243949 -242563 -302316 -427765 -430464 -312047 -265947 -310270 -268134 -127392 -68215 -96721
38898 -96721 -14052 179545 216768 14261 -153664 -79116 95506 176567 206073 267167 263991
38887 263991 96246 -142315 -300902 -337886 -244108 1485 293088 414298 301345 117732
38877 117732 4738 -49380 -62150 -18881 -15580 -171118 -357123 -315012 -94135 -36620 -241015
38866 -241015 -404134 -326985 -201995 -209489 -194605 4907 226790 257501 178093 169169 196615
$$ packed form
38940C11309J0256q2821n9037J5641K3548J185K2535K0035o8298j19379j1184
38929F3790J48924J92575J47399J19384O7633q0349k19404j96852n4629M3899
38919B32370L7136k3676p1727l1022J20205K17192N4746k56951l58117j64105
38909b43949J386n9753j25449k699J18417M6100m4323M2136J40742N9177k8506
38898i6721Q2669J93597L7223k02507j67925P4548J74622Q1061K9506O1094l176
38887B63991j67745k38561j58587l6984R3778K45593K91603J21210j12953j83613
38877A17732j12994n4118j2770M3269L301j55538j86005M2111K20877N7515k04395
38866b41015j63119P7149J24990p494J4884J99512K21883L0711p9408q924K7446
$$ plain form
38855 196615 150036 92348 120355 149505 65809 -62438 -119471 -129596 -141523 -104188 -21402
38844 -21402 -36799 -195451 -314659 -256512 -131077 -76188 -56329 -37426 -113920 -276929 -308462
38833 -308462 -118702 53275 1193 -121396 -78134 66861 101871 15165 -60793 -88441 -85609
38822 -85609 -12159 104980 118404 19940 34198 245605 377789 198508 -91168 -163619 -54391
38811 -54391 -28783 -118452 -115714 59691 265132 353243 284109 90274 -117209 -201221 -159502
38800 -159502 -97984 -1814 224528 439171 337874 -24813 -192228 9542 169233 -43503
38790 -43503 -345562 -346453 -174456 -145876 -172338 -9589 197892 160866 2544 31083 148165
38779 148165 41072 -181500 -119646 226401 443701 360684 210117 156729 155182 274157
$$ packed form
38855A96615m6579n7688K8007K9150q3696j28247n7033j0125j1927L7335Q2786
38844b1402j5397j58652j19208N8147J25435N4889J9859J8903p6494j63009l1533
38833c08462J89760J71977n2082j22589M3262J44995L5010q6706p5958k7648K832
38822h5609P3450J17139J3424r8464J4258K11407J32184j79281k89676p2451J09228
38811e4391K5608q9669K738J75405K05441Q8111o9134j93835k07483q4012M1719
38800a59502O1518R6170K26342K14643j01297l62687j67415K01770J59691k12736
38790d3503l02059q91J71997K8580k6462J62749K07481l7026j58322K8539J17082
38779A48165j07093k22572O1854L46047K17300q3017j50567n3388j547J18975
$$ plain form
38769 274157 658943 1122282 1239944 935113 561720 356437 218038 80770 73051 196948
38759 196948 240348 139612 96280 215392 327021 272924 110318 -41593 -122273 -75500
38749 -75500 82515 154105 -24443 -303108 -427190 -434734 -511633 -560245 -339942 15758 96969
38738 96969 -145362 -327549 -262980 -195692 -292636 -366192 -278174 -197841 -244523 -248143 -94550
38727 -94550 27420 -33030 -97511 35297 237267 262101 123842 26882 45154 67718 -12176
38716 -12176 -180003 -313357 -267649 -33827 199456 265929 254622 344325 472357 417257 180255
38705 180255 4760 3310 39172 14785 14159 103255 223218 329708 429250 464399 379222
38694 379222 286416 331891 418457 327782 92436 -40941 -6483 23049 -27368 -49114 -19948
$$ packed form
38769B74157L84786M63339J17662l04831l73393k05283j38399j37268p719J23897
38759A96948M3400j00736m3332J19112J11629n4097j62606j51911q0680M6773
38749g5500J58015P1590j78548k78665j24082p544p6899m8612K20303L55700Q1211
38738I6969k42331j82187O4569O7288r6944p3556Q8018Q0333m6682l620J53593
38727i4550J21970o0450o4481J32808K01970K4834j38259r6960J8272K2564p9894
38716a2176j67827j33354M5708K33822K33283O6473j1307Q9703J28032n5100k37002
38705A80255j75495j450L5862k4387o26Q9096J19963J06490R9542L5149q5177
38694C79222r2806M5475Q6566r0675k35346j33377L4458K9532n0417k1746K9166
$$ plain form
38683 -19948 -61388 -194722 -307859 -369243 -412852 -353038 -117614 90186 11463 -228238 -271929
38672 -271929 -89505 24699 -3441 64395 285037 396687 268610 79795 -43291 -173215
38662 -173215 -284823 -218446 -35868 -13835 -185032 -280838 -214102 -196421 -280210 -232058 7785
38651 7785 182183 179539 203404 327280 323141 107385 -77530 -103323 -137283 -207455 -62250
38640 -62250 311076 505910 316310 97911 199410 432787 437054 221075 23454 -67240
38630 -67240 -62807 80710 316835 453362 431013 401559 414650 348945 239913 278524 393262
38619 393262 296703 54884 69583 335231 324780 -126825 -455395 -241235 150743 233059
38609 233059 131924 169251 224075 62565 -121635 -51966 100924 52488 -63683 3808
$$ packed form
38683a9948m1440j33334j13137o1384m3609N9814K35424K07800p8723k39701m3691
38672b71929J82424J14204k8140O7836K20642J11650j28077j88815j23086j29924
38662a73215j11608O6377J82578K2033j71197r5806O6736J7681q3789M8152K39843
38651G785J74398k644K3865J23876m139k15756j84915k5793l3960p0172J45205
38640f2250L73326J94834j89600k18399J01499K33377M267k15979j97621r0694
38630f7240M433J43517K36125J36527k2349k9454J3091o5705j09032L8611J14738
38619C93262r6559k41819J4699K65648j0451m51605l28570K14160L91978Q2316
38609B33059j01135L7327N4824j61510j84200O9669J52890m8436j16171O7491
$$ plain form
38599 3808 116432 38200 -76128 7787 95852 -115050 -462523 -564601 -415676 -266371
38589 -266371 -134104 99703 312567 313534 209721 202053 222971 145091 94606 180827 202356
38578 202356 15504 -121009 12654 153974 16113 -161607 -32207 225833 247054 143011
38568 143011 243770 445152 413778 216644 157368 196965 123231 83445 337541 669582
38558 669582 667996 428560 351691 393693 180916 -234253 -404075 -236095 -78708 -58750
38548 -58750 66405 370379 626552 746159 841156 846234 577055 163053 -64713 -105295
38538 -105295 -227258 -403961 -314400 73223 385511 356690 84624 -204311 -312609 -105815
38528 -105815 261189 334847 -41351 -383033 -261218 -3734 -122443 -389439 -226060 240810
$$ packed form
38599C808J12624p8232j14328Q3915Q8065k10902l47473j02078J48925J49305
38589b66371J32267K33807K12864R67j03813p668K0918p7880n0485Q6221K1529
38578B02356j86852j36513J33663J41320j37861j77720J29400K58040K1221j04043
38568A43011J00759K01382l1374j97134n9276L9597p3734l9786K54096L32041
38558F69582j586k39436p6869M2002k12777m15169j69822J67980J57387J9958
38548e8750J25155L03974K56173J19607R4997N078k69179m14002k27766m0582
38538a05295j21963j76703Q9561L87623L12288k8821k72066k88935j08298K06794
38528a05815L67004P3658l76198l41682J21815K57484j18709k66996J63379M66870
$$ plain form
38518 240810 347784 -2649 -255666 -191113 -154408 -249805 -137946 214568 363464 167357
38508 167357 27788 137027 172713 -16808 -88359 140058 310604 130008 -159171 -222622
38498 -222622 -109561 -12661 54859 112782 93866 38880 88154 192160 173434 93758 161336
38487 161336 290151 216038 35785 111677 425626 570568 422998 274040 245141 145789
38477 145789 -16644 30691 279838 390624 291367 276646 408008 389981 163854 55695
38467 55695 188070 282791 190420 110068 171459 282321 439290 685603 777331 469415 91740
38456 91740 177790 551501 531985 59736 -206562 -10233 154918 9213 -70278 129985
38446 129985 219362 -39449 -265628 -149787 47818 68184 114250 378380 666766 819075
$$ packed form
38518B40810J06974l50433k53017O4553L6705r5397J11859L52514J48896j96107
38508A67357j39569J09239L5686j89521p1551K28417J70546j80596k89179o3451
38498b22622J13061R6900O7520N7923j8916n4986M9274J04006j8726p9676O7578
38487A61336J28815p4113j80253P5892L13949J44942j47570j48958k8899r9352
38477A45789j62433M7335K49147J10786r9257j4721J31362j8027k26127j08159
38467E5695J32375R4721r2371q0352O1391J10862J56969K46313R1728l07916l77675
38456I1740Q6050L73711j9516m72249k66298J96329J65151j45705p9491K00263
38446A29985Q9377k58811k26179J15841J97605K0366M6066K64130K88386J52309
$$ plain form
38436 819075 990057 1265029 1503343 1719661 2052791 2260161 1911830 1192819 781769 817646
38426 817646 777297 494272 404219 590347 542508 151806 -11075 254060 413436 256721
38416 256721 311122 743965 875685 361289 -108635 73532 509041 644065 683966 963856
38406 963856 1206462 1122282 1043347 1306820 1678249 1940205 2309723 2739801 2644477 1911431
38396 1911431 1326001 1359029 1426772 1028848 674001 884590 1200893 1063950 856294 1148737
38386 1148737 1665616 1890744 1978550 2193782 2173322 1625598 1058392 950288 911410 510032
38376 510032 171115 368002 688316 620542 509689 802397 1109438 965453 749094 896503
38366 896503 999162 650406 344408 523707 619111 111377 -366563 -134483 261164 102834
$$ packed form
38436H19075J70982K74972K38314K16318L33130K07370l48331p19011m11050L5877
38426H17646m0349k83025r0053J86128m7839l90702j62881K65135J59376j56715
38416B56721N4401M32843J31720n14396m69924J82167M35509J35024L9901K79890
38406I63856K42606q4180p8935K63473L71429K61956L69518M30078r5324p33046
38396A911431n85430L3028O7743l97924l54847K10589L16303j36943k07656K92443
38386A148737N16879K25128Q7806K15232k0460n47724n67206j08104l8878m01378
38376E10032l38917J96887L20314o7774j10853K92708L07041j43985k16359J47409
38366H96503J02659l48756l05998J79299R5404n07734m77940K32080L95647j58330
$$ plain form
38356 102834 -113591 321349 869420 716738 345378 629137 1156247 1013339 515299 561446
38346 561446 929823 813341 435130 528783 811532 579755 215814 472086 881378 563054
38336 563054 -22397 132312 678587 624673 301733 681953 1337733 1129024 414514 471071
38326 471071 1141654 1202036 691103 697593 1161028 1097118 702356 976770 1554891 1246121
38316 1246121 447737 595609 1473896 1592401 997079 1051651 1631782 1359293 513819 739696
38306 739696 1849238 2004567 1183377 1234889 2270375 2391385 1393851 1226808 2223212
38297 2223212 2498453 1762204 1944629 3224881 3417604 2302647 2385789 4162198 5031213
38288 5031213 4324902 4704218 6858214 7877585 7005356 7602771 10803372 12949934 12468941
$$ packed form
38356A02834k16425M34940N48071j52682l71360K83759N27110j42908m98040M6147
38346E61446L68377j16482l78211R3653K82749k31777l63941K56272M09292l18324
38336E63054n85451J54709N46275n3914l22940L80220O55780k08709p14510N6557
38326D71071O70583O0382n10933O490M63435o3910l94762K74414N78121l08770
38316A246121p98384J47872Q78287J18505n95322N4572N80131k72489q45474K25877
38306G39696J109542J55329q21190N1512J035486J21010r97534j67043R96404
38297B223212K75241p36249J82425J280252J92723j114957Q3142J776409Q69015
38288E031213p06311L79316K153996J019371q72229N97415L200601K146562m80993
$$ plain form
38279 12468941 13152148 16854498 19634632 19795882 22441478 30235428 37711215 42133963
38271 42133963 50903863 68500446 87276135 106715013 150391110 237106989 335442654
38264 335442654 376694449 327272092 228416511 148185136 110811663 92557060 71640055
38257 71640055 52845439 44700051 40429331 31610541 22695929 20497768 21175664 18125318
38249 18125318 13771867 13555309 15150000 13265904 9795095 9874167 11977982 11024371 8199579
38240 8199579 8633905 11499002 11527890 9105034 9629396 13218523 14444680 12879109 14239923
38231 14239923 19452362 22564775 22311361 25321587 33741958 40768172 44301443 52956373
38223 52956373 70312300 87427086 104942059 147714790 232253964 324256190 357764355
$$ packed form
38279A2468941O83207L702350K780134J61250K645596P793950P475787M422748
38271D2133963Q769900J7596583J8775689J9438878M3676097Q6715879R8335665
38264C35442654M1251795m9422357r8855581q0231375l7373473j8254603k0917005
38257G1640055j8794616q145388m270720q818790q914612k198161O77896l050346
38249A8125318m353451k16558J594691j884096l470809P9072K103815r53611k824792
38240H199579M34326K865097K8888k422856N24362L589127J226157j565571J360814
38231A4239923N212439L112413k53414L010226Q420371P026214L533271Q654930
38223E2956373J7355927J7114786J7514973M2772731Q4539174R2002226L3508165
$$ plain form
38216 357764355 306008121 212395962 139571382 106174515 89018226 69578749 52691008
38209 52691008 44954506 40183014 32070495 24557406 22130728 21118359 17303485 13452480
38201 13452480 13056232 13562473 11597797 9183275 9370808 10492260 9775176 8574657 9264029
38192 9264029 10469458 9904656 8862546 9612561 11071562 11175686 11100651 13101451 16313383
38183 16313383 18613737 20708216 24403299 28377719 29578555 27746354 25043020 22208861
38175 22208861 18529466 14756963 12596299 11700374 10249216 8178458 7006326 6817757
38167 6817757 6208707 5013386 4448085 4647119 4504214 3889169 3725662 3951680 3608111
38158 3608111 2869776 2850164 3459319 3533801 3029212 3030467 3608238 3691964 3134570 2972678
$$ packed form
38216C57764355n1756234r3612159p2824580l3396867j7156289j9439477j6887741
38209E2691008p736502m771492q112519p513089k426678j012369l814874l851005
38201A3452480l96248N06241j964676k414522J87533J121452p17084j200519O89372
38192I264029J205429n64802j042110P50015J459001J04124p5035K000800L211932
38183A6313383K300354K094479L695083L974420J200836j832201k703334k834159
38175B2208861l679395l772503k160664q95925j451158k070758j172132j88569
38167F817757o09050j195321n65301J99034j42905o15045j63507K26018l43569
38158C608111p38335j9612O09155P4482n04589J255N77771Q3726n57394j61892
$$ plain form
38148 2972678 3529712 4063942 4356235 4885350 5411776 5173091 4542977 4741937 5816032
38139 5816032 6606967 6794244 7255551 8318128 9382917 10439947 12274663 14959023 17684128
38130 17684128 20161522 22567956 24086299 23339705 20540136 17486292 15137484 12867844
38122 12867844 10375976 8487182 7541406 6698338 5487501 4532538 4142002 3645495 2736321
38113 2736321 2084209 2025423 1976079 1683000 1705912 2115575 2091395 1417795 1031140 1427474
38103 1427474 1831416 1631891 1384234 1667197 2131619 2390639 2705106 3092977 2903509
38094 2903509 2000093 1274193 1275698 1398108 1098679 818429 960931 1056461 734320 496354
38084 496354 731203 948892 769637 678239 1001684 1139183 659500 194300 342106 604704
$$ packed form
38148B972678N57034N34230K92293N29115N26426k38685o30114J98960J074095
38139E816032P90935J87277M61307J062577J064789J057030J834716K684360K725105
38130A7684128K477394K406434J518343p46594k799569l053844k348808k269640
38122A2867844k491868j888794r45776q43068j210837r54963l90536m96507r09174
38113B736321o52112n8786m9344k93079K2912M09663k4180o73600l86655L96334
38103A427474M03942j99525k47657K82963M64422K59020L14467L87871j89468
38094B903509r03416p25900J505J22410k99429k80250J42502R5530l22141k37966
38084D96354K34849K17689j79255r1398L23445J37499m79683m65200J47806K62598
$$ plain form
38074 604704 348692 -40913 62662 386026 367053 206593 356109 586355 481336 285152
38064 285152 401024 601727 539289 474095 724754 975068 885840 793230 1046409 1289633
38054 1289633 1183186 1168312 1665879 2167212 2035333 1608019 1554329 1689233 1419995 891394
38044 891394 676746 717813 552236 263886 256742 374164 173354 -167131 -109433 283091
38034 283091 497313 483251 586875 754649 630887 316029 243469 397819 377128 135155
38024 135155 -10320 9674 34878 156461 534476 890407 828002 523154 476505 726805
38014 726805 912963 949051 1019457 1062887 881728 629496 604884 707715 651990 522574
38004 522574 549311 560251 280675 -48067 -2546 277853 355344 304411 533935 944822
$$ packed form
38074F04704k56012l89605J03575L23364j8973j60460J49516K30246j05019j96184
38064B85152J15872K00703o2438o5194K50659K50314q9228r2610K53179K43224
38054A289633j06447j4874M97567N01333j31879m27314n3690J34904k69238n28601
38044H91394k14648M1067j65577k88350p144J17422k00810l40485N7698L92524
38034B83091K14222j4062J03624J67774j23762l14858p2560J54350k0691k41973
38024A35155j45475J9994K5204J21583L78015L55931o2405l04848m6649K50300
38014G26805J86158L6088P0406M3430j81159k52232k4612J02831n5725j29416
38004E22574K6737J0940k79576l28742M5521K80399P7491n0933K29524M10887
$$ plain form
37994 944822 1018771 690584 414225 369104 282454 69540 4485 174846 323918 309239
37984 309239 246699 188211 93839 70386 203399 269136 73526 -94614 129377 514708
37974 514708 558627 310150 226151 338354 262787 -16620 -90344 116697 206739 30837
37964 30837 -69023 124081 388690 507002 543218 566191 524673 480691 573625 714850 688304
37953 688304 530267 430546 340493 104137 -129785 -100348 68842 70221 1139 203672 599301
37942 599301 764513 634224 554687 647233 686929 617423 625251 687900 597013 436031 475690
37931 475690 593333 386552 -102240 -371447 -236498 -41431 -15785 5942 120824 171769
37921 171769 149831 267390 519806 659584 673271 780893 920729 783400 419106 244562
$$ packed form
37994I44822P3949l28187k76359m5121q6650k12914o5055J70361J49072j4679
37984C09239o2540n8488r4372k3453J33013O5737j95610j68140K23991L85331
37974E14708M3919k48477q3999J12203p5567k79407p3724K07041R0042j75902
37964C0837r9860J93104K64609J18312L6216K2973m1518m3982R2934J41225k6546
37953F88304j58037r9721r0053k36356k33922K9437J69190J379o9082K02533L95629
37942E99301J65212j30289p9537R2546L9696o9506P828O2649r0887j60982L9659
37931D75690J17643k06781m88792k69207J34949J95067K5646K1727J14882N0945
37921A71769k1938J17559K52416J39778J3687J07622J39836j37329l64294j74544
$$ plain form
37911 244562 362151 436711 334172 297196 380926 317936 91484 54445 307497 519987
37901 519987 528693 549297 638269 540772 263389 196304 434175 557582 346759 150336 262215
37890 262215 461423 467462 368014 312505 233048 118886 128543 225170 160695 -8938 90950
37879 90950 476047 668277 448645 171741 97831 10491 -227248 -345720 -218510 -148466
37869 -148466 -265157 -227484 109202 329544 169863 3753 165948 363201 259017 110501
37859 110501 277373 561707 582235 403011 287038 220230 156177 315160 748965 1029474
37849 1029474 870819 630003 672522 709495 363096 -63648 -75663 126470 -11420 -430526
37839 -430526 -574549 -312096 -50836 -18765 -56926 -72010 -130197 -145896 14372 181249
$$ packed form
37911B44562J17589P4560j02539l6976Q3730o2990k26452l7039K53052K12490
37901E19987Q706K0604Q8972r7497k77383o7085K37871J23407k10823j96423J11879
37890B62215J99208O039r9448n5509p9457j14162R657R6627o4475j69633R9888
37879I0950L85097J92230k19632k76904p3910q7340k37739j18472J27210P0044
37869a48466j16691L7673L36686K20342j59681j66110J62195J97253j04184j48516
37859A10501J66872K84334K0528j79224j15973o6808o4053J58983M33805K80509
37849A029474j58655k40816M2519L6973l46399m26744j2015K02133j37890m19106
37839d30526j44023K62453K61260L2071l8161j5084n8187j5699J60268J66877
$$ plain form
37829 181249 108073 -55020 6467 184416 110105 -185057 -299060 -112673 85243 117803
37819 117803 105390 128208 124408 125411 210558 251502 68148 -208928 -294062 -193768 -130962
37808 -130962 -115566 10213 178348 162114 -14048 -126086 -157228 -264035 -397423 -358866
37798 -358866 -189864 -114623 -137661 -79170 42132 47557 -33530 -15321 87124 128915 170596
37787 170596 336576 448693 259312 -42322 -55735 162868 192815 -16847 -80163 114016
37777 114016 210795 41356 -90370 27439 167183 122429 69219 194762 346339 332713
37767 332713 261435 308472 412090 434279 402436 383194 316237 152827 -16347 -109735 -163590
37756 -163590 -201094 -177381 -115286 -84945 -8644 259638 609148 716703 510211 306355
$$ packed form
37829A81249p3176j63093O1487J77949p4311k95162j14003J86387J97916L2560
37819A17803j2413K2818l800J003Q5147M0944j83354k77076q5134J00294O2806
37808a30962J5396J25779J68135j6234j76162j12038l1142j06807j33388L8557
37798c58866J69002P5241k3038N8491J21302N425q1087J8209J02445M1791M1681
37787A70596J65980J12117j89381l01634j3413K18603K9947k09662o3316J94179
37777A14016R6779j69439j31726J17809J39744m4754n3210J25543J51577j3626
37767C32713p1278M7037J03618K2189l1843j9242o6957j63410j69174r3388n3855
37756a63590l7504K3713O2095L0341P6301K68282L49510J07555k06492k03856
$$ plain form
37746 306355 364435 561377 638400 528761 309767 55824 -127209 -122440 23076 117080
37736 117080 90870 64232 101585 129233 138890 217481 312090 236764 -916 -152665 -109893
37725 -109893 -60563 -151804 -266509 -269810 -217233 -170621 -55458 142825 273882 267199 255688
37714 255688 307084 268570 44125 -205249 -317638 -362762 -429286 -405567 -198900 22175
37704 22175 56258 -6009 66003 267972 374616 276403 104868 38692 118218 230866 203590
37693 203590 -28814 -291634 -308917 -36418 269645 384028 357055 332129 293801 158887
37683 158887 -4868 -30327 130186 361616 519152 521679 372765 163579 3412 -90715
37673 -90715 -161898 -163652 22824 374604 670321 727826 592055 425144 320280 282143 278029
$$ packed form
37746C06355N8080J96942P7023j09639k18994k53943j83033M769J45516R4004
37736A17080k6210k6638L7353K7648R657P8591R4609p5326k37680j51749M2772
37725a09893M9330r1241j14705l301N2577M6612J15163J98283J31057o683j1511
37714B55688N1396l8514k24445k49374j12389m5124o6524K3719K06667K21075
37704B2175L4083o2267P2012K01969J06644r8213j71535o6176P9526J12648k7276
37693B03590k32404k62820j7283K72499L06063J14383k6973k4926l8328j34914
37683A58887j63755k5459J60513K31430J57536K527j48914k09186j60167r4127
37673i0715p1183j754J86476L51780K95717N7505j35771j66911j04864l8137m114
$$ plain form
37662 278029 246784 157137 95972 186802 392321 525659 487300 361473 265497 256500 389851
37651 389851 672632 926625 911555 651282 435336 427995 492493 487354 494691 612190 735015
37640 735015 723966 626981 563904 527255 450997 353647 274204 184580 88043 76779 174054
37629 174054 259030 268116 311249 442418 482781 270467 -36206 -121378 81911 331198 389431
37618 389431 252258 81040 28103 118885 230848 211015 55229 -81391 -76357 40714
37608 40714 177874 275299 284192 187488 79481 80026 135930 78207 -89131 -174475 -138724 -193624
37596 -193624 -427628 -592877 -471301 -233870 -184088 -311711 -377718 -329185 -336408 -455170
37586 -455170 -523898 -432749 -292802 -271875 -381951 -476626 -404187 -168838 32490 -275 -209632
$$ packed form
37662B78029l1245q9647o1165R0830K05519J33338l8359j25827r5976q997J33351
37651C89851K82781K53993j5070k60273k15946p341O4498n139P337J17499J22825
37640G35015j1049r6985o3077l6649p6258r7350p9443q9624r6537j1264R7275
37629A74054Q4976R086M3133J31169M0363k12314l06673q5172K03289K49287N8233
37618C89431j37173j71218n2937R0782J11963j9833j55786j36620N034J17071
37608D0714J37160R7425Q893r6704j08007N45N5904n7723j67338q5344L5751n4900
37596a93624k34004j65249J21576K37431M9782j27623o6007M8533p223j18762
37586d55170o8728R1149J39947K0927j10076r4675P2439K35349K01328l2765k09357
$$ plain form
37575 -209632 -324210 -223619 -102953 -156606 -264936 -182878 84271 314931 407295 450642
37565 450642 485866 428607 275451 192686 302725 499908 574297 456646 264673 138860
37555 138860 107393 129426 208268 372446 538931 518588 255045 -37738 -123326 -58572 -76028
37544 -76028 -196358 -195521 22252 265903 351906 336414 345188 368955 354096 329602 324103 308224
37532 308224 315320 445612 648718 697414 507645 295453 275244 391997 499775 594738
37522 594738 684859 638302 400087 195297 264559 518084 689972 725178 765168 834699 804024
37511 804024 637028 456472 359360 329033 317150 281782 178276 27315 -58704 -16984 66865
37500 66865 83563 25955 -78939 -218667 -292923 -148785 160629 351366 287059 170107
$$ packed form
37575b09632j14578J00591J20666n3653j08330Q2058K67149K30660R2364M3347
37565D50642L5224n7259j53156q2765J10039J97183P4389j17651j91973j25813
37555A38860l1467K2033P8842J64178J66485k0343k63543k92783q5588O4754j7456
37544g6028j20330Q37K17773K43651Q6003j5492Q774K3767j4859k4494n499j5879
37532C08224P096J30292K03106M8696j89769k12192k0209J16753J07778R4963
37522E94738R0121m6557k38215k04790O9262K53525J71888L5206L9990O9531l0675
37511H04024j66996j80556r7112l0327j1883l5368j03506j50961q6019M1720Q3849
37500F6865J6698n7608j04894j39728p4256J44138L09414J90737o4307j16952
$$ plain form
37490 170107 191081 232359 140992 48233 133625 282197 286886 210733 225656 261400 163988
37479 163988 55070 156497 365541 383649 184061 -25012 -216882 -512642 -786216 -752158
37469 -752158 -464323 -294506 -355297 -359429 -143072 79789 123317 117415 221285 369910 467056
37458 467056 535348 527907 296730 -82332 -254147 -59942 192220 149037 -119382 -287396
37448 -287396 -218694 -32300 121224 157700 55312 -95409 -147880 -103692 -116252 -215809 -230747
37437 -230747 -87658 34761 1981 -41801 75683 250038 250750 43540 -215040 -380256
37427 -380256 -358562 -87116 344046 666492 706289 584747 499934 438458 285769 102502
37417 102502 68508 205820 352071 385728 319139 190868 15706 -155629 -242440 -218306
$$ packed form
37490A70107K0974M1278r1367r2759Q5392J48572M689p6153J4923L5744r7412
37479A63988j08918J01427K09044J8108j99588k09073j91870k95760k73574L4058
37469g52158K87835J69817o0791m132K16357K22861M3528n902J03870J48625R7146
37458D67056O8292p441k31177l79062j71815J94205K52162m3183k68419j68014
37448b87396O8702J86394J53524L6476j02388j50721n2471M4188j2560r9557j4938
37437b30747J43089J22419l2780m3782J17484J74355P12k07210k58580j65216
37427c80256K1694K71446M31162L22446L9797j21542q4813o1476j52689j83267
37417A02502l3994J37312J46251L3657o6589j28271j75162j71335q6811K4134
$$ plain form
37407 -218306 -137134 -90884 -158327 -327479 -451024 -385793 -203343 -118794 -166930 -137969 68903
37396 68903 237990 151058 -73053 -171279 -133540 -160795 -306509 -412350 -377947 -265448 -130052
37385 -130052 38790 174947 140442 -49505 -170786 -60347 176045 327275 358066 409132
37375 409132 555484 683219 639813 440913 264450 247678 348465 430632 424807 344215 199867
37364 199867 9791 -130051 -117874 -11129 7349 -124996 -255994 -231244 -90885 19842
37354 19842 37606 3060 -8681 91076 339701 590064 571545 219674 -160534 -221853 9349
37343 9349 212426 205868 104419 67077 110798 221976 442780 724555 846959 647669 265918
37332 265918 12638 21850 153063 229385 237928 256864 305463 353432 401280 449383 432411
$$ packed form
37407b18306Q1172M6250o7443j69152j23545O5231J82450Q4549m8136K8961K06872
37396F8903J69087q6932k24111r8226L7739k7255j45714j05841L4403J12499J35396
37385a30052J68842J36157l4505j89947j21281J10439K36392J51230L0791N1066
37375D09132J46352J27735m3406j98900j76463j6772J00787Q2167n825q0592j44348
37364A99867j90076j39842J2177J06745J8478j32345j30998K4750J40359J10727
37354A9842J7764l4546j1741R9757K48625K50363j8519l51871l80208o1319K31202
37343I349K03077o558j01449l7342M3721J11178K20804K81775J22404j99290l81751
37332B65918k53280R212J31213P6322Q543J8936M8599M7969M7848M8103j6972
$$ plain form
37321 432411 292745 98247 -24185 -65752 -123752 -204845 -190650 -53047 51782 11371
37311 11371 -49689 54661 291158 450246 416387 260320 102338 10685 4232 39604 23612
37300 23612 -65429 -120621 -68179 -4289 -40058 -95540 -15277 169633 265809 163578 -90452
37289 -90452 -399579 -631776 -621581 -368648 -153197 -212937 -379367 -314683 -50115 48487
37279 48487 -148532 -356325 -334290 -180739 -62174 22739 66166 -47560 -284510 -388766
37269 -388766 -260145 -138232 -208700 -299772 -215339 -111250 -235892 -491702 -579226 -450356
37259 -450356 -306978 -229323 -105836 92301 231458 231591 166190 125594 123722 139366 135309
37248 135309 59349 -77764 -171027 -150933 -73895 -6561 76800 189036 243088 186864 113567
$$ packed form
37321D32411j39666j94498j22432m1567n8000q1093J4195J37603J04829m0411
37311A1371o1060J04350K36497J59088l3859j56067j57982r1653o453L5372j5992
37300B3612q9041n5192N2442O3890l5769n5482Q0263J84910R6176j02231k54030
37289i0452l09127k32197J0195K52933K15451n9740j66430O4684K64568R8602
37279D8487j97019k07793K2035J53551J18565Q4913M3427j13726k36950j04256
37269c88766J28621J21913p0468r1072Q4433J04089j24642k55810q7524J28870
37259d50356J43378P7655J23487J98137J39157J33o5401m0596j872J5644m057
37248A35309p5960j37113r3263K0094P7038O7334Q3361J12236N4052n6224p3297
$$ plain form
37237 113567 121947 176835 210075 225416 199711 50512 -162447 -191399 62651 339801 355538
37226 355538 193253 143910 292325 491885 621500 626090 425281 50987 -218058 -138110
37216 -138110 141784 264559 151374 37456 74518 190756 332592 538191 721900 666416
37206 666416 333639 -24780 -164457 -93429 50117 205011 378579 540652 614823 542480
37196 542480 349222 179215 202644 415265 605732 612811 519695 483654 492508 439552 326727
37185 326727 222334 120486 17509 15382 157120 274683 206787 47237 -38824 -94414
37175 -94414 -203940 -212005 51588 387665 450293 279959 212347 299110 267731 76865 25192
37164 25192 187560 218450 -63772 -319850 -208987 83884 178652 86389 91266 221410 224229
$$ packed form
37237A13567Q380N4888L3240J5341k5705j49199k12959k8952K54050K77150J5737
37226C55538j62285m9343J48415J99560J29615M590k00809l74294k69045P9948
37216a38110K79894J22775j13185j13918L7062J16238J41836K05599J83709n5484
37206F66416l32777l58419j39677P1028J43546J54894J73568J62073P4171p2343
37196E42480j93258j70007K3429K12621J90467P079r3116l6041Q854n2956j12825
37185C26727j04393j01848j02977k127J41738J17563o7896j59550q6061n5590
37175i4414j09526q065K63593L36077O2628j70334o7612Q6763l1379j90866n1673
37164B5192J62368L0890k82222k56078J10863K92871R4768r2263M877J30144K819
$$ plain form
37153 224229 17728 -167698 -139900 1814 44311 -54180 -140655 -70050 123474 263885
37143 263885 236047 109209 14388 -37984 -116595 -201857 -208035 -149816 -130687 -173127 -215989
37132 -215989 -264417 -361912 -422497 -299883 -45311 114604 99092 68015 149513 281971 383477
37121 383477 462820 488625 364606 129580 -17595 13531 104008 171304 292487 472344
37111 472344 521022 326852 67430 -18254 75336 191041 230444 172570 11252 -190938
37101 -190938 -299289 -261449 -157092 -38493 122079 275480 292886 204669 220246 394879
37091 394879 502663 381378 176643 77102 32487 -66298 -138228 -76445 11214 -30259 -124402
37080 -124402 -82067 97333 240291 231044 78819 -134137 -245446 -117611 107923 69098
$$ packed form
37153B24229k06501j85426K7798J41714M2497r8491q6475P0605J93524J40411
37143B63885k7838j26838r4821n2372p8611q5262o178N8219J9129m2440m2862
37132b15989m8428r7495o0585J22614K54572J59915j5512l1077Q1498J32458J01506
37121C83477P9343K5805j24019k35026j47175L1126R0477O7296J21183J79857
37111D72344M8678j94170k59422q5684R3590J15705L9403n7874j61318k02190
37101a90938j08351L7840J04357J18599J60572J53401J7406q8217J5577J74633
37091C94879J07784j21285k04735r9541m4615r8785p1930O1783Q7659m1473r4143
37080a24402M2335J79400J42958r247j52225k12956j11309J27835K25534l8825
$$ plain form
37070 69098 -320008 -660529 -593684 -294858 -138483 -100703 99114 410630 473872 211725
37060 211725 -36565 -47970 667 -90400 -214661 -190315 -72509 -38043 -122071 -236326 -331413
37049 -331413 -402298 -419248 -367507 -299501 -273463 -290180 -331307 -394612 -453132 -447560 -367681 -298276
37037 -298276 -343616 -515762 -699206 -722970 -504664 -145177 161746 324728 391019 389040
37027 389040 268141 47580 -119635 -128723 -44321 54476 202895 401283 498888 400073 247932
37016 247932 205761 181666 1437 -239246 -254898 28343 381082 573366 573469 462271 342270
37005 342270 317082 378142 337264 58386 -284987 -396192 -261494 -130710 -117980 -102272
36995 -102272 -47385 -113347 -341150 -496236 -391966 -169940 -84794 -155672 -197737 -99367 77377
$$ packed form
37070F9098l89106l40521O6845K98826J56375L7780J99817L11516O3242k62147
37060B11725k48290j1405M8637r1067j24261K4346J17806L4466q4028j14255r5087
37049c31413p0885j6950N1741O8006K6038j6717m1127o3305n8520N572P9879O9405
37037b98276m5340j72146j83444k3764K18306L59487L06923J62982O6291j979
37027C89040j20899k20561j67215r088Q4402R8797J48419J98388R7605r8815j52141
37016B47932m2171k4095j80229k40683j5652K83241L52739J92284J03j11198j20001
37005C42270k5188O1060m0878k78878l43373j11205J34698J30784J2730J5708
36995a02272N4887o5962k27803j55086J04270K22026Q5146p0878m2065R8370J76744
$$ plain form
36984 77377 205065 188227 12700 -209956 -299976 -189745 -8360 63669 -19966 -163538
36974 -163538 -251240 -242345 -188082 -172133 -202862 -188913 -80319 14176 -44248 -211722 -308079
36963 -308079 -267384 -204041 -217114 -268306 -288761 -278188 -248130 -177583 -81920 -40989 -110487
36952 -110487 -261674 -415442 -471059 -333357 -24589 253241 306437 192829 126328 147751
36942 147751 91214 -83099 -155982 18416 237553 205220 -48150 -211050 -119535 65977
36932 65977 150020 187202 351703 617449 743569 605412 395279 380903 548009 641160
36922 641160 535269 379418 330651 337802 293962 229145 201301 143230 -2482 -118752 -86484
36911 -86484 -22972 -123732 -332693 -405692 -270781 -94403 -1815 35904 30562 -68161 -206561
$$ packed form
36984G7377J27688j6838j75527k22656r0020J10231J81385P2029q3635j43572
36974a63538q7702Q895N4263J5949l0729J3949J08594R4495n8424j67474r6357
36963c08079M0695O3343j3073n1192k0455J0573L0058P0547R5663M0931o9498
36952a10487j51187j53768n5617J37702L08768K77830N3196j13608o6501K1423
36942A47751n6537j74313p2883J74398K19137l2333k53370j62900R1515J85512
36932F5977Q4043L7182J64501K65746J26120j38157k10133j4376J67106R3151
36922F41160j05891j55851m8767P151m3840o4817k7844n8071j45712j16270L2268
36911h6484O3512j00760k08961p2999J34911J76378R2588L7719n342r8723j38400
$$ plain form
36900 -206561 -236789 -151360 -111388 -187492 -266912 -273911 -282239 -337634 -365078 -335033 -327419 -333671
36888 -333671 -192859 141237 436475 440342 187443 -81472 -212638 -237873 -261502 -348065
36878 -348065 -465943 -489928 -332943 -96342 23461 737 8906 140775 261508 218586
36868 218586 53827 -84037 -116058 -46675 74163 130211 10058 -222946 -352164 -263467
36858 -263467 -55350 148259 330666 467947 472027 348476 236380 186450 81487 -108173
36848 -108173 -197494 -75378 79089 72195 12963 115585 318335 364830 192127 -18106
36838 -18106 -144467 -240830 -340619 -364798 -270673 -124336 19434 169535 295703 310413 208681
36827 208681 115900 132101 205532 220206 156486 105511 138500 201618 164036 -19917 -220244
$$ packed form
36900b06561l0228Q5429L9972p6104p9420o999q328n5395k7444L0045P614o252
36888c33671J40812L34096K95238L867k52899k68915j31166k5235k3629q6563
36878c48065j17878k3985J56985K36601J19803k2724Q169J31869J20733m2922
36868B18586j64759j37864l2021O9383J20838N6048j20153k33004j29218Q8697
36858b63467K08117K03609J82407J37281M080j23551j12096m9930j04963j89660
36848a08173q9321J22116J54467o894n9232J02622K02750M6495j72703k10233
36838a8106j26361r6363r9789k4179R4125J46337J43770J50101J26168J4710j01732
36827B08681r2781J6201P3431J4674o3720n0975L2989O3118l7582j83953k00327
$$ plain form
36816 -220244 -252961 -94916 80018 95168 -52302 -220849 -269779 -163900 -50 62514
36806 62514 -28752 -124568 -45701 154749 236364 106006 -43639 -3554 174799 274765 197059
36795 197059 48326 -2367 105831 256332 241253 -11246 -300869 -356959 -173913 -1938
36785 -1938 6674 -35356 17803 134316 211052 220782 153763 -31462 -294929 -498493 -597073
36774 -597073 -689232 -779944 -681364 -299137 147513 368481 343024 255051 204065 152791 75691
36763 75691 -4845 -77394 -118063 -74298 34864 94330 59784 41287 129757 264437 368545
36752 368545 472501 585295 590628 411948 158901 -16173 -88224 -87807 -16491 54421 -22441
36741 -22441 -245463 -410800 -415164 -405257 -474443 -452475 -208271 70884 159110 144064 218077
$$ packed form
36816b20244l2717J58045J74934J5150j47470j68547m8930J05879J63850O2564
36806F2514r1266r5816P8867K00450Q1615j30358j49645M0085J78353R9966p7706
36795A97059j48733n0693J08198J50501j5079k52499k89623n6090J83046J71975
36785a938Q612m2030N3159J16513P6736R730o7019j85225k63467k03564r8580
36774e97073r2159r0712R8580L82227M46650K20968k5457q7973n0986n1274p7100
36763G5691q0536p2549m0669M3765J09162N9466l4546j8497Q8470J34680J04108
36752C68545J03956J12794N333j78680k53047j75074p2051M17P1316P0912p6862
36741b2441k23022j65337m364R907o9186K1968K44204K79155Q8226j5046P4013
$$ plain form
36730 218077 306322 223277 57791 66293 263900 427730 447717 392728 283970 83542 -116070
36719 -116070 -139548 37112 275663 450159 493267 388111 264302 326696 514239 466497
36709 466497 61216 -297336 -241589 4406 37959 -46232 84715 292621 143730 -294911
36699 -294911 -474725 -215782 57365 32428 -92681 -82348 -20944 1017 107318 330164
36689 330164 472062 453944 432312 427193 238122 -111379 -273205 -115367 54452 23217
36679 23217 7276 192513 347766 213231 -63945 -188129 -113334 77813 372465 637402
36669 637402 571309 154676 -170208 -83634 161528 198058 113911 170985 262161 111698 -190095
36658 -190095 -303397 -159093 25263 125979 156302 65978 -149277 -268463 -117828 113205
$$ packed form
36730B18077Q8245q3045j65486Q502J97607J63830J9987n4989j08758k00428j99612
36719a16070k3478J76660K38551J74496M3108j05156j23809O2394J87543m7742
36709D66497m05281l58552N5747K45995L3553q4191J30947K07906j48891m38641
36699b94911j79814K58943K73147k4937j25109J0333O1404K1961J06301K22846
36689C30164J41898j8118k1632n119j89071l49501j61826J57838J69819l1235
36679B3217j5941J85237J55253j34535k77176j24184P4795J91147K94652K64937
36669F37402o6093m16633l24884Q6574K45162L6530q4147N7074R1176j50463l01793
36658a90095j13302J44304J84356J00716L0323r0324k15255j19186J50635K31033
$$ plain form
36648 113205 162864 134883 269885 452870 394231 185232 192223 435540 548553 386123
36638 386123 226264 273249 357331 270071 79258 -39646 -48129 -9006 7372 -73196 -250264
36627 -250264 -375881 -332967 -226445 -192917 -138470 49249 161631 -66604 -428043 -437012
36617 -437012 -72665 148367 -51169 -325294 -285717 -34838 142102 241064 377312 456534
36607 456534 351918 202957 217304 330739 356573 333429 424763 575550 576285 426885 355879
36596 355879 470996 627248 672019 623576 561533 497383 403115 259887 62371 -129480
36586 -129480 -167776 18262 245206 226751 -65171 -347410 -395670 -309584 -295540 -328241 -221286
36575 -221286 22996 158864 47201 -120626 -75497 163902 328120 248358 27728 -121530
$$ packed form
36648A13205M9659k7981J35002J82985n8639k08999O991K43317J13013j62430
36638C86123j59859M6985Q4082q7260j90813j18904q483L9123J6378q0568j77068
36627b50264j25617M2914J06522L3528N4447J87719J12382k28235l61439q969
36617d37012L64347K21032j99536k74125L9577K50879J76940R8962J36248P9222
36607D56534j04616j48961J4347J13435K5834k3144R1334J50787P35j49400p1006
36596C55879J15117J56252M4771m8443o2043o4150r4268j43228j97516j91851
36586a29480l8296J86038K26944j8455k91922k82239m8260Q6086J4044l2701J06955
36575b21286K44282J35868j11663j67827M5129K39399J64218p9762k20630j49258
$$ plain form
36565 -121530 -80889 128828 372314 464103 341227 180084 198556 342182 352992 168068
36555 168068 8961 -2160 -38696 -216151 -312101 -102351 229495 332982 202751 113980
36545 113980 135993 82917 -59717 -43056 220682 479465 535276 524717 611342 648557 414305
36534 414305 31846 -129435 56232 315265 355520 234377 243389 503519 796621 824390
36524 824390 553947 220009 15378 -92831 -211038 -331599 -395169 -416153 -411405 -305841
36514 -305841 -69305 132320 103893 -107756 -283274 -328580 -316449 -262520 -74918 248164
36504 248164 553132 706883 705040 598719 450448 351225 335890 308203 203083 159494 323177
36493 323177 540989 528434 327616 283883 512241 705984 599988 333282 175172 137247
$$ packed form
36565a21530M0641K09717K43486R1789j22876j61143J8472J43626J0810j84924
36555A68068j59107j1121l6536j77455r5950K09750L31846J03487j30231q8771
36545A13980K2013n3076j42634J6661K63738K58783N5811j0559Q6625L7215k34252
36534D14305l82459j61281J85667K59033M0255j21143R012K60130K93102K7769
36524H24390k70443l33938k04631j08209j18207j20561o3570k0984M748J05564
36514c05841K36536K01625k8427k11649j75518m5306J2131N3929J87602L23082
36504B48164L04968J53751j843j06321j48271r9223j5335k7687j05120m3589J63683
36493C23177K17812j2555k00818m3733K28358J93743j05996k66706j58110l7925
$$ plain form
36483 137247 68722 -48049 -115626 -114863 -94969 -50487 53863 201376 349943 457743 447925
36472 447925 285440 116137 138077 289782 302579 137254 81078 265762 396012 195985
36462 195985 -142596 -256400 -138170 -34514 15581 164109 365395 386959 202656 30519
36452 30519 -50230 -187561 -392814 -419861 -158938 123169 140786 -12892 -53152 44446 37593
36441 37593 -162863 -306624 -132815 255097 489803 385977 146800 69861 158845 163062
36431 163062 -41180 -287490 -382231 -367051 -404839 -513354 -553038 -434311 -220281 -39231
36421 -39231 21159 -55414 -223453 -412119 -565573 -628248 -530140 -286652 -88977 -135712 -351357
36410 -351357 -452105 -346543 -264687 -385858 -559238 -561756 -432209 -331758 -241076 -54359
$$ packed form
36483A37247o8525j16771o7577P63J9894M4482J04350J47513J48567J07800r818
36472D47925j62485j69303K1940J51705J2797j65325n6176J84684J30250k00027
36462A95985l38581j13804J18230J03656N0095J48528K01286K1564j84303j72137
36452C0519q0749j37331k05253k7047K60923K82107J7617j53678m0260R7598o853
36441C7593k00456j43761J73809L87912K34706j03826k39177p6939Q8984M217
36431A63062k04242k46310r4741J5180l7788j08515l9684J18727K14030J81050
36421c9231O0390p6573j68039j88666j53454o2675R8108K43488J97675m6735k15645
36410c51357j00748J05562Q1856j21171j73380k518J29547J00451R0682J86717
$$ plain form
36400 -54359 141857 154870 -9976 -173212 -259003 -319111 -336412 -253638 -159344 -186464 -245420
36389 -245420 -124419 144689 292567 203261 26719 -122431 -275212 -361443 -191900 173639
36379 173639 354673 145104 -183077 -284329 -197023 -143277 -104078 78340 322371 383488
36369 383488 253072 153555 139381 24614 -225786 -333277 -91488 295626 447722 260767
36359 260767 -36416 -200270 -191191 -106229 -36262 -14465 -17963 12120 103413 192192 181220
36348 181220 73691 -7933 23789 97896 82925 -18546 -64861 20694 136026 146069 59567
36337 59567 -27911 -100610 -208560 -320320 -336443 -261545 -214712 -222501 -153162 52651 227200
36326 227200 191002 16190 -96579 -134610 -262297 -504008 -652988 -558785 -321135 -98896
$$ packed form
36400e4359J96216J3013j64846j63236q5791o0108j7301Q2774R4294k7120n8956
36389b45420J21001K69108J47878q9306j76542j49150j52781q6231J69543L65539
36379A73639J81034k09569l28181j01252Q7306N3746L9199J82418K44031O1117
36369C83488j30416r9517j4174j14767k50400j07491K41789L87114J52096j86955
36359B60767k97183j63854R079Q4962O9967K1797l498L0083R1293Q8779j0972
36348A81220j07529q1624L1722P4107j4971j01471m6315Q5555J15332J0043q6502
36337E9567q7478p2699j07950j11760j6123P4898M6833p789O9339K05813J74549
36326B27200l6198j74812j12769l8031j27687k41711j48980R4203K37650K22239
$$ plain form
36316 -98896 105373 324463 434436 296037 29269 -72203 82738 276511 295768 174281
36306 174281 44304 -84938 -261641 -423194 -460299 -394825 -344486 -335692 -288561 -181026 -95561
36295 -95561 -83719 -96327 -79427 -50264 -49898 -94780 -190310 -314964 -380373 -292675 -74367 147571
36283 147571 280611 314747 246505 78735 -83815 -71243 154918 431129 563560 489159
36273 489159 251441 -55902 -275944 -261611 -54718 112772 82963 -56647 -137752 -128378
36263 -128378 -85125 -4228 143790 304268 389603 391105 342998 239799 89998 -15489 3410
36252 3410 108451 216493 304772 350717 268075 34057 -205147 -299444 -291397 -300605 -294117 -157153
36240 -157153 59480 167247 109749 17940 -17334 -47431 -105086 -117163 -56374 -46151 -212072
$$ packed form
36316i8896K04269K19090J09973j38399k66768j01472J54941J93773J9257j21487
36306A74281j29977j29242j76703j61553l7105O5474N0339Q794M7131J07535Q5465
36295i5561J1842j2608J6900K9163L66m4882r5530j24654o5409Q7698K18308K21938
36283A47571J33040L4136o8242j67770j62550J2572K26161K76211J32431p4401
36273D89159k37718l07343k20042J4333K06893J67490k9809j39610q1105R374
36263a28378M3253Q0897J48018J60478Q5335J502m8107j03199j49801j05487J8899
36252C410J05041J08042Q8279M5945q2642k34018k39204r4297Q047r208O488J36964
36240a57153K16633J07767n7498r1809l5274l0097n7655j2077O0789J0223j65921
$$ plain form
36229 -212072 -493159 -673451 -584016 -266294 37489 87071 -109974 -298060 -281372 -159444
36219 -159444 -152840 -269792 -302622 -130469 130478 292655 290394 193410 128101 190511 353034
36208 353034 471568 460378 411646 447673 523405 499406 342095 112267 -164627 -443825
36198 -443825 -556883 -381964 -82203 49329 -27848 -89728 -7101 118629 188365 225711
36188 225711 225164 126477 4628 45211 243729 355452 245050 75276 44931 143388 268676
36177 268676 380275 420368 295518 71779 -10816 139649 316038 314789 190863 71817
36167 71817 -60874 -224079 -276063 -120350 105390 244420 347699 480230 503382 313492
36157 313492 120439 181956 386915 419300 244874 106418 92527 59481 -17548 35760 252528
$$ packed form
36229b12072k81087j80292Q9435L17722L03783M9582j97045j88086J6688J21928
36219a59444O604j16952l2830J72153K60947J62177k261r6984o5309O2410J62523
36208C53034J18534j1190m8732L6027P5732k3999j57311k29828k76894k79198
36198d43825j13058J74919K99761J31532p7177o1880Q2627J25730O9736L7346
36188B25711n47r8687j21849M0583J98518J11723j10402j69774l0345R8457J25288
36177B68676J11599M0093j24850k23739q2595J50465J76389j249j23926j19046
36167G1817j32691j63205n1984J55713K25740J39030J03279J32531K3152j89890
36157C13492j93053O1517K04959L2385j74426j38456j3891l3046p7029N3308K16768
$$ plain form
36146 252528 413135 386370 319935 357359 392985 270722 51619 -87309 -102566 -78551 -52948
36135 -52948 14242 135268 259138 325850 301664 188472 41145 -45251 8391 221874 534997
36124 534997 793912 821492 598905 340969 273855 355709 349454 169579 -4719 -9192 70791
36113 70791 48875 -94138 -223918 -270981 -291078 -312304 -259415 -96016 47475 3376 -185792
36102 -185792 -267801 -92208 165303 200975 -38511 -309355 -393727 -315760 -202829 -100107
36092 -100107 -16171 -9497 -98228 -181544 -173134 -125803 -108914 -66827 57280 157158 100453 -40992
36080 -40992 -85920 -19748 19708 -907 17139 76509 54022 -56308 -84514 48947 197898
36069 197898 226120 207200 259239 327848 292720 183280 115713 81100 -22234 -160478 -145801
$$ packed form
36146B52528J60607k6765o6435L7424L5626j22263k19103j38928j5257K4015K5603
36135e2948O7190J21026J23870O6712k4186j13192j47327q6396N3642K13483L13123
36124E34997K58915K7580k22587k57936o7114Q1854o255j79875j74298m473P9983
36113G0791k1916j43013j29780m7063k0097k1226N2889J63399J43491m4099j89168
36102a85792q2009J75593K57511L5672k39486k70844q4372P7967J12931J02722
36092a00107Q3936O674q8731q3316Q410M7331J6889M2087J24107R9878n6705j41445
36080d0992m4928O6172L9456k0615J8046N9370k2487j10330k8206J33461J48951
36069A97898K8222j8920N2039O8609l5128j09440o7567l4613j03334j38244J4677
$$ plain form
36058 -145801 105963 431614 612122 619150 583722 582782 568427 493684 394735 317400 253997
36047 253997 198919 176524 151656 17341 -225879 -385078 -321021 -184043 -199177 -289522 -189879
36036 -189879 76253 167751 -35635 -206350 -72217 161303 165543 13055 12828 197751 336441
36025 336441 347994 342205 308869 142341 -33567 49577 335387 425655 154753 -151224 -157534
36014 -157534 31972 122307 74765 50070 69614 645 -185378 -348663 -358856 -203991 47460
36003 47460 287611 406961 378342 276543 171238 63813 -31073 -42219 42179 100307 14144
35992 14144 -166098 -270434 -195082 -481 141552 83106 -163333 -412515 -487935 -409110
35982 -409110 -327666 -309197 -294576 -257209 -244203 -238881 -136495 84085 287438 342324 261567
$$ packed form
36058a45801K51764L25651J80508P028l5428r40j4355p4743r8949p7335o3403
36047B53997n5078k2395k4868j34315k43220j59199O4057J36978j5134r0345R9643
36036a89879K66132R1498k03386j70715J34133K33520M240j52488k27J84923J38690
36025C36441J1553n789l3336j66528j75908Q3144K85810R0268k70902l05977o310
36014a57534J89506R0335m7542k4695J9544o8969j86023j63285j0193J54865K51451
36003D7460K40151J19350k8619j01799j05305j07425r4886j1146Q4398N8128q6163
35992A4144j80242j04336P5352J94601J42033n8446k46439k49182p5420P8825
35982d09110Q1444J8469J4621L7367J3006N322J02386K20580K03353N4886q0757
$$ plain form
35971 261567 142556 58760 33983 38829 15463 -7012 122743 454864 748716 719792 440315
35960 440315 245339 248585 240219 101179 -5115 36371 82245 13779 -52687 -24196 -27525
35949 -27525 -131600 -140813 68511 240120 75316 -296913 -499623 -422249 -248700 -91154
35939 -91154 73150 171997 83718 -95327 -128201 2064 76599 1819 -79570 -77265 -91024
35928 -91024 -179252 -218939 -109526 54369 121902 71239 -30744 -150372 -288779 -423828
35918 -423828 -498856 -446159 -246894 -12557 66946 -48347 -147713 -20409 262180 448074
35908 448074 409848 196775 -121267 -454365 -603865 -419749 -48039 193573 200532 146847
35898 146847 168771 205617 182594 127191 45883 -105712 -257811 -232144 -4680 215075 262887
$$ packed form
35971B61567j19011q3796k4777M846k3366k2475J29755L32121K93852k8924k79477
35960D40315j94976L246q366j39040j06294M1486M5874o8466o6466K8491l329
35949b7525j04075r213K09324J71609j64804l72229k02710P7374J73549J57546
35939i1154J64304R8847q8279j79045l2874J30265P4535p4780q1389K305j3759
35928i1024q8228l9687J09413J63895O7533n0663j01983j19628j38407j35049
35918d23828p5028N2697J99265K34337P9503j15293r9366J27304K82589J85894
35908D48074l8226k13073l18042l33098j49500J84116L71710K41612O959n3685
35898A46847K1924L6846k3023n5403q1308j51595j52099K5667K27464K19755M7812
$$ plain form
35887 262887 212239 190517 172931 93226 22626 79882 235242 337268 305855 209479 162948
35876 162948 196831 226373 154504 20725 -11087 124853 268005 236232 73002 -62230
35866 -62230 -162141 -319922 -470055 -439190 -255582 -145877 -183737 -195672 -76230 62727
35856 62727 140869 238317 355628 314523 68398 -128382 -60445 142521 238097 214585 190200
35845 190200 162288 107374 164252 429959 688558 643701 361159 188222 251267 318078 192165
35834 192165 -16577 -100458 -33144 61891 86897 34033 -26690 22983 235701 480812 539597
35823 539597 358190 121557 37757 118782 211792 195107 105510 79844 168047 223586 62058
35812 62058 -250683 -401427 -217868 70421 117548 -79102 -199882 -46876 243895 455536
$$ packed form
35887B62887n0648k1722j7586p9705p0600N7256J55360J02026l1413r6376m6531
35876A62948L3883K9542p1869j33779l1812J35940J43152l1773j63230j35232
35866f2230r9911j57781j50133L0865J83608J09705l7860j1935J19442J38957
35856F2727P8142R7448J17311m1105k46125j96780O7937K02966R5576k3512k4385
35845A90200k7912n4914N6878K65707K58599m4857k82542j72937O3045O6811j25913
35834A92165k08742q3881O7314R5035K5006n2864o0723M9673K12718K45111N8785
35823E39597j81407k36633q3800Q1025R3010j6685q9597k5666Q8203N5539j61528
35812F2058l12741j50744J83559K88289M7127j96650j20780J53006K90771K11641
$$ plain form
35802 455536 553015 610655 635346 584525 478104 389460 360700 386293 444322 496269 486788
35791 486788 387824 233146 89317 -1145 -45073 -71422 -69410 32606 272782 537807 629807
35780 629807 495898 298381 190148 129210 25869 -37078 90456 348770 487331 376306
35770 376306 146754 -5211 -17994 58108 144983 153173 39903 -93292 -72705 115965 268188
35759 268188 200184 -37244 -251062 -336248 -343040 -370916 -459578 -551240 -530172 -346659 -115331
35748 -115331 -15152 -69079 -117717 -55423 15874 -46853 -199008 -267997 -199281 -118098 -141054
35737 -141054 -231585 -282713 -267990 -242200 -223260 -155503 -19645 82566 34025 -118609 -187248
35726 -187248 -79200 79275 123164 65761 33830 57873 65310 48480 87492 195853 275354
$$ packed form
35802D55536R7479N7640K4691n0821j06421q8644k8760K5593N8029N1947r481
35791D86788r8964j54678j43829r0462m3928k6349K012J02016K40176K65025R2000
35780F29807j33909j97517j08233o0938j03341o2947J27534K58314J38561j11025
35770C76306k29552j51965j2783P6102Q6875Q190j13270j33195K0587J88670J52223
35759B68188o8004k37428k13818q5186o792k7876q8662r1662K1068J83513K31328
35748a15331J00179n3927m8638O2294P1297o2727j52155o8989O8716Q1183k2956
35737a41054r0531n1128J4723K5790J8940O7757J35858J02211m8541j52634o8639
35726a87248J08048J58475M3889n7403l1931K4043P437j6830L9012J08361P9501
$$ plain form
35715 275354 250400 139941 -12189 -162429 -225135 -147277 -33334 -33105 -87557 14263 271327
35704 271327 394638 218550 -29227 -47692 132474 275132 307391 309419 262608 103533
35694 103533 -35668 46902 259481 286713 68859 -93949 -11087 130959 132676 122135 279221
35683 279221 442123 309140 -74052 -340190 -289649 -81814 76015 169961 240725 232452
35673 232452 104260 -60862 -170786 -231608 -258832 -213655 -123757 -129396 -281162 -415068 -379704
35662 -379704 -274135 -272003 -300949 -138878 196536 420581 399604 341709 435045 515537 312480
35651 312480 -107330 -391377 -363506 -205836 -147430 -173673 -142359 -39323 26849 18898 16910
35640 16910 65086 83368 -7261 -123769 -72314 212614 533977 606470 363817 27236 -151277
$$ packed form
35715B75354k4954j10459j52130j50240o2706P7858J13943K29n4452J01820K57064
35704B71327J23311j76088k47777j8465J80166J42658L2259K028m6811j59075
35694A03533j39201Q2570K12579K7232k17854j62808Q2862J42046J717j0541J57086
35683B79221J62902j32983l83192k66138N0541K07835J57829R3946P0764q273
35673B32452j28192j65122j09924o0822k7224M5177Q9898n639j51766j33906L5364
35662c79704J05569K132k8946J62071L35414K24045k0977n7895R3336Q0492k03057
35651C12480m19810k84047K7871J57670N8406k6243L1314J03036O6172p951j988
35640A6910M8176J8282r0629j16508N1455K84928L21363P2493k42653l36581j78513
$$ plain form
35629 -151277 -143298 -100598 -137595 -244815 -369569 -472628 -512141 -470979 -415354 -445124 -565564
35618 -565564 -674141 -684064 -595130 -447315 -294877 -229830 -314475 -452760 -443980 -231142 2928
35607 2928 63673 -24930 -108586 -127415 -128791 -122942 -72616 -5094 1833 -49365 -77424 -63637
35595 -63637 -72239 -107342 -75970 53699 173451 192267 171998 203902 231572 134793 -42663
35584 -42663 -100274 52421 258616 311575 196576 44130 -86928 -244677 -415603 -474243
35574 -474243 -369535 -245660 -263395 -371155 -385752 -260329 -113216 8654 204224 483302
35564 483302 642310 528491 295709 201119 229288 151037 -61850 -141522 74556 371671
35554 371671 441488 278254 107695 27103 -70494 -244494 -386012 -391107 -300949 -204830 -120537
$$ packed form
35629a51277P979M2700l6997j07220j24754j03059l9513M1162N5625k9770j20440
35618e65564j08577r923Q8934J47815J52438O5047q4645j38285Q780K12838K34070
35607B928O0745q8603q3656j8829j376N849N0326O7522O927n1198k8059J3787
35595f3637q602l5103L1372J29669J19752J8816k0269L1904K7670r6779j77456
35584d2663n7611J52695K06195N2959j14999j52446j31058j57749j70926n8640
35574d74243J04708J23875j7735j07760j4597J25423J47113J21870J95570K79078
35564D83302J59008j13819k32782r4590K8169p8251k12887p9672K16078K97115
35554C71671O9817j63234j70559q0592r7597j74000j41518n095R0158R6119Q4293
$$ plain form
35543 -120537 -44454 -25421 -97258 -194033 -218266 -164826 -108379 -91726 -96535 -111844 -151745 -186612
35531 -186612 -130405 42565 201278 161816 -80660 -283679 -201560 109445 324005 228657
35521 228657 -20516 -115099 2515 106552 47878 -38549 33741 217535 321059 283838
35511 283838 200437 124149 26545 -55516 -17722 122207 197454 129186 41339 41356 40652 -50554
35499 -50554 -77331 183076 633176 880820 713363 360844 185828 259749 384137 423024
35489 423024 431584 478721 515868 478727 407227 379997 381205 309814 112671 -143269 -339980
35478 -339980 -419570 -412921 -374264 -313196 -208482 -82332 -24213 -102350 -256121 -323597 -209817
35467 -209817 -8228 86259 -12316 -195886 -303050 -297469 -252189 -189793 -45850 165441 252002
$$ packed form
35543a20537P6083J9033p1837r6775k4233N3440N6447J6653m809j5309l9901l4867
35531a86612N6207J72970J58713l9462k42476k03019Q2119L11005K14560r5348
35521B28657k49173r4583J17614J04037n8674q6427P2290J83794J03524l7221
35511B83838q3401p6288r7604q2061L7794J39929P5247o8268q7847J7p04r1206
35499e0554k6777K60407M50100K47644j67457l52519j75016P3921J24388L8887
35489D23024Q560M7137L7147l7141p1500k7230J208p1391j97143k55940j96711
35478c39980p9590O649L8657O1068J04714J26150N8119p8137j53771o7476J13780
35467b09817K01589R4487r8575j83570j07164N581M5280O2396J43943K11291Q6561
$$ plain form
35456 252002 38126 -362116 -602058 -483576 -181382 -11759 -59875 -146947 -120835 -38174
35446 -38174 -32994 -119093 -194718 -186210 -119068 -65150 -62519 -84651 -77806 -40409 -49846 -164143
35434 -164143 -309297 -342693 -241428 -135047 -114314 -115787 -73099 -69726 -203185 -370754 -366776
35423 -366776 -181663 -29934 -48842 -132830 -131911 -56824 18813 121003 288840 421234 391041
35412 391041 279255 314800 550984 750552 666718 344040 58424 9322 145372 276325
35402 276325 290298 230938 183889 146716 67241 -13516 33718 226200 373214 289782 50551
35391 50551 -93707 -27030 132455 234436 250980 200646 65945 -133864 -293365 -333168
35381 -333168 -291787 -238902 -174873 -93616 -66988 -159206 -297656 -333574 -225564 -84983 -35264
$$ packed form
35456B52002k13876m00242k39942J18482L02194J69623m8116q7072K6112Q2661
35446c8174N180q6099p5625Q508O7142N3918K631k2132O845L7397r437j14297
35434a64143j45154l3396J01265J06381K0733j473M2688L373j33459j67569L978
35423c66776J85113J51729j8908q3988R19P5087P5637J02190J67837J32394l0193
35412C91041j11786L5545K36184J99568q3834l22678k85616m9102J36050J30953
35402B76325J3973n9360m7049l7173p9475q0757M7234J92482J47014q3432k39231
35391E0551j44258O6677J59485J01981J6544n0334j34701j99809j59501l9803
35381c33168M1381N2885O4029Q1257K6628r2218j38450l5918J08010J40581M9719
$$ plain form
35370 -35264 -83317 -138261 -121220 -48105 -9070 -51978 -100787 -43748 105303 224947 284856
35359 284856 406937 652612 856833 801376 502776 205761 107719 190594 312929 365708
35349 365708 327077 247975 208606 238818 276210 244461 159074 104886 125552 190324 254626
35338 254626 298407 319057 336744 386195 454162 457834 347292 197538 125612 138106 137132 69522
35326 69522 875 33404 187057 355859 373501 173105 -99895 -213787 -120881 5141
35316 5141 47066 101861 254070 366999 289901 137024 125580 229691 254325 189524 197379
35305 197379 262113 172815 -91897 -273137 -232737 -153387 -187251 -180259 40888 328462 409103
35294 409103 275072 148513 152474 220084 255792 211702 74251 -72984 -58565 155293 359965
$$ packed form
35370c5264m8053n4944J7041P3115L9035m2908m8809N7039J49051J19644N9909
35359B84856J22081K45675K04221n5457k98600k97015r8042Q2875J22335N2779
35349C65708l8631p9102l9369L0212L7392l1749q5387n4188K0666O4772O4302
35338B54626M3781K0650J7687M9451O7967L672j10542j49754p1926J2494r74o7610
35326F9522o8647L2529J53653J68802J7642k00396k73000j13892R2906J26022
35316E141M1925N4795J52209J12929p7098j52877j1444J04111K4634o4801P855
35305A97379O4734q9298k64712j81240M0400P9350l3864O992K21147K87574Q0641
35294D09103j34031j26559L961O7610L5708m4090j37451j47235J4419K13858K04672
$$ plain form
35283 359965 368173 279816 291335 358165 292117 121957 80249 232049 376715 368697 304669
35272 304669 304604 307047 212256 88575 83304 183469 194132 -20025 -324506 -408385 -136879
35261 -136879 223235 254832 -103451 -460151 -468363 -233461 -50806 74254 346720 713860
35251 713860 833157 561723 182525 28220 110794 247913 343429 380741 307638 120594
35241 120594 -31679 -1147 148559 217756 131316 12804 -1638 57094 30530 -160292 -374788
35230 -374788 -387513 -198865 -103715 -323929 -662787 -724640 -441357 -141293 -70943 -107369
35220 -107369 -45936 69593 78186 -13829 -73768 -59675 -27254 975 30091 27059 -13134 -4256
35208 -4256 114032 264096 335395 323910 276518 194974 93114 36982 20388 -69826 -239522
$$ packed form
35283C59965Q208q8357J1519O6830o6048j70160m1708J51800J44666q018o4028
35272C04669o5K443r4791j23681n271J00165J0663k14157l04481q3879K71506
35261a36879L60114L1597l58283l56700q212K34902J82655J25060K72466L67140
35251G13860J19297k71434l79198j54305Q2574J37119R5516L7312p3103j87044
35241A20594j52273L0532J49706O9197q6440j18512j4442N8732k6564j90822k14496
35230c74788j2725J88648R5150k20214l38858o1853K83283L00064P0350l6426
35220a07369O1433J15529Q593r2015n9939J4093L2421K8229K9116l032m0193Q878
35208d256J18288J50064P1299j1485m7392q1544j01860n6132j6594r0214j69696
$$ plain form
35197 -239522 -292028 -119123 61458 -18426 -276891 -404339 -311087 -191652 -176568 -182922 -120540
35186 -120540 -7543 142775 325633 414448 266389 4547 -46954 211343 516319 616011
35176 616011 553100 463300 324864 80322 -173839 -301769 -301194 -217972 -40120 165895 185506
35165 185506 -59437 -287747 -170904 202671 419292 265474 -68539 -302377 -347900 -246463
35155 -246463 -55248 111110 107036 -57652 -182261 -127406 5761 49019 15865 45725 160723
35144 160723 222535 137813 -2527 -37496 61681 156424 108648 -50560 -159914 -136518 -81597
35133 -81597 -123351 -209646 -164926 50785 258086 278497 142291 6912 -55143 -92619 -140840
35122 -140840 -153865 -81694 51262 169767 223531 234290 278557 401719 529789 509880 290954
$$ packed form
35197b39522n2506J72905J80581p9884k58465j27448R3252J19435J5084o354O2382
35186a20540J12997J50318J82858Q8815j48059k61842n1501K58297L04976R9692
35176F16011o2911q9800j38436k44542k54161j27930N75Q3222J77852K06015J9611
35165A85506k44943k28310J16843L73575K16621j53818l34013k33838m5523J01437
35155b46463J91215J66358m074j64688j24609N4855J33167M3258l3154K9860J14998
35144A60723O1812q4722j40340l4969R9177R4743m7776j59208j09354K3396N4921
35133h1597m1754q6295M4720K15711K07301K0411j36206j35379o2055l7476m8221
35122a40840j3025P2171J32956J18505N3764J0759M4267J23162J28070j9909k18926
$$ plain form
35111 290954 31631 -49166 71790 188208 102650 -171094 -473988 -688778 -782170 -714547
35101 -714547 -441874 -52121 199542 106136 -244568 -527929 -523370 -338473 -245845 -351799
$$ packed form
35111B90954k59323q0797J20956J16418q5558k73744l02894k14790r3392O7623
35101g14547K72673L89753K51663r3406l50704k83361M559J84897R2628j05954
$$ [...]
##END NTUPLES=NMR SPECTRUM
##END=
