##TITLE=31Pdec_2PDM3005
 CDCl3, 24 sc
 31.5.2019
##JCAMPDX= 6.0         $$ Bruker NMR JCAMP-DX V2.0
##DATA TYPE= NMR SPECTRUM
##DATA CLASS= NTUPLES
##ORIGIN= UXNMR, Bruker Analytische Messtechnik GmbH
##OWNER= root
$$ XWIN-NMR		Version 3.5
$$ Fri May 31 12:34:32 2019 Russian Standard Time (UT+4h)  she@DPX200
##.OBSERVE FREQUENCY= 81.013821
##.OBSERVE NUCLEUS= ^31P
##.ACQUISITION MODE= SIMULTANEOUS
##.ACQUISITION SCHEME= undefined
##.AVERAGES= 24
##.DIGITISER RES= 17
##SPECTROMETER/DATA SYSTEM= spect
##.PULSE SEQUENCE= zgpg30
##.SOLVENT NAME= CDCl3
##.SHIFT REFERENCE= (INTERNAL, CDCl3, 0, 182.463)
##AUDIT TRAIL= $$ (NUMBER, WHEN, WHO, WHERE, WHAT)
$$ ##TITLE= Audit trail, XWIN-NMR		Version 3.5
$$ ##JCAMPDX= 5.01
$$ ##ORIGIN= Bruker BioSpin GmbH
$$ ##OWNER= she
$$ F:/spectra/data/she/nmr/P31/1/pdata/1/auditp.txt
$$ ##AUDIT TRAIL=  $$ (NUMBER, WHEN, WHO, WHERE, WHAT)
(   1,<2019-05-31 12:33:28.82 +0400>,<she>,<DPX200>,
      <created by zg, POWCHK disabled, PULCHK disabled
       configuration hash MD5:
       00 E9 B6 7A A2 85 ED C7 34 08 36 98 17 FE 4E 26
       data hash MD5: 32K
       09 C0 65 94 93 18 4F 02 35 B8 7C 57 F9 BB CE 14>)
(   2,<2019-05-31 12:33:31.34 +0400>,<she>,<DPX200>,
      <Start of raw data processing
       efp BC_mod = 2 LB = 1 FT_mod = 6 PKNL = 1 PHC0 = -2186.454 PHC1 = 68.7991 SI = 64K 
       data hash MD5: 64K
       30 26 5B 50 99 B1 72 46 BB 6E 67 F6 2D 8C 42 49>)
(   3,<2019-05-31 12:33:54.60 +0400>,<she>,<DPX200>,
      <pk PHC0 = 12.30372 PHC1 = 0 
       data hash MD5: 64K
       C1 99 A2 94 AB 05 59 5A 5C 7F 2F 31 F6 E4 47 46>)
(   4,<2019-05-31 12:33:57.96 +0400>,<she>,<DPX200>,
      <abs ABSG = 5 
       data hash MD5: 64K
       DD 8F 7F B8 E5 35 13 5A A1 6B 5B D4 6A E8 70 B4>)
$$ ##END=
$$ 
$$ hash MD5
$$ 04 0B C0 C6 A7 CF D1 82 CD C8 12 F7 A1 CB 2D 52
##$RELAX= 
##$RELAX= 
##$RELAX= 
##$RELAX= 
##$RELAX= 
##$RELAX= 
##$RELAX= 
##$RELAX= 
$$ Bruker specific parameters
$$ --------------------------
##$DU= <F:/spectra>
##$EXPNO= 1
##$NAME= <P31>
##$PROCNO= 1
##$TYPE= <nmr>
##$USER= <she>
##$AMP= (0..31)
100 100 100 100 100 100 100 100 100 100 100 100 100 100 100 100 100 100 
100 100 100 100 100 100 100 100 100 100 100 100 100 100 
##$AQSEQ= 0
##$AQ_mod= 1
##$AUNM= <au_zg>
##$AUTOPOS= <>
##$BF1= 81.014009
##$BF2= 200.13
##$BF3= 200.13
##$BF4= 200.13
##$BF5= 200.13
##$BF6= 200.13
##$BF7= 200.13
##$BF8= 200.13
##$BYTORDA= 1
##$CFDGTYP= 0
##$CFRGTYP= 5
##$CHEMSTR= <none>
##$CNST= (0..31)
1 1 145 1 1 1 1 1 1 1 1 1 1 1 1 1 1 1 1 1 1 1 1 1 1 1 1 1 1 1 1 1 
##$CPDPRG= <waltz16>
##$CPDPRG1= <>
##$CPDPRG2= <waltz16>
##$CPDPRG3= <>
##$CPDPRG4= <mlev>
##$CPDPRG5= <mlev>
##$CPDPRG6= <mlev>
##$CPDPRG7= <mlev>
##$CPDPRG8= <mlev>
##$CPDPRGB= <>
##$CPDPRGT= <>
##$D= (0..31)
0 1 0 0 0 0 0 0 0 0 0 0.03 2e-05 3e-06 0 0 0 0 0 0 0 0 0 0 0 0 0 0 0 0 
0 0 
##$DATE= 1559291608
##$DBL= (0..7)
120 120 120 11 120 120 24 19 
##$DBP= (0..7)
150 150 150 150 150 150 150 150 
##$DBP07= 0
##$DBPNAM0= <>
##$DBPNAM1= <>
##$DBPNAM2= <>
$$ [...]
##$SUBNAM3= <"">
##$SUBNAM4= <"">
##$SUBNAM5= <"">
##$SUBNAM6= <"">
##$SUBNAM7= <"">
##$SUBNAM8= <"">
##$SUBNAM9= <"">
##$SW= 369.568048894756
##$SWIBOX= (0..15)
0 1 3 0 0 0 0 0 0 0 0 0 0 0 0 0 
##$SW_h= 29940.119760479
##$TD= 32768
##$TD0= 1
##$TE= 0
##$TE2= 300
##$TE3= 300
##$TEG= 300
##$TL= (0..7)
0 120 53 12 22 120 120 120 
##$TP= (0..7)
150 150 150 150 150 150 150 150 
##$TP07= 0
##$TPNAME0= <>
##$TPNAME1= <>
##$TPNAME2= <>
##$TPNAME3= <>
##$TPNAME4= <>
##$TPNAME5= <>
##$TPNAME6= <>
##$TPNAME7= <>
##$TPOAL= (0..7)
0.5 0.5 0.5 0.5 0.5 0.5 0.5 0.5 
##$TPOFFS= (0..7)
0 0 0 0 0 0 0 0 
##$TUNHIN= 0
##$TUNHOUT= 0
##$TUNXOUT= 0
##$USERA1= <user>
##$USERA2= <user>
##$USERA3= <user>
##$USERA4= <user>
##$USERA5= <user>
##$V9= 5
##$VALIST= <valist>
##$VCLIST= <CCCCCCCCCCCCCCC>
##$VD= 0
##$VDLIST= <DDDDDDDDDDDDDDD>
##$VPLIST= <PPPPPPPPPPPPPPP>
##$VTLIST= <TTTTTTTTTTTTTTT>
##$WBST= 1024
##$WBSW= 4
##$XGAIN= (0..3)
0 0 0 0 
##$XL= 0
##$YL= 0
##$YMAX_a= 105707
##$YMIN_a= -113996
##$ZGOPTNS= <>
##$ZL1= 120
##$ZL2= 120
##$ZL3= 120
##$ZL4= 120
##$ABSF1= 182.463
##$ABSF2= -187.1042
##$ABSG= 5
##$ABSL= 3
##$ALPHA= 0
##$AQORDER= 0
##$ASSFAC= 0
##$ASSFACI= 0
##$ASSFACX= 0
##$ASSWID= 0
##$AUNMP= <proc_1d>
##$AZFE= 0.1
##$AZFW= 0.5
##$BCFW= 0
##$BC_mod= 2
##$BYTORDP= 0
##$COROFFS= 0
##$CY= -3
##$DATMOD= 1
##$DC= 0
##$DFILT= <>
##$DTYPP= 0
##$F1P= 0
##$F2P= 0
##$FCOR= 1
##$FTSIZE= 65536
##$FT_mod= 6
##$GAMMA= 0
##$GB= 0
##$INTBC= 1
##$INTSCL= 5.30512e-09
##$ISEN= 30
##$LB= 1
##$LEV0= 0
##$LPBIN= 0
##$MAXI= 10000
##$MC2= 0
##$MEAN= 0
##$ME_mod= 0
##$MI= 50
##$NCOEF= 0
##$NC_proc= -2
##$NLEV= 6
##$NOISF1= 182.463
##$NOISF2= 159.3651
##$NSP= 0
##$NTH_PI= 0
##$NZP= 0
##$OFFSET= 182.463
##$PC= 4
##$PHC0= -2174.15
##$PHC1= 68.7991
##$PH_mod= 1
##$PKNL= yes
##$PPARMOD= 0
##$PSCAL= 0
##$PSIGN= 0
##$REVERSE= no
##$SF= 81.0140089999434
##$SI= 65536
##$SIGF1= 159.3651
##$SIGF2= -187.1042
##$SINO= 113.3802
##$SIOLD= 16384
##$SREGLST= <1H.CDCl3>
##$SSB= 0
##$STSI= 65536
##$STSR= 0
##$SW_p= 29940.119760479
##$SYMM= 0
##$S_DEV= 0
##$TDeff= 32768
##$TDoff= 0
##$TI= <>
##$TILT= no
##$TM1= 0
##$TM2= 0
##$TOPLEV= 0
##$USERP1= <user>
##$USERP2= <user>
##$USERP3= <user>
##$USERP4= <user>
##$USERP5= <user>
##$WDW= 1
##$XDIM= 65536
##$YMAX_p= 335020880
##$YMIN_p= -2626274
$$ End of Bruker specific parameters
$$ ---------------------------------
##NTUPLES= NMR SPECTRUM
##VAR_NAME=  FREQUENCY,     SPECTRUM/REAL,   SPECTRUM/IMAG
##SYMBOL=    X,             R,               I
##VAR_TYPE=  INDEPENDENT,   DEPENDENT,       DEPENDENT
##VAR_FORM=  AFFN,          ASDF,            ASDF
##VAR_DIM=   65536,         65536,           65536
##UNITS=     HZ,            ARBITRARY UNITS, ARBITRARY UNITS
##FACTOR=    0.456856943014862, 1,           1
##FIRST=     14782.0589164792, 0,            0
##LAST=      -15158.0608439998, 0,           0
##MIN=       -15158.0608439998, -2626274,    0
##MAX=       14782.0589164792, 335020880,    0
$$ Real data points
##PAGE= N=1
##DATA TABLE= (X++(R..R)), XYDATA
$$ [...]
41540A57934j08155q1288m5981j2804L3920O2636M4139J1268m621k7299o2485
41529c2736n4210J6146P2081N5434J1058j1004l6398p0089l8000O6499R7202m0991
41517C4992k03105j84650j6764R5475P7158L7985M7229M8330J1026r840j812k1413
41505h5389n4597q186J08265J49720N7080l8255k2576K8442J590n6562l8146K4753
41493F6139J7608n3878p8910l4823r695l0294j8856M7439P5309J4507m2263j196
41481d8913Q5140J04724M7840j3786n0272p3870o5581j4763N554o8982j49324
41470b42233q8742P5120J41644M8727k7931L7686J17750N8518m6373j1541J15878
41459A78503J17913m8176j89662j71697o8334J1376N9872Q1242L7541m5651o8856
$$ y = [157934, 49779, -31509, -77490, -90294, -56374, 6262, 50401, 61669, 57048, 29749, -32736, -86946, -70800, 1281, 56715, 67773, 56769, 20371, -49718, -87718, -21219, 75983, 34992, -168113, -352763, -369527, -274052, -196894, -158909, -111680, -63350, -52324, -62164, -63976, -85389, -139986, -148172, -39907, 109813, 166893, 128638, 106062, 134504, 136094, 79532, 41386, 66139, 83747, 29869, -49041, -83864, -93559, -123853, -142709, -95270, -19961, -5454, -47717, -48913, 36227, 140951, 188791, 175005, 124733, 50863, -14718, -29481, -23927, -92909, -242233, -330975, -255855, -114211, -65484, -93415, -55729, 62021, 120539, 74166, 62625, 178503, 296416, 248240, 58578, -113119, -181453, -170077, -110205, -28963, 8578, -37073, -105929]
41448a05929j9491j875m9061n9260J1138N6960J8517q76O9497J14520K4943r3104
41436c4021o9287O9960J56532J21725L1376n3290j07129r3730j9127K6757q77
41425B8889j2743N2470Q6541q598j10408m8149R8027J01809m9082j38849o7679
41414f7772K6193K4861o321J7528N8475N9706M4274L5435K715n2665p3647n4659
41402A4123n8215q8047o9573M412L8564m858l7557L397N2825L3756k2666l9111
41390a72950M274P4836J26488J11243K7480l9980j5936M3260L3376k0052j3290
41379A58749K9281j5973j31584j52584m0692M2880O550l5296J3809P2757N9378
41368G275L5313M9176K3017o4875p5358M8126J21735O414j27806o3282R0612O7594
$$ y = [-105929, -125420, -127295, -176356, -235616, -224478, -167518, -149001, -149877, -80380, 34140, 59083, -34021, -103308, -33348, 123184, 244909, 276285, 222995, 115866, 22136, 3009, 29766, 28889, 16146, 68616, 155157, 146559, 36151, -11998, 86029, 187838, 138756, -93, -67772, -41579, -16718, -23039, -5511, 52964, 112670, 156944, 192379, 195094, 142429, 68782, 14123, -44092, -132139, -201712, -197300, -158736, -163594, -201151, -197754, -144929, -111173, -133839, -172950, -168676, -93840, 32648, 143891, 171371, 131391, 115455, 158715, 192091, 172039, 158749, 188030, 172057, 40473, -112111, -152803, -109923, -103373, -138669, -124860, -52103, 7275, 42588, 91764, 114781, 49906, -25452, 22674, 144409, 150823, 23017, -40265, 50347, 117941]
41356A17941j08609j57703O67J27874N3627q2686q3129K1791P1214K1612l7258
41345e4659l8303O09L9010O3888P9335P8918M0282l8629j00597p5823J2750N7290
41333F4071J4113l6308k9479j6369m4056m8042K1227O9885N462p9733m2837O0663
41321f1403N7199n4502j02386k8134L3711l212n2422l0386J8146M2637P4898J14966
41309I112Q0561l6876j06849n4917R153k2015o3053J8061J57297J71209L4916
41298A96599q2979o6943P501J8821l1983o0893l5204M806K7456M6748P3023P5487
41286A72439K7077l5498m4599P14K3084j8546n8252k2971M4150M2271l0409p2611
41274B6849l3408K2140K0482k8104p1917q2264m8977K1442P8355O4780N397j4571
$$ y = [117941, 9332, -148371, -147704, -19830, 33797, -48889, -132018, -110227, -39013, -17401, -54659, -92962, -92353, -53343, 10545, 89880, 168798, 209080, 170451, 69854, -5969, 6781, 64071, 78184, 41876, 12397, -3972, -48028, -96070, -74843, -4958, 504, -79229, -122066, -61403, -4204, -58706, -161092, -189226, -155515, -158727, -211149, -241535, -223389, -180752, -105854, 9112, 89673, 52797, -54052, -108969, -99816, -121831, -184884, -166823, -9526, 161683, 196599, 113620, 46677, 54178, 72999, 41016, -19877, -55081, -50275, -22819, 23929, 96952, 172439, 199516, 164018, 119419, 120133, 143217, 124671, 66419, 43448, 87598, 129869, 99460, 26849, -6559, 15581, 36063, 7959, -63958, -146222, -195199, -173757, -95402, -30622, -25225, -39796]
41262c9796K1877M1467J4714Q932N5887P4463O696o6856n2833l287k1259p0336
41250c0331k9444Q5924J17874N552j13274r9487N004P1434O9064N7938N5530J8647
41238B14431n7626j14955j15455q2152m1854J1962P5611J06464P3598M311n0626
41227B3709o9250m8903J5422R5789J09989J0060j16070j16801K4006J40298R1087
41216A59336n1600j04369k1348O2959L9952l2418m3286K284J2279l7131p0545
41205h3887l8950P025K776l2544l5419K860L5240L8949L4343K6396n725m4513
41193i3449k8864M7457R5803N2013j8198j6486K5063j0468j19725j46384m429
41182b17667J71655J90314N1862o9589o5946r164r439n4000m9669K2179P2134
$$ y = [-39796, -17919, 23548, 38262, 47194, 103081, 177544, 184240, 117384, 64551, 61264, 40005, -30331, -59775, 26149, 144023, 149575, 36301, -63186, -58182, 13252, 82316, 140254, 195784, 214431, 156805, 41850, -73605, -155757, -197611, -185649, -110038, -3574, 70024, 74335, 23709, -45541, -94444, -79022, 16767, 126756, 136816, 20746, -96055, -72049, 68249, 159336, 107736, 3367, -17981, 44978, 84930, 52512, 9226, 11510, 23789, -13342, -83887, -122837, -115812, -113036, -145580, -180999, -178139, -142899, -103950, -69607, -43211, -48936, -93449, -122313, -74856, 20947, 72960, 54762, 38276, 63339, 52871, -66854, -213238, -217667, -46012, 144302, 196164, 126575, 60629, 51465, 42026, -11974, -61643, -39464, 32670]
41171C2670K9788n7024q8649m3564J3508L8374N1335O4289M5544j720p219N2217
41159A29549Q3412J6160n9222k0531P3488N7943o9401j32089n1058M2230L0047
41148A00528k3926k4594r950m3877p1907k3762L5380k60r5407j18476k4685J11671
41136a89265K01115J84893M3636j39474j95957o5150R5968J09200R003m5432j6225
41125g688N173k0407m8332o5984r1427q5453p549P2268O1533P971K1143P3335
41113h5417N1865k3573k9724K8018J8429o9384r1949j561O9546L1769l9028o1251
41101b02260n3190k0532P8637J89942J73273L6965l2386L2639N8701o9287j96307
41090c805j50561k1796J2136j9035K1360R9225P3667k9031m3263N3484J02159
$$ y = [32670, 62458, 5434, -83215, -126779, -113271, -74897, -23562, 40727, 86271, 84551, 77332, 129549, 212961, 229121, 169899, 149368, 222856, 280799, 211398, 79309, 28251, 70481, 100528, 76602, 52008, 42058, -1819, -73726, -97488, -62108, -62368, -157775, -276251, -300936, -189265, 11850, 196743, 240379, 100905, -95052, -160202, -64234, 44966, 53969, 8537, -7688, -2515, -22922, -71254, -137238, -228665, -314118, -321667, -249399, -187866, -179895, -158752, -85417, -33552, -57125, -86849, -58831, -40402, -109786, -201735, -203296, -133750, -101981, -141009, -202260, -255450, -275982, -197345, -7403, 165870, 202835, 170449, 203088, 261789, 192502, -3805, -154366, -176162, -164026, -183061, -161701, -62476, 11191, -17840, -61103, -7619, 94540]
41079I4540K3068p0879o4196O323L9493K724o7896j18288r8089l8J06148J38161
41067h929R9710N5857K3629l5740j16599j41999o3377O4095J32962R0534j0828
41056H9315o3190j7521N1910L6614n3857r7715l5585M9059O7011M5552M2087K6826
41044A40506m5597j14917q6679Q122M3470j5218o1503q048Q6263R5139r143j14745
41032h2350j01385R276P4724K0096n5699l0761M4164K6606p1844q8164K3667J07713
41020a23957N8296j7549J916N0946J3578o5724o6264R885P4253J06285J27948
41009A69613J05006K0798l1035J7539N9566k9597j57701j31840L6950J47094J06517
40998C12910K1713j5959l9390p3576p3594m2319n5403j16218j21154k2628R0356
$$ y = [94540, 117608, 46729, -17467, -11144, 28349, 31073, -36823, -155111, -253200, -253238, -147090, -8929, 90781, 146638, 170267, 134527, 17928, -124071, -187448, -123353, 9609, 100143, 89315, 26125, 8604, 60514, 97128, 43271, -54444, -90029, -40970, 26041, 71593, 113680, 140506, 94909, -20008, -106687, -98565, -55095, -70313, -131816, -139864, -53601, 41538, 32395, -82350, -183735, -174459, -99735, -79639, -135338, -166099, -121935, -95329, -167173, -255337, -231670, -123957, -65661, -83210, -81294, -30348, -16770, -82494, -148758, -138873, -64620, 41665, 169613, 274619, 295417, 264382, 281921, 341487, 311890, 154189, 22349, 59299, 206393, 312910, 334623, 318664, 279274, 205698, 132104, 89785, 34382, -81836, -202990, -225618, -135262]
40987a35262J21636P5835L476o3160r3036o8785l3018l5601m0892J2628Q2246
40976a73933P7201K5957L7523J01385R4009J206m4155J0207M8343l847m9344J114
40964A25666O5784K4792r1455j59034j27562l7925N9084J22701J19495O4716J5988
40953A82250j0135n0563j03191j09594n7635p051J4773M1243O7580M1384j8761
40942i700k6593J3760N37o5800m4885R8782J87078Q5762q3793j34003p6823m1067
40930i6745m2852j7649P551l7608j00975o9741L2281P5716L7401K2268P3663J10482
40918f208P3010O465k5994j3795K9881P7088O7218k4099j05362o5107N3597R0404
40906A57098p030j12892j09956l2935K5204M7134N9555M8392o626n6903k8430
$$ y = [-135262, -13626, 62209, 65685, 2525, -90511, -159296, -192314, -227915, -268807, -256179, -173933, -96732, -70775, -33252, 68133, 162142, 163348, 119193, 129400, 177743, 173896, 124552, 125666, 191450, 216242, 124787, -34247, -161809, -199734, -140650, -17949, 101546, 166262, 182250, 172115, 121552, 18361, -91233, -148868, -155919, -141146, -99903, -32323, 9061, -9700, -36293, -22533, -21996, -87796, -132681, -33899, 153179, 238941, 155148, 21145, -55678, -96745, -139597, -157246, -149695, -187303, -288278, -358019, -325738, -250022, -212621, -190353, -116690, -6208, 66802, 73267, 47273, 33478, 63359, 140447, 207665, 183566, 78204, 13097, 66694, 157098, 150068, 37176, -72780, -105715, -80511, -33377, 26178, 74570, 67944, 11041, -17389]
40895a7389O9349J38103J00481j7600j18669j27837n4221K7648N2552K2190j0258
40884F4349n076K4091L2802o11m6728n2587j997N8349O6556J4646m6706o7966
40872C9122m6612j8680k2884o3612r3435n4993L7125R3323O5266J6558J8089L0110
40860f23j7741p7993m5908N1604P4279j1893q1733n4773m428m474j1825J5561
40848a69947K2177j9986j7530Q6992J72148R7398p0758j40292n6061N3775O7612
40837B5528r381r8903j27740o6978L3971P7866L6841j3063k0626l1595o4707l4548
40825b93335R2079J81304J17337l238k6395J1421j5808o5605p031R3746L6029
40814A20504j59692k27731n5194J39611J33794l221p0233j9651O0931J17161J33959
$$ y = [-17389, 51960, 190063, 290544, 272944, 154275, 26438, -27783, -135, 52417, 74607, 64349, 59273, 83364, 116166, 115555, 68827, 16240, 14243, 72592, 139148, 153794, 107088, 39122, -7490, -26170, -49054, -112666, -206101, -261094, -223969, -130646, -65380, -48822, -30733, -623, -18364, -96357, -142265, -90661, -16382, -28275, -110008, -164781, -169209, -173683, -185508, -169947, -147770, -167756, -185286, -98294, 73854, 171252, 100494, -39798, -95859, -42084, 25528, 16147, -82756, -210496, -277474, -243503, -165637, -128796, -141859, -162485, -194080, -258787, -293335, -201256, -19952, 97385, 94147, 67752, 79173, 63365, -2240, -9271, 84475, 120504, -39188, -266919, -322113, -182502, -48708, -51929, -122162, -141813, -80882, 36279, 170238]
40803A70238P4786n2772j46202j30160n8612r414L4031J01870J33891P1140k5410
40792A63386o3235n9257p8003r1770k9952P3922J11318N6477j3178l9842l2086
40781b220p314J7106o074r3723j56370q6770P7218J79095J40613L8412k4836k9345
40769D5792q66L8803N2469M643o7821q1106k9617O26k4507l3912N940J1112o5532
40756a43976j10232j4518J14783Q4240p7933j31613K8208K13287K11068O0147
40746B33461n7646p8872o9222n6571j3970K7938M501n3660n1008J1366L7716R202
40734e6765J0739O1796P2499J8515K904O2959P0977n3494j71506j19767K7800
40723g3343O9697j9959q2804m0534J6287J2174p912N484K4132K3536L2851O0660
$$ y = [170238, 245024, 192252, 46050, -84110, -142722, -152136, -118105, -16235, 117656, 188796, 163386, 100151, 40894, -37109, -128879, -158831, -84909, 26409, 82886, 69708, 29866, -2220, -9534, 7572, 1498, -92225, -248595, -335365, -258147, -79052, 61561, 99973, 75137, 45792, 44926, 83729, 136198, 140841, 73020, -8086, -37703, -37077, -61584, -95496, -89556, -78444, -143976, -254208, -268726, -153943, -69703, -147636, -279249, -251041, -37754, 173314, 233461, 175815, 96943, 27721, -28850, -42820, -14882, -10381, -64041, -115049, -103683, -65967, -56765, -46026, 15770, 88269, 106784, 109688, 172647, 243624, 190130, 18624, -101143, -73343, -3646, -23605, -106409, -146943, -130656, -118482, -126394, -120910, -96778, -73242, -40391, 20269]
40711B0269P0859O3426P5653P7829j0033j55704k02054q8118M2771N1154J566
40700e2382K9455J03180P9889m4150j08283k8901P7373O8218l1939q9858m7157
40689d4555L4363P7178O1809M576o8321j08697o6814L9011J11770Q0319r307n5828
40677E5504l6663j6047k5153j5256M3052R1214O7085J602l0006j3078R872J3598
40665A45724J551k9649p9385j17290j15293q0971k4873N7143J27888J08481L886
40654b788n1235K5841J12710M5183j19204j63725k4730J25994J34164M1991l5860
40643H8341p4993j03742j09322o5163J0905P9473J12427Q8202J9761j7653K3084
40632E1320N7263k2846j46629j33639K0848J16708O0043J246O0164J15477K7061
$$ y = [20269, 91128, 154554, 230207, 308036, 298003, 142299, -59755, -147873, -105102, -53948, -52382, -22927, 80253, 160142, 115992, 7709, -21192, 56181, 124399, 92460, 2602, -44555, -10192, 66986, 128795, 133371, 65050, -43647, -110461, -71450, 40320, 120639, 111332, 55504, 18841, 2794, -22359, -37615, 5437, 96651, 163736, 165338, 135332, 122254, 132126, 145724, 147275, 117626, 38241, -79049, -194342, -275313, -300186, -243043, -115155, -6674, -2788, -54023, -28182, 84528, 129711, 10507, -153218, -177948, -51954, 82210, 124201, 88341, 13348, -90394, -199716, -264879, -253974, -174501, -62074, 26128, 45889, 28236, 51320, 108583, 85737, -60892, -194531, -173683, -56975, 3068, 4314, 64478, 179955, 207016]
40621B07016j03551r5346J4174M8594j2045l3795J8635M6026J8346J0432K3856
40610A42342k9017j27062j18144L5605J61024J18400k487m5877k6900o0436j34051
40599h6603j18437R378J05170O3490k8198k1549P4178J11234K8153n8415l6241
40588D2160K5031j2926j19612j19592L4026J62434J08987m4755j19664r2315o8449
40577b04675p3212l1057O3875J13936P6078K4239J8702K4508J799k3457k8381
40566c7645m2624p3698o4530J0903P9228O5268L811j7537J3108L2311O485k9247
40554e4167l0706M431M1483L5226l1156j05816r7700J1807J15697R5816k5407
40543d0492j08357o8874L4569R7942R3351O0889K9381k389k8645l1937j3801N905
$$ y = [207016, 103465, 8119, 22293, 70887, 58842, 25047, 43682, 89708, 108054, 118486, 142342, 113325, -13737, -131881, -96276, 64748, 183148, 180661, 134784, 107884, 47448, -86603, -205040, -195662, -90492, -27002, -55200, -76749, -2571, 108663, 136816, 78401, 42160, 67191, 54265, -65347, -184939, -150913, 11521, 120508, 75753, -43911, -136226, -204675, -277887, -308944, -245069, -131133, -55055, -30816, -12114, 12394, 14193, -9264, -37645, -80269, -153967, -218497, -207594, -128366, -63098, -59287, -76824, -63716, -31405, -24920, -54167, -84873, -80442, -38959, -3733, -34889, -140705, -238405, -226598, -110901, -15085, -40492, -148849, -217723, -183154, -85212, 8139, 69028, 98409, 96020, 67375, 35438, 21637, 27542]
40531B7542J9772L1068K3794k4303q9073j04072m4570K6652L4998q563l0672l483
40519a40910K4418J3365l178K6576Q5698J02240M5800l0180n7961l6786j4101
40508A4981n498J6030M6398K8934n2624j14242p4427J9305N3298J4661r446P814
40496e4816K657k8100N243J03284J17295k0806j50507j11307L836M379q5897q6489
40484c01228K6222R3107M9980M697J3007l653o4119n9242M4302J19115Q3196J7677
40472B3061p841m8076j18708j05055L4099J41103Q9568j1549p812M5530K381j11267
40460g4566j47323p4471J1148N8269Q4659Q2200M4053K9593O5191N3867o7532
40449F5088j65159p9415J08031J70955O0459n9968p4735k5130K8067O9911O2439
$$ y = [27542, 47314, 78382, 102176, 77873, -11200, -115272, -159842, -133190, -98192, -106755, -137427, -140910, -116492, -103127, -106305, -79729, 5969, 108209, 154009, 123829, 65868, 29082, 14981, 9483, 25513, 71911, 100845, 48221, -66021, -140448, -121143, -67845, -53184, -62630, -54816, -52159, -80259, -75016, 28268, 145563, 124757, -25750, -137057, -133221, -128842, -214739, -301228, -275006, -181899, -131919, -127222, -114215, -117868, -181987, -241229, -196927, -77812, 5384, 23061, 15220, -32856, -151564, -256619, -222520, -81417, 8151, -3398, -11210, 34320, 36701, -74566, -221889, -296360, -285212, -226943, -142284, -60084, -16031, 13562, 78753, 132620, 65088, -100071, -179486, -71455, 99500, 159959, 99991, 25256, 126, 28193, 98104, 160543]
40438A60543j9605q7266l5220P1280P9320J70j7125M2102L3784o7733r7757J8260
40426H0753J22769P4092m1253p0686k5723j5075n5190p9874p0701o6169p8735
40415b25792p9292l9822M2561J28255J40288N1316m2702k5113P1998J07562L8125
40404A67384l7671m7446k4406p91L8106O4426J4426p7292r2566k0744J3122l9324
40392d2776o6377O057Q7921Q1997K6289j0171l9492p1460n0009L0599P2932L4798
40380F0308J0838N9234Q7467K4415l6775l018M6096L928o5319m4658J9660L077
40368A65253o8491o1833L0611P7345J9046n6375n8374K632O3047P0667R009p5325
40356A17212r7164m0800R283L00r358K4667L1534m6178j22531r2984j261N0214
$$ y = [160543, 140938, 53672, 18452, 89732, 169052, 169222, 152097, 194199, 227983, 160250, 62493, 80753, 203522, 277614, 236361, 165675, 139952, 124877, 69687, -10187, -80888, -147057, -225792, -305084, -344906, -302345, -174090, -33802, 17514, -25188, -50301, 21697, 129259, 167384, 129713, 82267, 57861, 57070, 95176, 159602, 174028, 96736, 4170, -16574, -3452, -42776, -109153, -103096, -15175, 66822, 93111, 82940, 43448, -28012, -78021, -47422, 25510, 60308, 71146, 130380, 217847, 242262, 205487, 202469, 248565, 252493, 187174, 142516, 162176, 165253, 96762, 34929, 65540, 142885, 161931, 105556, 47182, 49814, 112861, 183528, 192537, 117212, 20048, -20752, -11469, -11169, -20527, 4140, 35674, -10504, -133035, -226019, -227280, -177066]
40344a77066O8429J04138J08377K3401n9252j8403P5501N6122o0451j02210l1758
40333a3172Q329l9804n5893K7827R7092M7203n1145p5385k2108L2063M4887J4144
40321A4038m5684p9022k7143O7450Q8407J7433k5982L0993R7316N8718n3171j15504
40309B7849p7411M203N0964L2316j9774l8066K599L6045o620p2594m9820M5510
40297f4799P1466j5742p8250j0584Q9316P1309m2026j07712p6695k7290j4981
40286b05988r263K0702N5381P3549P9933P2528L8850q672m0972n5409o5599n6543
40274a01503m075O2956P8882L0142k4699l9078l0546k5837p251M3666Q8973P4945
40262A46575R175n5378r9100j37843j51176q6268M0822J22838R2510J4987j5084
$$ y = [-177066, -108637, -4499, 103878, 127279, 68027, 49624, 125125, 181247, 120796, 18586, -13172, -4843, -44647, -100540, -72713, 24379, 71582, 20437, -54948, -77056, -44993, -106, 14038, -31646, -110668, -137811, -70361, 18046, 35479, 9497, 40490, 137806, 196524, 143353, 27849, -49562, -45359, 5605, 37921, 18147, -19919, -17320, 18725, 12105, -60489, -110309, -64799, 6667, -9075, -87325, -97909, -8593, 62716, 20690, -87022, -163717, -191007, -205988, -215251, -194549, -139168, -65619, 14314, 86842, 125692, 117020, 76048, 20639, -44960, -101503, -105578, -42622, 36260, 66402, 41703, 2625, -27921, -53758, -61009, -17343, 71630, 146575, 155750, 100372, 1272, -136571, -287747, -374015, -333193, -210355, -117845, -102858, -117942]
40251a17942r897l4154o3774j8324Q0642J13847M6095k0476j5907l601m6514q5324
40239a75329m3058L6027N5092J1167k3242j7498N930L4944O1536N4091J1195n451
40227E404L2582N0477j5405r5587q5400j0383K3976M535N168L6994L6061p360
40215a8938l1655j9824j9668m2776n0450m5306o9606j03118o9004L9330J30822
40204c00193J34805O8924j1775n5041j5218R1764J55247R0436l1179p7972m8600
40193A198l7955n4507l2963R1l6066q1777J218J50416J30094q5463k07715n1727
40181c05156J71114J71013J337p2938L351M5820l4802j16414r2863j5029L4165
40170b10402M7923L5319j6653p4496o0491K9066R7403Q2110L6426L1230N0233
$$ y = [-117942, -127839, -161993, -225767, -244091, -163449, -49602, -3507, -23983, -39890, -43491, -90005, -175329, -218387, -182360, -127268, -116101, -139343, -156841, -150911, -115967, -54431, -340, 10855, 5404, 37986, 88463, 73058, -22529, -107929, -118312, -94336, -89801, -84633, -47639, -11578, -18938, -50593, -70417, -90085, -132861, -183311, -228617, -298223, -401341, -470345, -431015, -300193, -165388, -96464, -108239, -163280, -178498, -86734, 68513, 158949, 127770, 49798, 1198, -36757, -91264, -124227, -124136, -160202, -241979, -240761, -90345, 39749, -45714, -253429, -305156, -134042, 36971, 38308, -34630, -31279, 14541, -20261, -136675, -229538, -244567, -210402, -162479, -127160, -143813, -218309, -278800, -249734, -152331, -70221, -33795, -2565, 47668]
40159D7668M0618J1336J1127L6034K9410k1207m8137j251N7945K5615q4612j32024
40147b7478l8754Q7436R7513O747n0921l2176j3952k5257j798O2727P0991j0265
40135A24813p5069n2980k8263p9180j19105l4758J07148J43672N3557l5021m6038
40124d1224k4708j3277P471L4651J8567l9526n4684K7934J43321J73336P6398
40113C08259o8527j32555n6767Q1022J39116P0964k5218m4378q254n804m9490
40102B08368p0052l2164K0406L2134o791o4693q9639m5985L3249O6143L5607K7014
40090A13597Q8249J21492K1547j28449j42194n093Q7622J0081j16878j15829j1745
40079g7600K5846n3759j17212n7876M7035N6735k6992o8393K053R0285P9790N13
$$ y = [47668, 88286, 99622, 110749, 146783, 176193, 154986, 106849, 105598, 163543, 189158, 104546, -27478, -66232, 21204, 118717, 125464, 74543, 42367, 28415, 3158, 1360, 64087, 135078, 124813, 49744, -3236, -31499, -110679, -229784, -264542, -157394, -13722, 39835, 4814, -41224, -65932, -79209, -71738, -37087, -18520, -58046, -112730, -84796, 58525, 231861, 308259, 239732, 107177, 50410, 131432, 270548, 341512, 316294, 271916, 263662, 257858, 208368, 138316, 106152, 126558, 158692, 151901, 87208, -2431, -48416, -15167, 50976, 86583, 113597, 201846, 323338, 344885, 216436, 74242, 69149, 156771, 166852, 49974, -65855, -77600, -51754, -105513, -222725, -280601, -233566, -176831, -203823, -272216, -270163, -179878, -100088, -99575]
40067i9575j8759N9846J27134P8968m2171j03081m5248N1552P0372m808p2104
40056B126m1066M2337N0278m2230j06818m7224M8257L8201n1578p2386J2450Q5120
40044h2533O8422J5186k1689o1167r4326n9527K4984M7708r770k3037N6473R4550
40032d4726o02j04686p5589J6230K6657j5066Q438O7962N0364q745K4617J29785
40020G4639J46529M3962l3166j1868J1632l1575p1763n4210m3138q8646j23907
40009a81511q1350j162N2521Q1401Q8267K9186q4137j30556l0732J16146J48440
39998F513M9239n6722q1598n4379k8642j100M6275Q2014N7631r954m0815K538
39986b9000N4330L8079j3322j0840L1133L954r9752j32635j1834J31802J37284
$$ y = [-99575, -118334, -58488, 68646, 147614, 105443, 2362, -42886, 8666, 79038, 74230, 2126, -38940, 3397, 53675, 11445, -95373, -142597, -94340, -56139, -107717, -180103, -167653, -82533, -14111, 1075, -20614, -81781, -176107, -235634, -210650, -162942, -172712, -195749, -139276, -44726, -45328, -150014, -225603, -209373, -182716, -197782, -189344, -121382, -71018, -79763, -55146, 74639, 221168, 265130, 231964, 220096, 231728, 200153, 128390, 74180, 31042, -57604, -181511, -262861, -264023, -211502, -130101, -41834, -12648, -96785, -227341, -258073, -141927, 6513, 55752, -970, -82568, -136947, -165589, -166689, -120414, -38400, 19231, 9277, -31538, -29000, 25330, 63409, 50087, 39247, 70380, 74334, -25418, -158053, -169887, -38085, 99199]
39975I9199M0378j9611k5613n0570p2976j6014O7334M8209m6900n8672L5577P6736
39963G7077q971r4542p3066j0334J0007K0653M7483J7736q4032j18359L890J43461
39951f8997J20920j2939o3763J3106P7133L7367l1688k5035N3042J11792P3950
39940B84888n2881j68331j67416o6777J0691J0984K0261R7599J46665P1029l6597
39929A50115k0032P9908P3834p1538j64378p6896O0103N3789p5198j41026n8759
39918a90078O2691Q8726K1034l9717l1719J4028L6663K1352J250K593J1975M834
39906C632j2965j5830o018j8755o3866r0015m5564L3680N0225k1612q1786l5623
39894c04497O3590Q3682P662m2112J0232R0064J01855O1901K7741j2049p7489
$$ y = [99199, 139577, 119966, 94353, 43783, -29193, -45207, 22127, 70336, 23436, -35236, 341, 77077, 68106, -26436, -99502, -109836, -99829, -79176, -31693, -13957, -97989, -216348, -212458, -68997, 51923, 38984, -24779, -11673, 65460, 102827, 71139, 46104, 99146, 210938, 284888, 232007, 63676, -103740, -170517, -159826, -148842, -128581, -30982, 115683, 186712, 150115, 130083, 209991, 283825, 212287, 47909, -28987, 31116, 84905, 9707, -131319, -190078, -127387, -38661, -17627, -57344, -89063, -75035, -38372, -17020, -15770, -13177, -1202, 3632, -9333, -25163, -31181, -49936, -113802, -203817, -249381, -215701, -165476, -187088, -268874, -304497, -240907, -157225, -149563, -191675, -181443, -91379, 10476, 72377, 100118, 88069, 10580]
39883A0580j03007k5275Q3636R5925J1801n6404n9064m2898k8181J0677M3300
39872e8910J892q3340j01913l7177J2524J0545L2388R9194J15931M2197k2111
39861A1220m490K4582l089k7564Q614L1502k8728q2065j1350J16804J31928P368
39849A74732j16421j34074p2859R29N6925P7699N4556J6568L56k395j6811l1334
39837G871k5281j3093q294R477L8605L0407j8590k9505K4121L8537n2478j27309
39825a25532m4615J11083J32724M715q0262k4616M7461J6728n2331m7222J4557
39814d7310M5658K9190K151k7228n7841n2535m54K7102l3165j24092j25910j2882
39802c77316J13994J49392Q9726J3384j1658O509L32o8638j43132j27284j5964
$$ y = [10580, -92427, -117702, -34066, 61859, 73660, 17256, -41808, -84706, -112887, -102210, -58910, -57018, -140358, -242271, -279448, -266924, -256379, -223991, -124797, -8866, 33331, 11220, 6730, 31312, 28223, 659, 9273, 40775, 12047, -70018, -81368, 35436, 167364, 174732, 58311, -75763, -148622, -147693, -90768, -13069, 41487, 58055, 58411, 56016, 39205, 7871, -17410, -30503, -38797, -29320, 9285, 39692, 21102, -8403, 15718, 54255, 1777, -125532, -170147, -59064, 73660, 78375, -1887, -26503, 20958, 37686, -14645, -61867, -47310, -1652, 27538, 29689, 2461, -55380, -107915, -108369, -81267, -114432, -238524, -364434, -377316, -263322, -113930, -24204, -10820, -22478, -15969, -15637, -84275, -227407, -354691, -370655]
39791c70655Q4809R3865N6209N7105Q2430M5990n7733j19013o0893M7642Q0833
39780e9411J7667m7728m0194J5890N6405N9082L7744j030n4364r6883r3643l4880
39768b41345N6329J36573J56579R6351J555n3092n4937n8681p8779n1139M4495
39757d6091J04624L6880q5071j12808l1328M2917M8397L4291L4884K1609l041
39746D5263R353M6608L4955k5498m7109j0712l850n6244p5014j0416M9784L5913
39734f967J6276O0385J01897N5099l2222o3263m4754l7697l4072j237K1710r312
39722B5843m4375k1883J4128o085m7602m2113k2387n1956q1434k1506Q5783J18249
39710i5338O4559J6799o11l9054p7144l0139P7211J05571R706q4581o6390J2880
$$ y = [-370655, -285846, -191981, -135772, -78667, 3763, 49753, -7980, -126993, -187886, -140244, -59411, -41744, -89472, -129666, -113776, -57371, 1711, 39455, 38425, -15939, -112822, -206465, -241345, -185016, -48443, 108136, 204487, 206042, 152950, 98013, 39332, -39447, -90586, -46091, 58533, 95413, 10342, -102466, -133794, -90877, -42480, -8189, 26695, 48304, 45263, 54616, 101224, 136179, 110681, 63572, 52860, 49010, -7234, -82248, -92664, -42880, -6967, 9309, 69694, 171591, 226690, 194468, 131205, 86451, 48754, 14682, 13445, 35155, 25843, -18532, -40415, -26287, -32372, -79974, -122087, -144474, -196430, -277864, -299370, -213587, -95338, -30779, -13980, -14591, -53645, -130789, -160928, -83717, 21854, 31560, -53021, -119411, -106531]
39698a06531M0181k347m5933l8103J4877O8547P4278K5646k1321r380M3926P0881
39686A14721M0528j8951o2233n2503J7650Q8094O7901l4858q9150k1753N6861
39675A06307J2732r7924j10942n005P7620M8102l0221o8516n5277j3510M0899
39664i5735P5317N6387K681m1258o9944r0525o6678K6216J23914J42003Q7477
39653A49855J5263p1984j72970j97185o4859J34979K24040J55956L8685l5662
39643A76118n9484m0383O373K1525k4313o1170l5976k2171p6516q9605L5342J57441
39631a2819Q6481q4566j06466J8063N4033n1156r5575O82P3565M6702O2547J66094
39619A57585J70347n729j53439j09854j2031k0691m5634L0094Q9282j808j14287
$$ y = [-106531, -66350, -68697, -114630, -152733, -137856, -69309, 4969, 30615, 9294, -86, 43840, 114721, 155249, 136298, 74065, 21562, 39212, 127306, 195207, 160349, 71199, 49446, 106307, 119039, 21115, -89827, -94832, -17212, 30890, 669, -67847, -123124, -136634, -95735, -20418, 35969, 38650, -2608, -72552, -163077, -229755, -203539, -79625, 62378, 149855, 165118, 93134, -79836, -277021, -341880, -206901, 17139, 173095, 211780, 176118, 116634, 76251, 82624, 104149, 79836, 18666, -17310, -39481, -115997, -205602, -170260, -12819, 73662, -10904, -117370, -99307, -45274, -96430, -192005, -191323, -117758, -71056, -8509, 157585, 327932, 322203, 168764, 58910, 46879, 26188, -19446, 10648, 99930, 98122, -16165]
39608a6165o2570P1452Q3797j7369p9561q4487r8662n8588J16456K79289K09211
39597C42803k9446j53919p1576L4328K7275k4780m2170n2418o4484k3759M9937
39586h209N1657l0371q1786m8016r44J4487M1309P6987M3754m8079o8073K3245
39574c4039Q2200L239j00828o8332O0996J11732L6899l1421J967N6721J0712j05875
39562B3971j39522k6865J04300R6692k4811q7579p364J08034J21712M1838k9015
39551A81391m4283l3226k0252n577K530K287J7877M8793L7537m8386j37594j30081
39539a28984l2352M6357K5765o1386j08670l8141J12064J95346J03244q6835j83571
39528a57163j16863o619L1980L2316O2088Q7506N3113J216m58K1968P003k7351
$$ y = [-16165, -78735, -7283, 76514, 59145, -20416, -104903, -203565, -262153, -145697, 133592, 342803, 313357, 159438, 87862, 122190, 149465, 124685, 82515, 30097, -34387, -58146, -8209, 43448, 13077, -68709, -116725, -117669, -103182, -61873, 15114, 58868, 10789, -57284, -34039, 48161, 51400, -49428, -117760, -56764, 54968, 91867, 60446, 62413, 119134, 129846, 23971, -115551, -142416, -38116, 58576, 33765, -53814, -61178, 46856, 168568, 210406, 181391, 137108, 103882, 83630, 78053, 80583, 82870, 100747, 149540, 187077, 138691, 1097, -128984, -161336, -114979, -89214, -150600, -259270, -297411, -185347, 9999, 113243, 26408, -157163, -274026, -280645, -248665, -216349, -154261, -66755, -13642, -12426, -12884, 9084, 16087, -11264]
39516a1264k5613O344L1415M6284L9998k7061j20254j14524J2943R2830K614j24104
39504a90392r7533K6605N2118k8225m2375N2867J13179P1706L4748N8195L7640
39493H8533q4512j75246r7577P5940J58110Q8446k0226m3299K0897P4522M5349
39482A30937k4455l6499J5024K1403o9443j46121q8890M3676J02408O3883K4163
39471C6086K0315P717j0165J2427L5428k5579j18345q5777P9370J77572P7696
39460B06745r0801j21124j785J01696P5566k9415r0342m9838L7600P1196K0214
39449A29712l5159p275P7100J11413N0203m8022j12521j29777j16478q1132k9266
39438a91202K4645N7232M3832n760j8931O6793J85361J87308M4350r2646r9759
$$ y = [-11264, -36877, -30533, 882, 47166, 87164, 60103, -60151, -174675, -161732, -68902, -66288, -190392, -287925, -261320, -209202, -237427, -279802, -226935, -113756, -42050, -7302, 50893, 88533, 4021, -171225, -268802, -192862, -34752, 53694, 33468, -9831, 11066, 85588, 130937, 106482, 69983, 85007, 106410, 36967, -109154, -198044, -154368, -51960, 11923, 36086, 56401, 64118, 53953, 66380, 101808, 76229, -42116, -127893, -48523, 129049, 206745, 115944, -5180, -6965, 94731, 170297, 140882, 50540, 702, 38302, 109498, 129712, 94553, 87278, 164378, 275791, 325994, 277972, 165451, 35674, -80804, -161936, -191202, -166557, -109325, -65493, -71253, -90184, -23391, 161970, 349278, 393628, 300982, 201223]
39427B01223l2169O839K2625M7712L1656m9740r0765j6326O0456Q570r6416j03083
39415i418m0463l6598o8754k4701N3090K9248o0158n3213N0986R8231N8202M5267
39403D1719O6156J2404q4923p0421L5001L5255q5666j06384M7686J60300Q6787
39392A37914k4533k3440K013m5866o2165L5029R5417j3625j41070q3719P2783
39381e1262R8755j2033p3746k8034J2951M087K3303R1237J21531P2050N262k1772
39369B42329k2233k4989l5550n1562o2460n0365k5413j9895k4693K517M5798L7914
39357A1398j6488l4324l382j0948p7082r9042k5793N3683O8571O5810P3228K3882
39345B9513q4896j22339l3979M0895l394n5691R737J02311P3747k0571k1430O6913
$$ y = [201223, 169054, 175893, 198518, 246230, 277886, 228146, 137381, 121055, 181511, 190081, 93665, -9418, -49881, -86479, -155233, -179934, -126844, -97596, -157754, -210967, -159981, -61750, -3548, 41719, 107875, 120279, 35356, -35065, -64, 35191, -50475, -156859, -109173, 51127, 137914, 113381, 89941, 91954, 46088, -16077, 18952, 114369, 100744, -40326, -124045, -51262, 47493, 35460, -38286, -66320, -53369, -49282, -25979, 65258, 186789, 258839, 264101, 242329, 220096, 195107, 159557, 107995, 45535, -4830, -30243, -50138, -74831, -72314, -26516, 11398, -5090, -39414, -42796, -53744, -130826, -229868, -255661, -201978, -133407, -67597, 5631, 29513, -55383, -177722, -211701, -170806, -174200, -229891, -220154, -117843, -44096, -64667, -86097, -19184]
39333a9184J08336O5992J5499k0322p4626j14108p5407M059L1494M654r619m45
39321h3677j166m232L070j6168o0071l4442Q6336J49110L3296j23206j02213N7406
39309i5957J13329j2240j30507q0892N2227Q6055j6229j20884r1975N2923J50371
39298i3779P8894o6403p5624Q1391J96754J21349l4133r6990p4268n9066m5687
39287f7562m968p308q5729j04852K9651J53918P0796j12489j31031K5783J23784
39276a10007O9771P285K1751K1130m3749q1043m4663j1761j2380K6562J08833
39265d8271J25847M9756l633L0539P1058N0831J3912o838n1048j07240q5275J7388
39253E7026P3713K5568k5125l863J0437n1040r7874k1724J17092J71311J05152
$$ y = [-19184, 89152, 155144, 170643, 150321, 75695, -38413, -113820, -109761, -78267, -73613, -83232, -83677, -84843, -89075, -86005, -102173, -162244, -196686, -110350, 38760, 72056, -51150, -153363, -95957, 17372, 5132, -125375, -206267, -154040, -67985, -84214, -205098, -297073, -244150, -93779, -14885, -81288, -156912, -75521, 121233, 242582, 208449, 111459, 37191, -21875, -67562, -72530, -79838, -165567, -270419, -240768, -86850, -16054, -128543, -259574, -233791, -110007, -40236, -32951, -11200, 9930, -33819, -114862, -159525, -171286, -183666, -157104, -48271, 77576, 127332, 123699, 154238, 225296, 276127, 290039, 283201, 232153, 124913, 39638, 57026, 130739, 156307, 131182, 127319, 137756, 86716, -11158, -32882, 84210, 255521, 360673]
39242C60673L332o2904q4109p0652m4132l9057n1834k2918P7296J82802K06559
39231D55056J51464R5410Q4959R3012Q2347P4533J31653K72452M31668N24911
39221B397465N29230M54300K67235n6623m08411n94878n56734m25696l17033k01424
39211A087431n6315J5129n2589j40402j17044m5580n2316r5822n5921L1683L4125
39200E52379m1193o8989k7293j657j848K7382L7845p0438k31203k51907r4923
39189a71845O5705R6902M7018O382j1541j5023R54P567k6190n9292m6822m0617
39177a46802q8830j01119J4464J46913J20033j7517o5700L007L8845J0002L5240
39166e1464J16356J12534J4502k5902J3951j6039j27684j27087M1843J64921J00506
$$ y = [360673, 364005, 301101, 216992, 146340, 102208, 63151, 11317, -11601, 65695, 248497, 455056, 606520, 701930, 786889, 879901, 962248, 1036781, 1168434, 1440886, 1872554, 2397465, 2926695, 3380995, 3648230, 3591607, 3183196, 2588318, 2031584, 1605888, 1288855, 1087431, 1031116, 1046245, 993656, 853254, 736210, 690630, 638314, 542492, 486571, 518254, 552379, 511186, 442197, 414904, 413247, 411399, 438781, 476626, 406188, 174985, -76922, -171845, -106140, -9238, 37780, 44162, 32621, 17598, 18552, 26119, -71, -59363, -106185, -146802, -235632, -336751, -322287, -175374, -55341, -72858, -138558, -135551, -96706, -86704, -51464, 64892, 177426, 191928, 166026, 179977, 163938, 36254, -90833, -48990, 115931, 216437]
39155B16437l442J2945O5413J9785o7058q3036o2815p8516p9323m519P4651P3506
39143H4028L4415K3559J0415l7135o6479n3063o2412j01913o4026P6144J67241
39132A0774J05686k071k4711J978k944q116K4742K6268m1870p1159K0730J27222
39120A66529J10262M665p1487r3761q7785l2546N7072P3782j8578q7175l3392
39109a2414L6383m272p4874k4620J03628J32785J9070j00434r8775J7725J45355
39098A39557J66195M9151q3573p6327M1279Q1803j8532j12029r0440l1792j2499
39087E2793J8964O8919J8889j35229j84324k4406J36235R1970l7570l1510O7007
39076D1738P0138j6124m5225j3902k5738n0954J8996J31443J29842J7013n6798
$$ y = [216437, 212995, 225940, 291353, 311138, 244080, 161044, 98229, 19713, -59610, -64129, 10522, 84028, 118443, 142002, 152417, 115282, 48803, -4260, -66672, -168585, -232611, -156467, 10774, 116460, 114389, 89678, 91656, 88712, 80596, 105338, 131606, 89736, 18577, 39307, 166529, 276791, 281456, 209969, 116208, 28423, -4123, 52949, 126731, 108153, 20978, -12414, 23969, 19697, -55177, -79797, 23831, 156616, 175686, 75252, -23523, -5798, 139557, 305752, 354903, 271330, 195003, 236282, 318085, 299553, 187524, 97084, 65292, 52793, 71757, 140676, 159565, 24336, -159988, -184394, -48159, 43811, 6241, -25269, 41738, 111876, 95752, 50527, 36625, 10887, -40067, -21071, 110372, 240214, 257227, 200429]
39065B00429m1164k3593m8103p4534q7845r0634l7146P5232J23781L1045p0868
39054d3400k4910R3813J01841J497o1171n7106o6922o9905K4173J58602J70014
39043B26526M3832o6600p4965l7919m116L8587O5573K1965o9844j31494j34496
39032a22951q2134M5156K05569K52347J23002k6902m0372L606m5080j28315r2717
39021I1209J9799M5702q411m370M8749J4918r6176j29459n1067J8290L1031N1077
39009C1292P3108K5022n3741n0221J3860K0142k0718L63N7862K1537r1967j29467
38997a02928n7573J6816O5114J38064J70715N0972j21266j21198L7579J07210
38987A83505N255p7995k7997K9651K251j0447N1937O9669l0581j23113q9959M193
$$ y = [200429, 159265, 135672, 87569, 13035, -74810, -165444, -202590, -127358, -3577, 27468, -43400, -68310, 25503, 127344, 128841, 67670, 10564, -56358, -126263, -102090, 56512, 226526, 270358, 203758, 128793, 90874, 86758, 125345, 190918, 212883, 143039, 11545, -122951, -205085, -159929, 45640, 297987, 420989, 394087, 353715, 357321, 312241, 183926, 91209, 111008, 156710, 148299, 143929, 192678, 207596, 111420, -18039, -69106, -50816, -19785, 31292, 104400, 129422, 75681, 25460, 39320, 59462, 38744, 39107, 96969, 118506, 26539, -102928, -160501, -143685, -78571, 59493, 230208, 281180, 159914, 38716, 76295, 183505, 188760, 110765, 82768, 112419, 114670, 104223, 156160, 225829, 195248, 72135, -17824, -13631]
38975a3631N7785P7950Q0020J7028q9890j17580l2344M2502L1553J4936N0714
38964A19043O1025r755q0192p1875k6798k368K0312N3170N3661J9682J0306L1173
38952A77384K3517j2159j7854p475m0416p4018k1105N7476K4411p7066p1377L7956
38940g26O5480j7970k8256Q3496J19245j4293j22459m6401P7215N7448n8285j12841
38928A653q6650m7524k970M5598L6390l3835n5953J4632O6725K1660l6806k4115
38916a01195Q531O228K3095R0046J18652N0994l0274m1856j6300L460L9885P6049
38904B27315L4639o4503r5704m5335m6966j23327j11688M6328J63920R8265k6244
38893E6700m1755M403j5094p6413q0222k8187K2507O2291P2744R95j09932j17317
$$ y = [-13631, 44154, 122104, 202124, 219152, 129262, 11682, -20662, 21840, 53393, 68329, 119043, 180068, 170313, 90121, 18246, -8552, -10920, 9392, 62562, 116223, 135905, 146211, 177384, 200901, 188742, 170888, 163413, 122997, 48979, 27874, 85350, 109761, 32695, -38682, -726, 64754, 46784, 18528, 102024, 221269, 206976, 84517, 38116, 115331, 172779, 114494, 1653, -84997, -132521, -135491, -89893, -53503, -87338, -143291, -128659, -61934, -40274, -77080, -101195, -92664, -86436, -63341, 26705, 145357, 196351, 166077, 124221, 107921, 111381, 151266, 227315, 261954, 197451, 101747, 56412, 9446, -113881, -225569, -179241, -15321, 82944, 56700, 14945, 19348, 4254, -72159, -152381, -180568, -158061, -95770, -23026, -22031, -131963, -249280]
38881b49280L75Q8442P1858O5778J23088J00401p0261j97399j10436O3465J05253
38870h716K6397j7434K307M109k0862k3720j2376r165J8732P5940R3081N6016
38858A84309M9220Q6582N9800n3316j11015m3687K2822o262m5581k8530l9202
38847G5140j06202r0052N8660J48547L9650j17313j23121k0436M2672N2087N0272
38836I904O105o6901n5785L1245J1066j46797j97551j8472J49728R2878k5309
38825b09889K3473J35411J03796N300K2359Q5846L4477n1292j2244O1185M44j00009
38813I8857n2565O2555M8926l6864j6368M7813j8143j30338q0490O4866P2400
38802F0649l7703n2743K6403J8483n7103j4732J16365J21875O74l0626O4867R2535
$$ y = [-249280, -248905, -160463, -88605, -22827, 100261, 200662, 130401, -66998, -177434, -113969, -8716, 17681, 247, 2554, 6663, -14199, -37919, -50295, -59460, -40728, 35212, 128293, 184309, 233529, 320111, 379911, 326595, 215580, 171893, 194715, 188453, 142872, 114342, 75140, -31062, -121114, -62454, 86093, 125743, 8430, -114691, -135127, -92455, -40368, 9904, 16009, -50892, -106677, -75432, -64366, -211163, -408714, -427186, -277458, -184580, -209889, -186416, -51005, 52791, 58091, 80450, 166296, 200773, 149481, 137237, 198422, 198866, 98857, 46292, 108847, 157773, 120909, 104541, 152354, 134211, 3873, -76617, -11751, 60649, 22946, -29797, -3394, 15089, -42014, -56746, 59619, 181494, 182168, 151542, 216409, 308944]
38790C08944q910q0242m8442j9151l7843l2946l156o175J0272J06979J48574j0139
38778C27765k11921j92264p798P7885N3772J14986K20152J32715j04013j78597
38768B32682l5393M7344l4286n6143Q5945J97853J78102J80915K57539K44925
38758A299483J64525K99888O56323P57510K83310m17931p71607o72597m34394
38749A164510k68514j48584n7090m9635j04120j24062q4174m0595k6665k8802
38739B32269k4719M813M7674L6526n9774j39659q6908M2364J00385P7974P3645
38728C04590P3842j5112j35326j21756J1411P1625Q62n2985j2668K1071j2061
38717A33493l6317j7592k1674m7234p837Q1668J03359M3924L803j51k8577m2112
$$ y = [308944, 300034, 219792, 171350, 152199, 114356, 81410, 78254, 72079, 82351, 189330, 337904, 327765, 115844, -76420, -84218, -6333, 47439, 162425, 382577, 515292, 411279, 232682, 197289, 244633, 210347, 154204, 240149, 438002, 616104, 797019, 1054558, 1299483, 1464008, 1763896, 2420219, 3177729, 3461039, 3043108, 2271501, 1598904, 1164510, 895996, 747412, 690322, 640687, 536567, 412505, 328331, 287736, 261071, 232269, 207550, 212363, 260037, 296563, 236789, 97130, 10222, 52586, 152971, 230945, 304590, 378432, 363320, 227994, 106238, 117649, 189274, 190136, 137151, 124483, 145554, 133493, 97176, 79584, 57910, 10676, 2839, 84507, 187866, 231790, 235593, 235442, 206865, 164753]
38705A64753K8196P2703n2224k07439j24208J36524K33933Q0770m5889J0417P0880
38694C68416L4o8024k8437K748m5943m9433M4550Q2687p143p5503l9140k6727
38682A58085r6278r7524K8813J01463J5046o9826k3193L6721k965m1824P859M0274
38670E6651j6761l8992M7527R7656J2442o1192O753Q5991J2932j27031j45978
38659g0002l2325Q5085J21272N9475p4499j73304j26904P279P3553O5043R3856
38648B8529J30071M1709j05454r9848M3612R6882L0506M2974J37588Q4038j14444
38637C16163j53940L9729J54050K8068r4410m4627j4190j25259j56212K5142J67593
38626A42107P5355m7892j675M5374p7325j72489k9124J75947J84522P3300K9714
$$ y = [164753, 192949, 265652, 213428, 5989, -118219, 18305, 252238, 333008, 287119, 297536, 368416, 368450, 300426, 271989, 274737, 228794, 179361, 223911, 306598, 299455, 223952, 184812, 158085, 61807, -35717, -6904, 94559, 109605, 39779, 16586, 53307, 50342, 8518, 16377, 56651, 39890, 898, 48425, 146081, 158523, 97331, 104084, 190075, 203007, 75976, -70002, -102327, -17242, 104030, 163505, 89006, -84298, -211202, -203923, -130370, -65327, 28529, 158600, 200309, 94855, -4993, 38619, 135501, 166007, 208981, 346569, 430607, 316163, 162223, 201952, 356002, 384070, 289660, 245033, 230843, 105584, -50628, -25486, 142107, 217462, 169570, 167895, 213269, 135944, -36545, -65669, 110278, 294800, 368100, 397814]
38615C97814q16j12967j67316m7628P0893J8745p0060m4950k7389j17320j30245
38604b31239N2060J91907R7388j3518Q5824J95080N4599j59099j37107K9310N4431
38593B19636l6071k9243N1029M8002J1109N8031R2242O289n0365N2521J27574
38582E50754l33j31740l5883J14947N3254j06603j12020l3755o2384j00350J0326
38571A46213J06730o518j39488l6983J39158J09558l999N3556J45424N855k10877
38560C08629j81778j637J9325o2549P739J33531M9725j22843p6655R3874P3602
38549B40963o8074l7256Q0799j2023k00060j24338J35810J89100M2478L5540J47943
38538D30882N0046j97675j90247O6701J33356p8792j68123J5625J38423K6800
$$ y = [397814, 396998, 284031, 116715, 69087, 139980, 158725, 88665, 43715, 16326, -100994, -231239, -179179, 12728, 110116, 96598, 182422, 377502, 432101, 273002, 135895, 165205, 219636, 183565, 154322, 205351, 253353, 264462, 322493, 414735, 421024, 370659, 423180, 550754, 550421, 418681, 382798, 497745, 550999, 444396, 332376, 298621, 236237, 135887, 146213, 252943, 246425, 106937, 69954, 209112, 318670, 314671, 368227, 513651, 519506, 308629, 126851, 125214, 144539, 81990, 89729, 223260, 272985, 150142, 73487, 167361, 240963, 172889, 135633, 216432, 204409, 4349, -119989, 15821, 204921, 247399, 282939, 430882, 480928, 283253, 93006, 159707, 293063, 214271, 46148, 61773, 200196, 226996]
38528B26996o0128L3439J03662L1228j8762J8204r497r3330l6036J19109R9437
38517D14322q9096j41948l825N1203n1926p7456L3277N5456n7005q0474L0709
38506H3237O6954q135o315P5544N3399l1450K5293J36498M0437j62012j33506
38495A39944P2418R2955o9465p9541M8256k4075k39787j73974J59505K62981K5915
38484B15132j00813N1407J05015q5012j41754Q6482K13402M4104p3807N8706J22626
38473D95488o1130j57465L3461J71279L534j79469j02552K6580j4309m6599Q2070
38462B50888J48110o713j45295p9568K470m8188n5120P6443J28032N049n9550
38451B16558K8362M0637p8786n8785J48458K11684K9287p7508J1067M929j63172
$$ y = [226996, 166868, 200307, 303969, 335197, 316435, 334639, 325142, 231812, 195776, 314885, 414322, 325226, 183278, 179453, 230656, 178730, 101274, 134551, 190007, 133002, 52528, 83237, 150191, 142056, 135741, 211285, 264684, 233234, 258527, 395025, 435462, 273450, 139944, 212362, 305317, 235852, 156311, 204567, 180492, -59295, -233269, -73764, 189217, 215132, 114319, 165726, 270741, 185729, 43975, 130457, 343859, 387963, 314156, 372862, 495488, 434358, 276893, 310354, 481633, 485167, 305698, 203146, 229726, 215417, 168818, 250888, 398998, 392285, 246990, 167422, 169892, 121704, 66584, 143027, 271059, 276108, 216558, 244920, 285557, 206771, 147986, 296444, 508128, 537415, 459907, 470974, 475903, 312731]
38440C12731j49216J09147J89336m5227j63718L6182J63580L338q1455J05155
38430D79853J82995m7097j73503M2485J86422j5870j57529O4242K46382M5057
38420H53437j55245L6291K79697J45829r9601j3517K54542L31451K57593J87341
38410B077818k6506m02957n30689k33798K0261j02399k28660j9760J76621J6126
38400G46057j65201j3002J52881j7874k05061n3097J22951k3082j55454P8047
38390D67165K97023P8661k13699r0186J68386Q7067j06213N342J72335j0624k64349
38379E90908j41595J19642Q7104l2273J26268K95380J05086j20271O4643L75348
38369A470240L41735J52637J41297L9716l91951o40617k68426J83824P6275k18333
$$ y = [312731, 163515, 272662, 461998, 416771, 253053, 289235, 452815, 456153, 374698, 479853, 662848, 615751, 442248, 484733, 671155, 655285, 497756, 561998, 808380, 853437, 698192, 734483, 1014180, 1160009, 1060408, 1046891, 1301433, 1632884, 1890477, 2077818, 2051312, 1648355, 1117666, 883868, 904129, 801730, 573070, 553310, 729931, 746057, 580856, 567854, 720735, 702861, 497800, 444703, 567654, 544572, 389118, 467165, 764188, 842849, 629150, 538964, 707350, 794417, 688204, 693546, 865881, 855257, 590908, 449313, 568955, 656059, 623786, 750054, 1045434, 1150520, 1030249, 1094892, 1470240, 1811975, 1964612, 2105909, 2145625, 1753674, 1113057, 844631, 1028455, 1104730, 886397]
38359H86397q0871J81348R685k54930m9319K52246N0220k68984p3162K33860j7567
38348H68923l78340p4254M46534K59588l08106k67062K10485J84408k43012j82078
38338E17086K87573K91483j32805j57017J87675J21299k73340j89744K73239K62070
38328A187519j58907j39612K52204J54504l36027k75361K88788L58493j13696
38319A217905j62615K84722K73232k76617l69010J60656L54552k0816j34008J74801
38309A502802J27295k91009k01268L58792L68806j96354k54289K83088L14966
38300B012829k71418l40012K47425L12917l09978l90371K83829M32448k20252
38291A757417l68014L21936N30380j18717l04394L50902M82325k86689m89834
$$ y = [886397, 805526, 986874, 996559, 741629, 692310, 944556, 994776, 725792, 652630, 886490, 868923, 490583, 416329, 862863, 1122451, 814345, 547283, 757768, 942176, 699164, 517086, 804659, 1096142, 963337, 806320, 993995, 1115294, 841954, 652210, 925449, 1187519, 1028612, 889000, 1141204, 1295708, 959681, 684320, 973108, 1331601, 1217905, 1055290, 1340012, 1613244, 1336627, 967617, 1128273, 1482825, 1462009, 1328001, 1502802, 1630097, 1339088, 1137820, 1496612, 1865418, 1669064, 1414775, 1697863, 2012829, 1741411, 1401399, 1648824, 1961741, 1651763, 1261392, 1545221, 1977669, 1757417, 1389403, 1711339, 2241719, 2123002, 1818608, 2169510, 2651835, 2365146, 1875312]
38282A875312L20038O10350j53636m30330L27805N25021l56417n45175N39658
38273B712626R22941j43495n37755O81311J282069J32078m33700R10368J717808
38264G244251M72904k10463J436071K609253J205253J72096J932192L366376J876131
38255B0104064J249013M820390Q233721P170345O638909J2379760J8996986K0462331
38247A00055519K7107561N1872749P8598678O8238896R147477n7677083q1847899
38240A95495898o0143541l0740794k0201831k0065180j4707668o886876n839950
38233C6910058q418552o266595j251130o35610l378553k996991J59519L96003
38225A4518149k146943k038158R29597J477156r88479j263846J654263K564610
$$ y = [1875312, 2195350, 2805700, 2652064, 2221734, 2549539, 3074560, 2718143, 2172968, 2712626, 3635567, 3492072, 2954317, 3635628, 4917697, 5049775, 4616075, 5526443, 7244251, 7717155, 7506692, 8942763, 11552016, 12757269, 12929365, 14861557, 18227933, 20104064, 21353077, 26173467, 34407188, 41577533, 48216442, 60596202, 79593188, 100055519, 127163080, 179035829, 257634507, 325873403, 335020880, 277343797, 195495898, 135352357, 104611563, 84409732, 64344552, 49636884, 42750008, 36910058, 28491506, 22224911, 20973781, 20338171, 16959618, 13962627, 14122146, 14518149, 12371206, 10333048, 11262645, 12739801, 11751322, 10487476, 12141739, 14706349]
38217A4706349K5508o41059K612748M394972K042962J127490N092675Q231724
38209C7593369O439229O097129J2527556J8659862J8764674K5082971N0473977
38202A75638767P6665911O4590629N610354n7839224p8281184n5897117k8266659
38195A02221477j9050675j9063665j4126905p180516o106011p842806n790352
38188B3060547k046563j978219l856807k888184k83987k59773j930708j502566
38180H313740M27185M39431j067560r40932O62642R08190k07124j66551J079045
38171I448066J247958L03552M31122J765335K290798J838948K247586L495666
38163B3069031L380180J319043q38418k056030l072918l912737l488159k086881
$$ y = [14706349, 14731857, 14090798, 16703546, 21098518, 23141480, 24268970, 29361645, 37593369, 44032598, 50129727, 62657283, 81317145, 100081819, 125164790, 175638767, 252304678, 316895307, 322505661, 264666437, 186385253, 130488136, 102221477, 83170802, 64107137, 49980232, 42799716, 36693705, 28850899, 23060547, 21013984, 19035765, 15178958, 12290774, 12006787, 11747014, 9816306, 8313740, 8740925, 9180356, 8112796, 7171864, 7834506, 8742696, 8535572, 8369021, 9448066, 10696024, 10999576, 11430698, 13196033, 15486831, 17325779, 19573365, 23069031, 26449211, 27768254, 26929836, 24873806, 21800888, 17888151, 14399992, 12313111]
38155A2313111j433897j827457j787225q91555m13701p65336q16425k20636k8754
38146D128125m91008n29799R1787K72790k52843l86945J75980L64741j47426k98795
38136B926607K85159N75207J40969o7759L82569O13657K44563J64100P44070J057600
38126G066742O78662N47951J203961J800763J771107J870228K589125K993444
38118B0521983K170656N85786q97383k141546l077865l168361k400160j710090
38110I883020j631604j571281j082872o96519p86070p99013l73175q5158l23175
38101B534153n14247k29984J8184j64633k81198K4372K22695m9261k46100Q135
38091A322116J55192j91725m31370r9057K23218j905k61495N144L42843J68640
$$ y = [12313111, 10879214, 9051757, 7264532, 6372977, 5959276, 5193940, 4377515, 4156879, 4128125, 3637117, 3107318, 3199105, 3471895, 3219052, 2832107, 3008087, 3372828, 3225402, 2926607, 3211766, 3786973, 3927942, 3860183, 4242752, 4856409, 5100972, 5265072, 6009142, 7066742, 7745404, 8293355, 9497316, 11298079, 13069186, 14939414, 17528539, 20521983, 22692639, 23278425, 22381042, 20239496, 17161631, 13993270, 11593110, 9883020, 8251416, 6680135, 5597263, 4900744, 4114674, 3315661, 2942486, 2857328, 2534153, 2019906, 1789922, 1808106, 1643473, 1362275, 1386647, 1609342, 1560081, 1313981, 1322116, 1477308, 1285583, 854213, 755156, 978374, 976469, 714974, 720118, 1062961, 1231601]
38081A231601j47480l6832K37085K13768J24634K63050K44920k10936n32924k31876
38071A155010J64763K9170k61587r3652K21684O5110l33438l64233j27747r0445
38061C64635j46114M8921K66114J24863j17486m3439J09230n9233k73655r2131
38051A81705K06992J15634j53418p9955J92470J69961o0169o5441Q3553K8325
38041F19657j11955R329K34541J94212M8963J78181M02761K74504j09047l04570
38031A436576k91129l41409l83808j86831O5984N4462p1907K599J33859K5430
38021D43826j48465p0726Q9111K0878r3029M3581J89612l840k70689j68455J06034
38010A37838R3013p6328J4037K24544J40556r0519l1324J86219J06975j63638
$$ y = [1231601, 1084121, 1047289, 1284374, 1498142, 1622776, 1885826, 2130746, 1919810, 1386886, 1155010, 1319773, 1348943, 1087356, 993704, 1215388, 1280498, 947060, 582827, 455080, 364635, 218521, 267442, 533556, 658419, 540933, 497494, 606724, 547491, 273836, 181705, 388697, 504331, 350913, 270958, 463428, 633389, 573220, 507779, 591332, 619657, 507702, 517031, 751572, 945784, 994747, 1172928, 1575689, 1850193, 1741146, 1436576, 1145447, 804038, 420230, 233399, 299383, 353845, 281938, 284537, 418396, 443826, 295361, 224635, 313746, 334624, 241595, 285176, 474788, 470948, 200259, 31804, 137838, 230851, 154523, 168560, 393104, 533660, 443141, 411817, 598036, 705011, 541373]
38000E41373j58620O1762N6308j30902q6167J35544J19059q4553o2450J33969
37990E25323Q6689j55075j58755M4880J9546k19786k24717L4583J37256K0159
37980A10103K5361J47530L5631k41475k34974M4817J25968m7823m6931J76453
37970I4660J81338r1482j69449P2102J86350N271p3034J20213K01217k0869j86868
37959C19449o8571N5366o063j9086J26551J42049q6321k22527p9865M8322n3755
37948A55549j59322p6202J2930l3565l8908Q6899J25674j2688q1111M1236J19553
37937A40045K0346m6493M0649Q5777q951m1718O4470Q1960o5287j15256M1539
37926A97081J32875J088j07774Q69J37890J02364L167k0712l4208n8655L7535
$$ y = [541373, 382753, 444515, 500823, 369921, 283754, 419298, 538357, 453804, 391354, 525323, 612012, 456937, 298182, 343062, 362608, 142822, -81895, -47312, 89944, 110103, 135464, 282994, 318625, 77150, -157824, -113007, 12961, -34862, -81793, 94660, 275998, 184516, 15067, 87169, 273519, 278790, 205756, 325969, 527186, 506317, 319449, 250878, 306244, 300181, 281095, 407646, 549695, 463374, 240847, 160982, 209304, 155549, -3773, -79975, -67045, -100610, -139518, -52619, 73055, 60367, -20744, 20492, 140045, 160391, 113898, 154547, 240324, 231373, 189655, 254125, 336085, 270798, 155542, 197081, 329956, 331044, 223270, 224139, 362029, 464393, 467560, 446848, 412640, 353985, 391520]
37915C91520K14682K09029j9901j77535j29857r5340j78698j63123L0183J26863
37905B07823j7504j44987n6289O0425J6164n0038J3922R0993P0921O0694R7976
37894C50100J0607k18347l03601j00850J44521J97574J39807R0741p674j34998
37884A67880r8527R8101J61369j8068j69951j11818k0852m3542m0428O7202J02327
37873I3693K703k0405R2674R2012r3287j59586K8260J61001L5023q5655K4604
37862A71037J40041L0332j08639m6217N8937M851o2766J5985O1814p8011j74392
37851A2972k5922J28197J8520j65380j22770L2209K7621o6652l1811O2445L7097
37840i3474j4716O9007J62778R1676o338N6687J31849O060j72952j51323k5859
$$ y = [391520, 606202, 815231, 795330, 617795, 487938, 392598, 213900, 50777, 80960, 207823, 190319, 45332, -10957, 49468, 65632, 15594, 29516, 120509, 191430, 252124, 350100, 360707, 142360, -161241, -262091, -117570, 80004, 219811, 310552, 302878, 167880, 69353, 167454, 328823, 310755, 140804, 28986, 8134, -35408, -75836, -8634, 93693, 96396, 75991, 168665, 260677, 167390, 7804, 36064, 197065, 232088, 146433, 171037, 311078, 341410, 232771, 186554, 245491, 250342, 187576, 203561, 265375, 187364, 12972, -12950, 115247, 133767, -31613, -154383, -122174, -94553, -161205, -193016, -130571, -93474, -108190, -39183, 123595, 215271, 208933, 265620, 397469, 403529, 230577, 79254, 53395]
37829E3395l5239j09396m7320N8412O478q6979J4147J99095J78716q501q6204
37818A36604k7150l1519j04566o5853P1269J07817J7434l5934n415J0136j353
37807G1470K5971N5836K2403m324M8105P8666k690o8624O113R2180L1140p0746
37795B85500m8142J6043k1694o8563P331Q3508R663p5426L663R5521j4800j73948
37783I8656j02066R5209Q9799j07340j80598m1191Q4655P0286K1962R969p870
37772C1471r673N8638J13041M9857l8203j2409N3183J9074m7812k1061J8326m9148
37760A65284j11226l1490M9060m6916j69041q0328J05829J15773q794k3320O6871
37749C1702O9454j450M598L0284o4762j63630q3452L7038k7588j25831J8851K42735
$$ y = [53395, 18156, -91240, -138560, -80148, -73670, -160649, -146502, 52593, 231309, 222808, 136604, 109454, 77935, -26631, -92484, -21215, 86602, 104036, 68102, 62687, 72823, 71470, 97441, 153277, 175680, 171356, 219461, 298127, 295437, 226813, 232926, 325106, 356246, 285500, 237358, 253401, 231707, 163144, 170475, 253983, 263646, 188220, 191883, 287404, 272604, 98656, -3410, 91799, 181598, 74258, -106340, -147531, -62876, 7410, 29372, 39341, 31471, 21798, 80436, 193477, 243334, 205131, 192722, 245905, 264979, 217167, 196106, 214432, 165284, 54058, 22568, 71628, 24712, -144329, -224657, -118828, -3055, -11849, -35169, 31702, 101156, 99706, 104304, 134588, 69826, -93804, -177256, -140218, -167806, -293637, -274786, -32051]
37737c2051J68203j10299j46516R6687K03320L8718p1500J9332M4303j20103k01382
37726a11288l8263J31867J07732K8295L4413J4592j00507j43545k2660Q3185L4833
37715A8654m2077j2898M8735N0254M0529N3650K6312l0241q024P7064Q2154J004
37703C05116k5824O946m0427j51923j47669j6535M8384j1709n2516k8247m3917
37692a58321p9371K449J40656J21591k5965m9087P5518R8905l0852p3027M1500
37681F3996P6170n2998j05467L5246J42767O2290l4211p04L5512k2775m0769M3177
37669B02234M9160r7502j79441o3847N0922j1659j10543p3682P872N358K088Q4717
37657a34323J32265L9979o8156n3708J9130N2716Q4816J33997J02490k2270r5114
$$ y = [-32051, 136152, 25853, -120663, -23976, 179344, 218062, 146562, 165894, 210197, 90094, -111288, -149551, -17684, 90048, 118343, 152756, 167348, 66841, -76704, -99364, -16179, 18654, -23423, -36321, 12414, 62668, 103197, 156847, 183159, 152918, 144894, 221958, 304112, 305116, 279292, 286238, 245811, 93888, -53781, -70316, -21932, -33641, -86157, -114404, -158321, -237692, -235243, -94587, 27004, 1039, -48048, 27470, 126375, 95523, 22496, 63996, 140166, 87168, -18299, 16947, 159714, 222004, 187793, 187089, 222601, 199826, 159057, 202234, 251394, 153892, -25549, -89396, -38474, -50133, -160676, -234358, -226486, -221128, -219040, -134323, -2058, 37921, -30235, -83943, -64813, -12097, 72719, 206716, 309206, 286936, 191822]
37646A91822o0617l2874l9833K9478J39575R7834p2545j09775K0178L3897j42157
37635E4983j90439L8272K24264J15321n0972J4405J67317J37823o286o0354n8404
37624C85930j06486j11191J042O1731l2994p9153N8739J41048k8744j99310q2875
37613G737J28480R6996p5534o9352O4404L3513j30091j31929M3010J15279L987
37602H6500q2487m2553o50k4016l5053p934Q597L3291Q9981Q3944l5665j13411
37590c9456k5469P7396K7644m4597L8219J32374J7501j63026j11995J01071J52652
37579A62314J0809o0183Q162J8942p3297q5466K1599O7426r13k4532N0079P8924
37567A73864k311q7220j18120j35689j04597M0782J82896J34692l8304r3259K375
$$ y = [191822, 131205, 98331, 58498, 87976, 227551, 325385, 252840, 143065, 163243, 197140, 54983, -135456, -97184, 127080, 242401, 191429, 205834, 373151, 510974, 504688, 444334, 385930, 279444, 168253, 169295, 231026, 198032, 118879, 177618, 318666, 289922, 90612, 7737, 136217, 233213, 157679, 88327, 152731, 186244, 56153, -75776, -32766, 82513, 86500, 4013, -38540, -39190, -63206, -98259, -106193, -97596, -64305, 25676, 109620, 73955, -39456, -64925, 12471, 40115, -4482, 33737, 166111, 183612, 20586, -91409, 9662, 162314, 173123, 112940, 121102, 140044, 66747, -18719, 2880, 70306, 69393, 44861, 94940, 173864, 171553, 84333, -33787, -169476, -274073, -233291, -50395, 84297, 45993, -47266, -44891]
37556d4891N3021l004k4358K9900M0071k819K9753J20448R4126o1240j46684p8167
37544F156J0245L2672N0321O5498m485j01866n7118J03563J55969L8166o4548
37533B34573n1351l4659o7441l6076P8436J13531J1385o7013k4023K7828N946
37522A91136o397K7246K031r0651q6260N6861J35274K9336q5364l1899Q2299O9129
37510B92741l8670r1483p3844n5124j8351P0429J23986M7323q2635j11662l1070
37499C1640L1864R654l7394l3417J7616M8876Q173p1017q6561q0Q3026N1864k9398
37486B4846k991J38027K27455J55533j1128j50787k01053j45769k0360N8644l97
37475G2020j18206j30090j7809P6778O7277J0830k1319k0635J5534Q2504J11604
$$ y = [-44891, 8130, 5126, -19232, 10668, 50739, 47920, 77673, 198121, 292247, 231007, 84323, 6156, 16401, 49073, 99394, 164892, 160407, 58541, 1423, 104986, 260955, 299121, 234573, 183222, 148563, 81122, 45046, 123482, 237013, 248398, 181385, 157362, 185190, 191136, 184739, 211985, 214016, 123365, 37105, 93966, 229240, 258576, 173212, 141313, 223612, 292741, 254071, 162588, 88744, 33620, 15269, 85698, 209684, 257007, 174372, 62710, 31640, 63504, 73158, 35764, 2347, 19963, 68839, 77012, 5995, -80566, -80646, 2380, 54244, 24846, 21855, 159882, 387337, 542870, 531742, 380955, 179902, 34133, 13773, 72417, 72020, -46186, -176276, -194085, -117307, -50030, -39200, -60519, -81154, -65620, 16884, 128488]
37464A28488M5307m5653n2249j842J463l4709k7246O819o131k6296K7071Q4171
37452I9193K6092o9492l0634R4022R2151m8968j19090m5990N403n4286j00697
37441a52296m4136L1322N1745N0883L0510m8064r8430J2459J86116J70641l5715
37430A55035j56965p9462R74l4115l2357R0356J49076K2684j07941p0068J6494
37419d6289j0311o1845M672J04922Q5771l953k5270J3230K7290K8226M5871K1478
37407A83792o1047q6939n943M7127j9801q2915k1376O8844N6944J922J1864L9744
37395A32216L197m2119k3096L378j9337k7737P671p645q3030o1344Q6497J32750
37383A01401l4348j70383o4517R0593L2860j03896l3766J57937J53521m4135j24401
$$ y = [128488, 173795, 128142, 75893, 74051, 75514, 40805, 13559, 20378, 14247, -12049, 15022, 99193, 125285, 55793, 25159, 119181, 211332, 162364, 43274, -2716, 2687, -51599, -152296, -196432, -165110, -113365, -62482, -31972, -80036, -178466, -166007, 20109, 190750, 155035, -1930, -81392, -80418, -114533, -146890, -56534, 92542, 115226, 7285, -62783, -46289, -56600, -118445, -113773, -8851, 76920, 72967, 47697, 60927, 88217, 116443, 162314, 183792, 122745, 35806, 29863, 76990, 57189, -25726, -47102, 21742, 78686, 80608, 92472, 132216, 135413, 93294, 70198, 73576, 54239, 26502, 34173, 26528, -56502, -117846, -31349, 101401, 67053, -103330, -167847, -77254, -44394, -148290, -182056, -24119, 129402, 85267, -39134]
37372c9134j360P5121k5985j21099n7972N3035O8511K8470K8011N6377N7141J4598
37360A35714o5263j42776j19882L5681J72467J24548l7465j07629n8458m0253
37350a03316q7327o7483M6936R6935M171q3890k4005J04523J28439K2109q3989
37339d6897p7848K1667R9189O4599m1826q8973k8979L2806L147n1245k4572M3715
37327i5217M3460j0296j0764M8857P3802M1057K2950L6782J1711p5482j48242
37316f1382j37748n6438M3374J14134J26354R7967Q2934Q2165K7713q6498j49357
37305H3218r2089k693K1980K7136P5562R0755r615j24447j04649k916J3710n2708
37293g6756m9326M8630R5236K7830l5205n98O0119M3829l2583p8589m9697K1326
$$ y = [-39134, -40494, 34627, 8642, -112457, -170429, -117394, -48883, -20413, 7598, 63975, 121116, 135714, 70451, -72325, -192207, -156526, 15941, 140489, 103024, -4605, -63063, -103316, -190643, -258126, -211190, -114255, -110084, -193974, -217979, -113456, 14983, 37092, -46897, -124745, -103078, -3889, 60710, 18884, -70089, -99068, -66262, -63115, -114360, -138932, -95217, -51757, -62053, -72817, -23960, 49842, 90899, 113849, 150631, 162342, 86860, -61382, -199130, -255568, -212194, -98060, 28294, 126261, 209195, 291360, 319073, 232575, 83218, -8871, -11564, 10416, 37552, 113114, 203869, 194254, 69807, -34842, -37758, -24048, -76756, -126082, -77452, 17784, 45614, 10409, 9811, 69930, 113759, 81176, 2587, -47110, -25784]
37281b5784O4827L7056k5714m2963n081J5467K164L2803J13901J12209l7888j87746
37269E3251j72494m2248M5441N0783K2630l5117j07247r8057J4250Q1930J8488
37258a68390k9254N9425J26683K544j49162p3408J23256J31168l4453o3896J05758
37247C0271J89178M9814q7952m2367N1521K8842l1752J111P5567Q0803L0764j2859
37235C62941m8711o5810j6769O0573N0781m7768j02470o5893l6647n6866m5864
37224a2503J2247K2065k1252Q86R0290Q3594o3663j66424r6652K6597N5800L0158
37212c8857M2832O9022N6614L4947K1721l0737j05630r7297J372N7859K0994n615
37200B7225J6590j4282j06678j07584J1383N2076p0820j44688j1621J38677P5667
$$ y = [-25784, 39043, 76099, 50385, 7422, 2341, 17808, 19972, 52775, 166676, 278885, 240997, 53251, -119243, -161491, -116050, -65267, -42637, -77754, -185001, -283058, -268808, -186878, -168390, -197644, -138219, -11536, -8992, -158154, -231562, -108306, 22862, -11591, -75487, 30271, 219449, 269263, 181311, 138944, 190465, 219307, 187555, 188666, 264233, 345036, 375800, 362941, 314230, 248420, 231651, 292224, 343005, 295237, 192767, 126874, 90227, 33361, -12503, -256, 21809, 557, 1443, 91733, 175327, 111664, -54760, -151412, -124815, -69015, -38857, 3975, 72997, 129611, 164558, 186279, 155542, 49912, -47385, -46013, 11846, 32840, 27225, 43815, 29533, -77145, -184729, -173346, -121270, -192090, -336778, -348399, -209722, -134055]
37189a34055q2088o8723R1449J48805M0899m7160k656Q1878R8196M7840l0487
37178A43898j03732j15690m2286L9607M5827J1214J8840N3604L8297k8389p5553
37167a4363o5196j0653O1923J02752N6921m2527q3574l6350J152j9852j2811O6771
37155D193J09536L6649n0450m4437j6208o5777j19647n7776O4079J06528P5033
37144D1723P0424Q4430L4478n0909o8231k7763l2605q8963r7143k4198N3701P6599
37132b8457N2446m48n8629o7867r120M6071L3527l620O81K4045K5244L8171Q3380
37119A35424P8757k8743j29655r6283J6601O3590K5953j6461n2664j08488j14487
37108b26456O795J64022J91018R0374Q244q621m7149j26328j45845o2540L4820
$$ y = [-134055, -216143, -284866, -193417, -44612, -3713, -50873, -53529, 28349, 126545, 174385, 143898, 40166, -75524, -117810, -78203, -32376, -21162, -2322, 51282, 89579, 61190, -14363, -79559, -90212, -28289, 74463, 131384, 88857, 5283, -31067, -29915, -49767, -62578, 4193, 113729, 150378, 99928, 55491, 39283, -26494, -146141, -203917, -139838, -33310, 41723, 112147, 196577, 231055, 180146, 111915, 84152, 51547, -37416, -134559, -158757, -105056, -28457, 23989, 23541, -35088, -102955, -112075, -66004, -32477, -36097, -35416, -11371, 13873, 52044, 135424, 214181, 185438, 55783, -40500, -23899, 39691, 65644, 49183, -3481, -111969, -226456, -219661, -55639, 135379, 225753, 233997, 225376, 178227, 51899, -93946, -156486, -121666]
37097a21666O0343K2555l3166o9360m7784K5701P0759M2958K1950P4762J07626
37086A54678J1416j15604q8290O1225J18268K3442m9159O353O3823p691j31123
37075D7338j53140o3381L0857O3496M5885K461m7590p3762n3975j700M3544M3723
37063a16244o672o0259n9251j6385L219J518N3573J48680J51333J0552j23191
37052a3127j15509n1029n9094o8538N0635K01399J70281j7681j12590j6956R1234
37041E9025N6589m7848q3135l7120J9740L6369j0634r5325j15372r848J09718
37030a17841R3289j1004l4727K5348K2818m2284k840J54413K14898Q0059o5011
37019C17118n9002p327n4065j19439o4408M4323M7414l9680p4945l1424m435k3963
$$ y = [-121666, -61323, -38768, -71934, -141294, -189078, -163377, -92618, -49660, -27710, 47052, 154678, 166094, 50490, -37800, 23425, 141693, 165135, 115976, 122329, 186152, 178461, 47338, -105802, -169183, -138326, -74830, -28945, -26484, -74074, -147836, -201811, -203511, -159967, -116244, -122916, -183175, -242426, -258811, -255592, -254074, -200501, -51821, 99512, 110064, -13127, -128636, -179665, -238759, -307297, -256662, -55263, 115018, 97337, -15253, -32209, 59025, 115614, 67766, -15369, -52489, -32749, 3620, -7014, -102339, -217711, -227559, -117841, -24552, -35556, -70283, -44935, -22117, -64401, -67241, 87172, 302070, 382129, 317118, 258116, 250789, 196724, 77285, 12877, 57200, 104614, 64934, -10011, -41435, -45870, -69833]
37007f9833k8479m010l543l0740k3121L9599R7569R1835K6969m7362q2335o8390
36995a01841m4415m6061m9970j6385K9372L3780J8460M6564R3392P1212j0664
36984B3444m5782r928O000k4480j2233O3012Q4367j811p7290m7576M213k1723
36972e9787o8137m3833N164m765l0748Q695P1373O8895L0307L8412O9734M8671
36960A33981L672J5062N0225O309j05599j64592j21614m9970j6471j3141j4037
36949b76175k125M9834J34525J67642Q4427m5220r4352m7858K507N232j0170j7222
36937d8955j6893L164M1691M5401r799m4219J0187P5000M1548l1701q247P4030
36925A31207M3364j05445j71037o4813M4715J3229n2319k360Q5779M5850p8832
$$ y = [-69833, -98312, -102322, -105865, -136605, -159726, -120127, -22558, 69277, 96246, 48884, -33451, -101841, -146256, -192317, -242287, -258672, -229300, -195520, -177060, -130496, -37104, 34108, 23444, -22338, -32266, -26266, -50746, -62979, 33, 84400, 82589, 5299, -42277, -38064, -59787, -127924, -171757, -166593, -171358, -202106, -193411, -122038, -53143, -22836, 15576, 85310, 133981, 137653, 152715, 202940, 209249, 103650, -60942, -182556, -232526, -248997, -262138, -276175, -278300, -228466, -93941, 73701, 158128, 112908, 18556, -29302, -26795, -21563, -31733, -48955, -65848, -62684, -20993, 24408, 14609, -29610, -19423, 55577, 97125, 65424, 57177, 131207, 174571, 69126, -101911, -166724, -122009, -108780, -161099, -163459, -77680, -31830, -110662]
36914a10662r3574L5005J31846Q4722j9535o5752n7516l5021J3875P9389Q0598
36903D3375j4734j07658r9583l2773k253J542M3651R2601N9152l2624n9581K810
36891a06075M0180m914l7717J8015Q1972N1266k7761l9636J7492M9204K1642j1857
36879E1811j6269q033j67K879k0037o0830n1461L4387R9020M6046o1297r2252
36867g6203n3517n1333p9609k7448R4053J26776K2580n7728L138Q8343L8328r1223
36855f3843j16652j581J04707Q4778j0169n2401J0364J12476J42661N6456o9853
36844A96943j17476o2595M447N222l7225n5455k8045J6418L8546Q041o8524j22116
36832b21819p6649M8785J42757J25480K6184o9245r8420n2359J8433L5288j3534
$$ y = [-110662, -204236, -169231, -37385, 47337, 27802, -37950, -95466, -130487, -116612, -37223, 43375, 28641, -79017, -178600, -211373, -213626, -212084, -168433, -75832, -16680, -49304, -108885, -106075, -65895, -70809, -108526, -90511, -8539, 42727, 14966, -24670, -7178, 42026, 63668, 51811, 35542, 27509, 27342, 30221, 10184, -50646, -102107, -67720, 31300, 77346, 16049, -76203, -129720, -181053, -260662, -288110, -194057, -67281, -44701, -102429, -99291, -10948, 27380, -63843, -180495, -182076, -77369, 7409, -2760, -55161, -44797, 67679, 210340, 266796, 196943, 79467, 16872, 21319, 26541, -10684, -66139, -94184, -77766, -39220, -31179, -99703, -221819, -298468, -249683, -106926, 18554, 44738, -24507, -122927, -175286, -156853, -121565, -135099]
36821a35099l5217L5539J11381P2514k7316k8597P0862J00076n405r0767k6015
36810D1956R8210J23616M5906k6111l5541l232L3388L1128l4389j03774q4266
36799H6891j230K0675l4753m0773L7115N2389o9137j67516r2880M5272N5738l1564
36787a39773m2145M7777R7146M0976l8097o6149n3045j6537M0623Q1887O8649
36776B1312K7967P028m300k9023l8009j1930J889j8509p691N7454P0917l0882
36764D6223j17198m3672J04231J30496K6133m4746j6076J8783N267k34K8752L8584
36752A76543R955j4470l0259p1111j04565n8456M2545R4145P2940N6347P8117
36741B51731Q8149O3499L6660L785p3518j59738j57081n1455N3851P5241L6950
$$ y = [-135099, -170316, -134777, -23396, 49118, 21802, -6795, 64067, 164143, 158738, 67971, 41956, 140166, 263782, 309688, 283577, 248036, 244804, 278192, 309320, 274931, 171157, 86891, 85661, 106336, 71583, 30810, 67925, 120314, 51177, -116339, -209219, -163947, -108209, -139773, -181918, -134141, -36995, 3981, -34116, -100265, -153310, -169847, -129224, -47337, 21312, 49279, 56307, 52007, 22984, -15025, -26955, -25066, -43575, -51266, 6188, 77105, 46223, -70975, -114647, -10416, 120080, 146213, 101467, 85391, 104174, 109441, 109207, 137959, 176543, 186498, 172028, 141769, 70658, -33907, -92363, -49818, 44327, 117267, 173614, 251731, 339880, 403379, 440039, 443824, 370306, 210568, 53487, 2032, 55883, 131124, 168074]
36730A68074P984K0575N4342N0937k9598j25094j13744k29M7854n2052j41093
36719a12044n8199R0140R4708k4752q0097l2164J595R849Q8271J86783J33913
36708B98003n1625j38637l6992P2793M3459m0351o4617o6054r4850r4257l5619
36697b08747K028p234K7996J19008J24961l774j00876m2069N3152L4277l6189
36686c7467k9315J0368k8717r3057m5415R0141J52442P7139m5832j19780j20026
36675a89519n6182L3841P9934N4676J3494M3j6364m6127k3330O8744J22762O4674
36663A06646j6985j6188K0252J146l2282M500N8853K5094n1662m0036M3692N4316
36651A57346l4457q5087k6741L8694J7851l2136k2994J6747Q455l7083m4821l754
$$ y = [168074, 176058, 196633, 250975, 301912, 272314, 147220, 33476, 33247, 81101, 29049, -112044, -170243, -80103, 14605, -10147, -90244, -122408, -120813, -110964, -22693, 164090, 298003, 246378, 107741, 70749, 143542, 187001, 146650, 82033, 15979, -78871, -173128, -208747, -206719, -213953, -185957, -66949, 58012, 54238, -46638, -88707, -35555, -1278, -37467, -66782, -56414, -85131, -178188, -223603, -133462, 18980, 96119, 50287, -69493, -189519, -245701, -211860, -131926, -77250, -63756, -63713, -80077, -126204, -149534, -80790, 41972, 106646, 89661, 73473, 93725, 94871, 62589, 67089, 125942, 151036, 99374, 59338, 103030, 157346, 122889, 37802, 11061, 49755, 67606, 35470, 12476, 29223, 37678, 595, -44226, -47980]
36639d7980J9520o316k4035K2028Q9935Q9856J7952k7994P964N1041J2494o5695
36627A38770p8298k8313j1417m3730l8924K7667O7626L1900j2749j3092j2688
36616B6752m1222m0950J5494M4256j8592r7342q3424J2505R8564J21525P8554
36605A16120j2715q8625o8899K3282O3772J1699k2767L1593Q2706M2776j6482
36594A62460o994O239o3102j33289p8360M2202O8994L040j3510M9976P1838j748
36582A07746o8543l8371M5375R1930O9300q68p0838p9705j2281O0112O3190J7539
36570A84586j4441l0764n5209n9987k5216j4303p2394j12998m2698O1031N5912
36559a26481k9167m3952K4941M2150k8301o6751k3860j144l9244j9614J18230
$$ y = [-47980, -28460, -34776, -58811, -36783, 53152, 143008, 160960, 132966, 140930, 191971, 204465, 138770, 60472, 32159, 20742, -22988, -61912, -34245, 33381, 65281, 52532, 39440, 26752, -14470, -55420, -39926, 4330, -14262, -111604, -195028, -182523, -83959, 37566, 116120, 103405, 14780, -54119, -30837, 32935, 44634, 21867, 53460, 136166, 178942, 162460, 155466, 161705, 98603, -34686, -113046, -70844, -1850, 1190, -12320, 37656, 109494, 107746, 39203, 832, 46207, 138137, 207437, 206569, 135731, 56026, 43745, 103857, 167047, 184586, 170145, 139381, 84172, 24185, -1031, -15334, -87728, -200726, -243424, -182393, -126481, -155648, -199600, -174659, -132509, -160810, -227561, -251421, -252565, -291809, -311423, -193193]
36548a93193K30569J74756K9560l5217j1316j9366q4754j05609l4673M3440M4301
36537C8498n513l0904j5250R31r625l3245m1165j4320M3634R0797O3112m7134
36525C9816j35868q1673P9713J58654N3188r6019r8342J2212M9557j9267l9319
36514g7348M7252R6048J6984o4892k6935M8658L9900q56K9939P7755L2498n7848
36502A61155o6303m379K2615J0730K6321M3013m198n9194k8975K7998l705o9706
36490E5372l2018O5071N7405l6021l3396Q0237J13652K207q5421m6870J377l1170
36478A10425n3587l599J4143n8927r2911K087R4720N0602l9428l3073J4110k5867
36466b1305j02602p4914L3866P3633J1043m9403n5120m7051l2150K5755R1110
$$ y = [-193193, 37376, 212132, 241692, 206475, 195159, 175793, 91039, -14570, -49243, -5803, 38498, 32985, 2081, -13169, -12238, -21863, -55108, -96273, -110593, -66959, 23838, 86950, 39816, -96052, -177725, -98012, 60642, 113830, 17811, -80531, -68319, -18762, -38029, -77348, -30096, 65952, 82936, 18044, -8891, 39767, 79667, 78811, 108750, 186505, 219003, 161155, 94852, 90473, 113088, 123818, 150139, 193152, 188954, 129760, 100785, 128783, 125078, 55372, 23354, 88425, 145830, 109809, 76413, 156650, 270302, 272509, 187088, 140218, 141595, 110425, 56838, 53239, 67382, 8455, -84456, -82369, 12351, 62953, 23525, -9548, 4562, -21305, -123907, -198821, -164955, -91322, -80279, -129682, -184802, -231853, -264003, -238248, -147138]
36455a47138P7035p340n2120o771N7822O6613L2629Q284J0149J5633j784l9408
36443A3604n2019J170Q0003Q8387P333o5589n7317k1105k9270m6541o549N3814
36431c4079N2006O317K709M0384L5558k4010n2143j2756J9931p223l5604j190
36419a0100M7763K4628n1063p7224k6053J6492o669k7050L6289J26192J12525
36408A65730o818q7412n1821k880m5990j04852m2195J01141J43220K7038r7775
36397b614q9212J4823Q9500Q8937N3464J7831k1829p4497j20953j10291j0839
36386a65680J09667J12386l3731j62594j08576N8230J31600O5366K68M544j4710
36375c230r8784j30034l0840Q6835Q3846j0302o8303l8076M4143J27761J56809
$$ y = [-147138, -70103, -77443, -129563, -136334, -78512, -11899, 20730, 29014, 39163, 54796, 53012, 13604, -38415, -37245, 42758, 131145, 138478, 72889, 15572, -5533, -34803, -81344, -87893, -34079, 17927, 24244, 26953, 67337, 102895, 78885, 26742, 13986, 33917, 26694, -8910, -10100, 37663, 62291, 11228, -65996, -92049, -75557, -82226, -109276, -72987, 53205, 165730, 158912, 71500, 19679, 16799, -29191, -134043, -176238, -75097, 68123, 95161, -2614, -91826, -77003, 12497, 101434, 154898, 172729, 150900, 76403, -44550, -154841, -165680, -56013, 56373, 22642, -139952, -248528, -190298, -58698, 6668, 6936, 11480, -3230, -102014, -232048, -262888, -176053, -92207, -102509, -170812, -208888, -164745, -36984, 119825]
36364A19825Q7243l7542j08405r5691p6866q2331m1911N8750J11518N8126p827
36353a5111m834P521l0477m8135J6710P6319L6595k7085P614R9023J08453J4730
36341B41323p8884j01466n8708K4708J00877R8955K3960k1466K712J415p1605
36330A61821r8369j237Q3323J2647j09938r6207K0133O2302J6126J8929Q8998
36319A58528J01710K1023n9705j00601j38095j38671l7032Q6897Q1427k3769n2086
36308a00374K5409N6442q222l6055K8885O6002J7836K092P6390J04347o552j18845
36296A07355p4772N3398Q2886j6614j24269j51245r8602J39Q9016R9848L4194
36285A334k2037j9805m465q024R975N6199N6451j0210m9581j1510J1103n3402
$$ y = [119825, 207068, 169526, 61121, -34570, -111436, -193767, -235678, -176928, -65410, -7284, -15111, -19945, -12424, -42901, -91036, -74326, 1993, 38588, 11503, 19117, 118140, 226593, 241323, 162439, 60973, 2265, 26973, 127850, 226805, 250765, 229299, 232011, 233426, 161821, 63452, 62215, 145538, 158185, 48247, -47960, -27827, 34475, 50601, 69530, 158528, 260238, 281261, 221556, 120955, -17140, -155811, -192843, -105946, -24519, -48288, -100374, -74965, -18523, -26745, -62800, -33915, 32087, 49923, 52015, 128405, 232752, 226200, 107355, 32583, 85981, 168867, 152253, 27984, -123261, -221863, -221724, -132708, -32860, 1334, -20703, -40508, -44973, -52997, -43022, 13177, 69628, 59418, 9837, -1673, 9430, -43972]
36273d3972j11911n4978N3461P6754J7374j6648J258O843j5304j9705p983k6125
36261a40936o3444o1485j6658J9998L3275M5545M6978J5549j3461O115L5190M362
36249h8972n0155k3966P9472J34820Q2607R975k507J727l7896p8223n5875j3880
36237d2873l1400p6630n3209K8956O1820K7008L4767J22832J54867K7199j31788
36226A21549j21414L1211J05100J1007r9126r0506l3390l5517m4547L4387J34596
36215A3350J14643p293p4695k9533K7131J7183j4479j1268L170j4075o0464j12516
36203a48846j40103r0557N2882J92002J92856N9274o8892j02018p9537m9493N474
36192a76958Q0850J08314O2199Q725r498m1064j14327j55121r5979J0194O6185
$$ y = [-43972, -155883, -210861, -157400, -80646, -63272, -79920, -78662, -71819, -87123, -106828, -114811, -140936, -204380, -265865, -282523, -262525, -229250, -183705, -136727, -121178, -134639, -128524, -93334, -88972, -139127, -163093, -83621, 51199, 133806, 143781, 141274, 143001, 105105, 26882, -28993, -42873, -74273, -150903, -204112, -175156, -113336, -86328, -51561, 71271, 226138, 253337, 121549, 135, 31346, 136446, 147453, 48327, -42179, -75569, -111086, -155633, -121246, 13350, 127993, 120700, 46005, 16472, 43603, 60786, 46307, 35039, 38209, 24134, -36330, -148846, -288949, -379506, -326624, -134622, 58234, 117508, 48616, -53402, -132939, -182432, -176958, -96108, 12206, 74405, 83130, 73632, 32568, -81759, -236880, -332859, -322665, -256480]
36181b56480N8184L5859K2859J6090K2897L7201K6914l615L353O1625R3583M2353
36169A60823l4372n4341l2953l4503n4390m1225j888P900j4959j0397M9153J13025
36157E1873J14945M6890l5249o4621k9840Q812q057n8391p5418n3974m7838n8508
36145b09376k0360P3908J29468Q3398l371m8162n7532o7605n6142O15N3993N6997
36133f4169N0397P9543Q6490j045j17109j22252q584Q1951N6829j8264m1092j0381
36121b7686Q782q161l1182l5511k6034j1298J0954L4503L2468j1747o1474m8543
36109a74929L6228J06960Q4642Q276k2255N842J6326j4752k4571P192J2039l1555
36097I443l0804O9653J66335J31799p82r7284j12465j05734j02412o0056K6986
$$ y = [-256480, -198296, -162437, -139578, -123488, -100591, -63390, -36476, -40091, -36738, 24887, 118470, 160823, 126451, 72110, 39157, 4654, -49736, -90961, -92849, -84949, -99908, -110305, -61152, 51873, 166818, 213708, 178459, 113838, 83998, 92810, 84753, 26362, -49056, -103030, -150868, -209376, -229736, -155828, -26360, 57038, 53667, 5505, -52027, -119632, -175774, -175159, -121166, -64169, -13772, 65771, 152261, 151216, 34107, -88145, -96729, -14778, 42051, 23787, -17305, -27686, -18904, -27065, -58247, -93758, -119792, -131090, -120136, -85633, -53165, -64912, -126386, -174929, -138701, -31741, 52901, 61177, 38922, 44764, 61090, 46338, 21767, 28959, 40998, 9443, -21361, 48292, 214627, 346426, 345644, 248360, 135895, 30161, -72251, -132307, -105321]
36086a05321R0442P7792J5059l4469l2399J1866M6291J9091n4083r4220n8901
36075a18852N322M4248O9125R7697R1096K5211l4243j8692K6800J0627n6188q1059
36063F1092m1269r513k7669n0945l3080J1306M7739O1877M5975J982l3239j8061
36051A6195L1839N7675L5020o746l7512n2065m6860j8801J1813J6791j022j3745
36039g418n585J9331M7309N2267J5118k9542j3264O1979R3736R479j20261j64274
36027d1125q9600K4956R8240J03983N0608k8121q1573r1429q4078o0510K1996
36016a76653J43585J80389O3427q9054j12012j7709M2930J0148k5703R665P3096
36005A02109Q8467L7378n1175j24999j20352k4209Q0169J01318N4379J1861k1487
$$ y = [-105321, -14879, 62913, 77972, 43503, 11104, 22970, 69261, 88352, 34269, -59951, -118852, -113530, -69282, -157, 97540, 188636, 213847, 179604, 160912, 187712, 198339, 142151, 61092, 19823, 10310, -17359, -68304, -101384, -90078, -42339, 19538, 65513, 67495, 34256, 16195, 48034, 105709, 140729, 133983, 96471, 44406, -2454, -21255, -9442, 7349, 6327, -7418, -13003, 6328, 53637, 105904, 121022, 91480, 78216, 140195, 233931, 243410, 123149, -41125, -130725, -105769, -7529, 96454, 147062, 118941, 37368, -54061, -138139, -198649, -176653, -33068, 147321, 210748, 121694, 9682, -8027, 34903, 45051, 19348, 29013, 102109, 190576, 227954, 176779, 51780, -68572, -92781, -12612, 88706, 143085, 154946, 133459]
35994A33459p8624j08139j9853J43664K16071J20855l5049j16541j07887o7359
35984H0597l1719j5677k8861m5071j4528N8260J03332P7612J7093k0947k0194
35973A59897j317P59l7895q5052o2734L8652J04332M0483p2658q5797O95N6854
35961E6219L6215J6522L0194J4592m5429p8213o2972o0343p1979k6018N5893N0236
35949h5083m5472o4800N5680J39400L9914j17398j31628k6878L3889K7869N3656
35938a20851J01400O6774k1717p829J26493J93322O9625j18400j75759q7894J1878
35927C7042M0732K3927L01k5999m6968m3475k6564k8728m1293j3041O2552J04328
35915D2814L5193j03589j81174j21295K4183J48823J91116J50148N9312k4049
$$ y = [133459, 54835, -53304, -73157, 70507, 286578, 407433, 372384, 255843, 147956, 80597, 48878, 33201, 4340, -40731, -55259, 3001, 106333, 183945, 201038, 180091, 159897, 158580, 159339, 121444, 36392, -26342, 12310, 116642, 157125, 84467, -1330, -635, 56219, 92434, 108956, 139150, 153742, 108313, 30100, -32872, -93215, -165194, -191212, -135319, -85083, -130555, -195355, -139675, -275, 39639, -77759, -209387, -236265, -202376, -174507, -120851, -19451, 47323, 25606, 17777, 144270, 337592, 407217, 288817, 113058, 25164, 37042, 77774, 101701, 102002, 76003, 29035, -14440, -41004, -69732, -111025, -124066, -61514, 42814, 78007, -25582, -206756, -328051, -303868, -155045, 36071, 186219, 245531, 221482]
35905B21482m9879l1296k7219m3895j8119O1449R8957L0633n8512n7512m041j3938
35893A08110q0940q5096J1597J08508J11700K6444r2230j73521j33798K6691J48254
35882b4281Q2971o9185p3536Q0434J44441l289j57288r6206Q9906J54827N0337
35871A79131n7316n2254J6548N6592L6733k1118o8495o3696k8614k6879m8838
35860g8206m733J11013J58413M8522j00154j20531k9703K7608M533j8468O129
35849D423L5656L0986J887l5564o4507m8020K1306Q0040P2380L1599J3211L83
35837A43780m0262o7178l0897J6464q647p6118q1447q320N7467O2990L4205l014
35825i77m8028p4653m6329J5824N3519N0482K7232j1761n1322l1409O3951J26601
$$ y = [221482, 171603, 140307, 113088, 69193, 51074, 112523, 211480, 242113, 183601, 126089, 122048, 108110, 27170, -57926, -46329, 62179, 173879, 200323, 108093, -65428, -199226, -172535, -24281, 58690, -10495, -84031, -3597, 140844, 137555, -19733, -115939, -26033, 128794, 179131, 121815, 69561, 86109, 142701, 179434, 158316, 89821, 26125, -2489, -29368, -78206, -82939, 28074, 186487, 235009, 134855, 14324, -15379, 12229, 16762, -1706, 4423, 40079, 71065, 72952, 37388, -27119, -75139, -53833, 26207, 98587, 130186, 143397, 143780, 103518, 36340, 5443, 21907, 13260, -62858, -144305, -152625, -95158, -32168, 2037, -977, -49005, -123658, -169987, -154163, -100644, -50162, -22930, -34691, -86013, -117422, -53471, 73130]
35813G3130M8765j01710j54894p1699K5901N2825N0873O3134N5795J0735k0121
35802C2734q225P2k2523k8864Q410L2484k159m3049k3491K2644J1592n5178q5787
35789a61340k6782O3309Q7392K3161n8593p6885k3950L5821L7889k0102p8394
35778a98474o7992J9667J02392Q0912k5679p0451K8267J42414R8594n3703j01631
35767d5684K942P1550p809r4858n3537J5334k2497o8844L5665J91573J58216n7665
35755A24386j94786j23743N347M2680L4185N4688M9798l4342j13237q2474K5262
35744b12236J02939J09908P0776R349m4456m8318q975J0644j0629j8469J1584
35733b7883J9653k9847o5220r392R0698J15394K8730p6344q6718M570Q4970M5475
$$ y = [73130, 121895, 20185, -134709, -206408, -180507, -127682, -76809, -13675, 42120, 52855, 32734, 24509, 24581, 2058, -26806, -18396, 14088, 11929, -31120, -54611, -31967, -20375, -75553, -161340, -188122, -124813, -37421, -14260, -72853, -149738, -173688, -137867, -99978, -120080, -198474, -266466, -246799, -144407, -63495, -89174, -159625, -131358, 11056, 109650, 55947, -45684, -42742, 28808, 20999, -73859, -127396, -112062, -134559, -203403, -167738, 23835, 182051, 124386, -70400, -194143, -188796, -146116, -111931, -57243, -7445, -41787, -155024, -237498, -212236, -109297, 611, 71387, 80736, 36280, -12038, -21013, -10369, -20998, -39467, -27883, -8230, -38077, -103297, -112689, -21991, 93403, 122133, 45789, -40929, -36359, 48611, 94086]
35721I4086p5424j18545j6767Q8170L5155j10320j40226r486J07901Q9123K0360
35710c5973J8202M5253J0421n8838o7247q157M1742M6805L8400L6696K3873p300
35698H3877l2002k7070j156J1940r413l6177j0613O4788R8297K5469q2352j04802
35686a9214l8259J8919K3962K2365L2568J9256r304J803M0589L0580k9695n3117
35674D0453k0129j7578p6972j06904m9408K0487K4470l460o778l897j7308q257
35662b25281L6991N3367Q398l0467j7111r168m3938m5482L9603J20925R8933K5793
35650A2563M285J3456k3638p1190l5446N5814Q1896K0668k6273O94M7909N1764
35638A32502J5188k7698m5586j3492M8275N9925j8470j05085j00041l5624j9045
$$ y = [94086, 18662, -99883, -116650, -28480, 6675, -103645, -243871, -253357, -145456, -56333, -35973, -17771, 27482, 37903, -20935, -88182, -96339, -54597, -7792, 30608, 67304, 91177, 83877, 51875, 24805, 23649, 35589, 26176, -10001, -20614, 44174, 142471, 167940, 85588, -19214, -57473, -38554, -14592, 7773, 40341, 59597, 50293, 52096, 92685, 123265, 93570, 40453, 20324, 2746, -74226, -181130, -230538, -210051, -185581, -189041, -195819, -199716, -217024, -225281, -188290, -134923, -126525, -156992, -174103, -183271, -227209, -272691, -233088, -112163, -13230, 12563, 16848, 30304, 6666, -64524, -99970, -44156, 37740, 58408, 32135, 32829, 80738, 132502, 147690, 119992, 74406, 60914, 109189, 169114, 150644, 45559, -54482, -90106, -109151]
35627a09151n3870m4195K5784N2131j2912o7806j5307Q2200R4453K0629q181P4001
35615C7776J58584J04415n9181j56447r7905K302K23o5884m7346P0881J37794
35604H5212O3285n4713q2499k1397M0245N5598K8848k8179p9320o7856K820N3536
35592d420M1881J7629K0906J4857k3431m2213j5492m821l9330l6192N9470J49329
35580A38173J09818l0548j48632j86619j51594m2322J02541J64913Q8689r965
35570C4454m792M6377J6737o1582o4699j3061l6339j22995j15362K2021J25329
35559a73912Q2518n245L375Q4906J13930M6182m6246p9289m2399J194j3535o5980
35547i4501o3651K2754R6457P2026O418l264J5367k6718j04518j11792m1094J2592
$$ y = [-109151, -163021, -207216, -181432, -129301, -142213, -210019, -225326, -143126, -48673, -28044, -36225, 37776, 196360, 300775, 241594, 85147, -12758, -10456, -10233, -76117, -123463, -52582, 85212, 148497, 93784, 11285, -10112, 30133, 85731, 114579, 86400, 7080, -60776, -57956, -4420, 37461, 55090, 75996, 90853, 67422, 25209, 9717, 4896, -34434, -70626, -11156, 138173, 247991, 217443, 68811, -117808, -269402, -311724, -209183, -44270, 44419, 34454, 29662, 76039, 92776, 31194, -33505, -46566, -82905, -205900, -321262, -299241, -173912, -91394, -96639, -93264, -8358, 105572, 151754, 105508, 26219, -16180, -14986, -28521, -94501, -158152, -135398, -38941, 33085, 39503, 36239, 51606, 24888, -79630, -191422, -232516, -219924]
35535b19924J1349j180j5473n0030m9367M9230J55898J13222m6802j13230K009
35524a64298J48282J68443P7963l8022j34145j52563m0552J04303Q6908r5743
35514c9424k00278q2795Q7995J05435K9596L2131R1733O7115k8873n8819j0317
35503f501J468m2044l9856K5963N4917J7372K928M1844M4240k6580p4432l7317
35491c7998O963q481j5553M7671Q8915L695j16719r5096M6456R8834j1977r9889
35479i3179l654J59399J68579K5846o8575k3632M2939K6135j8343j0233J6597
35468B21879L895j6249O75J0787l2814p1367l2044L6123L8524n399o161L1140
35456A78989J9722n0163r4032p1292k6204O964L3981M3563K3426J7308N9986Q5071
$$ y = [-219924, -208575, -209755, -225228, -275258, -324625, -275395, -119497, -6275, -53077, -166307, -164298, -16016, 152427, 230390, 192368, 58223, -94340, -134892, -30589, 56319, -39424, -239702, -322497, -234502, -129067, -99471, -67340, 24393, 91508, 62635, 3816, -6501, -5033, -47077, -86933, -60970, -6053, 11319, 14247, 56091, 100331, 73751, -681, -37998, -31035, -39516, -55069, -7398, 81517, 85212, -31507, -126603, -80147, 18687, 6710, -93179, -96833, 62566, 231145, 256991, 188416, 164784, 207723, 233858, 215515, 205282, 221879, 225774, 209525, 210200, 220987, 188173, 116806, 84762, 120885, 159409, 154010, 147849, 178989, 198711, 148548, 54516, -16776, -42980, -36016, -2035, 41528, 64954, 82262, 142248, 227319]
35444B27319K0960n8787l3440M6811K4083r3263j28420l5599K1295l8994o8046
35433a16081M4648J59170J05608m1318r0596k1134M2394N2416N6284N0818o912
35422B35297p6160p6461l3543l6976p0663l4133O8634J10543L7397m9833n3089
35411B1013m844J9557K2302M1927N7443J7755n8595q6565k6028N7649O9035m981
35399A25668q8671j15359r2414n7072j3245M9588J10039J37124J31716R7324J0586
35388B95284j10682j59460o4970O5143N7356p9209j59136r3768l140j903k8010
35377b82495K0037J02973J16151N4273j3926o5601j09104j05777j5447J11575
35367a87341J76718J46592O4440j5886n5322l5294J1283K3209J608R112M5553
$$ y = [227319, 248279, 189492, 156052, 202863, 226946, 133683, 5263, -30336, -9041, -48035, -116081, -71433, 87737, 193345, 152027, 61431, 40297, 82691, 135107, 191391, 242209, 235297, 159137, 82676, 49133, 12157, -58506, -92639, -24005, 86538, 123935, 74102, 21013, 16169, 35726, 58028, 99955, 157398, 175153, 116558, 29993, 3965, 61614, 130649, 125668, 36997, -78362, -170776, -227848, -241093, -191505, -81466, 55658, 187374, 284698, 295284, 184602, 25142, -39828, 25315, 82671, 3462, -155674, -249442, -252582, -254485, -282495, -262458, -159485, -43334, 10939, -2987, -68588, -177692, -283469, -298916, -187341, -10623, 135969, 200409, 184523, 129201, 93907, 105190, 128399, 130007, 139119, 184672]
35356A84672K4008p2665j25146n5289L7910L1722k6668j1685O8897R5276K4617
35345A75649p1252j26289j22948m7942P7582J51855R4847j9935m7609K5683P0431
35334A60072J760j18676j76697j24581l929R1680R0454K5905Q860O8761R2379
35323A15988o094j36090j57343q2000k3611n495L4549Q8230Q1437K4273R551N3495
35311c110O9437J5648m7986o6247m6639n264M2659M3089l3396r5657k7630J17169
35299c7927J57463M3860o6475m2901M5171O0684p141p0545q5558p4810n1065L650
35287a25594Q8968J55654J32990N93j51127j75216l6658J16151J24469K1669l6631
35276A15268o968J0347l3296n8013j3330K2824k1683q1294m6294P0533J44705
$$ y = [184672, 208680, 136015, 10869, -44420, -6510, 25212, -1456, -13141, 55756, 151032, 175649, 104397, -21892, -144840, -192782, -115200, 36655, 131502, 111567, 63958, 89641, 160072, 161832, 43156, -133541, -258122, -262051, -170371, -79917, -54012, -45152, 23609, 115988, 109894, -26196, -183539, -265539, -289150, -294645, -260096, -171866, -90429, -66156, -56605, -3110, 66327, 81975, 33989, -32258, -78897, -84161, -41502, 1587, -31809, -127466, -155096, -37927, 119536, 163396, 96921, 54020, 99191, 159875, 152734, 82189, -3369, -78179, -129244, -125594, -36626, 119028, 252018, 252611, 101484, -73732, -110390, 5761, 130230, 151899, 115268, 108300, 118647, 85351, 27338, 14008, 36832, 15149, -66145, -112439, -41906, 102799]
35265A02799R5866k4720j00472p5705q078J0923j9546j1361O8486J29553R2764
35254B60509J8058L394J9529l1493j30103j49076m8451O4390Q8977M3790K584
35243A42108L033L5593N8480K6452m0952n5670Q153M4587k5740j05747o5920L4154
35231E8531L8286m4545o4249J0219N7632K8067m692k3025q5486j46095p9223P3646
35219a80934J17054K3744m267J10679J67177K6505j37426j19337k463J9257l5247
35208a5258k1164N4461P5061L7545J5720j5028j03683j52611m6013J07745R7771
35197C4546n1796j04294J9756J28327O6758o7482j09887o1880k5837k4450j866
35186a98105N8086J07468J01142L6918m7151r0227n6644J4722M2268k996o5481
$$ y = [102799, 198665, 173945, 73473, -2232, -10310, 613, -18933, -30294, 38192, 167745, 260509, 278567, 281961, 301490, 269997, 139894, -9182, -57633, 6757, 95734, 139524, 142108, 145141, 180734, 239214, 265666, 224714, 169044, 177197, 221784, 196044, 90297, 24377, 58531, 96817, 52272, -11977, -1758, 55874, 83941, 79249, 56224, -29262, -175357, -254580, -180934, -63880, -40136, -44403, 66276, 233453, 259958, 122532, 3195, 732, 19989, -15258, -36422, 18039, 93100, 130645, 146365, 131337, 27654, -124957, -170970, -63225, 34546, -17250, -121544, -101788, 26539, 93297, 25815, -84072, -145952, -171789, -196239, -198105, -140019, -32551, 68591, 105509, 58358, -31869, -88513, -73791, -31523, -34519, -100000]
35175a00000p7531l2113K7325O1729O4718M8218J7175k6150n1066r101Q6939J33793
35163A43936N8649n7570p2890J2187O0653J5437k6938L754M1783K3622k480N356
35151B05499j2360q3495j01692R841J38598J32479K1880n5103o8886q2156q7404
35140A7201l3667L0179J2410m7763l1316N2048P5737J3621k5097O747K8598l391
35128I5307k5031o561j8133q5683j11820k3585J01003J35098N9149m6974j03739
35117c0969p6774J4066R0585Q1920J9257m072K1059R259n9690q9270l0085K4134
35105c0580p664m9243L797R4538Q9656O437p411P8721J14981Q562j20066j16919
35093F4809j8397L6178L6539P6660J26711L2173k04763l34602j83515P6414J54110
$$ y = [-100000, -177531, -209644, -182319, -120590, -55872, -7654, 9521, -16629, -67695, -76796, 10143, 143936, 202585, 145015, 72125, 84312, 144965, 160402, 133464, 137218, 179001, 202623, 200143, 205499, 193139, 109644, 7952, 17793, 156391, 288870, 310750, 255647, 186761, 104605, 17201, -16466, 13713, 26123, -21640, -52956, -908, 74829, 88450, 63353, 70100, 98698, 95307, 70276, 63715, 45582, -40101, -151921, -175506, -74503, 60595, 119744, 72770, -30969, -107743, -93677, -3092, 78828, 98085, 94013, 115072, 124331, 64641, -24629, -54714, -30580, -38244, -87487, -83690, 10848, 100504, 106941, 99530, 178251, 293232, 301794, 181728, 64809, 46412, 82590, 119129, 195789, 322500, 354673, 149910, -184692, -368207, -291793, -137683]
35082a37683M0165k5806N5938J20192L2343j03541j23976l2695N8999R7614R0913
35071G2463M3554j8348l9464k2411l3980o9372k8500J00220J66875P4107o2243
35060A82901q8552l3753j7960m4940l7811j914j6k2344j6084Q407J6921K9794
35048b5351N1225J0380j02678j46978k6517J26235J31437K9326j7535N850J708
35037C7102j9292K0185O4889R240o9117j0798J21232J07762o1045j63282j09633
35026g2757m6665m8083L060J32070J60335J4645j07892n1181M8868J1220q8265
35015d4645p0070M4548R5480M7664k090j1919j6680j2260L1978P7174N4996j8630
35003A75546o3117m1366J8563P1480P3945Q600o8455p1240q985J6248l0796o6055
$$ y = [-137683, -97518, -123324, -67386, 52806, 85149, -18392, -142368, -175063, -116064, -18450, 72463, 116017, 97669, 58205, 35794, 1814, -67558, -96058, 4162, 171037, 245144, 182901, 94349, 60596, 42636, -2304, -40115, -42029, -42045, -64389, -80473, -72066, -55145, -25351, 25874, 36254, -66424, -213402, -239919, -113684, 17753, 47079, 29544, 35394, 37102, 17810, 37995, 102884, 112124, 43007, 32209, 153441, 261203, 200158, 36876, -72757, -119422, -167505, -164445, -32375, 127960, 142605, 34713, -16468, 32400, 43620, -44645, -114715, -70167, 25313, 72977, 70887, 58968, 42288, 30028, 62006, 139180, 194176, 175546, 112429, 71063, 89626, 161106, 235051, 243651, 175196, 103956, 94971, 111219, 80423, 14368]
34991A4368l5854r44j1664k0099Q612J4398m1438q4710m5570K4823M1485O735
34979a29858l0175n2073n0543j0399L4282K6554o34L4492Q5238J5598j33516j31011
34967c42045Q7416K68761K04707L8594J2458R0086P3796l9875q6681l7950k0586
34956B48681o7899q2696m0059j9301l0622O39O5453O1253k9678j06169j10275
$$ y = [14368, -21486, -22430, -34094, -54193, -45581, -31183, -72621, -157331, -202901, -178078, -136593, -129858, -160033, -212106, -262649, -273048, -238766, -212212, -212846, -178354, -93116, -77518, -211034, -342045, -254629, 14132, 218839, 257433, 269891, 359977, 433773, 393898, 307217, 269267, 248681, 180782, 98086, 58027, 38726, 8104, 8743, 74196, 135449, 105771, -398, -110673]
$$ [...]
##END NTUPLES=NMR SPECTRUM
##END=
