##TITLE=31Pdec_2PDM2805
 CDCl3, 24 sc
 28.5.2019
##JCAMPDX= 6.0         $$ Bruker NMR JCAMP-DX V2.0
##DATA TYPE= NMR SPECTRUM
##DATA CLASS= NTUPLES
##ORIGIN= UXNMR, Bruker Analytische Messtechnik GmbH
##OWNER= root
$$ XWIN-NMR		Version 3.5
$$ Tue May 28 16:32:18 2019 Russian Standard Time (UT+4h)  she@DPX200
##.OBSERVE FREQUENCY= 81.013821
##.OBSERVE NUCLEUS= ^31P
##.ACQUISITION MODE= SIMULTANEOUS
##.ACQUISITION SCHEME= undefined
##.AVERAGES= 24
##.DIGITISER RES= 17
##SPECTROMETER/DATA SYSTEM= spect
##.PULSE SEQUENCE= zgpg30
##.SOLVENT NAME= DMSO
##.SHIFT REFERENCE= (INTERNAL, DMSO, 0, 182.463)
##AUDIT TRAIL= $$ (NUMBER, WHEN, WHO, WHERE, WHAT)
$$ ##TITLE= Audit trail, XWIN-NMR		Version 3.5
$$ ##JCAMPDX= 5.01
$$ ##ORIGIN= Bruker BioSpin GmbH
$$ ##OWNER= she
$$ F:/spectra/data/she/nmr/P31/1/pdata/1/auditp.txt
$$ ##AUDIT TRAIL=  $$ (NUMBER, WHEN, WHO, WHERE, WHAT)
(   1,<2019-05-28 16:31:35.37 +0400>,<she>,<DPX200>,
      <created by zg, POWCHK disabled, PULCHK disabled
       configuration hash MD5:
       00 E9 B6 7A A2 85 ED C7 34 08 36 98 17 FE 4E 26
       data hash MD5: 32K
       F7 C6 5F 88 25 A3 11 F5 BA 8E 23 89 E8 D2 DA 78>)
(   2,<2019-05-28 16:31:38.28 +0400>,<she>,<DPX200>,
      <Start of raw data processing
       efp BC_mod = 2 LB = 1 FT_mod = 6 PKNL = 1 PHC0 = -1802.074 PHC1 = 19.39899 SI = 64K 
       data hash MD5: 64K
       FC 44 54 07 77 67 B2 BF 4D 86 9F 7E FF 97 75 B7>)
(   3,<2019-05-28 16:31:48.51 +0400>,<she>,<DPX200>,
      <pk PHC0 = 6.034325 PHC1 = 0 
       data hash MD5: 64K
       E8 CE 5E B4 09 7D 6A 75 BD 03 D3 EF CB 22 46 9A>)
(   4,<2019-05-28 16:31:50.71 +0400>,<she>,<DPX200>,
      <abs ABSG = 5 
       data hash MD5: 64K
       C4 D4 83 3B 59 B9 B5 7B BE 7B 5E 0E AF 27 DD F3>)
$$ ##END=
$$ 
$$ hash MD5
$$ FC A8 45 90 DB 1B 29 80 80 E1 2F BE 75 DE 24 85
##$RELAX= 
##$RELAX= 
##$RELAX= 
##$RELAX= 
##$RELAX= 
##$RELAX= 
##$RELAX= 
##$RELAX= 
$$ Bruker specific parameters
$$ --------------------------
##$DU= <F:/spectra>
##$EXPNO= 1
##$NAME= <P31>
##$PROCNO= 1
##$TYPE= <nmr>
##$USER= <she>
##$AMP= (0..31)
100 100 100 100 100 100 100 100 100 100 100 100 100 100 100 100 100 100 
100 100 100 100 100 100 100 100 100 100 100 100 100 100 
##$AQSEQ= 0
##$AQ_mod= 1
##$AUNM= <au_zg>
##$AUTOPOS= <>
##$BF1= 81.014009
##$BF2= 200.13
##$BF3= 200.13
##$BF4= 200.13
##$BF5= 200.13
##$BF6= 200.13
##$BF7= 200.13
##$BF8= 200.13
##$BYTORDA= 1
##$CFDGTYP= 0
##$CFRGTYP= 5
##$CHEMSTR= <none>
##$CNST= (0..31)
1 1 145 1 1 1 1 1 1 1 1 1 1 1 1 1 1 1 1 1 1 1 1 1 1 1 1 1 1 1 1 1 
##$CPDPRG= <waltz16>
##$CPDPRG1= <>
##$CPDPRG2= <waltz16>
##$CPDPRG3= <>
##$CPDPRG4= <mlev>
##$CPDPRG5= <mlev>
##$CPDPRG6= <mlev>
##$CPDPRG7= <mlev>
##$CPDPRG8= <mlev>
##$CPDPRGB= <>
##$CPDPRGT= <>
##$D= (0..31)
0 1 0 0 0 0 0 0 0 0 0 0.03 2e-05 3e-06 0 0 0 0 0 0 0 0 0 0 0 0 0 0 0 0 
0 0 
##$DATE= 1559046694
##$DBL= (0..7)
120 120 120 11 120 120 24 19 
##$DBP= (0..7)
150 150 150 150 150 150 150 150 
##$DBP07= 0
##$DBPNAM0= <>
##$DBPNAM1= <>
##$DBPNAM2= <>
$$ [...]
##$SUBNAM3= <"">
##$SUBNAM4= <"">
##$SUBNAM5= <"">
##$SUBNAM6= <"">
##$SUBNAM7= <"">
##$SUBNAM8= <"">
##$SUBNAM9= <"">
##$SW= 369.568048894756
##$SWIBOX= (0..15)
0 1 3 0 0 0 0 0 0 0 0 0 0 0 0 0 
##$SW_h= 29940.119760479
##$TD= 32768
##$TD0= 1
##$TE= 0
##$TE2= 300
##$TE3= 300
##$TEG= 300
##$TL= (0..7)
0 120 53 12 22 120 120 120 
##$TP= (0..7)
150 150 150 150 150 150 150 150 
##$TP07= 0
##$TPNAME0= <>
##$TPNAME1= <>
##$TPNAME2= <>
##$TPNAME3= <>
##$TPNAME4= <>
##$TPNAME5= <>
##$TPNAME6= <>
##$TPNAME7= <>
##$TPOAL= (0..7)
0.5 0.5 0.5 0.5 0.5 0.5 0.5 0.5 
##$TPOFFS= (0..7)
0 0 0 0 0 0 0 0 
##$TUNHIN= 0
##$TUNHOUT= 0
##$TUNXOUT= 0
##$USERA1= <user>
##$USERA2= <user>
##$USERA3= <user>
##$USERA4= <user>
##$USERA5= <user>
##$V9= 5
##$VALIST= <valist>
##$VCLIST= <CCCCCCCCCCCCCCC>
##$VD= 0
##$VDLIST= <DDDDDDDDDDDDDDD>
##$VPLIST= <PPPPPPPPPPPPPPP>
##$VTLIST= <TTTTTTTTTTTTTTT>
##$WBST= 1024
##$WBSW= 4
##$XGAIN= (0..3)
0 0 0 0 
##$XL= 0
##$YL= 0
##$YMAX_a= 110028
##$YMIN_a= -118639
##$ZGOPTNS= <>
##$ZL1= 120
##$ZL2= 120
##$ZL3= 120
##$ZL4= 120
##$ABSF1= 182.463
##$ABSF2= -187.1042
##$ABSG= 5
##$ABSL= 3
##$ALPHA= 0
##$AQORDER= 0
##$ASSFAC= 0
##$ASSFACI= 0
##$ASSFACX= 0
##$ASSWID= 0
##$AUNMP= <proc_1d>
##$AZFE= 0.1
##$AZFW= 0.5
##$BCFW= 0
##$BC_mod= 2
##$BYTORDP= 0
##$COROFFS= 0
##$CY= -3
##$DATMOD= 1
##$DC= 0
##$DFILT= <>
##$DTYPP= 0
##$F1P= 0
##$F2P= 0
##$FCOR= 1
##$FTSIZE= 65536
##$FT_mod= 6
##$GAMMA= 0
##$GB= 0
##$INTBC= 1
##$INTSCL= 5.30512e-09
##$ISEN= 30
##$LB= 1
##$LEV0= 0
##$LPBIN= 0
##$MAXI= 10000
##$MC2= 0
##$MEAN= 0
##$ME_mod= 0
##$MI= 50
##$NCOEF= 0
##$NC_proc= -4
##$NLEV= 6
##$NOISF1= 182.463
##$NOISF2= 159.3651
##$NSP= 0
##$NTH_PI= 0
##$NZP= 0
##$OFFSET= 182.463
##$PC= 4
##$PHC0= -1796.04
##$PHC1= 19.39899
##$PH_mod= 1
##$PKNL= yes
##$PPARMOD= 0
##$PSCAL= 0
##$PSIGN= 0
##$REVERSE= no
##$SF= 81.0140089999434
##$SI= 65536
##$SIGF1= 159.3651
##$SIGF2= -187.1042
##$SINO= 113.3802
##$SIOLD= 16384
##$SREGLST= <1H.CDCl3>
##$SSB= 0
##$STSI= 65536
##$STSR= 0
##$SW_p= 29940.119760479
##$SYMM= 0
##$S_DEV= 0
##$TDeff= 32768
##$TDoff= 0
##$TI= <>
##$TILT= no
##$TM1= 0
##$TM2= 0
##$TOPLEV= 0
##$USERP1= <user>
##$USERP2= <user>
##$USERP3= <user>
##$USERP4= <user>
##$USERP5= <user>
##$WDW= 1
##$XDIM= 65536
##$YMAX_p= 284098646
##$YMIN_p= -4060995
$$ End of Bruker specific parameters
$$ ---------------------------------
##NTUPLES= NMR SPECTRUM
##VAR_NAME=  FREQUENCY,     SPECTRUM/REAL,   SPECTRUM/IMAG
##SYMBOL=    X,             R,               I
##VAR_TYPE=  INDEPENDENT,   DEPENDENT,       DEPENDENT
##VAR_FORM=  AFFN,          ASDF,            ASDF
##VAR_DIM=   65536,         65536,           65536
##UNITS=     HZ,            ARBITRARY UNITS, ARBITRARY UNITS
##FACTOR=    0.456856943014862, 1,           1
##FIRST=     14782.0589164792, 0,            0
##LAST=      -15158.0608439998, 0,           0
##MIN=       -15158.0608439998, -4060995,    0
##MAX=       14782.0589164792, 284098646,    0
$$ Real data points
##PAGE= N=1
##DATA TABLE= (X++(R..R)), XYDATA
$$ [...]
41199H64127n0950l11742n11842n06012l18620o5374J90592L80862L81785J86482
$$ 864127 813177 501435 -10407 -516419 -835039 -900413 -709821 -328959 52826 239308
41189B39308K437J0025J29071J74539J10928j6033k27153m49734l93288O6736
$$ 239308 241745 251770 380841 555380 666308 650275 423122 -26612 -419900 -353164
41179c53164N09008M08730q0045k92054n8634M9312k82131n13840j38345L95538
$$ -353164 155844 564574 484529 192475 133841 183153 -98978 -612818 -751163 -355625
41169c55625L44710j18049j93967K09838L52599p1871m51992l27816r7776j88760
$$ -355625 -10915 -128964 -322931 -113093 239506 167635 -284357 -612173 -709949 -898709
41159h98709k62521J21346O30756O57698K74168r535j08837k63931l42427l1170
$$ -898709 -1161230 -1039884 -409128 248570 522738 513203 404366 140435 -201992 -233162
41149b33162M09947L79956q7524l33358j20860O1215j09109l00464j75659J06315
$$ -233162 176785 556741 469217 135859 14999 76214 -32895 -333359 -509018 -402703
41139d02703L12227M77359N40991K24462l77196o43070k88119J27968K4210l30895
$$ -402703 -90476 386883 927874 1152336 775140 132070 -156049 -28081 -3871 -334766
41129c34766l15537N9228K73607J71623R4146K26771L53253K79122Q9393o2546
$$ -334766 -650303 -591075 -317468 -145845 -51699 175072 528325 807447 896840 834294
41119H34294j29172j19229q8597j36346k43908k38541p2385O4243R2207K24920
$$ 834294 705122 585893 497296 360950 117042 -121499 -193884 -129641 -37434 187486
41109A87486N31949O36274K35618l33714n04616k59981m0527k7832k2928M9569
$$ 187486 719435 1355709 1591327 1257613 752997 493016 452489 424657 401729 451298
41099D51298L5414o0932o2739j3502j20956k81639j49461K33398L62801M718m25115
$$ 451298 486712 425780 363041 349539 228583 -53056 -202517 30881 393682 398400 -26715
41088b6715m36693p9111K40828K74991P5191j47775j55539J12696L74917K92190
$$ -26715 -463408 -542519 -301691 -26700 48491 -99284 -254823 -142127 232790 524980
41078E24980k6213j26526R7672K15345m9053l30915j56935L30231N56788K76506
$$ 524980 498767 372241 469913 685258 636205 305290 148355 478586 1035374 1311880
41068A311880j92622m30168l44269j46185p3760j55453j87068M071K70947K92078
$$ 1311880 1119258 689090 344821 198636 124876 -30577 -217645 -213574 57373 349451
41058C49451M6293r6136J09912M03970L61103m8872m62491n81132m29576k15593
$$ 349451 395744 299608 409520 813490 1174593 1125721 663230 82098 -347478 -563071
41048e63071r6817o8227P248K17374M24820L85387P5958k45412l54179k64446
$$ -563071 -659888 -728115 -720867 -503493 -78673 306714 382672 137260 -216919 -481365
41038d81365q1946J20243K08522M9674j96011j36883K79380N40888K18581l88201
$$ -481365 -563311 -443068 -234546 -184872 -380883 -517766 -238386 302502 521083 132882
41028A32882o16052l09921N3041P2538j09411j21348J35591M20945M49142J80776
$$ 132882 -483170 -793091 -740050 -667512 -776923 -898271 -762680 -341735 107407 288183
41018B88183j21051j58914J9937M5435k58340n68697m93259j22186J47280J94000
$$ 288183 167132 8218 28155 73590 -184750 -753447 -1246706 -1368892 -1221612 -1027612
41008a027612K09561K33824R5169j45993j37170K20105N35035M55054J22789j22712
$$ -1027612 -818051 -584227 -489058 -635051 -772221 -552116 -17081 437973 560762 438050
40998D38050k08540k14468p3234K43027M23393J42061l69196n02714r4996L26013
$$ 438050 229510 15042 -58192 184835 608228 750289 381093 -121621 -216617 109396
40988A09396K73902o2979j90969n5946m3342l15533n32644l43169J13466L93633
$$ 109396 383298 320319 129350 73404 30062 -285471 -818115 -1161284 -1047818 -654185
40978f54185L12376J14650R6462K24604K24230k2605k88141k62825N2542L30981
$$ -654185 -341809 -227159 -130697 93907 318137 295532 7391 -255434 -202892 128089
40968A28089L13411R4498o7643j00304j10820j23512o0530K5843l1906k03651
$$ 128089 441500 535998 468355 368051 257231 133719 73189 99032 67126 -136525
40958a36525k31895m4191P1643r2952k98275k01830J21385L22703K99989K25657
$$ -136525 -368420 -412611 -340968 -433920 -732195 -934025 -812640 -489937 -189948 35709
40948C5709J58753J7844j02159k847J98131J38336k02675l94680j89542J23737
$$ 35709 194462 212306 110147 107300 305431 443767 241092 -153588 -343130 -219393
40938b19393J99548J02866L9765l6579k30937l95149l55555k33608k06397j51477
$$ -219393 -19845 83021 122786 86207 -144730 -539879 -895434 -1129042 -1335439 -1486916
40928a486916J11554M03499M06488J84195P7725J48373J29604p6214k46220k22604
$$ -1486916 -1375362 -971863 -565375 -381180 -303455 -155082 -25478 -101692 -347912 -570516
40918e70516r3365O9598L07134N26077M99877K43425P1954J31663J68882m4424
$$ -570516 -663881 -594283 -287149 238928 738805 982230 1054184 1185847 1354729 1310305
40908A310305l32334m01507k81719k06717k09192j19538J01821K82313K74917
$$ 1310305 977971 576464 294745 88028 -121164 -240702 -138881 143432 418349
40899D18349R0940j84803m34743m79721k07857K15833M26442K39836j32066l27002
$$ 418349 509289 324486 -110257 -589978 -797835 -582002 -155560 84276 -47790 -374792
40889c74792k29075l4669L7916o628j5577P7942J82091J87367R3857k8226j38153
$$ -374792 -603867 -638536 -600620 -607248 -622825 -544883 -362792 -175425 -81568 -109794 -247947
40878b47947k28921k61322j54985J25473M67577O15756L65849j70847n70631n05108
$$ -247947 -476868 -738190 -893175 -767702 -300125 315631 681480 510633 -59998 -565106
40868e65106j21511J40841R9905j1845L1592J34676J14341K702q4659j77375l06398
$$ -565106 -686617 -545776 -445871 -457716 -426124 -291448 -177107 -174405 -259064 -436439 -742837
40857g42837l05071l7182K99189L93832K64492J69740J55900M3956j49693j71201
$$ -742837 -1047908 -1085090 -785901 -392069 -127577 42163 198063 242019 92326 -78875
40847g8875J3311R1742r9430k76550j29692K07517L67220K58480J09036Q7125
$$ -78875 -65564 26178 -73252 -349802 -479494 -271977 95243 353723 462759 549884
40837E49884J21233Q3236l0327j34354j72844j64098j58355j63927j39354q1042
$$ 549884 671117 754353 724026 589672 416828 252730 94375 -69552 -208906 -289948
40827b89948n2445n8362O675J52838J64819r7881l75262k95498N3297K15958O7727
$$ -289948 -342393 -400755 -394080 -241242 -76423 -174304 -549566 -845064 -791767 -575809 -508082
40816e08082j2427J90381L40936J28921j67275j07566J97202K70111J2372k05812
$$ -508082 -520509 -330128 10808 139729 -27546 -135112 62090 332201 344573 138761
40806A38761j48387K4932J17389J27716P2095o9032j54995J1029K76103J96581
$$ 138761 -9626 15306 132695 260411 332506 263474 108479 119508 395611 592192
40796E92192l15467p29657n34025J08526O06550O50654L92848O3034k55578m87871
$$ 592192 276725 -452932 -986957 -878431 -271881 378773 771621 834655 579077 91206
40786I1206n02901k82718O106J81887K03307J44571R9597J04940R2629l3036k04654
$$ 91206 -411695 -694413 -688307 -506420 -303113 -158542 -58945 45995 138624 105588 -99066
40775i9066j92048O6947K69982J25315j66409j35126K46390M57671J88636j67255
$$ -99066 -291114 -224167 45815 171130 4721 -130405 115985 573656 762292 595037
40765E95037q3148L04475L80571o2681n37623n23992j02641K20674J32278j96135
$$ 595037 511889 816364 1196935 1134254 596631 72639 -30002 190672 322950 126815
40755A26815l47746j14170K68367L69002R3080j74322j00168J06889L1660k59283
$$ 126815 -220931 -335101 -66734 302268 395348 221026 120858 227747 259407 124
40745A24k86918P8117L76066K29711j39120k90988j47266O2279J68434J33001
$$ 124 -286794 -208677 167389 397100 257980 -33008 -180274 -117995 50439 183440
40735A83440k9897j87992j58512j1462m0517k65884l13093j6211K57894K09440
$$ 183440 153543 -34449 -192961 -204423 -244940 -510824 -823917 -840128 -582234 -372794
40725c72794J09785K72739M22637J48356l18342l98995m8592K59961K80293J42571
$$ -372794 -263009 9730 432367 580723 262381 -136614 -185206 74755 355048 497619
40715D97619p8698l41853l58048Q899K59315o9452m59698q6605O95976P04153
$$ 497619 418921 77068 -280980 -272081 -12766 -82218 -541916 -628521 67455 771608
40705G71608j43919n42602J34128P78915L27157n65249o67086j05492N9663l74760
$$ 771608 627689 85087 219215 998130 1325287 760038 92952 -12540 47123 -327637
40695c27637o23814k96655K00572N29047P12855O38803J67627k83376j36455L63594
$$ -327637 -951451 -1248106 -1047534 -518487 194368 833171 1000798 717422 580967 944561
40685I44561M10683r3592m16959k44044j17751l69797n03649r9623L96488L47219
$$ 944561 1355244 1261652 844693 600649 482898 113101 -390548 -490171 -93683 253536
40675B53536j30435m23604k72374Q8701L72771M50792L07514O1918j02896j55041
$$ 253536 123101 -300503 -572877 -484176 -111405 339387 646901 708819 605923 450882
40665D50882j81112j34375Q0636K84765J90142r5488j93861j08670j97582m23314
$$ 450882 269770 135395 216031 500796 690938 595450 401589 292919 95337 -327977
40655c27977k98725K19476M88344J76542j77772o9090J66735L7901j90103N203
$$ -327977 -626702 -407226 81118 257660 79888 10798 177533 215434 25331 30534
40645C0534M19659M28373J2902k83920k76110k64467l14298j35520K60996M46952
$$ 30534 450193 878566 891468 607548 331438 66971 -247327 -382847 -121851 325101
40635C25101K46416l7598j83139k91611l43356r1410L74619N11854J01468l30773
$$ 325101 571517 533919 350780 59169 -284187 -375597 -978 510876 612344 281571
40625B81571k64165N2465N9907j94234j68050K56042N38507K75843k25870m12635
$$ 281571 17406 69871 129778 -64456 -232506 23536 562043 837886 612016 199381
40615A99381k20115m2534j06156k00099o0595K36223M05811L22652Q1436k16908
$$ 199381 -20734 -63268 -169424 -369523 -430118 -193895 211916 534568 616004 399096
40605C99096n27194p16350n80500j04357M32204P06612O29207L21018n0374l24258
$$ 399096 -128098 -844448 -1424948 -1529305 -1097101 -390489 238718 559736 509362 185104
40595A85104l66338j78936N6828J48217P3726m4641r4722o4668m0732j20472k54912
$$ 185104 -181234 -360170 -303342 -155125 -81399 -126040 -220762 -285430 -326162 -446634 -701546
40584g01546k28254N5513L30182K58796n0885j45467J00186K81568J03118j62860
$$ -701546 -929800 -874287 -544105 -285309 -336194 -481661 -381475 -99907 3211 -159649
40574a59649j40892N4345O6240j02081j53841k1908Q9606J10645J52323J78751
$$ -159649 -300541 -246196 -179956 -282037 -435878 -457786 -368180 -257535 -105212 73539
40564G3539K7468k12662k21421N8119K69553J31398j74166k56643J0290M01597
$$ 73539 101007 -111655 -333076 -274957 -5404 125994 -48172 -304815 -294525 107072
40554A07072O08835N00480J87861j16307l20215m75905n50626l59290J10383M88536
$$ 107072 715907 1216387 1404248 1287941 967726 491821 -58805 -418095 -307712 180824
40544A80824M12129J9050k32229j67719k4601j4729p8472q8366j5245J33973K96715
$$ 180824 592953 612003 379774 212055 187454 172725 94253 5887 -9358 124615 421330
40533D21330K87066J6872k51007j89924P1020Q2685k46138n04214l93310r1273
$$ 421330 708396 725268 474261 284337 355357 438042 191904 -312310 -705620 -796893
40523g96893J23967K15793J91395k6510k99199k41597J98765M86368J97117l13730
$$ -796893 -672926 -457133 -265738 -292248 -591447 -833044 -634279 -147911 49206 -264524
40513b64524l75441N6462L83336K22247j53360k85054r0183J81868L21831L30309
$$ -264524 -639965 -583503 -200167 22080 -131280 -416334 -506517 -324649 -2818 327491
40503C27491L11653L00894J97235j07454n10163o95689m52607N7168M36736M41318
$$ 327491 639144 940038 1137273 1029819 519656 -176033 -628640 -571472 -134736 306582
40493C06582J74062p1159j18583p1273j43873l18791k97027P3128M69581M68270
$$ 306582 480644 409485 290902 219629 75756 -243035 -540062 -466934 2647 470917
40483D70917J51346q634J41510K53883R2957j06324r3834j3691p6301j68622j18024
$$ 470917 622263 613629 755139 1009022 1101979 995655 901821 888130 811829 643207 525183
40472E25183m6748j11404j55102k675J29899n2489l73260l90379n7013K46515
$$ 525183 478435 367031 211929 209254 339153 286664 -86596 -476975 -533988 -287473
40462b87473K85771J76135M7965r3106j68331o9305P1246P490j90667j99775J6258
$$ -287473 -1702 174433 222398 129292 -39039 -108344 -37098 -29608 -220275 -420050 -403792
40451d03792J11443q2457k68486j45503J38496K20803J6448k25590k39294K3639
$$ -403792 -292349 -374806 -643292 -788795 -650299 -429496 -413048 -638638 -877932 -854293
40441h54293L80321N49339L87914N2048j61086j41755m6799o8713k29314l73308
$$ -854293 -473972 75367 463281 515329 354243 212488 165689 96976 -132338 -505646
40431e05646k90287O0520L68724K20326l05295n51690r7753N98147P71304L55900
$$ -505646 -795933 -735413 -366689 -146363 -451658 -1003348 -1101101 -502954 268350 624250
40421F24250p6325k18252k67459l15554j60985J58571K62122N1317j00663J3236
$$ 624250 547925 329673 62214 -253340 -414325 -255754 6368 57685 -42978 -29742
40411b9742J37849J00889R1756J59446M1177k06281o8864N09466P55280J85567
$$ -29742 108107 208996 300752 460198 501375 295094 226230 735696 1490976 1676543
40401A676543n32816n52299j17330l4474l23743l64730j09110j03315l67107k84121
$$ 1676543 1143727 591428 474098 439624 115881 -248849 -357959 -461274 -828381 -1112502
40391a112502K58450N77801L08022n6365p1677O328q4400l5016L50279N52302
$$ -1112502 -854052 -276251 31771 -24594 -96271 -89943 -174343 -209359 140920 693222
40381F93222J13440m68471l74978K94175O48813K52575m14979p25908n58140j23280
$$ 693222 806662 338191 -36787 257388 906201 1158776 743797 17889 -540251 -663531
40371f63531L46707N95356M34017K8956j89279n5551J33294Q2166r1881j05047
$$ -663531 -316824 278532 712549 741505 552226 496675 629969 712135 620254 515207
40361E15207L1159M9693j36101k85779j87878J3960J8581j68576j89760J56540
$$ 515207 546366 596059 459958 174179 -13699 261 18842 -149734 -339494 -182954
40351a82954N54121N30283P4210l71083m97224l99740k25187Q0662M89693O84682
$$ -182954 371167 901450 975660 604577 107353 -292387 -517574 -436912 52781 737463
40341G37463M40305Q096j93020j38425j37261k98619l98166k80199p8341M4273
$$ 737463 1177768 1185864 992844 854419 717158 418539 20373 -259826 -338167 -293894
40331b93894J21029K28045K93590K03275j2633k11265k94815k62494j58421l3647
$$ -293894 -172865 55180 348770 552045 539412 328147 33332 -229162 -387583 -421230
40321d21230O3057R6827N3497n1474j55947j80935j18125n1465m3229l6465P0227
$$ -421230 -358173 -261346 -207849 -259323 -415270 -596205 -714330 -765795 -809024 -845489 -775262
40310g75262K77667M70708N31422M34311K55463J06816J9387j12170l86311o72237
$$ -775262 -497595 -26887 504535 938846 1194309 1301125 1320512 1208342 822031 149794
40300A49794o48121j61088N05444Q30455N51142n7110m26078k77461M8289r125
$$ 149794 -498327 -659415 -153971 676484 1227626 1170516 744438 466977 515266 506141
40290E06141m55772o37042j34039N23922N01551j52920n69749l23431N3633M3867
$$ 506141 50369 -586673 -720712 -196790 304761 151841 -417908 -741339 -687706 -643839
40280f43839p5012J22252L89054K69569n8753j12464K6735q8177l78542l27253
$$ -643839 -718851 -596599 -207545 62024 3271 -109193 -82458 -170635 -549177 -876430
40270h76430Q2746K85139P2191j02922N4650K36016J63700N3450J13906J41427
$$ -876430 -793684 -508545 -436354 -539276 -484626 -248610 -84910 -31460 82446 223873
40260B23873q470m7417K13912L90534P0219m77225o28038k47044K20227L60293
$$ 223873 215403 167986 381898 772432 842651 365426 -262612 -509656 -289429 70864
40250G0864J50572j66412k80843l1758L39800L56722m8513l41485j33351K20396
$$ 70864 221436 55024 -225819 -257577 82223 438945 390432 48947 -84404 135992
40240A35992J93904n2850K9616M03596M28510j30086o73616n74109K2956M66949
$$ 135992 329896 277046 306662 710258 1138768 1008682 335066 -239043 -216087 250862
40230B50862L99195M1718j51340M1603M08297M99984J20454l99715n71620l48900
$$ 250862 650057 691775 540435 582038 990335 1490319 1610773 1211058 639438 290538
40220B90538j28304j54056k20432p9721J31657J11001j18862k12654J439K60759
$$ 290538 162234 8178 -212254 -291975 -160318 -49317 -168179 -380833 -379394 -118635
40210a18635K27196l1631j32254O4248K36900R1635j72727j73295M0031P4809
$$ -118635 108561 76930 -55324 8924 245824 337459 164732 -8563 31468 106277
40200A06277j37159k18220K4922L06120L70904L48693L39759J16070l91491p26896
$$ 106277 -30882 -249102 -224180 81940 452844 801537 1141296 1257366 865875 138979
40190A38979n03526l7492J14499k9659o1559O3779O4129l8515M2160K49514K32322
$$ 138979 -364547 -402039 -287540 -317199 -378758 -314979 -250850 -289365 -247205 2309 234631
40179B34631j2568j45227j32640k63037m70484l36536R3007K12350j50324l40821
$$ 234631 222063 76836 -55804 -318841 -789325 -1125861 -1032854 -820504 -970828 -1311649
40169a311649J02597O55052N75031M412l04734p2723K79639L43183J54764m8800
$$ -1311649 -1209052 -554000 21031 25443 -279291 -352014 -72375 270808 425572 376772
40159C76772j25463o1477L8524J4014j37529k06438p4734Q1060N6409q2461j42339
$$ 376772 251309 189832 228356 242370 104841 -101597 -176331 -95271 -38862 -121323 -263662
40148b63662p3791O9864K56487L90767L12138N0474j33665j28372j29338k40664
$$ -263662 -337453 -267589 -11102 379665 691803 742277 608612 480240 350902 110238
40138A10238k41727j1349J56041J1807j73793k6039K92484L36268J04807k281
$$ 110238 -131489 -142838 13203 25010 -148783 -174822 117662 453930 558737 556456
40128E56456J13376J19976j27182l23748k21387r984M147j69098k81279j73204
$$ 556456 669832 789808 662626 338878 117491 107507 111654 -57444 -338723 -511927
40118e11927J16357M27379N60153M05165Q2077j44639j53016q9972j62547l63956
$$ -511927 -395570 31809 591962 997127 1079204 934565 781549 691577 529030 165074
40108A65074m63572k73873Q6987K63142O6670k56751l22485j02513J09613J83691
$$ 165074 -298498 -572371 -485384 -222242 -155572 -412323 -734808 -837321 -727708 -544017
40098e44017K60660L44359K13351r6521j67505J48098L62589M3887m66476n09144
$$ -544017 -283357 61002 274353 177832 10327 158425 521014 564901 98425 -410719
40088d10719m5682L64016L77836J67592k6676j61089k08811j30467m8640j18644
$$ -410719 -456401 -92385 285451 453043 426367 265278 56467 -74000 -122640 -241284
40078b41284k45135k32934j33747j02755l9805K10402M22234K48795j42147k23593
$$ -241284 -486419 -719353 -853100 -955855 -995660 -785258 -363024 -114229 -256376 -479969
40068d79969R1513L44764K83721J66568J91429J73583R01r7562n585O422k40477
$$ -479969 -388456 -43692 240029 406597 598026 771609 772510 674948 669363 675785 435308
40057D35308m71113l81405r4619J03519J83385K32612J79552l2629k13377j53720
$$ 435308 -35805 -417210 -511829 -408310 -224925 7687 187239 154610 -58767 -212487
40047b12487P4116K59991L24818K76376J06604r8490j65688j02615j14619k17792
$$ -212487 -138371 121620 446438 722814 829418 730928 565240 462625 348006 130214
40037A30214j39227K14793N11951M44477J29754j61544l53841m02826j60238K68789
$$ 130214 -9013 205780 717731 1162208 1291962 1130418 776577 373751 213513 482302
40027D82302M00523J3341m12155l54572m9713p3909l65811l31699J36071M38914
$$ 482302 882825 896166 484011 129439 79726 5817 -359994 -691693 -555622 -116708
40017a16708K09084j39799q7628K35537L48736J70275M3854J28362J51610j48305
$$ -116708 92376 -47423 -135051 100486 449222 619497 663351 791713 943323 795018
40007G95018n83070o93973l08429K37297M78732L20347M8869o6219q831J20684
$$ 795018 211948 -482025 -790454 -553157 -74425 245922 294791 228572 219741 340425
39997C40425K54501L07746J82451o9951k44305k37044j69899j92280l09146m41784
$$ 340425 594926 902672 1085123 1015172 770867 533823 363924 171644 -137502 -579286
39987e79286m73680k29391L21016Q01797P22186J36672l46734l59847j68003q2911
$$ -579286 -1052966 -1282357 -961341 -159544 562642 699314 352580 -7267 -175270 -258181
39977b58181K1462K68613L51154M1600k67407j13934K46417K29497j29060k85123
$$ -258181 -236719 31894 383048 424648 157241 43307 289724 519221 390161 105038
39967A05038j05630K8317r53J13244M07430M81437J99346o6636r7994j30528k53980
$$ 105038 -592 27725 26772 140016 547446 1028883 1228229 1161593 1063599 933071 679091
39956F79091j44637K49666L68139j23336o50109m75307K17873O01820L55161n9343
$$ 679091 534454 784120 1152259 1028923 378814 -96493 121380 723200 1078361 1019018
39946A019018j86806r3793m1937j00310k05826k95824k78474j01887R8003J26136
$$ 1019018 832212 738419 696482 596172 390346 94522 -183952 -285839 -187836 -61700
39936f1700J3714m3402k0931p9355k14917j81895J31833M89397O05435M77848
$$ -61700 -47986 -91388 -112319 -191674 -406591 -588486 -456653 32744 638179 1116027
39926A116027K79007Q4459j13575k44269k14419q5088j7872m3250k4024J26381
$$ 1116027 1395034 1479493 1365918 1121649 907230 822142 804270 761020 736996 863377
39916H63377L05217L39966J61649j66973m98480o33379m20194O8870N15458O11475
$$ 863377 1168594 1508560 1670209 1503236 1004756 371377 -48817 20053 535511 1146986
39906A146986L29265j08354m59181n79961m09216j1286L64911M39825J81409j59622
$$ 1146986 1476251 1367897 908716 328755 -80461 -91747 273164 712989 894398 734776
39896G34776l18326k40055n1182P9829O1642k0931L9139K75146L84029R8014l39541
$$ 734776 416450 176395 125213 205042 266684 245753 284892 560038 944067 1042081 702540
39885G02540m05425k6907L06317K71210J24556J56933J69980j08528m31505l59126
$$ 702540 297115 270208 576525 847735 972291 1129224 1299204 1190676 759171 400045
39875D00045J2408J67527m9579k62699j94336j5162M8556P0123J98293L45949
$$ 400045 412453 579980 530401 267702 73366 58204 106760 176883 375176 721125
39865G21125K99915R411l42237m78287k51023J62458L51554J20122k41138l22298
$$ 721125 1021040 1030451 688214 209927 -41096 121362 472916 593038 351900 29602
39855B9602j23613L0354j967o7078n3466j5261L3747J49506K70601K61424J26153
$$ 29602 -94011 -63657 -65624 -132702 -186168 -201429 -167682 -18176 252425 513849 640002
39844F40002n0715k76859m83631l60545K18827P44904N84837q9378m67023k38964
$$ 640002 589287 312428 -171203 -531748 -312921 431983 1016820 927442 460419 221455
39834B21455N3210l6457k13268o4258K39258K92725R5483q9765j93417k65979
$$ 221455 274665 238208 24940 -39318 199940 492665 588148 498383 304966 38987
39824C8987k24199k9905J18543Q7241N0493J48930J95108L2261j22141m6531P6428
$$ 38987 -185212 -215117 -96574 -9333 41160 190090 385198 417459 295318 248787 325215
39813C25215K0767j2146K42327N19877L41477k02702n17508l35815j1496P2428
$$ 325215 345982 333836 576163 1096040 1437517 1234815 717307 381492 369996 442424
39803D42424k5677m5565P3817J79578J32347k1938n5436J80861M41083K60299
$$ 442424 416747 371182 444999 624577 756924 734986 679550 860411 1301494 1561793
39793A561793l87043q88445p33283j79079J77176K24385K70479L60942K37447
$$ 1561793 1174750 286305 -446978 -626057 -448881 -224496 45983 406925 644372
39784F44372p5722k07629l6818J27200O4050q6741j86919l01665l89772k21508
$$ 644372 568650 361021 324203 451403 515453 428712 241793 -59872 -449644 -671152
39774f71152J69885L49262R1714j95869l5740L70362L89928j07981n06432k61488
$$ -671152 -501267 -152005 -60291 -256160 -291900 78462 468390 360409 -146023 -407511
39764d07511L51262N91798K20160k41196k77476o7888j03074l51274l04331J43779
$$ -407511 -56249 535549 755709 514513 237037 169149 66075 -285199 -589530 -445751
39754d45751M21825J31872l07682k87431Q4005K22106N661j09668J13483L32709
$$ -445751 -23926 107946 -199736 -487167 -403162 -181056 -175395 -285063 -171580 161129
39744A61129J88900j83456l93350k63186Q7510M20600N28603L63634R2524p8050
$$ 161129 350029 166573 -226777 -489963 -402453 18147 546750 910384 1002908 924858
39734I24858j18113j12140q1776m2778j13963l34085m77589l17209J7787K13579
$$ 924858 806745 694605 612829 570051 456088 122003 -355586 -672795 -655008 -441429
39724d41429K08514J74012J59097P1842n8964j19820j41383j92113j52822P4666
$$ -441429 -232915 -58903 100194 172036 113072 -6748 -148131 -340244 -493066 -418400
39714d18400K76581K27133J16111K18695L09059j0843m91202m36226K06423O52265
$$ -418400 -141819 85314 201425 420120 729179 718336 227134 -209092 -2669 649596
39704F49596L88222j54306l36958j70370n4208j07771j75948j99988k18923k02017
$$ 649596 1037818 883512 546554 376184 321976 214205 38257 -161731 -380654 -582671
39694e82671j34108r2536r0548m6810K4513N4286J43765L88820N15961J90433
$$ -582671 -716779 -809315 -899863 -946673 -922160 -867874 -724109 -335289 180672 371105
39684C71105l03402k98427K31518N49754K65384j31319j47537Q429J8097N3803
$$ 371105 67703 -230724 794 550548 815932 684613 537076 545505 563602 617405
39674F17405K65568L05659m2159l43580k49124j63258m74088p02431k80258L16325
$$ 617405 882973 1188632 1146473 802893 553769 390511 -83577 -786008 -1066266 -749941
39664g49941K10316m21759n92670o2602L95461L17155J22153J72720J78537j07176
$$ -749941 -539625 -961384 -1554054 -1616656 -1221195 -904040 -781887 -609167 -430630 -537806
39654e37806l46627j88244J76345L87987M08928L50164K11287L9179m824P5575
$$ -537806 -884433 -1072677 -896332 -508345 -99417 250747 462034 501213 496389 571964
39644E71964Q2179k8570j10386j68938l20501m01753j29853L02652L64160K0100
$$ 571964 654143 625573 515187 346249 25748 -376005 -505858 -203206 160954 181054
39634A81054j74134J9826J71225q617j67339l904J59762j4827k36476r2559K31663
$$ 181054 6920 26746 197971 189354 22015 18111 177873 163046 -73430 -165989 65674
39623F5674L14502K22631K84388M16741K81823o7492k71213k66057k65872k44652
$$ 65674 380176 602807 887195 1303936 1585759 1518267 1247054 980997 715125 470473
39613D70473k958K90169K05817k20994m17472r4566L18249K93775j08195m42538
$$ 470473 467515 757684 963501 742507 325035 230469 548718 842493 734298 291760
39603B91760m74179k83558Q138L02308M17603K25852j03317k32837q7924M2551
$$ 291760 -182419 -465977 -457839 -155531 262072 487924 384607 151770 63846 106397
39593A06397o3858k10468n8400L33811N14960K38255j88158l00145m8313K23224
$$ 106397 42539 -167929 -226329 107482 622442 860697 672539 372394 324081 547305
39583E47305K35436j727l20961n26470m69234k11971l2142m8813k314L06461N59825
$$ 547305 782741 781014 460053 -66417 -535651 -747622 -779764 -828577 -830891 -524430 35395
39572C5395L43723j22956k36709N4172J91867l9475j93268q906J27301m9394j25614
$$ 35395 379118 256162 19453 73625 265492 226017 32749 23843 151144 101750 -23864
39561b3864K39549N87294L38320k54275n35710m63143m25849l52597J18063P01294
$$ -23864 215685 802979 1141299 887024 351314 -111829 -537678 -890275 -772212 -70918
39551g0918O39696p9304n46184k40115K44550J73795k70107m13654j08610K14875
$$ -70918 568778 489474 -56710 -296825 -52275 121520 -148587 -562241 -670851 -455976
39541d55976K46897Q8555k4131L9357K44964L78142K28688q5156k04872n6146
$$ -455976 -209079 -120524 -144655 -105298 139666 517808 746496 661340 456468 400322
39531D00322L8047o5729m9229K67987M51561M7675o14776p63909k29461L56360
$$ 400322 438369 372640 323411 591398 1042959 1090634 475858 -288051 -517512 -161152
39521a61152M10757J7171l66957m27692j16712L98575P57091O46696J77170j94413
$$ -161152 249605 266776 -100181 -527873 -644585 -246010 511081 1157777 1334947 1140534
39511A140534k15408r5162j07453j92185j39816L1813J19844M3877r5282j97871
$$ 1140534 925126 829964 722511 530326 390510 422323 542167 586044 490762 292891
39501B92891k33189j76723l7892Q1710R2502M5455L3897K1918p4458j76175j04979
$$ 292891 59702 -117021 -154913 -73203 19299 64754 98651 120569 46111 -130064 -235043
39490b35043J25374K71596J81417j1550j07047j02874j03828q1863Q5253L60976
$$ -235043 -109669 161927 343344 331794 224747 121873 18045 -63818 21435 382411
39480C82411N06478L44472k1391l01692k99384p3901J45560J95806J21123N9764
$$ 382411 888889 1233361 1211970 910278 610894 536993 682553 878359 999482 1059246
39470A059246K8735p0391k24242k52754q0977Q9063M5407j14538j41096k5992
$$ 1059246 1087981 1017590 793348 540594 459617 548680 594087 479549 338453 312461
39460C12461M677j41432l09969l52537k49510M659L44541M62254P7315n24621
$$ 312461 317138 175706 -134263 -486800 -736310 -731651 -387110 75144 152459 -372162
39450c72162o45042q1245N23279N47203K20303J54494L79036M10328J08176j44617
$$ -372162 -1017204 -1098449 -575170 -27967 192336 346830 725866 1136194 1244370 1099753
39440A099753j03034N0004J32123J76341J33019j38952m57027m08164l9540P8338
$$ 1099753 996719 1046723 1178846 1355187 1488206 1349254 892227 484063 444523 522861
39430E22861k64299n26875k84134P1146R656k40798j47957J49406J03030k11099
$$ 522861 258562 -268313 -552447 -481301 -471645 -712443 -860400 -710994 -607964 -819063
39420h19063j75223K66211M56354J56868k8367K59134M25154p8305o93130n17624
$$ -819063 -994286 -728075 -271721 -114853 -143220 115914 541068 462763 -230367 -747991
39410g47991K52951N60225O0297m30792k35523K53879L50587J29804J06315K64445
$$ -747991 -495040 65185 125482 -305310 -540833 -286954 63633 193437 299752 564197
39400E64197J24605l34562n11236r2510M16756L97791k9006k65181j23431K2921
$$ 564197 688802 354240 -156996 -249506 167250 565041 536035 270854 147423 170344
39390A70344o0623j16946P9448K55809N1675l39342l69899O5436M48307L47792
$$ 170344 109721 -7225 72223 328032 379707 40365 -329534 -264098 184209 532001
39380E32001l9664k55791j96336p9408L384J53263L38895L41247R0129j92835
$$ 532001 492337 236546 40210 -39198 -35814 117449 456344 797591 887720 694885
39370F94885k92278k61387k78245l71610l95525k03076K01065N98473O52465K29128
$$ 694885 402607 141220 -137025 -508635 -904160 -1107236 -906171 -307698 344767 573895
39360E73895l36494m88886p6999M34080N12657J68888j59698k00213r0401p5204
$$ 573895 237401 -251485 -328484 105596 618253 787141 627443 427230 336829 261625
39350B61625j79647k33749r9246J70263L47397K41796n9510k52857j95208q1441
$$ 261625 81978 -151771 -251017 -80754 266643 508439 448929 196072 864 -80577
39340h0577j11947j60578j4689K01045J82571k6629n8876J73318K99965R2258
$$ -80577 -192524 -353102 -367791 -166746 15825 -10804 -69680 103638 403603 495861
39330D95861j37399k6786K34209J77568k16686m70409k76194J28932L41224K70679
$$ 495861 358462 331676 565885 743453 526767 56358 -219836 -90904 250320 520999
39320E20999J05954p517p3329j10328p9330L1371J29890R5533o4546j84402j24584
$$ 520999 626953 619436 546107 435779 356449 387820 517710 613243 548697 364295 239711
39309B39711L8766J04515K0094o5994n1677j8788m4174m6544L9644R5606J2011
$$ 239711 278477 382992 403086 337092 285415 266627 222453 175909 215553 311159 323170
39298C23170p8352M393J43347M6586k94495n30672l99567l3193K57708L26690
$$ 323170 244818 249211 392558 439144 144649 -386023 -785590 -818783 -561075 -234385
39288b34385K33095J04760O6436J76268L24016K89108L25l32701m27041k10835
$$ -234385 -1290 103470 169906 346174 670190 959298 959623 626922 199881 -10954
39278a0954J47705M24018M97428L92811K19600M9203j33839l13204l53620j80804
$$ -10954 136751 560769 1058197 1451008 1670608 1719811 1585972 1272768 919148 738344
39268G38344O870o4585l16289l47010J46L57092L12176l4661k56963k04006j13751
$$ 738344 745214 680629 364340 17330 17476 374568 686744 652083 395120 191114 77363
39257G7363j63107k14091q8747J32911K27917J19778o1535j46541q6491Q290l0642
$$ 77363 -85744 -299835 -388582 -255671 -27754 92024 30489 -116052 -202543 -194253 -224895
39246b24895k26955l65612k19901J07911K32183l4009l82990l60730P1409N15860
$$ -224895 -451850 -817462 -1037363 -929452 -697269 -731278 -1114268 -1474998 -1403589 -887729
39236h87729O53856N59509M43927L17096Q2200j87165l09569k85456k77131k86061
$$ -887729 -233873 325636 769563 1086659 1168859 981694 672125 386669 109538 -176523
39226a76523j13641K55418M81673K84823j38722l42719j74926J28183L08401L01719
$$ -176523 -290164 -34746 446927 731750 593028 250309 75383 203566 511967 813686
39216H13686J35979j12599k46707r5800K05587L22373J59464m7156j40230k38463
$$ 813686 949665 837066 590359 494559 700146 1022519 1181983 1134827 994597 756134
39206G56134l86531l36365N4944M61027M60717J33897o5277K6493Q8683j62196
$$ 756134 369603 33238 88182 549209 1009926 1143823 1078546 1105039 1193722 1031526
39196A031526n40040o10992k11729L46487N52434J92674l80287n72881k19962
$$ 1031526 491486 -119506 -331235 15252 567686 760360 380073 -192808 -412770
39187d12770K29879L24560J66766J11057J60503Q6196k4104J12858L36128J47077
$$ -412770 -182891 141669 308435 419492 579995 666191 642087 754945 1091073 1238150
39177A238150l98301n46874N4582O95289N53354j33269m85378k70280m0604j03017
$$ 1238150 839849 292975 347557 1042846 1596200 1462931 977553 707273 666669 563652
39167E63652j25489J10337K71298Q0237k01697k57000k09049k46672j78407J61989
$$ 563652 438163 548500 819798 900035 698338 441338 232289 -14383 -192790 -30801
39157c0801M17089J79055k71217l13878L4960J56578j36103k86362O4523M60242
$$ -30801 386288 565343 294126 -19752 15208 171786 35683 -250679 -186156 274086
39147B74086L60496j2615q5739J47604K09643k9348j99757j10523k7404j44637
$$ 274086 634582 621967 536228 683832 893475 864127 664370 553847 526443 381806
39137C81806k48427j27355N8333Q5327M7313J28111K25820J34262n5800q9262
$$ 381806 133379 6024 64357 149684 196997 325108 550928 685190 629390 540128
39127E40128n280r5814l77908m61319r6807M06937N41820K34007j11201j48495
$$ 540128 534848 439034 61126 -400193 -497000 -90063 451757 685764 574563 426068
39117D26068M0372J59275J01774J2153J6204M8406j0304j30974j80025j25079
$$ 426068 466440 625715 727489 739642 755846 804252 793948 662974 482949 357870
39107C57870p0316o5253r637J62335L04133K06869j05359l73347m06080k52618
$$ 357870 287554 222301 212664 374999 679132 886001 780642 407295 1215 -251403
39097b51403m0739J97937M36926N22500L18654m8851k75362k37213j11528p2473
$$ -251403 -292142 -94205 342721 865221 1183875 1135024 859662 622449 510921 438448
39087D38448l7520J35712L29612K75025l9653k99482k71600q7854j059k6332O9
$$ 438448 400928 536640 866252 1141277 1101624 802142 530542 442688 441629 415297 415366
39076D15366J15713J93281J71288J32976J40615J46053R8100J2894r2384k18297
$$ 415366 531079 724360 895648 1028624 1169239 1315292 1413392 1426286 1333902 1115605
39066A115605k99549k13272O7594L87532N11414L02191j54592n54528n99093l21766
$$ 1115605 816056 602784 670378 1057910 1569324 1871515 1716923 1162395 563302 241536
39056B41536q1104r4479j43131K9008K16639M6483l37414l92885k3289K52820
$$ 241536 160432 65953 -77178 -48170 168469 214952 -122462 -515347 -538636 -285816
39046b85816J52524P1469L38482N81592L53026o3355j07205J20085R0738j79977
$$ -285816 -133292 -61823 276659 858251 1211277 1147922 1040717 1160802 1251540 1071563
39036A071563k00358J5725r2936n41023n52809J76278P74242M02835m23151n40733
$$ 1071563 871205 886930 793994 252971 -299838 -123560 650682 1053517 630366 89633
39026H9633J70366O79103L44481k63095l22443J09463L69304J96146m5192m0116
$$ 89633 259999 939102 1283583 1020488 698045 807508 1176812 1372958 1327766 1287650
39016A287650L0099j46961m75261n36777j76542K45931L20792J29646P5475K49602
$$ 1287650 1317749 1170788 695527 158750 -17792 228139 548931 678577 754052 1003654
39006A003654L11512P2782j60539o2571J82274J59023j40866l29651k04642K6801
$$ 1003654 1315166 1387948 1227409 1164838 1347112 1506135 1365269 1035618 830976 857777
38996H57777J10238K8541j16967k43729k55857j14974J7765m5179j78395p5795
$$ 857777 968015 996556 879589 635860 380003 265029 282794 237615 59220 -16575
38986a6575K16190K59500j05556m09012j82225L28084M79620J32512k07008j44814
$$ -16575 199615 459115 353559 -55453 -237678 90406 570026 702538 495530 350716
38976C50716J17930K03015J04976N5745O6141n4542k76743k78392J02893N71420
$$ 350716 468646 671661 776637 832382 898523 843981 567238 288846 391739 963159
38966I63159O99042M26756O3786j41345k20171k74663k74448j71545n3254k6823
$$ 963159 1662201 2088957 2152743 2011398 1791227 1516564 1242116 1070571 1017317 990494
38956I90494n2345m3031m8630j60709k88740k39592k3791J27928J05669P1982
$$ 990494 938149 895118 846488 685779 397039 157447 133656 261584 367253 439235
38946D39235J65932K45322J04902j67572k70709r9544J21472J59255O5339M8827
$$ 439235 605167 850489 955391 787819 517110 417566 539038 698293 763632 812459
38936H12459J63415K64504K48109J75336J07700l2574k91349m65583k87850J50328
$$ 812459 975874 1240378 1488487 1663823 1771523 1738949 1447600 982017 694167 844495
38926H44495L98327J92903j96592l52052k60708k31021l65730m21100j85039K60182
$$ 844495 1242822 1435725 1239133 887081 626373 395352 29622 -391478 -576517 -316335
38916c16335O69397Q15541N72821Q1138k15207k9291K82080J10569m81280p46647
$$ -316335 353062 1168603 1741424 1822562 1607355 1578064 1860144 1970713 1489433 742786
38906G42786l40190J56232J49180r2064l1329J54856m4017m19347k69685L70853
$$ 742786 402596 558828 708008 615944 584615 739471 695454 276107 6422 377275
38896C77275O49722K19377k32484j46873L4285k44031n72434k00906O61731J044378
$$ 377275 1026997 1246374 1013890 867017 901302 657271 84837 -116069 545662 1590040
38886A590040N87298p1681l26771k96937k94136k35104M6587L32599K85481l1764
$$ 1590040 2177338 2105657 1778886 1481949 1187813 952709 999296 1331895 1617376 1585612
38876A585612k40343j49867O2381J26026k4694k06047j85054K8859J41071l3405
$$ 1585612 1345269 1195402 1257783 1383809 1359115 1153068 968014 996873 1137944 1104539
38866A104539k25707n5696L22789L40996j20785m62472k30264J87905J63621k19316
$$ 1104539 878832 823136 1145925 1486921 1366136 903664 673400 861305 1024926 805610
38856H05610l61405r1285J96916K85364L66559M48437J85268m12323o84643j98854
$$ 805610 444205 352920 549836 835200 1201759 1650196 1835464 1423141 738498 539644
38846E39644N14994O47936K37782L806K05537L32668k703m84877o49412n19777
$$ 539644 1054638 1702574 1940356 1944162 2149699 2482367 2479664 1994787 1345375 825598
38836H25598l48129j15720K76999N83303M57829L7236j71468M243K00111R5242
$$ 825598 477469 361749 638748 1222051 1679880 1717116 1545648 1549891 1750002 1845244
38826A845244j60971k52712j34538L3392J60460K20242J43367n8147j84845r2351
$$ 1845244 1684273 1431561 1297023 1330415 1490875 1711117 1854484 1796337 1611492 1519141
38816A519141N5163P186j62272j25880K09330N31834N19414K17597p0845j39716
$$ 1519141 1574304 1581490 1419218 1293338 1502668 2034502 2553916 2771513 2700668 2560952
38806B560952l2603N8066k4753k37428l21434o9790L53972N18838K41913j51193
$$ 2560952 2528349 2586415 2561662 2324234 2002800 1933010 2286982 2805820 3047733 2896540
38796B896540k29406O798J92861J25877l9418j43584k84606n48797o90349l89737
$$ 2896540 2667134 2673932 2866793 2992670 2953252 2809668 2525062 1976265 1285916 896179
38786H96179K03207N11135K45549j80264j98304J40529K93161O1770j34444M2708
$$ 896179 1099386 1610521 1856070 1675806 1477502 1618031 1911192 1972962 1838518 1881226
38776A881226L03603K06069j30131k28877k2861P9973j05863k62930j22687J26354
$$ 1881226 2184829 2390898 2260767 2031890 2009029 2089002 1983139 1720209 1597522 1723876
38766A723876K07035J74840J88741J57524m2678k13490q0002K20359K70137k9010
$$ 1723876 1930911 2105751 2294492 2452016 2409338 2195848 2115846 2336205 2606342 2577332
38756B577332l24994l20308j19364P954k6259j23350j72639j31387l4212K9480
$$ 2577332 2252338 1932030 1812666 1820620 1794361 1671011 1498372 1366985 1332773 1362253
38746A362253K7728N4707J70125K26396M5775k54874l47249j34846J11428J36132
$$ 1362253 1389981 1444688 1614813 1841209 1886984 1632110 1284861 1150015 1261443 1397575
38736A397575J0086m7175L0115J59321K63765K82215J48928r3588k55170j99493
$$ 1397575 1407661 1360486 1390601 1549922 1813687 2095902 2244830 2151242 1896072 1696579
38726A696579j1001J39808K06722K36067K24797J47583N5653J3076j3364p5670
$$ 1696579 1685578 1825386 2032108 2268175 2492972 2640555 2696208 2709284 2695920 2620250
38716B620250j13356m3931N9282M8547m4271j9598J65469K57343L3459l29542
$$ 2620250 2506894 2462963 2522245 2570792 2526521 2506923 2672392 2929735 2963194 2633652
38706B633652m10993q7990K58967K10287j36607k85259q765L40319L07110q5111
$$ 2633652 2222659 2134669 2393636 2603923 2467316 2182057 2173292 2513611 2820721 2735610
38696B735610m37651n02825l34639k1354L71910N92976L42545k25355n03664j75566
$$ 2735610 2297959 1795134 1460495 1439141 1811051 2404027 2746572 2521217 2017553 1841987
38686A841987L43943N01017L49563L08947M02349K63140j54808m28920l44314
$$ 1841987 2185930 2686947 3036510 3345457 3747806 4010946 3856138 3427218 3082904
38677C082904k10271k69503k60871O0165L53530J57429l05390l62363J07440M79373
$$ 3082904 2872633 2603130 2342259 2402424 2755954 2913383 2607993 2245630 2353070 2832443
38667B832443L12906n7955j38606j8742p7145k60582j90107J32654K63951K1965
$$ 2832443 3145349 3087394 2948788 2930046 2852901 2592319 2402212 2534866 2798817 2820782
38657B820782k17686j14817J23962R8839j74527l18217j33699J73858K85990J15449
$$ 2820782 2603096 2488279 2612241 2711080 2536553 2218336 2084637 2258495 2544485 2659934
38647B659934j30481j51418J25789L98124K95351j20763l75868j98895J27293
$$ 2659934 2529453 2378035 2503824 2901948 3197299 3076536 2700668 2501773 2629066
38638B629066J94003q873k18258k95294k18709P4437N00728P00595M78181J64014
$$ 2629066 2823069 2814196 2595938 2300644 2081935 2156372 2657100 3357695 3835876 3999890
38628C999890J12616P7734l43927q37910o84481N8727M92680J92091k03717q1953
$$ 3999890 4112506 4190240 3846313 3008403 2323922 2382649 2875329 3067420 2863703 2781750
38618B781750K11309Q8603k57261k60554K4525J03443m3927J0240L05756M08880
$$ 2781750 2993059 3081662 2824401 2563847 2588372 2691815 2647888 2658128 2963884 3372764
38608C372764J86427J1653Q5952J42261M382q5511M8317J46281n6030l53084l52820
$$ 3372764 3559191 3570844 3656796 3799057 3803439 3717928 3766245 3912526 3856496 3503412 3150592
38597C150592l2138K76169L29258J75135k1337j64120k45602k89192k95323k40389
$$ 3150592 3118454 3394623 3723881 3899016 3877679 3713559 3467957 3178765 2883442 2643053
38587B643053j42549p2627l8820N3454K26696L26771K40806J03378R2312J29535
$$ 2643053 2500504 2427877 2389057 2442511 2669207 2995978 3236784 3340162 3432474 3562009
38577C562009K5908j58779j78493K932J47544R2183o3772j38832n6635J30976
$$ 3562009 3587917 3429138 3250645 3253577 3401121 3493304 3429532 3290700 3234065 3365041
38567C365041K51691J24118j68656k69865m0907J52907j7709k58403q2585L49236
$$ 3365041 3616732 3740850 3572194 3302329 3261422 3414329 3396620 3138217 3055632 3404868
38557C404868M24261N2242k19618j36101q5974l12209m41604j61558K08504K55306
$$ 3404868 3829129 3881371 3661753 3525652 3439678 3127469 2685865 2524307 2732811 2988117
38547B988117J07105P9873J02319k9402j74411j14140n930q8806j95421m7133
$$ 2988117 3095222 3175095 3277414 3248012 3073601 2959461 2953531 2864725 2669304 2622171
38537B622171J91760J67168l2351j7387K37297L70555K22662r611j64591k36570
$$ 2622171 2813931 2981099 2948748 2931361 3168658 3539213 3761875 3752264 3587673 3351103
38527C351103j51006J52281M36542L86818R9958m3549K8972M4182p2555o8595
$$ 3351103 3200097 3352378 3788920 4175738 4275696 4232147 4261119 4305301 4232746 4164151
38517D164151J63880M04466M67395L74406J32588k55290n27870l66793O1439K28504
$$ 4164151 4328031 4732497 5199892 5574298 5706886 5451596 4923726 4556933 4618372 4846876
38507D846876J3855j36334L5047K08049R0178j06628j16872p8410j56072j39082
$$ 4846876 4860731 4724397 4759444 4967493 5057671 4951043 4834171 4755761 4599689 4460607
38497D460607J40944L66946K14342l7843O9484L68065K93040j71783m01616n2382
$$ 4460607 4601551 4968497 5182839 5144996 5214480 5582545 5875585 5703802 5302186 5249804
38487E249804M62199N85474K89557p2070k57674k60937j62918n7373m849L0116
$$ 5249804 5712003 6297477 6587034 6514964 6257290 5996353 5833435 5776062 5771213 5801329
38477E801329Q4005M8365j73122l69644j84597L40057O80437M65955m5838l38277
$$ 5801329 5885334 5933699 5760577 5390933 5206336 5546393 6226830 6692785 6646947 6308670
38467F308670k76495j30214r5558p5857Q4254L64137N96213O05472L29827r1318
$$ 6308670 6032175 5901961 5806403 5730546 5814800 6178937 6775150 7380622 7710449 7619131
38457G619131l80857l88192k51270j82530j58886M327K98208M51448K83432l7834
$$ 7619131 7238274 6850082 6598812 6416282 6257396 6261723 6559931 7011379 7294811 7256977
38447G256977k01773j18790L3023O5761k1399r2995n1441N6522R1366r041j13480
$$ 7256977 7055204 6936414 6969437 7035198 7013799 6920804 6869363 6925885 7017251 7008210 6894730
38436F894730p374L48891P21028Q14236N66208J89135n8606r8053l7822j1473
$$ 6894730 6887356 7236247 7957275 8771511 9337719 9526854 9468248 9370195 9332373 9320900
38426I320900m2660o4976l3257L3650J10625J84944J88837K8286k20936k65126
$$ 9320900 9278240 9213264 9180007 9213657 9324282 9509226 9698063 9726349 9505413 9240287
38416I240287O4544M81894N18024J51529j19422L9711L29844K74191q0699k66566
$$ 9240287 9304831 9786725 10304749 10456278 10336856 10376567 10706411 10980602 10899903 10633337
38406A0633337j00605Q8668j113k08825j87233Q2394K75276J74494l7316j2072
$$ 10633337 10532732 10621400 10620287 10411462 10224229 10306623 10581899 10756393 10719077 10707005
38396A0707005K89969M85906K34487k65824m71924k10263J07013J25217O0824
$$ 10707005 10996974 11482880 11717367 11451543 10979619 10769356 10876369 11001586 11062410
38387A1062410K59789N49383N03970J78905L0657J55327J84221j142m9036J79114
$$ 11062410 11322199 11871582 12375552 12554457 12585114 12740441 12924662 12923520 12874484 13053598
38377A3053598K86944K4841k18802k6848L59161M33355J97810N5642J51063K82203
$$ 13053598 13340542 13365383 13146581 13119733 13478894 13912249 14110059 14165701 14316764 14598967
38367A4598967L19266K83672J40944q6552j36842J56597M83908M39752J54605
$$ 14598967 14918233 15201905 15342849 15256297 15119455 15276052 15759960 16199712 16354317
38358A6354317Q1865K69208L66707L00917L56384N46309N09927J97120P0155L45269
$$ 16354317 16436182 16705390 17072097 17373014 17729398 18275707 18785634 18982754 19052909 19398178
38348A9398178N58894K80224j62082j38337L61107P51099O89890M44287L85022
$$ 19398178 19957072 20237296 20075214 19936877 20297984 21049083 21738973 22183260 22568282
38339B2568282M82759M71379L07246K41916M43169P09871P07549M42571K88460
$$ 22568282 23051041 23522420 23829666 24071582 24514751 25224622 25932171 26374742 26663202
38330B6663202M63233P13045O99955M82876L41790L25109L24195M23932P34599
$$ 26663202 27126435 27839480 28539435 29022311 29364101 29689210 30013405 30437337 31171936
38321C1171936R87240Q20378M51277M94813J034045J452534J356214J066758R44892
$$ 31171936 32159176 32979554 33430831 33925644 34959689 36412223 37768437 38835195 39780087
38312C9780087Q42390O17932O08025J043084J472010J385951J046159J039481
$$ 39780087 40622477 41240409 41848434 42891518 44363528 45749479 46795638 47835119
38304D7835119J314515J382796J263958J416322J784186J778186J350509J251581
$$ 47835119 49149634 50532430 51796388 53212710 54996896 56775082 58125591 59377172
38296E9377172J865838K533724K554053K253079K380823K866964K984009K600630
$$ 59377172 61243010 63776734 66330787 68583866 70964689 73831653 76815662 79416292
38288G9416292K440795K929390L485886L386163K858489K770213L417481M181259
$$ 79416292 81857087 84786477 88272363 91658526 94517015 97287228 100704709 104885968
38280A04885968M434851M320339M381716M752397N083749N170289N251317N586694
$$ 104885968 109320819 113641158 118022874 122775271 127859020 133029309 138280626 143867320
38272A43867320O023736O224938O195511O302566O731712P167599P203799O942591
$$ 143867320 149891056 156115994 162311505 168614071 175345783 182513382 189717181 196659772
38264A96659772O896698P245245P493765P124279O375197N978899O163887O366829
$$ 196659772 203556470 210801715 218295480 225419759 231794956 237773855 243937742 250304571
38256B50304571O062315N429127M897584M426983L695205K777438K109158J813036
$$ 250304571 256366886 261796013 266693597 271120580 274815785 277593223 279702381 281515417
38248B81515417J521567R26075J35587n84788j127478j528581j896751k386666
$$ 281515417 283036984 283963059 284098646 283513858 282386380 280857799 278961048 276574382
38240B76574382l021004l584218l939223m320050m964701n616471n866992n879640
$$ 276574382 273553378 269969160 266029937 261709887 256745186 251128715 245261723 239382083
38232B39382083o183406o771802p068460o879629o691550o820421o953784o832919
$$ 239382083 233198677 226426875 219358415 212478786 205787236 198966815 192013031 185180112
38224A85180112o722101o817896o821390o531825o265097o220815o050854n576806
$$ 185180112 178458011 171640115 164818725 158286900 152021803 145800988 139750134 134173328
38216A34173328n284648n470981n546364m960502m218871m069356m201168l810714
$$ 134173328 128888680 123417699 117871335 112910833 108691962 104622606 100421438 96610724
38208I6610724l078525k903647l346637l550835l222734k979548l043883k802670
$$ 96610724 93532199 90628552 87281915 83731080 80508346 77528798 74484915 71682245
38200G1682245k066725j646898k066997k639110k529892j986167j740526j807930
$$ 71682245 69615520 67968622 65901625 63262515 60732623 58746456 57005930 55198000
38192E5198000j682705j319497j136402j260972j421094j455236j420993j323050
$$ 55198000 53515295 52195798 51059396 49798424 48377330 46922094 45501101 44178051
38184D4178051j153719j054737j079150r95804o88294m98835p57875j191685j252683
$$ 44178051 43024332 41969595 40890445 39894641 39206347 38707512 37949637 36757952 35505269
38175C5505269q88305n46008n17188o73563p78054p09925m64369k28012l16170
$$ 35505269 34616964 34070956 33553768 32880205 32102151 31392226 30927857 30699845 30383675
38166C0383675p28051r61247o43977j43726q0861m05143n14801k28331k0295j98278
$$ 30383675 29655624 28694377 28050400 27906674 27825813 27420670 26905869 26677538 26657243 26458965
38156B6458965m36120l69056j68009j89164m01072n05508l86051j18991K63109
$$ 26458965 26022845 25653789 25485780 25296616 24895544 24390036 24003985 23884994 24148103
38147B4148103O83070Q30538M34023k77822p01861n39161j20380P0158R581P5484
$$ 24148103 24831173 25661711 26095734 25817912 25116051 24576890 24456510 24526668 24536249 24611733
38137B4611733M48158Q13588P55384K99925r8163r1877K00591M33377M80805M91130
$$ 24611733 25059891 25873479 26628863 26928788 26830625 26738748 26939339 27372716 27853521 28344651
38127B8344651N61474N82616M80632M18104N62653P63946P29768N23001N64441
$$ 28344651 28906125 29488741 29969373 30387477 30950130 31714076 32443844 32966845 33531286
38118C3531286J003078J410311J395050J238153J452881J886315J871702J310232
$$ 33531286 34534364 35944675 37339725 38577878 40030759 41917074 43788776 45099008
38110D5099008R40641J277599J883232K093118J931784J793814J689278J447765
$$ 45099008 46039649 47317248 49200480 51293598 53225382 55019196 56708474 58156239
38102E8156239J310388J588380J954078J816243J270272R22448Q53499N79610
$$ 58156239 59466627 61055007 63009085 64825328 66095600 67018048 67871547 68451157
38094F8451157N8558j56492N3473O5186m41745r40971r78350q79927j036894j181506
$$ 68451157 68509715 68353223 68406696 68471882 68030137 67089166 66110816 65230889 64193995 63012489
38084F3012489r76105p18698q00783r70288q22729n92203p27326j022174r15282
$$ 63012489 62036384 61317686 60516903 59546615 58723886 58131683 57404357 56382183 55466901
38075E5466901m18207k9657J04721K55213M57627M83443L93830M66845N99977
$$ 55466901 55048694 55019037 55123758 55378971 55836598 56320041 56713871 57180716 57780693
38066E7780693M33286Q2997R1266N33792P99576M71685q8999k92826n9251K25546
$$ 57780693 58213979 58296976 58388242 58922034 59721610 60193295 60104296 59811470 59752219 59977765
38056E9977765J90491k52781q81164j296564j307855j195645j355470j727094
$$ 59977765 60168256 59915475 59034311 57737747 56429892 55234247 53878777 52151683
38048E2151683j902330j759596j602846j646645j753182j760248j723637j734400
$$ 52151683 50249353 48489757 46886911 45240266 43487084 41726836 40003199 38268799
38040C8268799j778654j838987j882411j759430j400824j057585r98669j044864
$$ 38268799 36490145 34651158 32768747 31009317 29608493 28550908 27552239 26507375
38032B6507375q31597m81019m86744q90178j146375r77327p99690j009603j325988
$$ 26507375 25675778 25194759 24708015 23817837 22671462 21694135 20894445 19884842 18558854
38023A8558854j242167p87975m25184l84706m73382m43467k79264j51653k36149
$$ 18558854 17316687 16528712 16103528 15718822 15245440 14801973 14522709 14371056 14134907
38014A4134907n16948p16689n62082j63541O5583o7948l15730l77170k78644k29646
$$ 14134907 13617959 12901270 12339188 12175647 12241230 12173282 11857552 11480382 11201738 10972092
38004A0972092k91907l45213k72758q8766N0170k4355k48682l16643r9849P3215
$$ 10972092 10680185 10334972 10062214 9973448 10023618 9999263 9750581 9433938 9334089 9407304
37994I407304j36178m89554m55103k6845K27261l082l70776m48274k64853p4761
$$ 9407304 9271126 8781572 8326469 8299624 8526885 8523803 8153027 7704753 7439900 7365139
37984G365139J5832k5012k43314m89970m51858j15363J10537m2782l14405l20512
$$ 7365139 7380971 7355959 7112645 6622675 6170817 6055454 6165991 6123209 5808804 5488292
37974E488292q0794R8321M8532j47200k82887j62493J82160L78723J22000l12655
$$ 5488292 5407498 5505819 5554351 5407151 5124264 4961771 5143931 5522654 5644654 5331999
37964E331999l81007r7202K705k02294k09931J34473K21493k91402p33681l84687
$$ 5331999 4950992 4853790 4856495 4654201 4444270 4578743 4800236 4508834 3775153 3390466
37954C390466L55561N38094M8718l78773l24961p7647O4557J49781J90066N4109
$$ 3390466 3746027 4284121 4332839 3954066 3629105 3551458 3616015 3765796 3955862 4009971
37944D009971j55817j49113L7713M9405j81456l01043j14387J32371J77611O9932
$$ 4009971 3854154 3705041 3742754 3792159 3610703 3309660 3195273 3327644 3505255 3575187
37934C575187n2964j60166j90448m7420J66674K18100J10213O2459P6428q7367
$$ 3575187 3522223 3362057 3171609 3124189 3290863 3508963 3619176 3681635 3758063 3670696
37924C670696l97925m42676l9023M05633M13891M0977l06727m12951l24456q3350
$$ 3670696 3272771 2830095 2791072 3196705 3610596 3651573 3344846 2931895 2607439 2524089
37914B524089K73431N29560M22676l298l92273m74059l18401j47001l8347P3391
$$ 2524089 2797520 3327080 3749756 3746458 3354185 2880126 2561725 2414724 2376377 2449768
37904B449768J89181J89797K1672j76739k27033j22614J7379J35706K19462J55288
$$ 2449768 2638949 2828746 2850418 2673679 2446646 2324032 2341411 2477117 2696579 2851867
37894B851867j50471m86917m62895l8264L37302L00630M0660n3790K1257j4732
$$ 2851867 2701396 2214479 1751584 1713320 2050622 2351252 2391912 2338122 2359379 2344647
37884B344647j88988k21680M302K56024K96543J56440k3804k00674l56695l83055
$$ 2344647 2155659 1933979 1938281 2194305 2490848 2647288 2623484 2422810 2066115 1683060
37874A683060j85141J42167L42383K19140j73107n47770o04290k56615L10509
$$ 1683060 1497919 1640086 1982469 2201609 2028502 1480732 876442 619827 930336
37865I30336P48903P35961K37912l22819l84056O6883L59070J5176n00993m26262
$$ 930336 1679239 2415200 2653112 2330293 1946237 2013120 2372190 2387366 1886373 1460111
37855A460111J13994K79477j37585l85217j3896L83668J78842k96664m08371k46468
$$ 1460111 1574105 1853582 1715997 1330780 1316884 1700552 1879394 1582730 1174359 927891
37845I27891k37205k33504J42667N88376M59247j30003m03182r4090K62441K49993
$$ 927891 690686 457182 599849 1188225 1647472 1517469 1114287 1020197 1282638 1532631
37835A532631N5775n5073q8124k5189K14920M08337J93226k92133n04820l20709
$$ 1532631 1588406 1533333 1445209 1420020 1634940 2043277 2236503 1944370 1439550 1118841
37825A118841j66908k22999j38606K44912N18808L56898J0934j60157j92039k35205
$$ 1118841 951933 728934 590328 835240 1354048 1710946 1721880 1561723 1369684 1134479
37815A134479j98732l305J57047J11184m983O424J24504K33204K69306J53084
$$ 1134479 935747 932442 1089489 1200673 1195690 1202114 1326618 1559822 1829128 1982212
37805A982212j36713l69512k85116l3329j932k00186k66260r7710L8188M6275
$$ 1982212 1845499 1475987 1190871 1157542 1155610 955424 689164 591454 629642 675917
37795F75917Q8703R5885j63176m51319k34905L61942N61702J37572k14886n5350
$$ 675917 764620 860505 697329 246010 11105 373047 934749 1072321 857435 802085
37785H02085J26885q7684k50176P4050M06191J61406k82175k24281J35210O1221
$$ 802085 928970 841286 591110 665160 1071351 1232757 950582 726301 861511 922732
37775I22732m41654o40400k19983L74418O68742N77889J99602k17609k60570J24675
$$ 922732 481078 -159322 -379305 -4887 663855 1241744 1441346 1223737 963167 1087842
37765A087842L25821j11514o52242m99141J25550L01464j43477m63515k73814
$$ 1087842 1413663 1302149 649907 150766 276316 577780 434303 -29212 -303026
37756c03026k3215j7712Q2671M41099N59404J11420m08370m16626j01327J0811
$$ -303026 -326241 -343953 -261282 179817 739221 850641 442271 25645 -75682 -64871
37746f4871o2311Q1183M16653M57929L0594m04667l60400M2031K74432J25545
$$ -64871 -127182 -45999 370654 828583 859177 454510 94110 136141 410573 536118
37736E36118m1685J44834M65688L89882j04047m17432j75707K56156L76130K34740
$$ 536118 494433 639267 1104955 1494837 1390790 973358 797651 1053807 1429937 1664677
37726A664677J22914k7405l87620o77226m87939Q532K90871L00195L78913M81871
$$ 1664677 1787591 1760186 1372566 695340 207401 215933 506804 806999 1185912 1667783
37716A667783J77906m89678q54925n57462k3258K30820K39958K59809K74435J68713
$$ 1667783 1845689 1356011 501086 -56376 -79634 151186 391144 650953 925388 1094101
37706A094101J8792j00063k85327n07371m31525J36036Q07163R27337L12451m87483
$$ 1094101 1112893 1012830 727503 220132 -211393 -75357 731806 1659143 1971594 1484111
37696A484111p04060j53268M96938M45755k13886n55928j10317M19782K08057
$$ 1484111 780051 626783 1123721 1569476 1355590 799662 689345 1109127 1317184
37687A317184m31590n83721j71982P7263n3570m5042K19571J63489l50821o10105
$$ 1317184 885594 301873 129891 207154 153584 108542 328113 491602 140781 -469324
37677d69324k17967K37721K16240O2721J86716K27492j70265m52733L6843Q42776
$$ -469324 -687291 -449570 -233330 -170609 16107 243599 73334 -379399 -342556 500220
37667E00220R55584K92407l02032l71061k69567k93588k34033L7951K26643J10594
$$ 500220 1455804 1748211 1446179 1075118 805551 511963 277930 315881 542524 653118
37657F53118r7315j15341L5631J87530K57232K02955O839j94927j79955O6877
$$ 653118 555803 440462 476093 663623 920855 1123810 1130649 935722 755767 822644
37647H22644K82908K22403o9042l03221k41029L3626J55546q7647m20401m08559
$$ 822644 1105552 1327955 1258913 955692 714663 748289 903835 816188 395787 -12772
37637a2772p8061J34635N7632j4713J16002K53864K39599K07186J99280J9394
$$ -12772 -90833 43802 101434 86721 202723 456587 696186 903372 1102652 1122046
37627A122046k82754l08689M555J68010k5196p6185L25471O32817L07813k31472
$$ 1122046 839292 530603 535158 703168 677972 601787 927258 1560075 1867888 1636416
37617A636416k87786j3155l0230l29732m25602k99781k93426k99030J9726L92625
$$ 1636416 1348630 1335475 1305245 975513 549911 250130 -43296 -342326 -322600 70025
37607G0025K82296p2097M8590N54226O04305K8118l76364j71597J10667K338k13056
$$ 70025 352321 280224 328814 883040 1487345 1515463 1139099 967502 1078169 1080507 867451
37596H67451k26836k29779k92465p6733L76319M14234j43906n10912j29872M00439
$$ 867451 640615 410836 118371 41638 417957 832191 688285 177373 47501 447940
37586D47940L02077j68559k72439P607J39749L777j13705j69018k73014k23414
$$ 447940 750017 581458 309019 316626 456375 460152 346447 177429 -95585 -318999
37576c18999J75311N58854M42782R667j88499j05437j11839k22309j31040Q4609
$$ -318999 -143688 415166 857948 867615 679116 573679 461840 239531 108491 193100
37566A93100K8314k45223k17123K42773O21875N17167J31205j40548j82405o9853
$$ 193100 221414 -23809 -240932 1841 623716 1140883 1272088 1131540 949135 879282
37556H79282J19434K63218K41055R6813n4530k20879l88945l54442m8828J57923
$$ 879282 998716 1261934 1502989 1599802 1545272 1324393 935448 581006 532178 690101
37546F90101o5832m14883l68424n6604n1606l57293l57027J32296N10217L51912
$$ 690101 624269 209386 -159038 -215642 -267248 -624541 -981568 -849272 -339055 12857
37536A2857L0716K2119J85767J72016M0688Q255j2039j51862k11999j319K39730
$$ 12857 43573 65692 251459 423475 464163 472418 460379 308517 96518 95199 334929
37525C34929J98412J5846J7050J48224J28018m1194j57521k29315l43761l05457
$$ 334929 533341 549187 566237 714461 842479 801285 643764 414449 70688 -234769
37515b34769Q1956N00737M42463K050k15906p261J94694R3718n6751l3126m9952
$$ -234769 -152813 347924 790387 792437 576531 569270 763964 857682 800931 767805 717853
37504G17853k38502k40707J94097O14320M41414j21881l68109j36059N1340r5217
$$ 717853 479351 238644 432741 1047061 1488475 1366594 998485 862426 913766 818549
37494H18549k25273m0322J97073J71343M7641Q4739J07740j38596m05143k74936
$$ 818549 593276 552954 750027 921370 969011 1053750 1161490 1022894 617751 342815
37484C42815R3169J73538l7668j6532L19424L51559k24866p76474o19150k3102
$$ 342815 435984 609522 571854 555322 874746 1226305 1001439 224965 -394185 -417287
37474d17287K70652J60463J17154K36468J30544k48313m16029j50130J58749J78864
$$ -417287 -146635 13828 130982 367450 497994 249681 -166348 -316478 -157729 21135
37464B1135Q9100Q5262N68k13760j71714K91323O15303K77103l04339l33007J12971
$$ 21135 110235 195497 196065 -17695 -189409 101914 717217 994320 689981 356974 469945
37453D69945J95262l29013o91815l07547L33624M29719J7745k04178O4858M01062
$$ 469945 665207 336194 -355621 -663168 -329544 100175 117920 -86258 -21400 379662
37443C79662L29527j04190m86575m85898j11578K91134L21621m0992l53823k45259
$$ 379662 709189 604999 118424 -367474 -479052 -187918 133703 92711 -261112 -506371
37433e06371P8762J30672j44382l08370j01902K08544K94202K24888K26452K58382
$$ -506371 -427609 -296937 -441319 -749689 -851591 -643047 -348845 -123957 102495 360877
37423C60877J49558k5858n2984L0348j7511k17314l19484k19888j07476r4563
$$ 360877 510435 484577 431593 461941 444430 227116 -92368 -312256 -419732 -514295
37413e14295q801K56060M39896K39007k13528m63433k85321R8591L31100K69604
$$ -514295 -523096 -267036 172860 411867 198339 -265094 -550415 -451824 -120724 148880
37403A48880K8686j66973j59438j225Q9816N942r5009l3168J11437J63471J85113
$$ 148880 177566 10593 -148845 -150070 -60254 -54312 -149321 -182489 -71052 92419 277532
37392B77532L43401M94628K86806k38758n42171l03454Q6526P6230k55663l69887
$$ 277532 620933 1115561 1402367 1163609 621438 317984 404510 480740 225077 -144810
37382a44810j04523J15677l8970l21624l09978o416K29488K03781P7088N6574
$$ -144810 -249333 -133656 -172626 -494250 -804228 -810644 -581156 -377375 -300287 -243713
37372b43713J19830J13272m538j15424r5432N1966K10487K56023J45546n4432
$$ -243713 -123883 -10611 -15149 -130573 -226005 -174039 36448 292471 438017 383585
37362C83585k02846j84261k6077R6385L2523j53864k25310l5429K84439M41954
$$ 383585 180739 -3522 -29599 66786 99309 -54555 -279865 -315294 -30855 411099
37352D11099K74539r4012l75873l90832k19911p9059n9072o7461l7126m2413j06428
$$ 411099 685638 591626 215753 -175079 -394990 -474049 -533121 -600582 -637708 -680121 -786549
37341g86549o6060J57189K96808P6214k62736j83668L23953N98048K00509m42059
$$ -786549 -852609 -695420 -398612 -322398 -585134 -768802 -444849 153199 353708 -88351
37331h8351o29835k96493Q2120K34723K77193K90076J99441M7567m2133j50646
$$ -88351 -718186 -1014679 -932559 -697836 -420643 -130567 68874 116441 74308 -76338
37321g6338m01658n52456k35204L56634N54078J37395l25826k96553N0808K59165
$$ -76338 -477996 -1030452 -1265656 -909022 -354944 -217549 -543375 -839928 -789120 -529955
37311e29955K70444K87242K98901J86789P1240J27106K08270N2283k50302l68654
$$ -529955 -259511 27731 326632 513421 584661 711767 920037 972320 722018 353364
37301C53364k49150j62852k43710k93559j02903K43449M34895K26427k81615o12848
$$ 353364 104214 -58638 -302348 -595907 -698810 -455361 -20466 205961 -75654 -688502
37291f88502l55344K71742N66709K30304k31700k56423M979P9085j5435Q4215
$$ -688502 -1043846 -772104 -205395 24909 -206791 -463214 -458235 -379150 -394585 -310370
37281c10370L37448L34763J4716k53984l14543l70720m45255k74971J27508L60480
$$ -310370 27078 361841 376557 122573 -191970 -562690 -1007945 -1282916 -1155408 -794928
37271g94928K57275J14986J21927P8669r2955j02967J47331K70004J8416k50594
$$ -794928 -537653 -422667 -300740 -222071 -315026 -417993 -270662 -658 17758 -232836
37261b32836j52264R8183Q3158j37241k14025j01531L350Q4988K17418K45396
$$ -232836 -385100 -286917 -203759 -341000 -555025 -656556 -653206 -568218 -350800 -105404
37251a05404J2970k43694j76861J22139K82705K52173K78261L58168J85560k95529
$$ -105404 -92434 -336128 -512989 -390850 -108145 144028 422289 780457 966017 670488
37241F70488o85914o14688j75087K17518K50402j8668k17124n1806K92621L53863
$$ 670488 -15426 -630114 -805201 -587683 -337281 -355949 -573073 -624879 -332258 21605
37231B1605P3395q2906J02121J62017k93154q11158p02407j11503K25598J35634
$$ 21605 95000 12094 114215 276232 -16922 -828080 -1530487 -1641990 -1416392 -1280758
37221a280758J48261M76297O33985K80523k11379l42031j43735N4356J29419J49316
$$ -1280758 -1132497 -656200 -22215 258308 46929 -295102 -438837 -384481 -255062 -105746
37211a05746J50508J50972J59872Q2809j26979k33456J397L25363K52157j69941
$$ -105746 44762 195734 355606 438415 311436 77980 79377 404740 656897 486956
37201D86956l80391j79224M376j19819k59712j14888J57880L27029M03972L20822
$$ 486956 106565 -72659 -68283 -188102 -447814 -562702 -404822 -77793 326179 647001
37191F47001j19882o62811o14495J30345P05076M33774k14468m19890j82696j1764
$$ 647001 527119 -135692 -750187 -619842 85234 519008 304540 -115350 -298046 -309810
37181c09810K6817J48795J62256j92596n15490k46818L06997L52524j00604k57932
$$ -309810 -282993 -134198 28058 -164538 -680028 -926846 -619849 -267325 -367929 -625861
37171f25861J46577M82616L14063o438q8943r0254k27319l43938k75420j16781
$$ -625861 -479284 3332 317395 310957 222014 131760 -95559 -439497 -714917 -831698
37161h31698Q9614L98637N56177J88388m29948n17802M0760M30639J67739j80317
$$ -831698 -742084 -343447 212730 401118 -28830 -546632 -505872 -75233 92506 -87811
37151h7811m2641J94600j3150l10916o5869M55975M82969N344k83203j56689o3261
$$ -87811 -130452 64148 50998 -259918 -325787 130188 613157 618501 335298 178609 115348
37140A15348j81324j36002K18486M94491M45316K89102J59084j41015n82233p06217
$$ 115348 -65976 -201978 16508 510999 956315 1245417 1404501 1263486 681253 -24964
37130b4964l06916J77193K90886J56298J15922J88986K30690K62596K83400R5581
$$ -24964 -331880 -154687 136199 292497 408419 597405 828095 1090691 1374091 1469672
37120A469672l03146m92835k14357J38769Q7888j61381q3359K48462K69387j10667
$$ 1469672 1166526 673691 459334 598103 685991 524610 441251 689713 959100 848433
37110H48433l41965j47050N2493j16700l66156k59065Q7654K43475J14270n9765
$$ 848433 506468 359418 411911 295211 -70945 -330010 -242356 1119 115389 55624
37100E5624j42587j50028l2707K01569K87383K1367l18030k81560P8976K75385
$$ 55624 -86963 -236991 -269698 -68129 219254 240621 -77409 -358969 -279993 -4608
37090d608J04034j42321k17279k04681j56667O0874L61273L54199l4749k99118
$$ -4608 99426 -42895 -260174 -464855 -621522 -560648 -199375 154824 120075 -179043
37080a79043p5597K69953K33256j6093J1640K21746P5462m32362o45056k32521
$$ -179043 -254640 15313 248569 232476 244116 465862 541324 108962 -536094 -768615
37070g68615L09040M08208J58319k8031p9120j62437k18501n3691K31809L10560
$$ -768615 -459575 -51367 106952 78921 -199 -162636 -381137 -434828 -203019 107541
37060A07541R7834j56799k54323k55811k59253j90228O8620M42542O59727M91766
$$ 107541 205375 48576 -205747 -461558 -720811 -911039 -842419 -399877 259850 751616
37050G51616O801m29207m77909j77044J20377J69261O4885J1151K8182Q869p0312
$$ 751616 758417 329210 -148699 -325743 -205366 -36105 28780 39931 68113 76982 6670
37039F670j44835j80464j65108o2834R8826J75420P1135j07537j83493j23962
$$ 6670 -138165 -318629 -483737 -546571 -447745 -272325 -201190 -308727 -492220 -616182
37029f16182q361J27297K68475L26759K36059R1896L1524K4559m3549j28144p6222
$$ -616182 -624543 -497246 -228771 97988 334047 425943 457467 482026 438477 310333 234111
37018B34111Q8207J57817O9239J6565J29536K24272M2983l61901o53929n90899
$$ 234111 322318 480135 549374 565939 695475 919747 962730 600829 -53100 -643999
37008f43999k46538J31550L57759L74956K03103p5729l07133l37199j46573J18854
$$ -643999 -890537 -758987 -401228 -26272 176831 101102 -206031 -543230 -689803 -570949
36998e70949K91661L36700L20358K61213J04849j35535l12815k95440j32391P680
$$ -570949 -279288 57412 377770 638983 743832 608297 295482 42 -132349 -124669
36988a24669L5646P027J50R989j1375o5006j00478p8130J878J19344K34181K62859
$$ -124669 -89023 -81996 -81846 -71857 -83232 -148238 -248716 -326846 -324968 -205624 28557 291416
36976B91416J26553j21955k83093k26287q4295q8320k15614j97643N8180K78448
$$ 291416 417969 296014 12921 -213366 -297661 -385981 -601595 -799238 -741058 -462610
36966d62610K09117r371p3452M0868J37397J71840K37160K50563K7493l23330
$$ -462610 -253493 -262864 -336316 -295448 -158051 13789 250949 501512 529005 205675
36956B05675m53524k90294j25519q4830P8922M48754O06834K00440m26184n85813
$$ 205675 -247849 -538143 -663662 -748492 -669570 -220816 386018 586458 160274 -425539
36946d25539j27715L97355M37042K3549l74333l97170j35068K1525j21017k67437
$$ -425539 -553254 -155899 281143 304692 -69641 -466811 -601879 -580354 -701371 -968808
36936i68808k2250M59517N54875K8533n66604n99421j44261K65702L71800K91130
$$ -968808 -991058 -531541 23334 51867 -514737 -1114158 -1258419 -992717 -620917 -329787
36926c29787J39364j056P8465M31225O40931K74687m23494p77898n77112k24220
$$ -329787 -190423 -191479 -113014 318211 959142 1233829 810335 32437 -544675 -768895
36916g68895j2680J78804L83594L27324n1788l45895k36620N8218J69270Q3689
$$ -768895 -781575 -602771 -219177 108147 56359 -289536 -526156 -467938 -298668 -214979
36906b14979M496j2320k2272k9976p2245k30308l92747k83285J00186L80960L34650
$$ -214979 -210483 -222803 -245075 -275051 -347296 -577604 -970351 -1253636 -1153450 -772490 -437840
36895d37840J95775K05707K14469L4451j55764j33565o2830j92208l62945k46564
$$ -437840 -242065 -36358 178111 212562 56798 -76767 -139597 -331805 -694750 -941314
36885i41314J07876L78525M62657M56922L13469l3346l28181k61450R620Q6759
$$ -941314 -833438 -454913 7744 464666 778135 744789 416608 155158 164778 251537
36875B51537k198R9091L44498K77271j41918l35363m9L67981K21790k28249m15165
$$ 251537 249339 348430 692928 970199 828281 492918 492869 860850 1082640 854391 439226
36864D39226k75837j91487k72153k38571J0022J79729M7591j83540j65053J37657
$$ 439226 163389 -28098 -300251 -538822 -528800 -349071 -301480 -485020 -650073 -512416
36854e12416M08309L39960l5159l64498l33747q966K51410K36286R7202O6895
$$ -512416 -104107 235853 200694 -163804 -497551 -506517 -255107 -18821 78381 145276
36844A45276J34429J32497N072j72621l27314l85314k61718k8760M3219j58677
$$ 145276 279705 412202 417274 244653 -82661 -467975 -729693 -758453 -715234 -873911
36834h73911l20105q1243L82918N15659J44845k51499j85568K17141M39624K29583
$$ -873911 -1194016 -1275259 -892341 -376682 -231837 -483336 -668904 -451763 -12139 217444
36824B17444j80280m08124l03197k8774J35112R7898O6509K39936M41302L05647
$$ 217444 37164 -370960 -674157 -702931 -567819 -469921 -403412 -163476 277826 583473
36814E83473j29270l56566j02286K37942J68809j79226l09621j52271q3941k04452
$$ 583473 454203 97637 -4649 233293 402102 222876 -86745 -239016 -322957 -527409
36804e27409j49919K29738N04875K73977k15053l98982j40602J91465K63167J07091
$$ -527409 -677328 -447590 57285 331262 116209 -282773 -423375 -231910 31257 138348
36794A38348l7910j973J87780L32976K65303P1061k5437l7350k09828n24473n60341
$$ 138348 100438 98465 286245 619221 884524 955585 930148 892798 682970 158497 -401844
36783d01844j18519L48864L29103n282j29679l3692j43596m54277m36559M8117
$$ -401844 -520363 -171499 157604 152322 22643 -11049 -154645 -608922 -1045481 -997364
36773i97364M01510J75283k48584k86128j0949J21115P1962J61737L79416L49256
$$ -997364 -595854 -420571 -669155 -955283 -966232 -845117 -773155 -611418 -232002 117254
36763A17254p131k95644k51667q6993o0030o3309J14372L76112M42956K41699
$$ 117254 110123 -185521 -437188 -524181 -584211 -647520 -533148 -157036 285920 527619
36753E27619o9199l43726m80211l09549K35399Q18334Q88180L34359k85317m05636
$$ 527619 458420 114694 -365517 -675066 -439667 378667 1266847 1601206 1315889 910253
36743I10253j56065q5762l17882m30861k17714l7343j48541j88980K02133O13680
$$ 910253 754188 668426 350544 -80317 -298031 -335374 -483915 -672895 -470762 142918
36733A42918L68066l70030p11947l09230K10465K63437P3798O6560J39060N3155
$$ 142918 510984 140954 -570993 -880223 -669758 -406321 -332523 -265963 -126903 -73748
36723g3748K4431K84020M44913K4837o30266o98189r1502M06746K82290j14262
$$ -73748 -49317 234703 679616 704453 74187 -624002 -715504 -308758 -26468 -140730
36713a40730k78696k20280j26992P6040M27684O06988L53835o0087j94082p3284
$$ -140730 -419426 -639706 -766698 -690658 -262974 344014 697849 637762 443680 370396
36703C70396n9541k23933k68280n8585J39596O0254j93376l26577k43617j00031
$$ 370396 310855 86922 -181358 -239943 -100347 -40093 -233469 -560046 -803663 -903694
36693i03694k0899P7431L18221N99504O47734L72832K1509j35513j31301j52563
$$ -903694 -924593 -847162 -528941 70563 718297 1091129 1112638 977125 845824 693261
36683F93261k06545j87420j58379k35814k52961N2980M88157M99262j7786m64229
$$ 693261 486716 299296 140917 -94897 -347858 -294878 193279 692541 674755 210526
36673B10526l68627m1760j0105j73178o5024K75188L22113o4823l78675k23919
$$ 210526 -158101 -199861 -209966 -383144 -448168 -172980 149133 84310 -294365 -518284
36663e18284J42210K69193J42501N6625J16406J81639J70796J37159R8332J7928
$$ -518284 -376074 -106881 35620 92245 208651 390290 561086 698245 796577 814505
36653H14505n8942l9103L8118R866j76191l51507l22601j19898K7586l1908j87436
$$ 814505 755563 716460 754578 764444 588253 236746 -85855 -205753 -178167 -210075 -397511
36642c97511k16142q7619K858n4104r2903N4714K29034J45711j07953j12378K44967
$$ -397511 -613653 -701272 -698414 -752518 -845421 -790707 -561673 -415962 -523915 -636293 -391326
36631c91326N01029K41153k59044l77135j0003L06506J65932k02312l36396j41393
$$ -391326 109703 350856 91812 -285323 -295326 11180 177112 -25200 -361596 -502989
36621e02989J27404K53943J99557J2724j69497j53571O1089J89687M4502j42255
$$ -502989 -375585 -121642 77915 90639 -78858 -232429 -171340 18347 62849 -79406
36611g9406p2908Q7041n3740m05451m28472K8631M26077L17660j4321q4271J4128
$$ -79406 -152314 -65273 -119013 -524464 -952936 -924305 -498228 -180568 -194889 -279160 -265032
36600b65032j42279m95743n19603k7905N23234O53859M02523J17373J2698Q0466
$$ -265032 -407311 -903054 -1422657 -1450562 -927328 -273469 129054 246427 259125 339591
36590C39591K00906K06663K9376j34765j6923K96683L80962L2630m33129o07022
$$ 339591 540497 747160 776536 641771 624848 921531 1302493 1335123 901994 294972
36580B94972m82643l30751k63938j72543k255J34077J27475K3607k5289P0136
$$ 294972 -187671 -518422 -782360 -954903 -957158 -823081 -695606 -671999 -697288 -627152
36570f27152K05497J70557m7145j43952J16824M83808M79413O9494k89338l26685
$$ -627152 -421655 -251098 -298243 -442195 -325371 158437 637850 707344 418006 91321
36560I1321k61138k71628j38198K65026N39157K92887j81935k88167k391J64715
$$ 91321 -169817 -441445 -579643 -314617 224540 517427 335492 47325 44934 209649
36550B09649N561j53359r9753n9600j92734k44216J0913L28236L30721N9238j28337
$$ 209649 215210 61851 -37902 -97502 -290236 -534452 -523539 -195303 135418 194656 66319
36539F6319p4956M1284L1144q7589k02293k61529k68599k08758m6987J84318L06561
$$ 66319 -8637 32647 63791 -23798 -226091 -487620 -756219 -964977 -1011964 -827646 -521085
36528e21085J05337l63455o58349l68296L28310P56340N16640l1846k47925j6468
$$ -521085 -415748 -779203 -1437552 -1805848 -1477538 -721198 -204558 -236404 -484329 -500797
36518e00797J84477O23l01403k18593K58490N64452K72327l11513m79385j815
$$ -500797 -316320 -315697 -617100 -835693 -577203 -12751 259576 -51937 -531322 -533137
36508e33137N65547N42855q4574o80991o59107m0199N98516O40599M105p10167
$$ -533137 32410 575265 490691 -190300 -849407 -889606 -291090 349509 353614 -356553
36498c56553p87277k06525L27551K90585k8352o0977J98545L23593J93776N9611
$$ -356553 -1143830 -1350355 -1022804 -732219 -760571 -821548 -623003 -299410 -105634 -46023
36488d6023j9804k09355l68315j19073M21244N97359J59010l19563k94203P449
$$ -46023 -65827 -275182 -643497 -762570 -341326 256033 415043 95480 -198723 -191274
36478a91274J08681M7189R6151J39136o5728k85172j17761K60612K91820p9629
$$ -191274 -82593 -35404 60747 199883 134155 -151017 -268778 -8166 283654 204025
36468B04025l18434j30947J59600J74435m7174k56949k91053o8870L29367N33311
$$ 204025 -114409 -245356 -85756 88679 41505 -215444 -506497 -575367 -246000 287311
36458B87311K32765k93009m35398j11049J37740J2031j34179J3779J95307R9945
$$ 287311 520076 227067 -208331 -319380 -181640 -169609 -303788 -290009 -94702 5243
36448E243p0927k9004L2090j80098m32149k96909J12901L21550K50273K14204
$$ 5243 -65684 -94688 -62598 -242696 -674845 -971754 -858853 -537303 -287030 -72826
36438g2826K55795J13474j39686q9632K44730K81016j95625n68499k96944K02041
$$ -72826 182969 296443 156757 67125 311855 592871 397246 -171253 -468197 -266156
36428b66156J63292l44432n15365j4734N57964N69084J82574k9274O2455J13354
$$ -266156 -102864 -447296 -962661 -977395 -419431 149653 332227 302953 365408 478762
36418D78762l4101j24309J2017J20030p4074l61747l00579J05910L46637J11907
$$ 478762 444661 320352 332369 452399 378325 16578 -284001 -178091 168546 280453
36408B80453k74328l53000j76479j07907j62224j2671L62789N42373L31625J16325
$$ 280453 6125 -346875 -523354 -631261 -793485 -806156 -443367 99006 430631 546956
36398E46956K30706L55145Q918n89489p20860k07087K96357K24569j41541j65137
$$ 546956 777662 1132807 1141725 552236 -168624 -375711 -79354 145215 3674 -161463
36388a61463K21169M89432K85055j65043m26798l46176q8707R4466N6222j36183
$$ -161463 59706 549138 834193 669150 242352 -103824 -192531 -98065 -41843 -178026
36378a78026k21910k0464K85033L24787N6219j37400J230K04704Q8236k40281
$$ -178026 -399936 -420400 -135367 189420 245639 108239 109469 314173 402409 162128
36368A62128l35202r9101Q8345j7823j73937p6496J82393L31781L32388K87804
$$ 162128 -173074 -272175 -183830 -201653 -375590 -452086 -269693 62088 394476 682280
36358F82280J62540q3199k42672j15770R2469K4992k28481k28578R2152K87915
$$ 682280 844820 761621 518949 403179 495648 520640 292159 63581 155733 443648
36348D43648J21573n8007O4414K12946p428m04217m53869r8306J97827J38473
$$ 443648 565221 507214 571628 784574 777146 372929 -80940 -179246 18581 157054
36338A57054q9509k16037k15859j63737q9247o4788j59145k36605q5720J90068
$$ 157054 67545 -148492 -364351 -528088 -617335 -682123 -841268 -1077873 -1163593 -973525
36328i73525K29997l2250k11989l8150K52539L21234K27095K15241K49757J34225
$$ -973525 -743528 -775778 -987767 -1025917 -773378 -452144 -225049 -9808 239949 374174
36318C74174m8922k5240J79304K18241l8684k83389k23161J2662J15481N4624
$$ 374174 325252 300012 479316 697557 658873 375484 152323 164985 280466 335090
36308C35090M8057J59830J82296k8233k86711k97391o1602J07500J0579j58474
$$ 335090 383147 542977 725273 697040 410329 112938 51336 158836 169415 10941
36298A0941q7664K03338L78834K29469r3038l07246k85039o6255K04584K90624
$$ 10941 -76723 126615 505449 734918 641880 334634 49595 -16660 187924 478548
36288D78548M6770k94433k80496J38301M24208J67119k87932l32892j1029R5456
$$ 478548 525318 230885 -49611 88690 512898 680017 392085 59193 48164 143620
36278A43620j67732k87713M0773L96123L28344Q0360J19033L03955J32844l54610
$$ 143620 -24112 -311825 -271052 125071 453415 533775 652808 956763 1089607 734997
36268G34997n73475l24197r8491k47913m09292j38058L18803L87648N2109j71973
$$ 734997 161522 -162675 -261166 -509079 -918371 -1056429 -737626 -349978 -297869 -469842
36258d69842n2185J12715J05741J21704K83791K96419p0296m77475m20462L8915
$$ -469842 -522027 -409312 -303571 -181867 101924 398343 328047 -149428 -569890 -530975
36248e30975L56770K57363R575o3633O935K2236p3972k04624k77308j88782J02071
$$ -530975 -174205 83158 92733 29100 36035 58271 -15701 -220325 -497633 -686415 -584344
36237e84344M18041M76233K55481N2419N8602R6809n8834k96223l15783m6426
$$ -584344 -166303 309930 565411 617830 676432 773241 714407 418184 102401 55975
36227E5975K90743M57901L78244J17668j57772k75315k35146k12652k70528k10486
$$ 55975 346718 804619 1182863 1300531 1142759 867444 632298 419646 149118 -61368
36217f1368J12773M61489M41051J2084m38087n34896k65646R5662K57827J13303
$$ -61368 51405 512894 953945 966029 527942 -6954 -272600 -176938 80889 194192
36207A94192j92563l82881l21399j31756R435R0453J72926K14363J43456J6133
$$ 194192 1629 -381252 -702651 -834407 -824972 -734519 -561593 -347230 -203774 -187641
36197a87641o3846r4627j03451l4993J29208K56488K29715J02705m8565k33947
$$ -187641 -251487 -346114 -449565 -484558 -355350 -98862 130853 233558 184993 -48954
36187d8954l43917j24697L62314N70293J67440l69221l77831m048O2783k83898
$$ -48954 -392871 -517568 -155254 415039 582479 213258 -164573 -168621 -105838 -389736
36177c89736m45641j61029J01873J3474p9255J58734M48639M14678J70902m6805
$$ -389736 -835377 -996406 -894533 -881059 -960314 -801580 -352941 61737 232639 185834
36167A85834l16767o14198m91689K01850P46817M41593k74084m08476Q5523L24345
$$ 185834 -130933 -745131 -1236820 -1034970 -288153 153440 -120644 -529120 -443597 -119252
36157a19252k1051k45877J17144M68133J36145m91954n64995p1619K26004O715
$$ -119252 -140303 -386180 -269036 199097 335242 -156712 -721707 -793326 -567322 -560607
36147e60607k18589k8900K53097J57221j54047j74225J18269K42720P511j85816
$$ -560607 -779196 -808096 -554999 -397778 -551825 -726050 -607781 -365061 -357550 -543366
36137e43366q065K58921J91622p6290p9236K19185L92966K47949L5245r2555l02996
$$ -543366 -551431 -292510 -100888 -177178 -256414 -37229 355737 603686 638931 546376 243380
36126B43380n84332n60001j07442L13800L24071J68932J76193J32559k26502n18887
$$ 243380 -340952 -900953 -1008395 -694595 -370524 -201592 -25399 107160 -119342 -638229
36116f38229k43643K58211K05010l46989n04342O5203N93983M06084j01295j68388
$$ -638229 -881872 -623661 -418651 -765640 -1269982 -1204779 -610796 -204712 -306007 -474395
36106d74395K05956M38683K89263L3140j01632j72824k59907l19528k83208r7849
$$ -474395 -268439 170244 459507 492647 391015 218191 -41716 -361244 -644452 -742301
36096g42301K24015M56133K93119j76473m29617k14824K7931j61658m86529l22024
$$ -742301 -518286 -62153 230966 54493 -375124 -589948 -562017 -723675 -1210204 -1532228
36086a532228K68448N80733L30059L2401J45313L86834K62754j25571k47318O7241
$$ -1532228 -1263780 -683047 -352988 -320587 -175274 211560 474314 348743 101425 168666
36076A68666M15483L83164P497l77415n35098m57388k36357L8786K55985K68155
$$ 168666 584149 967313 974810 597395 62297 -395091 -631448 -592662 -336677 -68522
36066f8522K1955k97255l74383j18734J73361J59264q6937j46544J76122N66684
$$ -68522 -46567 -343822 -718205 -836939 -663578 -504314 -591251 -737795 -561673 5011
36056E011O09524L18578N4414q195p4508l39273o27359o07095k61542O7877J22184
$$ 5011 614535 933113 987527 979332 904824 565551 -61808 -668903 -930445 -862568 -740384
36045g40384J8749J4966J38578K18869J87374J33539Q5383k9450j54541q1579
$$ -740384 -721635 -706669 -568091 -349222 -161848 -28309 57074 27624 -126917 -208496
36035b08496K05220L79623J88555j44115k09666j8035L0049k10987l80239j70745
$$ -208496 -3276 376347 564902 420787 211121 193086 223135 12148 -368091 -538836
36025e38836J64742J59247j83494l74843r3927M06418O05897K69562l40197o86236
$$ -538836 -374094 -214847 -398341 -773184 -867111 -460693 145204 414766 74569 -611667
36015f11667m13460K63914O74926M06282j32431j68533L76220P08051K59834m61151
$$ -611667 -1025127 -761213 -86287 319995 187564 19031 395251 1103302 1363136 901985
36005I01985n73029p3999K18130q6137m38091k85738R2717J17617j66713k57774
$$ 901985 328956 254957 473087 386950 -51141 -336879 -244162 -126545 -293258 -551032
35995e51032o2928L150k18386l34368n0332L26508L38676L8349j52808p7675K7756
$$ -551032 -613960 -610810 -829196 -1163564 -1213896 -887388 -548712 -510363 -663171 -740846 -713090
35984g13090m643m5303J9524N4382o0442j65771p8649N5993j0522j44561K9057
$$ -713090 -717733 -763036 -743512 -689130 -749572 -915343 -993992 -937999 -948521 -1093082 -1064025
35973a064025M56825N72905J03006m51818m89659j34667P1883M8942J55058M05054
$$ -1064025 -607200 -34295 68711 -383107 -872766 -1007433 -935550 -886608 -731550 -326496
35963c26496L75118k7457l28107k24152L237P1959J35088L01086K76392o5635
$$ -326496 48622 21165 -306942 -531094 -527857 -455898 -320810 -19724 256668 191033
35953A91033k72074j0101K77896N6674l54116k64397K20508L52877l2016k93236
$$ 191033 -81041 -91142 186754 243428 -110688 -375085 -154577 198300 166284 -126952
35943a26952p0344K06128J21946j00453j17531k5141l2415l7595R3216J84876
$$ -126952 -197296 8832 130778 30325 -87206 -112347 -144762 -182357 -89141 95735
35933I5735M1730k02082l11311k84978k32147j55990n2573K6103J50411M47583
$$ 95735 137465 -64617 -375928 -660906 -893053 -1049043 -1101616 -1075513 -925102 -477519
35923d77519P24673N52349n2970m39767j43053M39308N65647J01263m19637n19853
$$ -477519 247154 799503 746533 306766 163713 603021 1168668 1269931 850294 330441
35913C30441k35777O2779O5517k07814m13053k73643J7722M5610j71347j78460
$$ 330441 94664 157443 222960 15146 -397907 -671550 -653828 -608218 -779565 -958025
35903i58025J53955L59868J16839k24738k06394P3228K65299L46844M27383L38779
$$ -958025 -804070 -444202 -327363 -552101 -758495 -685267 -419968 -73124 354259 693038
35893F93038n0977l91064k69401J12554K21875N70j41879l8196O4860J0555p5790
$$ 693038 642061 250997 -18404 94150 316025 316595 174716 136520 201380 211935 136145
35882A36145j10109j55179j98853j74309j54696j97187j08944K49097N59454L98830
$$ 136145 26036 -129143 -327996 -502305 -657001 -854188 -963132 -714035 -154581 244249
35872B44249j00535m06910l41377j93689j29654Q35K32018L48617K71960J69361
$$ 244249 143714 -263196 -604573 -798262 -927916 -927081 -695063 -346446 -74486 94875
35862I4875J19858N3096L0934J77813L29388J90061j52803l29955l02336l63437
$$ 94875 214733 267829 298763 476576 805964 996025 843222 513267 210931 -152506
35852a52506n12226l97280J4521K97914K70899K71710N04066O44920L99883k2183
$$ -152506 -664732 -1062012 -1047491 -749577 -478678 -206968 297098 942018 1341901 1319718
35842A319718k95758m19812m82512l90149j32534M2368p828j16505j65029k41099
$$ 1319718 1023960 604148 121636 -268513 -401047 -358679 -366507 -483012 -648041 -889140
35832h89140k63517M0550N30917N97211O9485l82894k14933J93997K50546R9548
$$ -889140 -1152657 -1112107 -581190 16021 85506 -297388 -512321 -318324 -67778 31770
35822C1770J73214K74089m7121n16474m55351N9135K62133n5189k61740o089K40330
$$ 31770 204984 479073 431952 -84522 -539873 -480738 -218605 -273794 -535534 -541623 -301293
35811c01293Q2673j31299j6101J27944j17211m77315l93900N9613L20893K40219
$$ -301293 -218620 -349919 -366020 -238076 -355287 -832602 -1226502 -1166889 -845996 -605777
35801f05777J91946K98633J88181k86694o31786l69850K43773N68992M27352J77924
$$ -605777 -413831 -115198 72983 -213711 -845497 -1215347 -971574 -402582 24770 202694
35791B02694N9329p0757k82484l17483k6897K61847J45365k68093m90515k83333
$$ 202694 262023 191266 -91218 -408701 -435598 -173751 -28386 -296479 -786994 -1070327
35781a070327J26933M03382L98915J37542k27015m16229k32359J88578M92020
$$ -1070327 -943394 -540012 -141097 -3555 -230570 -646799 -879158 -690580 -198560
35772a98560M76911K26730m8782j47819J5J44637j22714p23227r11937k30959
$$ -198560 278351 505081 456299 308480 308495 453132 330418 -392809 -1304746 -1535705
35762a535705O41734O83499J896l30323P3648M10529J14269k22882M4919M62080
$$ -1535705 -893971 -210472 -208576 -538899 -465251 -54722 59547 -163335 -118416 343664
35752C43664K58481l36657n04367j67031L3293j11648j53377J08446L16607K48719
$$ 343664 602145 265488 -238879 -405910 -372617 -484265 -637642 -529196 -212589 36130
35742C6130J26940R6937j892j87418j86622Q5137L35469L30907J45441r6249l30526
$$ 36130 163070 260007 258115 70697 -115925 -30788 304681 635588 781029 684780 354254
35731C54254l78284r9654K26208J42064k94714n37440l49666o7271N0070J59379
$$ 354254 -24030 -123684 102524 244588 -50126 -587566 -937232 -1004503 -954433 -795054
35721g95054L24286K55612j03311k62572J05591N63787M95585j1283l45579k27542
$$ -795054 -470768 -215156 -318467 -581039 -475448 88339 583924 572641 227062 -480
35711d80O3092J80805M1864k53180m89156m07245Q99L59000L36397R5106J5570
$$ -480 62612 243417 285281 32101 -457055 -864300 -863401 -504401 -168004 -72898 -57328
35700e7328J08197O3339j75558k92225j09632J24970J07176j18719k75223k11003
$$ -57328 50869 114208 -61350 -353575 -463207 -338237 -231061 -349780 -625003 -836006
35690h36006j0839J53031J82404J21716R9176J46688J16178j02606l27004k53768
$$ -836006 -846845 -693814 -511410 -389694 -290518 -143830 -27652 -130258 -457262 -711030
35680g11030Q3566K70438N6392k65460k39805J36472M57539M96391M16730L54734
$$ -711030 -627464 -357026 -300634 -566094 -805899 -669427 -211888 284503 701233 1055967
35670A055967J54712k67359n93410m69760l6446K62173K88442K44468J65842j21843
$$ 1055967 1210679 943320 349910 -119850 -156296 105877 394319 638787 804629 682786
35660F82786m76918m23430R2032M34056J61171k64603j69230K80692L66812k6647
$$ 682786 205868 -217562 -125530 308526 469697 205094 35864 316556 683368 656721
35650F56721k76954o4639J64435M066k64194k07851L5539L6715k10811l15932
$$ 656721 379767 315128 479563 483629 219435 11584 47123 83838 -126973 -442905
35640d42905j03639J85177K76880J52961m4200j64861j05611J02681K47952J32024
$$ -442905 -546544 -361367 -84487 68474 24274 -140587 -246198 -143517 104435 236459
35630B36459j69435l63931k72157J818K34190L04785K29600P9679n2128o6459
$$ 236459 67024 -296907 -569064 -567246 -333056 -28271 201329 281008 228880 162421
35620A62421M6435J24309k7831l45824m79060k10198J92011K76271K7725j32093
$$ 162421 208856 333165 305334 -40490 -519550 -729748 -537737 -261466 -233741 -365834
35610c65834j7793L2939k42646n15760l20355K22039N62463M78940K45216J07572
$$ -365834 -383627 -350688 -593334 -1109094 -1429449 -1207410 -644947 -166007 79209 186781
35600A86781J8809q6800j37783j18978j20345j44035j17045p9795r3572l8206
$$ 186781 205590 118790 -18993 -137971 -258316 -402351 -519396 -599191 -692763 -730969
35590g30969J67945K65479Q945k85525j14368L23481K96349k82175n95931j64910
$$ -730969 -563024 -297545 -288600 -574125 -688493 -365012 -68663 -350838 -946769 -1111679
35580a111679L89363L34451n1789m5502L00937L20243j06943l80942j91607M2848
$$ -1111679 -722316 -387865 -439654 -485156 -184219 136024 29081 -351861 -543468 -500620
35570e00620o0096k48997j20350K37681M52415M43496M17827M16330K28099k00961
$$ -500620 -560716 -809713 -930063 -692382 -239967 203529 621356 1037686 1265785 1064824
35560A064824n43963m49616j3224L03279K28891k8128j41483j18785j79003l21430
$$ 1064824 520861 71245 58021 361300 590191 562063 420580 301795 122792 -198638
35550a98638l26341j48854J1407O4368J30088K17963J51815n5245j04629J06405
$$ -198638 -524979 -673833 -662426 -598058 -467970 -250007 -98192 -153437 -258066 -151661
35540a51661K38779J5522l15881l47447j15348J2746q5951j80433j01798M4417
$$ -151661 87118 102640 -213241 -560688 -676036 -663290 -749241 -929674 -1031472 -987055
35530i87055J03394P7823N6889P4839Q2539J6942q7840q5082Q3589K20488J07827
$$ -987055 -883661 -805838 -748949 -674110 -591571 -574629 -662469 -747551 -663962 -443474 -335647
35519c35647j18017j14925J24117K32269O0028r1800j0108O5547j01090k79595
$$ -335647 -453664 -568589 -444472 -212203 -152175 -243975 -254083 -188536 -289626 -569221
35509e69221j22633K79753N41125M79917J95752j46422l47121k26626Q5007J71892
$$ -569221 -691854 -412101 129024 608941 804693 658271 311150 84524 169531 341423
35499C41423r1745l04871j73201Q169r4271k28125k6163K45023P8963l32645k82862
$$ 341423 249678 -55193 -228394 -220225 -314496 -542621 -568784 -323761 -244798 -577443 -860305
35488h60305L52127Q66808O89045M9174m54390n24774k76809k8638o2212l15422
$$ -860305 -508178 358630 1047675 1096849 642459 117685 -159124 -187762 -249974 -565396
35478e65396l55803L6365M17584K52527k28191l21910P1019L35361J58905l8767
$$ -565396 -921199 -884834 -467250 -214723 -442914 -764824 -693805 -358444 -199539 -238306
35468b38306R3650K66173J23413j45326j86108n7875j1074q347J19879K72753
$$ -238306 -144656 121517 244930 99604 -86504 -144379 -155453 -163800 -43921 228832
35458B28832K26445M0702k6065P2017J29329K9961j01408j10137k8580k9227j93158
$$ 228832 455277 495979 469914 541931 671260 701221 599813 489676 461096 431869 238711
35447B38711l65306l20672r5622J1894j18930k16102n6248J24697J3223j95484
$$ 238711 -126595 -447267 -542889 -530995 -649925 -866027 -922275 -797578 -784355 -979839
35437i79839o0702L57150N30486K55591r1409j72398r0171m0594L783Q5642J01490
$$ -979839 -1040541 -683391 -152905 102686 11277 -161121 -251292 -291886 -288103 -202461 -100971
35426a00971J3727p4333j43933k49769k62552j0250L06875L00328L5605k2365
$$ -100971 -87244 -161577 -305510 -555279 -817831 -828081 -521206 -220878 -185273 -207638
35416b07638K18959L40112J76186Q0070J82845P5025l89799o30599k09478L87045
$$ -207638 11321 351433 527619 607689 790534 865559 475760 -154839 -364317 22728
35406B2728M51157R3465q1946P176m5055k83318l14764o8770K3857k56016n34404
$$ 22728 473885 567350 485404 492580 447525 164207 -150557 -219327 -195470 -451486 -985890
35395i85890l84011R3923M29797L39979j3110k30250j00766J67751K20674M9214
$$ -985890 -1369901 -1275978 -846181 -506202 -519312 -749562 -850328 -682577 -461903 -412689
35385d12689n721J95778L45151J72570j20437j92691p9277n1400j42990j56042
$$ -412689 -418410 -222632 122519 295089 174652 -18039 -97316 -148716 -291706 -447748
35375d47748k9234J10379K06621L17429M16541L59349O8823l32248n58691l61138
$$ -447748 -476982 -366603 -159982 157447 573988 933337 1002160 669912 111221 -249917
35365b49917J68521N38630L59084j25484l30966j38413L2868k1204k1766J54896
$$ -249917 -81396 457234 816318 690834 359868 221455 254323 233119 211353 366249
35355C66249J77307j05688k99188j13973J40282J31555N8709J63339K07314k8779
$$ 366249 543556 437868 138680 24707 164989 296544 355253 518592 725906 697127
35345F97127k24630q3273P7607o0079j22708K70797O25044K87756l35109l31589
$$ 697127 472497 389224 466831 406752 284044 554841 1179885 1467641 1132532 800943
35335H00943J81090K10793m48830q72087n14301J7913R4675o366J69091L90891
$$ 800943 982033 1192826 743996 -128091 -642392 -624479 -529804 -536170 -367079 23812
35325B3812K43351r9851k10216r5760k9481k2390O4699J58836J35195J05963J94636
$$ 23812 267163 167312 -42904 -138664 -168145 -190535 -125836 33000 168195 274158 468794
35314D68794K39724N0244k32070l22050j90252k8541M7635O5329Q3822J57347
$$ 468794 708518 758762 526692 204642 14390 -14151 33484 98813 182635 339982
35304C39982K86315L36915J71029j15440k87264l00294k87626k47257o8337J46701
$$ 339982 626297 963212 1134241 1018801 731537 431243 143617 -103640 -171977 -25276
35294b5276J64780L4557J701N781k35327n77105m81070J00729M74425J82421l00737
$$ -25276 139504 174061 175762 181543 -53784 -630889 -1111959 -1011230 -536805 -354384 -655121
$$ [...]
##END NTUPLES=NMR SPECTRUM
##END=
