##TITLE=31Pdec_2PBPA2212
 CDCl3, 24 sc
 23.12.2022
##JCAMPDX= 6.0         $$ Bruker NMR JCAMP-DX V2.0
##DATA TYPE= NMR SPECTRUM
##DATA CLASS= NTUPLES
##ORIGIN= UXNMR, Bruker Analytische Messtechnik GmbH
##OWNER= root
$$ XWIN-NMR		Version 3.5
$$ Fri Dec 23 13:52:04 2022 Russian Standard Time (UT+4h)  she@DPX200
##.OBSERVE FREQUENCY= 81.013821
##.OBSERVE NUCLEUS= ^31P
##.ACQUISITION MODE= SIMULTANEOUS
##.ACQUISITION SCHEME= undefined
##.AVERAGES= 24
##.DIGITISER RES= 16
##SPECTROMETER/DATA SYSTEM= spect
##.PULSE SEQUENCE= zgpg30
##.SOLVENT NAME= DMSO
##.SHIFT REFERENCE= (INTERNAL, DMSO, 0, 248.564)
##AUDIT TRAIL= $$ (NUMBER, WHEN, WHO, WHERE, WHAT)
$$ ##TITLE= Audit trail, XWIN-NMR		Version 3.5
$$ ##JCAMPDX= 5.01
$$ ##ORIGIN= Bruker BioSpin GmbH
$$ ##OWNER= she
$$ F:/spectra/data/she/nmr/P31/1/pdata/1/auditp.txt
$$ ##AUDIT TRAIL=  $$ (NUMBER, WHEN, WHO, WHERE, WHAT)
(   1,<2022-12-23 13:50:12.40 +0400>,<she>,<DPX200>,
      <created by zg, POWCHK disabled, PULCHK disabled
       configuration hash MD5:
       00 E9 B6 7A A2 85 ED C7 34 08 36 98 17 FE 4E 26
       data hash MD5: 32K
       3E 9E 49 B4 74 FF C2 F1 3A E6 ED 9B CD 01 CE 33>)
(   2,<2022-12-23 13:50:14.96 +0400>,<she>,<DPX200>,
      <Start of raw data processing
       efp BC_mod = 2 LB = 1 FT_mod = 6 PKNL = 1 PHC0 = -10878.26 PHC1 = 793.0566 SI = 64K 
       data hash MD5: 64K
       55 8C E8 1F 62 AC 16 C1 FE 4B CA EF 4F 74 45 D9>)
(   3,<2022-12-23 13:50:29.43 +0400>,<she>,<DPX200>,
      <pk PHC0 = 3.313707 PHC1 = 0 
       data hash MD5: 64K
       46 F7 2C E0 2A DE 8B 77 43 10 DB 66 2E 52 B1 FF>)
(   4,<2022-12-23 13:50:34.14 +0400>,<she>,<DPX200>,
      <abs ABSG = 5 
       data hash MD5: 64K
       4D A0 C2 70 35 7C 75 F9 C6 20 B4 C6 05 10 9C 4C>)
$$ ##END=
$$ 
$$ hash MD5
$$ B5 1B 3A A9 72 FE B7 ED 15 6F B0 BD 0B 4F 4E A8
##$RELAX= 
##$RELAX= 
##$RELAX= 
##$RELAX= 
##$RELAX= 
##$RELAX= 
##$RELAX= 
##$RELAX= 
##$RELAX= 
$$ Bruker specific parameters
$$ --------------------------
##$DU= <F:/spectra>
##$EXPNO= 1
##$NAME= <P31>
##$PROCNO= 1
##$TYPE= <nmr>
##$USER= <she>
##$AMP= (0..31)
100 100 100 100 100 100 100 100 100 100 100 100 100 100 100 100 100 100 
100 100 100 100 100 100 100 100 100 100 100 100 100 100 
##$AQSEQ= 0
##$AQ_mod= 1
##$AUNM= <au_zg>
##$AUTOPOS= <>
##$BF1= 81.014009
##$BF2= 200.13
##$BF3= 200.13
##$BF4= 200.13
##$BF5= 200.13
##$BF6= 200.13
##$BF7= 200.13
##$BF8= 200.13
##$BYTORDA= 1
##$CFDGTYP= 0
##$CFRGTYP= 5
##$CHEMSTR= <none>
##$CNST= (0..31)
1 1 145 1 1 1 1 1 1 1 1 1 1 1 1 1 1 1 1 1 1 1 1 1 1 1 1 1 1 1 1 1 
##$CPDPRG= <waltz16>
##$CPDPRG1= <>
##$CPDPRG2= <waltz16>
##$CPDPRG3= <>
##$CPDPRG4= <mlev>
##$CPDPRG5= <mlev>
##$CPDPRG6= <mlev>
##$CPDPRG7= <mlev>
##$CPDPRG8= <mlev>
##$CPDPRGB= <>
##$CPDPRGT= <>
##$D= (0..31)
0 1 0 0 0 0 0 0 0 0 0 0.03 2e-05 3e-06 0 0 0 0 0 0 0 0 0 0 0 0 0 0 0 0 
0 0 
##$DATE= 1671789011
##$DBL= (0..7)
120 120 120 11 120 120 24 19 
##$DBP= (0..7)
150 150 150 150 150 150 150 150 
##$DBP07= 0
##$DBPNAM0= <>
##$DBPNAM1= <>
$$ [...]
##$SUBNAM3= <"">
##$SUBNAM4= <"">
##$SUBNAM5= <"">
##$SUBNAM6= <"">
##$SUBNAM7= <"">
##$SUBNAM8= <"">
##$SUBNAM9= <"">
##$SW= 501.771253377433
##$SWIBOX= (0..15)
0 1 3 0 0 0 0 0 0 0 0 0 0 0 0 0 
##$SW_h= 40650.406504065
##$TD= 32768
##$TD0= 1
##$TE= 0
##$TE2= 300
##$TE3= 300
##$TEG= 300
##$TL= (0..7)
0 120 53 12 22 120 120 120 
##$TP= (0..7)
150 150 150 150 150 150 150 150 
##$TP07= 0
##$TPNAME0= <>
##$TPNAME1= <>
##$TPNAME2= <>
##$TPNAME3= <>
##$TPNAME4= <>
##$TPNAME5= <>
##$TPNAME6= <>
##$TPNAME7= <>
##$TPOAL= (0..7)
0.5 0.5 0.5 0.5 0.5 0.5 0.5 0.5 
##$TPOFFS= (0..7)
0 0 0 0 0 0 0 0 
##$TUNHIN= 0
##$TUNHOUT= 0
##$TUNXOUT= 0
##$USERA1= <user>
##$USERA2= <user>
##$USERA3= <user>
##$USERA4= <user>
##$USERA5= <user>
##$V9= 5
##$VALIST= <valist>
##$VCLIST= <CCCCCCCCCCCCCCC>
##$VD= 0
##$VDLIST= <DDDDDDDDDDDDDDD>
##$VPLIST= <PPPPPPPPPPPPPPP>
##$VTLIST= <TTTTTTTTTTTTTTT>
##$WBST= 1024
##$WBSW= 4
##$XGAIN= (0..3)
0 0 0 0 
##$XL= 0
##$YL= 0
##$YMAX_a= 3931
##$YMIN_a= -2906
##$ZGOPTNS= <>
##$ZL1= 120
##$ZL2= 120
##$ZL3= 120
##$ZL4= 120
##$ABSF1= 248.5645
##$ABSF2= -253.2056
##$ABSG= 5
##$ABSL= 3
##$ALPHA= 0
##$AQORDER= 0
##$ASSFAC= 0
##$ASSFACI= 0
##$ASSFACX= 0
##$ASSWID= 0
##$AUNMP= <proc_1d>
##$AZFE= 0.1
##$AZFW= 0.5
##$BCFW= 0
##$BC_mod= 2
##$BYTORDP= 0
##$COROFFS= 0
##$CY= -3
##$DATMOD= 1
##$DC= 0
##$DFILT= <>
##$DTYPP= 0
##$F1P= 0
##$F2P= 0
##$FCOR= 1
##$FTSIZE= 65536
##$FT_mod= 6
##$GAMMA= 0
##$GB= 0
##$INTBC= 1
##$INTSCL= 6.047779e-11
##$ISEN= 30
##$LB= 1
##$LEV0= 0
##$LPBIN= 0
##$MAXI= 10000
##$MC2= 0
##$MEAN= 0
##$ME_mod= 0
##$MI= 50
##$NCOEF= 0
##$NC_proc= -9
##$NLEV= 6
##$NOISF1= 182.463
##$NOISF2= 159.3651
##$NSP= 0
##$NTH_PI= 0
##$NZP= 0
##$OFFSET= 248.5645
##$PC= 4
##$PHC0= -10874.95
##$PHC1= 793.0566
##$PH_mod= 1
##$PKNL= yes
##$PPARMOD= 0
##$PSCAL= 0
##$PSIGN= 0
##$REVERSE= no
##$SF= 81.0140089999694
##$SI= 65536
##$SIGF1= 159.3651
##$SIGF2= -187.1042
##$SINO= 113.3802
##$SIOLD= 16384
##$SREGLST= <1H.CDCl3>
##$SSB= 0
##$STSI= 65536
##$STSR= 0
##$SW_p= 40650.406504065
##$SYMM= 0
##$S_DEV= 0
##$TDeff= 32768
##$TDoff= 0
##$TI= <>
##$TILT= no
##$TM1= 0
##$TM2= 0
##$TOPLEV= 0
##$USERP1= <user>
##$USERP2= <user>
##$USERP3= <user>
##$USERP4= <user>
##$USERP5= <user>
##$WDW= 1
##$XDIM= 65536
##$YMAX_p= 513630992
##$YMIN_p= -69788421
$$ End of Bruker specific parameters
$$ ---------------------------------
##NTUPLES= NMR SPECTRUM
##VAR_NAME=  FREQUENCY,     SPECTRUM/REAL,   SPECTRUM/IMAG
##SYMBOL=    X,             R,               I
##VAR_TYPE=  INDEPENDENT,   DEPENDENT,       DEPENDENT
##VAR_FORM=  AFFN,          ASDF,            ASDF
##VAR_DIM=   65536,         65536,           65536
##UNITS=     HZ,            ARBITRARY UNITS, ARBITRARY UNITS
##FACTOR=    0.620285442955139, 1,           1
##FIRST=     20137.2065510682, 0,            0
##LAST=      -20513.1999529968, 0,           0
##MIN=       -20513.1999529968, -69788421,   0
##MAX=       20137.2065510682, 513630992,    0
$$ Real data points
##PAGE= N=1
##DATA TABLE= (X++(R..R)), XYDATA
$$ [...]
$$ plain form
42962 3768283 13705982 16146474 13783732 11324075 9498116 5131296 -3496980 -12374842
42954 -12374842 -14799082 -9014565 -147467 6576225 11356318 16577045 21293644 22089048
42946 22089048 17564453 9558446 1336394 -4158160 -6292866 -7700850 -10661886 -12742046
42938 -12742046 -10197762 -5478599 -5286789 -10067759 -12263804 -7519171 -768365 2219846
42930 2219846 2471234 2747547 1764919 -1080813 -1345458 3808160 9217339 7874097 80593
42921 80593 -7653869 -8896161 154969 18024549 34162126 35127987 19808821 1934988
42913 1934988 -6931865 -8865842 -9459691 -7081712 -436268 3472184 -190970 -3906592
42905 -3906592 684867 8661515 10930212 9835990 12389953 14844163 9148217 -362023
$$ packed form
42962C768283R937699K440492k362742k459657j825959m366820q628276q877862
42954a2374842k424240N784517Q867098O723692M780093N220727M716599P95404
42946B2089048m524595q006007q222052n494554k134706j407984k961036k080160
42938a2742046K544284M719163J91810m780970k196045M744633O750806K988211
42930B219846K51388K76313r82628k845732k64645N153618N409179j343242p793504
42921H0593p734462j242292R051130J7869580J6137577R65861j5319166j7873833
42913A934988q866853j933977n93849K377979O645444L908452l663154l715622
42905c906592M591459P976648K268697j094222K553963K454210n695946r510240
$$ plain form
42897 -362023 -2811396 130229 -2246125 -8850209 -7106822 4804402 13093253 9309260
42889 9309260 909308 -3382597 -4316801 -3206988 3404674 13301510 15775033 7449161
42881 7449161 -137103 2772551 9772867 9620188 3253243 -369245 1179760 3426878
42873 3426878 4877296 7898821 11619184 11329170 4611450 -6199232 -16290243 -20360854
42865 -20360854 -15393076 -4719766 3487746 4601053 1620016 -854728 -2524121 -4768161
42857 -4768161 -6562860 -6429937 -5068980 -3289851 -795647 603936 -3170803 -12001628
42849 -12001628 -18600113 -16140743 -6820406 627024 848878 -3188100 -4757383 -1429986
42841 -1429986 2040032 -121928 -5982483 -7196976 -1034499 4273884 1314329 -4682788
$$ packed form
42897c62023k449373K941625k376354o604084J743387J1911224Q288851l783993
42889I309260q399952m291905r34204J109813O611662R896836K473523q325872
42881G449161p586264K909654P000316j52679o366945l622488J549005K247118
42873C426878J450418L021525L720363k90014o717720j0810682j0091011m070611
42865b0360854M967778J0673310Q207512J113307k981037k474744j669393k244040
42857d768161j794699J32923J360957J779129K494204J399583l774739q830825
42849a2001628o598485K459370R320337P447430K21854m036978j569283L327397
42841a429986L470018k161960n860555j214493O162477N308383k959555n997117
$$ plain form
42833 -4682788 -3836859 2480756 4024027 -1597396 -5798339 -3513340 318316 1568990
42825 1568990 3490384 7710893 8244316 862878 -8887219 -13263652 -11985912 -8914878
42817 -8914878 -4997772 -359880 1689050 -1077346 -4969288 -4837512 -730516 3228191
42809 3228191 3618856 -551024 -6724149 -8298312 -1313920 7042080 4720865 -7599086
42801 -7599086 -14780417 -8296697 1067483 -121972 -7799465 -8399731 -578376 4530512
42793 4530512 2286305 248000 3477082 5989282 1475196 -6189050 -9114429 -6520984
42785 -6520984 -3807493 -3792379 -4629537 -5481691 -8944646 -15906017 -21236168 -18413929 -8358976
42776 -8358976 -32208 -94916 -4737329 -5335712 -198817 4417712 4566040 3910920 6865831
$$ packed form
42833d682788Q45929O317615J543271n621423m200943K284999L831656J250674
42825A568990J921394M220509N33423p381438r750097m376433J277740L071034
42817h914878L917106M637892K048930k766396l891942J31776M106996L958707
42809C228191L90665m169880o173125j574163O984392Q356000k321215j2319951
42801g599086p181331O483720R364180j189455p677493o00266P821355N108888
42793D530512k244207k038305L229082K512200m514086p664246k925379K593445
42785f520984K713491J5114q37158q52154l462955o961371n330151K822239J0054953
42776h358976Q326768o2708m642413n98383N136895M616529J48328o55120K954911
$$ plain form
42767 6865831 11496263 12731438 9474269 5139808 2976211 3523764 5571963 7677028
42759 7677028 9194283 10505518 11830879 12529718 12659869 13573126 15081321 14525624 11572558
42750 11572558 10612261 13811921 15332339 9097237 -288673 -2430442 4158189 10603529
42742 10603529 10720316 6858208 2191229 -3575352 -8809031 -9025778 -4183979 686507
42734 686507 3934932 8027564 10566940 5167509 -5350975 -7728653 4011558 19109736
42726 19109736 24348083 18897467 9184615 -1178773 -8973894 -8446867 134447 6718337
42718 6718337 4913648 1681388 4901126 9492848 6630839 -283258 -1039818 4745242
42710 4745242 8453710 6943797 4887488 4393750 2805010 226581 141882 2744843 5165903
$$ packed form
42767F865831M630432J235175l257169m334461k163597N47553K048199K105065
42759G677028J517255J311235J325361O98839J30151R13257J508195n55697k953066
42750A1572558r60297L199660J520418o235102r385910k141769O588631O445340
42742A0603529J16787l862108m666979n766581n233679k16747M841799M870486
42734F86507L248425M092632K539376n399431j0518484k377678J1740211J5098178
42726A9109736N238347n450616r712852j0363388p795121N27027Q581314O583890
42718F718337j804689l232260L219738M591722k862009o914097p56560N785060
42710D745242L708468j509913k056309m93738j588740k578429q4699K602961K421060
$$ plain form
42701 5165903 7300863 10377798 11399949 6263990 -2854347 -9493196 -10446617 -6090514
42693 -6090514 2958091 13263445 17487765 13581016 10208787 14234949 17716592 8053318
42685 8053318 -12203284 -26914773 -26351580 -15645635 -4563079 1518978 1512734 -1248995
42677 -1248995 336430 8357684 14217350 9933276 716925 -3809458 -5453230 -11306679
42669 -11306679 -16663414 -10749023 2230328 5747152 -3815688 -12247196 -11448763 -10526332
42661 -10526332 -16560300 -21336511 -16738031 -8814415 -5670734 -3667227 2812470 8313161
42653 8313161 5132530 -2900757 -6926860 -6697709 -7071678 -6931524 -2331057 4099804 7137510
42644 7137510 8499581 12858769 17749379 16844617 10784644 5843335 3538241 -119933
$$ packed form
42701E165903K134960L076935J022151n135959r118337o638849r53421M356103
42693f090514R048605J0305354M224320l906749l372229M026162L481643r663274
42685H053318k0256602j4711489N63193J0705945J1082556O082057o244k761729
42677a248995J585425Q021254N859666m284074r216351m526383j643772n853449
42669a1306679n356735N914391J2979351L516824r562840q431508P98433R22431
42661a0526332o033968m776211M598480P923616L143681K003507O479697N500691
42653H313161l180631q033287m026103K29151l73969J40154M600467O430861L037706
42644G137510J362071M359188M890610r04762o059973m941309k305094l658174
$$ plain form
42636 -119933 -5916591 -9471420 -8170036 -4527445 -2494415 -3783435 -6549394 -5615630
42628 -5615630 2450777 12383056 14092568 6799771 1958374 6955266 14221391 14130134
42620 14130134 10226899 11071933 14140390 11114108 4824363 6228583 15199781 18483856
42612 18483856 9359354 -2555270 -5128514 2128333 11629238 17300535 16814619 11224618
42604 11224618 5803616 5571776 8306823 8205789 6670178 10670746 19147256 21740246
42596 21740246 14978839 8930315 11366151 15427346 11789624 4438213 3330219 7394023
42588 7394023 7113315 1243034 -1262257 3677713 9100554 8436982 4289941 2194260
42580 2194260 2737000 4096838 6692785 10440425 11364087 5985726 -2794133 -8145880
$$ packed form
42636a19933n796658l554829J301384L642591K033030j289020k765959R33764
42628e615630Q066407R932279J709512p292797m841397M996892P266125r1257
42620A4130134l903235Q45034L068457l026282o289745J404220Q971198L284075
42612A8483856r124502j1914624k573244P256847R500905N671297m85916n590001
42604A1224618n421002k31840K735047j01034j535611M000568Q476510K592990
42596B1740246o761407o048524K435836M061195l637722p351411j107994M063804
42588G394023k80708n870281k505291M939970N422841o63572m147041k095681
42580B194260N42740J359838K595947L747640R23662n378361q779859n351747
$$ plain form
42572 -8145880 -6838850 -1638120 3193534 6515651 10075443 14405594 15634920 8300053
42564 8300053 -6818232 -19790549 -20743394 -11478207 -2936004 -641520 997232 7122601
42556 7122601 11949538 6377953 -7567874 -17324574 -14434607 -2973854 6874281 8840405
42548 8840405 3770650 -2495997 -3341682 2673517 9145080 8672783 2675881 -120222
42540 -120222 4235184 9720388 9381441 4265917 -101087 -1394912 -303512 3006920
42532 3006920 6706666 5031690 -4945952 -15880877 -16796032 -7562415 206711 -1317682
42524 -1317682 -6429721 -5646710 431336 3362588 55593 -3608710 -2851755 -1228276
42516 -1228276 -4450418 -11163515 -14511766 -11228385 -4784059 214533 2598591 2970037
$$ packed form
42572h145880J307030N200730M831654L322117L559792M330151J229326p334867
42564H300053j5118285j2972317r52845R265187Q542203K294484J638752O125369
42556G122601M826937n571585j3945827r756700K889967J1460753R848135J966124
42548H840405n069755o266647q45685O015199O471563m72297n996902k796103
42540a20222M355406N485204l38947n115524m367004j293825J091400L310432
42532C006920L699746j674976r977642j0934925r15155R233617P769126j524393
42524a317682n112039P83011O078046K931252l306995l664303P56955J623479
42516a228276l222142o713097l348251L283381O444326M998592K384058L71446
$$ plain form
42508 2970037 1658853 225044 1300328 4289705 4479625 -545410 -6868948 -10161407
42500 -10161407 -11876835 -14643371 -15350671 -9870762 -2097241 -32775 -4038437 -7704038
42492 -7704038 -9597486 -13557770 -16758748 -10651763 1918562 4502568 -9223932 -21939529
42484 -21939529 -15428721 2693224 9992085 823750 -9382506 -9010671 -2917674 1082871
42476 1082871 3068671 3990850 799918 -5471702 -7267638 -2149224 2253793 598791
42468 598791 -1964627 -392658 474698 -4855224 -10841738 -8177418 1811807 9206193
42460 9206193 9181042 5479213 2078418 -820477 -2941532 -2679439 -289990 2084978 3348084
42451 3348084 3117052 333814 -3900112 -4715983 143809 4597584 1084834 -7888513
$$ packed form
42508B970037j311184j433809J075284K989377J89920n025035o323538l292459
42500a0161407j715428k766536p07300N479909P773521K064466m005662l665601
42492g704038j893448l960284l200978O106985J2570325K584006j3726500j2715597
42484b1939529O510808J8121945P298861r168335j0206256L71835O092997M000545
42476A082871J985800R22179l190932o271620j795936N118414M403017j655002
42468E98791k563418J571969Q67356n329922n986514K664320R989225P394386
42460I206193k5151l701829l400795k898895k121055K62093K389449K374968J263106
42451C348084k31032k783238m233926q15871M859792M453775l512750q973347
$$ plain form
42443 -7888513 -11520956 -4337781 7783581 16037487 17492147 13906371 7387042 583286
42435 583286 -2634194 -601635 3553992 5200662 3010662 -845235 -3654880 -3672412 -132187
42426 -132187 5979602 11158769 10886822 3166126 -8652637 -16888704 -15451621 -6310373
42418 -6310373 1581979 2230631 27158 3655094 13383155 19816531 17049181 11284972
42410 11284972 11149563 13347709 6236324 -11831046 -26206733 -23073222 -7163624 4888534
42402 4888534 5859431 3813104 6622577 10306661 7360343 -848745 -7172390 -9668767
42394 -9668767 -11946537 -14962368 -15920114 -14540058 -13635145 -13473920 -11758753 -9202275 -8788541
42385 -8788541 -9346240 -6660798 -1477726 992029 425066 1872198 5295974 4479639 -228970
$$ packed form
42443g888513l632443P183175J2121362Q253906J454660l585776o519329o803756
42435E83286l217480K032559M155627J646670k190000l855897k809645j7532L540225
42426a32187O111789N179167k71947p720696j1818763q236067J437083R141248
42418f310373P892352O48652k203473L627936R728061O433376k767350n764209
42410A1284972j35409K198146p111385j8067370j4375687L133511J5909598J2052158
42402D888534R70897k046327K809473L684084k946318q209088o323645k496377
42394i668767k277770l015831r57746J380056R04913J61225J715167K556478M13734
42385h788541n57699K685442N183072K469755n66963J447132L423776q16335m708609
$$ plain form
42376 -228970 691742 9323455 12485153 772277 -14368731 -15963605 -6667485 -2828952
42368 -2828952 -7614654 -8159644 98247 5267186 1027235 -855139 8994910 18909083
42360 18909083 12950532 -2992476 -8520702 2010931 13722661 14573856 9361505 6943523
42352 6943523 6970803 6238066 7834218 14956818 22125240 21343800 13176958 4215546 -3063997
42343 -3063997 -10035810 -14096083 -10252165 -836800 4647267 1621016 -4295238 -6728943
42335 -6728943 -6980876 -9105765 -11868625 -10910175 -6048903 -1628168 -797617 -2717227 -4448894
42326 -4448894 -3524818 -80599 2330114 572675 -2515240 -695771 5604023 7455787
42318 7455787 -199827 -9975139 -12040878 -7984737 -6832206 -10607618 -13068321 -11457693
$$ packed form
42376b28970R20712Q631713L161698j1712876j5141008j594874R296120L838533
42368b828952m785702n44990Q257891N168939m239951j882374R850049R914173
42360A8909083n958551j5943008n528226J0531633J1711730Q51195n212351k417982
42352F943523K7280p32737J596152P122600P168422p81440q166842q961412p279543
42343c063997o971813m060273L843918R415365N484067l026251n916254k433705
42335f728943k51933k124889k762860R58450M861272M420735Q30551j919610j731667
42326d448894R24076L444219K410713j757439l087915J819469O299794J851764
42318G455787p655614r775312k065739M056141J152531l775412k460703J610628
$$ plain form
42310 -11457693 -9745562 -9377001 -6354216 -316477 2150108 -2289600 -7249839 -5467068
42302 -5467068 1250524 5783006 5065532 1302799 -2385586 -3585420 -1229848 2276253
42294 2276253 3201657 2776159 5813273 10432853 6861566 -7831499 -21287851 -20681368
42286 -20681368 -10362487 -4605866 -6704027 -7428423 -3598042 -4814640 -17082874 -30360258
42278 -30360258 -30398175 -16992222 -2687032 3459718 3609048 3836034 5900901 7852570
42270 7852570 8201321 6821815 4144574 1851710 2804014 7591160 11803616 9932931
42262 9932931 2853338 -1669267 1706145 8525147 10112862 5113204 853726 3050559
42254 3050559 8974653 12530296 11701476 7963893 1779390 -7217720 -16909316 -22997754
$$ packed form
42310a1457693J712131L68561L022785O037739K466585m439708m960239J782771
42302e467068O717592M532482p17474l762733l688385j199834K355572L506101
42294B276253R25404m25498L037114M619580l571287j4693065j3456352O06483
42286b0681368J0318881N756621k098161p24396L830381j216598j2268234j3277384
42278c0360258l7917J3405953J4305190O146750J49330K26986K064867J951669
42270G852570L48751j379506k677241k292864R52304M787146M212456j870685
42262I932931p079593m522605L375412O819002J587715m999658m259478K196833
42254C050559N924094L555643q28820l737583o184503q997110r691596o088438
$$ plain form
42246 -22997754 -22917108 -18339799 -14118959 -14453339 -18411055 -19953512 -15246138 -8816481
42238 -8816481 -7761671 -10617200 -8949930 -1110914 4010895 796776 -4033854 -2760092
42230 -2760092 346075 -3673296 -13373740 -19228248 -18138136 -15412408 -13421871 -8636826
42222 -8636826 -905264 4016350 3932746 3918559 6977395 8287880 3492374 -2928902 -3047541
42213 -3047541 3857830 10542820 10320759 3636573 -2999982 -3515650 1402280 4951985
42205 4951985 2761049 -1217876 -710160 3447467 5349872 3914927 3808579 6455467
42197 6455467 7462888 4666752 1972801 2682747 5014463 6775859 8532343 9437387
42189 9437387 6071294 -1321363 -7334481 -9235404 -9807366 -9131110 -1870052 11355352
$$ packed form
42246b2997754Q0646M577309M220840l34380l957716j542457M707374O429657
42238h816481J054810k855529J667270P839016N121809l214119m830630J273762
42230b760092L106167m019371r700444n854508J090112K725728J990537M785045
42222h636826P731562M921614q3604j4187L058836J310485m795506o421276j18639
42213c047541O905371O684990k22061o684186o636555n15668M917930L549705
42205D951985k190936l978925N07716M157627J902405j434945j06348K646888
42197F455467J007421k796136k693951P09946K331716J761396J756484R05044
42189I437387l366093p392657o013118j900923n71962O76256P261058J3225404
$$ plain form
42181 11355352 18286140 10002160 -4099578 -6746493 4775528 16883724 19095285 14694582
42173 14694582 11008412 9073107 6971503 5973990 8123539 11999318 14841462 15716817
42165 15716817 13864440 7587415 -1851589 -8316342 -6746139 514194 6524712 7730858
42157 7730858 6161733 4577518 2991390 663514 -1425855 -2022357 -1839141 -2086215 -1672769
42148 -1672769 1237241 4840014 4586787 176701 -2466059 -111932 760390 -7373611
42140 -7373611 -19398235 -21539009 -10342824 1803763 4514702 3475893 8836098 17259595
42132 17259595 16912285 6628000 -2118719 -2388906 404416 251831 -372470 1984472
42124 1984472 4012516 2126807 234012 3551707 8973336 9252445 4480174 1885666
$$ packed form
42181A1355352O930788q283980j4101738k646915J1522021J2108196K211561m400703
42173A4694582l686170j935305k101604r97513K149549L875779K842144Q75355
42165A5716817j852377o277025r439004o464753J570203P260333O010518J206146
42157G730858j569125j584215j586128k327876k089369n96502J83216k47074M13446
42148a672769K910010L602773k53227m410086k642760K354127Q72322q134001
42140g373611j2024624k140774J1196185J2146587K710939j038809N360205Q423497
42132A7259595l47310j0284285q746719k70187K793322j52585o24301K356942
42124A984472K028044j885709j892795L317695N421629K79109m772271k594508
$$ plain form
42116 1885666 4470578 6667356 3196556 -2780733 -3601157 3245271 12448124 17467003
42108 17467003 17512733 16576591 16333772 12964782 3252278 -8279767 -12703476 -7381701
42100 -7381701 871988 4483581 2706711 -1403333 -6778773 -13026559 -16682094 -13805876
42092 -13805876 -5357527 3445397 8288801 8135490 4710496 2388953 5692209 12973428
42084 12973428 15340042 6817743 -6542200 -13375381 -11331228 -8133618 -8696667 -8815396
42076 -8815396 -4036806 1950517 2571048 -1830841 -4253584 150278 8714882 14522063
42068 14522063 13545748 8413383 4698757 3327514 -574505 -8963423 -15087904 -12186657
42060 -12186657 -4922078 -3585964 -7683309 -5836709 5286256 13112173 7218368 -3847245
$$ packed form
42116A885666K584912K196778l470800n977289q20424O846428R202853N018879
42108A7467003M5730r36142k42819l368990r712504j1532045m423709N321775
42100g381701Q253689L611593j776870m110044n375440o247786l655535K876218
42092a3805876Q448349Q802924M843404j53311l424994k321543L303256P281219
42084A2973428K366614q522299j3359943o833181K044153L197610n63049j18729
42076h815396M778590N987323O20531m401889k422743M403862Q564604N807181
42068A4522063r76315n132365l714626j371243l902019q388918o124481K901247
42060a2186657P264579J336114m097345J846600J1122965P825917n893805j1065613
$$ plain form
42052 -3847245 -3935116 7839877 16451805 11391441 -2057904 -12400216 -14292320 -9144255
42044 -9144255 -53097 10235261 19676971 27481920 32582880 31702258 21822845 4844975
42036 4844975 -12354713 -22414609 -21440598 -11401194 -618501 2194571 -2005045 -2785979
42028 -2785979 5211337 13728045 13678271 10082974 13529979 21198255 20239662 9364848
42020 9364848 2056522 5042926 8330424 3693830 -353976 7054491 19784707 22730912
42012 22730912 13733896 5073556 5348944 10646296 13269086 10075280 1632988 -9139774
42004 -9139774 -16412213 -15764856 -9931239 -5235231 -2804793 1028381 6371485 8729220
41996 8729220 6920003 5281532 6279879 7019845 5392421 4071779 5437348 7305610
$$ packed form
42052c847245q7871J1774993Q611928n060364j3449345j0342312j892104N148065
42044i144255R091158J0288358R441710P804949N100960q80622r879413j6977870
42036D844975j7199688j0059896R74011J0039404J0782693K813072m199616p80934
42028b785979P997316Q516708m9774l595297L447005P668276r58593j0874814
42020I364848p308326K986404L287498m636594m047806P408467J2730216K946205
42012B2730912q997016q660340K75388N297352K622790l193806q442292j0772762
42004i139774p272439O47357N833617M696008K430438L833174N343104K357735
41996H729220j809217j638471R98347P39966j627424j320642J365569J868262
$$ plain form
41988 7305610 6853107 4586940 1341092 -4307386 -11627098 -14670359 -8937893 1098151
41980 1098151 6607498 5792746 5331298 9771478 14582649 12445488 3039597 -6975523
41972 -6975523 -12147019 -12985540 -12857685 -13267756 -13378831 -12494163 -11647515 -12894558 -16803680
41963 -16803680 -20149250 -17697819 -8711724 -421367 -976120 -8874910 -14175257 -11404549
41955 -11404549 -5701633 -3344311 -2404610 1729335 6659047 6064784 -586629 -8600569
41947 -8600569 -15872461 -22639603 -25577561 -20711827 -11414102 -5225059 -3504761 -2786082
41939 -2786082 -4627418 -12832648 -21313034 -18294724 -5045180 3624116 1874215 796613
41931 796613 6929368 9227497 -468448 -8689416 1156328 21578347 30552300 22512459
$$ packed form
41988G305610m52503k266167l245848n648478p319712l043261N732466J0036044
41980A098151N509347q14752m61448M440180M811171k137161r405891j0015120
41972f975523n171496q38521J27855m10071j11075Q84668Q46648j247043l909122
41963a6803680l345570K451431Q986095Q290357n54753p898790n300347K770708
41955a1404549N702916K357322R39701M133945M929712n94263o651413q013940
41947h600569p271892o767142k937958M865734R297725O189043J720298P18679
41939b786082j841336q205230q480386L018310J3249544Q669296j749901j077602
41931G96613O132755K298129r695945q220968R845744K0422019Q973953q039841
$$ plain form
41923 22512459 11967312 9079276 9181425 6769420 3731818 1082424 -3742957 -8354546
41915 -8354546 -6496610 -469489 -357747 -7477705 -10715804 -4241434 2485852 -970494
41907 -970494 -10899865 -15906777 -12000778 -4887238 -1690044 -4916028 -11187855 -13676804
41899 -13676804 -9223819 -2809019 -95148 2086262 9783909 18966112 19787102 13213584
41891 13213584 10407517 14129637 14887978 9056658 5674584 9035171 9875259 2959223
41883 2959223 -1459859 4180935 8726185 -274710 -13879815 -13996002 -1427015 6279620
41875 6279620 1712506 -4956126 -4907017 -878394 3451753 9475925 14875619 11494638
41867 11494638 -2122301 -15579901 -19553593 -16277369 -12507379 -9324461 -4420372 1112444
$$ packed form
41923B2512459j0545147k888036J02149k412005l037602k649394m825381m611589
41915h354546J857936O027121J11742p119958l238099O474370O727286l456346
41907i70494r929371n006912L905999P113540L197194l225984o271827k488949
41899a3676804M452985O414800K713871K181410P697647R182203Q20990o573518
41891A3213584k806067L722120P58341n831320l382074L360587Q40088o916036
41883B959223m419082N640794M545250r000895j3605105j16187J2568987P706635
41875F279620m567114o668632M9109M028623M330147O024172N399694l380981
41867A1494638j3616939j3457600l973692L276224L769990L182918M904089N532816
$$ plain form
41859 1112444 4115473 4453048 4535093 5445298 5847066 3449716 -2812560 -10252356 -13293035
41850 -13293035 -10051579 -6248767 -8019767 -12762872 -13125007 -8597643 -5617133 -6133747
41842 -6133747 -4422881 2495321 8792010 7904645 1029534 -5803993 -8350734 -5396607
41834 -5396607 1264789 5521382 1412784 -7891301 -11501621 -4951116 3312543 4348384
41826 4348384 1137665 1908514 6667782 8910974 7271418 6263520 6657731 4057414
41818 4057414 -2201594 -6548604 -5264685 -476522 5299342 11607313 15277472 11460465
41810 11460465 3537361 3796261 17220698 30982308 28997352 13025728 -431983 -2420116
41802 -2420116 -163809 -2475859 -7088294 -7139533 -2383760 1880829 1783345 -3932485 -14410568
$$ packed form
41859A112444L003029L37575Q2045R10205M01768k397350o262276p439796l040679
41850a3293035L241456L802812j771000m743105l62135M527364K980510n16614
41842f133747J710866O918202O296689q87365o875111o833527k546741K954127
41834e396607O661396M256593m108598r304085l610320O550505Q263659J035841
41826D348384l210719P70849M759268K243192j639556j007898L94211k600317
41818D057414o259008m347010J283919M788163N775864O307971L670159l817007
41810A1460465p923104K58900J3424437J3761610j984956j5971624j3457711j988133
41802b420116K256307k312050m612435n1239M755773M264589r7484n715830j0478083
$$ plain form
41793 -14410568 -23566573 -22217134 -9574384 2274630 2197253 -6076420 -11005932 -9156000
41785 -9156000 -4897166 1059668 10516999 17130418 10957257 -4222240 -11302132 -2259784
41777 -2259784 11569007 17427442 17642957 19969953 22259639 18192243 10883396 8480253
41769 8480253 10277939 8511460 1637700 -4448677 -7025351 -8761695 -10075703 -8304935
41761 -8304935 -4258129 -1146317 2591393 10527157 18444436 17195463 7045713 -292075
41753 -292075 3090149 12517931 20199582 24400263 24858946 18590711 7460994 2100192
41745 2100192 8981387 18585206 16238100 2259939 -8422896 -6526482 1292961 4870055
41737 4870055 4608662 7303866 13490496 16750648 14347496 11345895 12085695 12954098 7928173
$$ packed form
41793a4410568r156005J349439J2642750J1849014p7377q273673m929512J849932
41785i156000M258834N956834R457331O613419o173161j5179497p079892R042348
41777b259784J3828791N858435K15515K326996K289686m067396p308847k403143
41769H480253J797686j766479o873760o086377k576674j736344j314008J770768
41761h304935M046806L111812L737710P935764P917279j248973j0149750p337788
41753b92075L382224R427782P681651M200681M58683o268235j1129717n360802
41745B100192O881195R603819k347106j3978161j0682835J896414P819443L577094
41737D870055k61393K695204O186630L260152k403152l001601P39800Q68403n025925
$$ plain form
41728 7928173 -1635210 -7923238 -6843755 -2505056 -658533 -1949265 -3482212 -3333941
41720 -3333941 -1278662 1469542 1019954 -6394827 -17119693 -20447738 -11607863 -363457
41712 -363457 193608 -9111293 -15032516 -9441540 2644080 12728654 17999396 18548610
41704 18548610 13580315 5137968 -132456 1864979 7275634 9807720 8117865 4368501
41696 4368501 -363226 -4797835 -5334499 -827308 2760563 -1562001 -11490059 -16543200
41688 -16543200 -10600281 817855 7669259 6727508 3082255 1925520 2469662 1256380
41680 1256380 -1268093 -1324378 1267052 1572416 -2372080 -4502220 919598 8924295 9028455
41671 9028455 76298 -7935450 -8178442 -5209709 -5573023 -7733818 -6831267 -3454279 -1140702
$$ packed form
41728G928173r563383o288028J079483M338699J846523j290732j532947J48271
41720c333941K055279K748204m49588p414781j0724866l328045Q839875J1244406
41712c63457N57065r304901n921223N590976J2085620J0084574N270742N49214
41704A8548610m968295q442347n270424J997435N410655K532086j689855l749364
41696D368501m731727m434609n36664M507191L587871m322564r928058n053141
41688a6543200N942919J1418136O851404r41751l645253j156735N44142j213282
41680A256380k524473n6285K591430L05364l944496k130140N421818Q004697J04160
41671I028455q952157q011748k42992K968733l63314k160795R02551L376988K313577
$$ plain form
41662 -1140702 502611 3441306 5316501 2863303 -1102928 -1068240 2359782 3872419
41654 3872419 2561948 2412224 4193990 4503608 3301562 4401648 6966813 4980029
41646 4980029 -1784498 -4914165 -506991 3031415 -2394978 -11062375 -11872160 -5573393
41638 -5573393 -2790813 -6888450 -10187995 -8171827 -6242848 -8412229 -9261431 -3743640
41630 -3743640 2798116 2500702 -2534868 -4200798 -1220621 857578 332383 480111 346678
41621 346678 -5516651 -15844076 -20640021 -14867804 -6075291 -2658363 -1908031 2742418
41613 2742418 8748516 8384560 2157723 -2046439 -2325622 -4916630 -11454285 -14005177
41605 -14005177 -7145243 2984224 7376102 5871420 4132339 3889209 3113056 2454943
$$ packed form
41662a140702J643313K938695J875195k453198l966231L4688L428022J512637
41654C872419j310471j49724J781766L09618j202046J100086K565165j986784
41646D980029o764527l129667M407174L538406n426393q667397q09785O298767
41638e573393K782580m097637l299545K016168J928979k169381q49202N517791
41630c743640O541756k97414n035570j665930K980177K078199n25195J47728j33433
41621C46678n863329j0327425m795945N772217Q792513L416928P50332M650449
41613B742418O006098l63956o226837m204162k79183k591008o537655k550892
41605a4005177O859934J0129467M391878j504682j739081k43130p76153o58113
$$ plain form
41597 2454943 4037148 5474039 2525918 -2288616 -797311 9402454 20444889 23616772
41589 23616772 18655061 11229174 5760543 4084098 7184464 13646170 18476615 17514305
41581 17514305 11894283 5387936 -493052 -5234689 -5858680 -308372 6605367 6936760
41573 6936760 658877 -2574315 4244151 15444743 18777506 9321547 -5860410 -15474441
41565 -15474441 -13748515 -3649158 6994761 12587923 13979695 15208459 16789052 15190087
41557 15190087 9355099 3660279 2283307 4204230 6315930 7801611 8243409 5201525
41549 5201525 -2038004 -9295164 -12372798 -12324642 -11826614 -9987322 -5811288 -2687472 -2865615
41540 -2865615 -1379057 6534098 15512606 17365075 15557159 20202971 28876025 26561355
$$ packed form
41597B454943J582205J436891k948121m814534J491305J0199765J1042435L171883
41589B3616772m961711p425887n468631j676445L100366O461706M830445r62310
41581A7514305n620022o506347n880988m741637o23991N550308O913739L31393
41573F936760o277883l233192O818466J1200592L332763r455959j5181957r614031
41565a5474441J725926J0099357J0643919N593162J391772J228764J580593j598965
41557A5190087n834988n694820j376972J920923K111700J485681M41798l041884
41549E201525p239529p257160l077634M8156M98028J839292M176034L123816j78143
41540b865615J486558P913155Q978508J852469j807916M645812Q673054k314670
$$ plain form
41532 26561355 8891979 -7779513 -7327351 5317899 13214273 9440550 820391 -4356935
41524 -4356935 -2937862 4681618 14113212 17791566 13528758 9271325 12520502 18666192
41516 18666192 17617213 8950040 1964924 2487953 7921964 14339623 20093931 22270290
41508 22270290 17593399 8444396 1625825 -309302 -1087347 -3265432 -4465136 -2618503
41500 -2618503 42093 349413 -2058929 -5851848 -9834724 -12703227 -13661553 -13927550 -15333864
41491 -15333864 -17274221 -17313280 -15084875 -13774325 -17067666 -24683347 -30654781 -27702049
41483 -27702049 -15786559 -4035611 456575 2674259 10565173 18815398 14653190 405281
41475 405281 -6027635 1081494 4471639 -8117674 -22007992 -18259585 -4286179 -884244
$$ packed form
41532B6561355j7669376j6671492M52162J2645250P896374l773723q620159n177326
41524d356935J419073P619480R431594L678354m262808m257433L249177O145690
41516A8666192j048979q667173o985116N23029N434011O417659N754308K176359
41508B2270290m676891r149003o818571j935127p78045k178085j199704J846633
41500b618503K660596L07320k408342l792919l982876k868503r58326k65997j406314
41491a5333864j940357l9059K228405J310550l293341p615681n971434K952732
41483b7702049J1915490J1750948M492186K217684P890914Q250225m162208j4247909
41475D05281o432916P109129L390145j2589313j3890318L748407J3973406L401935
$$ plain form
41467 -884244 -8390026 -9255717 492489 6652459 3509535 1901930 7279211 10875721
41459 10875721 8130026 6633917 9568840 9395119 4506190 4072212 9195724 8050030
41451 8050030 -1353864 -2931761 11070152 23713329 18048376 2332973 -5274668 -3315974
41443 -3315974 -1439417 -316646 4640487 8607268 4441038 -1921495 386814 8756982
41435 8756982 11675376 6589407 -616510 -8097216 -15933239 -17963757 -10797833 -4840416
41427 -4840416 -10497745 -19420342 -16537073 -4936057 363083 -1283406 2259312 9882469
41419 9882469 6270854 -10295590 -21683109 -17830908 -10823481 -12976617 -19422013 -22333096
41411 -22333096 -25401945 -32162741 -34385895 -25431075 -14056133 -12107040 -17164238 -18962975
$$ packed form
41467h84244p505782q65691R748206O159970l142924j607605N377281L596510
41459A0875721k745695j496109K934923j73721m888929m33978N123512j145694
41451H050030r403894j577897J4001913J2643177n664953j5715403p607641J958694
41443c315974J876557J122771M957133L966781m166230o362533K308309Q370168
41435H756982K918394n085969p205917p480706p836023k030518P165924N957417
41427d840416n657329q922597K883269J1601016N299140j646489L542718P623157
41419I882469l611615j6566444j1387519L852201P007427k153136o445396k911083
41411b2333096l068849o760796k223154Q954820J1374942J949093n057198j798737
$$ plain form
41403 -18962975 -15253359 -10260800 -4508328 2810777 7333243 5999893 4856715 10288449
41395 10288449 17217420 16152306 7877097 911785 -2235099 -5651763 -8978383 -6607996
41387 -6607996 1844503 9465662 11692085 10774069 9799144 9050229 9348932 12682814 17786587
41378 17786587 20183068 18154407 14493958 11426914 7994255 3566969 129968 -318062
41370 -318062 2106865 6167148 9960431 10635257 7208344 3896442 6673583 15263594
41362 15263594 22122140 21375048 15851371 12620859 13679090 14542450 11684001 7770536
41354 7770536 7572932 10630799 11086138 5061180 -4420930 -11192310 -12519590 -10205227
41346 -10205227 -7287110 -6231527 -8453123 -12042219 -11218731 -2377034 9369870 13914272
$$ packed form
41403a8962975L709616M992559N752472P319105M522466j333350j143178N431734
41395A0288449O928971j065114q275209o965312l146884l416664l326620K370387
41387f607996Q452499P621159K226423r18016r74925p48915K98703L333882N103773
41378A7786587K396481k028661l660449l067044l432659m427286l437001m48030
41370c18062K424927M060283L793283O74826l426913l311902K777141Q590011
41362A5263594O858546p47092n523677l230512J058231Q63360k858449l913465
41354G770536j97604L057867M55339o024958r482110o771380j327280K314363
41346a0205227K918117J055583k221596l589096Q23488Q841697J1746904M544402
$$ plain form
41338 13914272 7449528 -3103173 -7758112 -3048861 5876470 9883448 3550378 -7930419
41330 -7930419 -11024247 1485394 19135678 24180382 13488632 1609774 122663 3793622
41322 3793622 2564954 -2108235 -2043357 2557308 3284672 -3087656 -10365256 -12383100 -9928217
41313 -9928217 -7374941 -7384862 -9536816 -10684372 -7234805 -156333 4221857 2091308 -2007870
41304 -2007870 -2163575 -731363 -4147109 -11010821 -12438271 -4906623 4315149 6360586
41296 6360586 25028 -9324076 -15089366 -13113009 -5319420 -106791 -3479038 -9871881
41288 -9871881 -8751103 -455738 3610645 -1214252 -5112480 710191 10304303 13073784
41280 13073784 10082878 10001268 13556825 13209214 6621404 -57314 -2726771 -3740002
$$ packed form
41338A3914272o464744j0552701m654939M709251Q925331M006978o333070j1480797
41330g930419l093828J2509641J7650284N044704j0691750j1878858j487111L670959
41322C793622j228668m673189O4878M600665P27364o372328p277600k017844K454883
41313i928217K553276r921k151954j147556L449567P078472M378190k130549m099178
41304b007870j55705J432212l415746o863712j427450P531648R221772K045437
41296F360586o335558r349104n765290J976357P793589N212629l372247o392843
41288i871881J120778Q295365M066383m824897l898228N822671R594112K769481
41280A3073784k990906q1610L555557l47611o587810o678718k669457j013231
$$ plain form
41272 -3740002 -4409015 -2265156 1242292 -1007625 -10693534 -18034508 -13548197 -1655127
41264 -1655127 4185200 -1806774 -11520610 -13241578 -3977680 8840398 15024412 10492230
41256 10492230 452606 -5648330 -2945942 5302487 12541038 14997444 12341643 5506929
41248 5506929 -3395708 -10571626 -12648723 -9247849 -2945207 1989353 1101318 -6377345
41240 -6377345 -14044268 -13259585 -4324011 2022544 -1402367 -7601044 -5503627 2957120
41232 2957120 5067656 -3768349 -12918623 -11328686 -1527827 6182979 7700153 7106937
41224 7106937 8072115 9551711 9456522 8059093 7118359 7907249 10176295 11912780 10978613
41215 10978613 7893957 5574277 5573506 6674927 7965611 10244028 12733981 11908977 6643577
$$ packed form
41272c740002o69013K143859L507448k249917r685909p340974M486311J1893070
41264a655127N840327n991974r713836j720968R263898J2818078O184014m532182
41256A0492230j0039624o100936K702388Q248429P238551K456406k655801o834714
41248E506929q902637p175918k077097L400874O302642M934560q88035p478663
41240f377345p666923P84683Q935574O346555l424911o198677K097417Q460747
41232B957120K110536q836005r150274J589937R800859P710806J517174n93216
41224G106937R65178J479596r5189j397429r40734P88890K269046J736485r34167
41215A0978613l084656k319680p71J101421J290684K278417K489953q25004n265400
$$ plain form
41206 6643577 1762828 2628518 7747800 10404915 6810116 -557607 -7035369 -9982336
41198 -9982336 -9066979 -5381802 -974085 2562853 5441915 8583106 11613806 13231205
41190 13231205 12970403 11384911 9201509 7355193 6697913 6486022 4721284 1466031
41182 1466031 -239426 993216 1626445 -1870530 -6340826 -5041139 2138319 6535400
41174 6535400 1644054 -7365280 -9627173 -2991418 2659600 -1806443 -13022460 -20146094
41166 -20146094 -18650534 -13095272 -7286346 -15169 6801796 4850539 -8205719 -19764077
41158 -19764077 -16226543 -2637525 3223228 -4123257 -11159450 -6512113 3441271 6610730
41150 6610730 2863682 806379 3531231 6675940 6999273 5129410 1935170 -1808769
$$ packed form
41206F643577m880749Q65690N119282K657115l594799p367723o477762k946967
41198i982336R15357L685177M407717L536938K879062L141191L030700J617399
41190A3231205k60802j585492k183402j846316o57280k11891j764738l255253
41182A466031j705457J232642O33229l496975m470296J299687P179458M397081
41174F535400m891346r009334k261893O635755N651018m466043j1216017p123634
41166b0146094J495560N555262N808926P271177O816965j951257j3056258j1558358
41158a9764077L537534J3589018N860753p346485p036193M647337R953384L169459
41150F610730l747048k057303K724852L144709L23333j869863l194240l743939
$$ plain form
41142 -1808769 -3919726 -3353022 -1961704 -789755 1416097 3299900 430578 -6376723
41134 -6376723 -9158515 -4457858 421124 -701590 -2447203 2417244 10109425 12339014
41126 12339014 9211700 5170680 -1579961 -13348315 -21899827 -17043367 -3516244 4265602
41118 4265602 2752925 1320250 4942153 8676110 9654297 10854048 11540419 7043374
41110 7043374 -142777 -1676542 2594853 4696997 3848196 7672005 16259813 20332016
41102 20332016 18499849 20265669 27205897 28124874 19577623 13858263 17558229 19213540
41094 19213540 9552077 -2139834 -4900598 -3998143 -7243539 -8065317 596135 8408017
41086 8408017 2831141 -8338314 -9816414 -5422889 -9852976 -19978505 -18082197 -2187937
$$ packed form
41142a808769k110957N66704J391318J171949K205852J883803k869322o807301
41134f376723k781792M700657M878982j122714j745613M864447P692181K229589
41126A2339014l127314m041020o750641j1768354q551512M856460J3527123P781846
41118D265602j512677j432675L621903L733957R78187J199751O86371m497045
41110G043374p186151j533765M271395K102144q48801L823809Q587808M072203
41102B0332016j832167J765820O940228R18977q547251n719360L699966J655311
41094A9213540r661463j1691911k760764R02455l245396q21778Q661452P811882
41086H408017n576876j1169455j478100M393525m430087j0125529J896308J5894260
$$ plain form
41078 -2187937 9738230 7911688 2257281 2009280 3239585 2440612 4639691 10501090
41070 10501090 11061237 3541297 -1395695 3617240 11378254 13736967 13931515 16080934
41062 16080934 14446057 4575278 -4597058 -2254888 7400412 11476431 6836010 1292468
41054 1292468 -386991 -1365098 -4712146 -8642567 -9592358 -4804184 6345677 18963163
41046 18963163 23740863 16821039 5616671 -223030 -20019 1138628 2318024 6119120
41038 6119120 11167613 12873037 10255344 5758226 393940 -4608061 -4506946 2365779
41030 2365779 7228859 59147 -14308127 -19934867 -11234843 36175 2769660 586399
41022 586399 1557926 3911408 1802736 -1670046 1068788 7747380 7924430 -1024398 -9837895
$$ packed form
41078b187937J1926167j826542n654407k48001J230305p98973K199079N861399
41070A0501090N60147p519940m936992N012935P761014K358713J94548K149419
41062A6080934j634877r870779r172336K342170R655300M076019m640421n543542
41054A292468j679459r78107l347048l930421r49791M788174J1149861J2617486
41046A8963163M777700o919824j1204368n839701K03011J158647J179396L801096
41038F119120N048493J705424k617693m497118n364286n002001J01115O872725
41030B365779M863080p169712j4367274n626740Q700024J1271018K733485k183261
41022E86399R71527K353482k108672l472782K738834O678592J77050q948828q813497
$$ plain form
41013 -9837895 -11005018 -7238364 -3473619 518000 4580420 3392067 -5439808 -14099432
41005 -14099432 -13367674 -5336694 322717 529174 1324073 6901634 13529753 15101173
40997 15101173 8792979 -4743274 -20334624 -27517633 -18787639 -478326 12094233
40990 12094233 12934210 11255752 15855635 22323293 22085663 16746548 14612753 17084300
40982 17084300 17388788 11734001 4657897 2907589 8348292 16533092 19567862 12733539
40974 12733539 1220347 -3375713 2948249 10598796 9287096 1770118 -2156185 -688908
40966 -688908 -298506 -4029454 -8988541 -14093489 -20825107 -26407233 -25536012 -19799783 -16560546
40957 -16560546 -17086382 -14604040 -6179022 2475428 7177107 11328645 17147036 19046378
$$ packed form
41013i837895j167123L766654L764745L991619M062420j188353q831875q659624
41005a4099432P31758Q030980N659411K06457P94899N577561O628119J571420
40997A5101173o308194j3536253j5591350p183009Q729994J8309313J2572559
40990A2094233Q39977j678458M599883O467658k37630n339115k133795K471547
40982A7084300L04488n654787p076104j750308N440703Q184800L034770o834323
40974A2733539j1513192m596060O323962P650547j311700p516978l926303J467277
40966f88908L90402l730948m959087n104948o731618n582126Q71221N736229L239237
40957a6560546n25836K482342Q425018Q654450M701679M151538N818391J899342
$$ plain form
40949 19046378 12260914 2180784 -1715595 2153995 6976520 6810447 2502694 -1664
40941 -1664 4529640 14097931 18758344 11058708 -2867254 -9339159 -5057838 -435280
40933 -435280 -2449391 -4453246 676264 6910633 4547783 -3043424 -3397397 6894425
40925 6894425 17956828 20068640 13291934 3780151 -2552748 -2635962 1285021 1874465
40917 1874465 -4945649 -12634385 -11219122 -1142711 7060224 6991762 2726920 -378056
40909 -378056 -3232868 -7766666 -10820005 -8563205 -2986323 711134 480675 -2577130
40901 -2577130 -7762144 -14041833 -17641476 -14945945 -7673703 -1761211 -687212 -2263952
40893 -2263952 -2273177 838963 5205510 7435879 4734212 -2652935 -9701750 -9393431 -122335
$$ packed form
40949A9046378o785464j0080130l896379L869590M822525j66073m307753k504358
40941a664M531304R568291M660413p699636j3925962o471905M281321M622558
40933d35280k014111k003855N129510O234369k362850p591207l53973J0291822
40925F894425J1062403K111812o776706r511783o332899q3214L920983N89444
40917A874465o820114p688736J415263J0076411Q202935o8462m264842l104976
40909c78056k854812m533798l053339K256800N576882L697457k30459l057805
40901b577130n185014o279689l599643K695531P272242N912492J073999j576740
40893b263952r225L112140M366547K230369k701667p387147p048815L08319R271096
$$ plain form
40884 -122335 10260658 11299445 2058396 -6703020 -4951170 4785051 11859771 11564001
40876 11564001 8798724 7849651 5822668 -187149 -5471418 -3596653 3034986 5147066
40868 5147066 -1254863 -10221898 -14288899 -13123598 -11889271 -13904057 -17042191 -16428577
40860 -16428577 -9992942 -1759531 1378836 -2635600 -8388622 -10207398 -9353117 -9919669
40852 -9919669 -10017887 -3877920 6949232 12030503 5297980 -6001914 -10702293 -7692654
40844 -7692654 -4403941 -4428173 -4249763 -1782853 -183175 -800318 643814 6303988 10330028
40835 10330028 7152546 1631955 2612462 7896910 5736924 -6156170 -13181245 -2725335
40827 -2725335 16734299 25596117 18690074 9398789 8163785 9134805 3198588 -6147641
$$ packed form
40884a22335J0382993J038787r241049q761416J751850R736221P074720k95770
40876A1564001k765277r49073k026983o009817n284269J874765O631639K112080
40868E147066o401929q967035m067001J165301J234327k014786l138134O13614
40860a6428577O435635Q233411L138367m014436n753022j818776Q54281n66552
40852i919669r8218O139967J0827152N081271o732523j1299894m700379L009639
40844g692654L288713k4232J78410K466910J599678o17143J444132N660174M026040
40835A0330028l177482n520591R80507N284448k159986j1893094p025075J0455910
40827b725335J9459634Q861818o906043r291285j235004R71020n936217r346229
$$ plain form
40819 -6147641 -8958382 -4606757 -1311289 -2467785 -3023238 331276 3742123 3189468
40811 3189468 420925 -1127236 -1551842 -2569063 -3857107 -3904475 -1985396 2063123 7046147
40802 7046147 8730107 3420550 -5163330 -7753417 -1359038 5740135 4974946 -1504917
40794 -1504917 -6506419 -9742548 -15700471 -21951812 -19827481 -8488273 872823 -469527
40786 -469527 -7005153 -7641453 -1165677 3666581 816377 -6659451 -11989070 -11276063 -5218412
40777 -5218412 1399174 2651190 -1932099 -4869868 539159 10381987 14602774 10119963
40769 10119963 2870362 -2214688 -4695344 -1963611 9600194 22854722 21285235 968300
40761 968300 -18541343 -17133697 -1157398 6347393 -1425168 -8009968 -815261 10670613
$$ packed form
40819f147641k810741M351625L295468j156496n55453L354514L410847n52655
40811C189468k768543j548161m24606j017221j288044m7368J919079M048519M983024
40802G046147J683960n309557q583880k590087O394379P099173p65189o479863
40794a504917n001502l236129n957923o251341K124331J1339208R361096j342350
40786d69527o535626o36300O475776M832258k850204p475828n329619P13007O057651
40777e218412O617586J252016m583289k937769N409027R842828M220787m482811
40769A0119963p249601n085050k480656K731733J1563805J3254528j569487k0316935
40761I68300j9509643J407646J5976299P504791p772561o584800P194707J1485874
$$ plain form
40753 10670613 10862093 258016 -8262983 -8263657 -5083317 -5391629 -9202603 -11918456 -10015579
40744 -10015579 -5023363 -2893555 -6596835 -9524758 -2663694 10192926 13318402 237702
40736 237702 -14815703 -15079250 -3692841 2967696 -510123 -4239429 -1987127 -629623
40728 -629623 -6394139 -12802218 -10188567 -801623 3982466 -673834 -7169691 -6114120
40720 -6114120 1795376 7622598 6464411 3854857 7445409 15185368 17536725 11304364
40712 11304364 3912750 1295485 -190060 -3982965 -3964173 5159691 14286798 9580863
40704 9580863 -6519667 -16793165 -12050233 -451802 7070572 8132102 3181111 -7990145
40696 -7990145 -18850490 -18184979 -6713399 260082 -5097269 -10610383 -3745439 8396231
$$ packed form
40753A0670613J91480j0604077q520999o74L180340l08312l810974k715853J902877
40744a0015579M992216K129808l703280k927923O861064J2856620L125476j3080700
40736B37702j5053405k63547J1386409O660537l477819l729306K252302J357504
40728f29623n764516o408079K613651R386944M784089m656300o495857J055571
40720f114120P909496N827222j158187k609554L590552P739959K351357o232361
40712A1304364p391614k617265j485545l792905J8792R123864R127107m705935
40704I580863j6100530j0273498M742932J1598431P522374J061530m950991j1171256
40696g990145j0860345O65511J1471580O973481n357351n513114O864944J2141670
$$ plain form
40688 8396231 12024291 8892927 9419624 11832713 6805070 -1883852 -1292436 7127350
40680 7127350 8222893 -100812 -1167766 12605435 24979083 19937828 5080631 -1913590
40672 -1913590 1933420 7301529 10144799 12571327 12950461 8920535 5539728 8077912
40664 8077912 11472594 9311538 7685722 15336208 24747308 21082500 8654882 8446204
40656 8446204 25578222 39112831 32848907 18335502 14438683 18972992 17109112 7538706
40648 7538706 1879052 3381712 4279152 2857067 6067830 13541878 15097559 8716249
40640 8716249 6280982 14079757 20429830 12737889 -3038472 -11472686 -9090385 -4294246
40632 -4294246 -363441 7818791 20364557 28480861 27350707 23042288 22159066 22883813
$$ packed form
40688H396231L628060l131364N26697K413089n027643q688922N91416Q419786
40680G127350J095543q323705j066954J3773201J2373648n041255j4857197o994221
40672a913590L847010N368109K843270K426528L79134m029926l380807K538184
40664H077912L394682k161056j625816P650486R411100l664808j2427618k08678
40656H446204J7132018J3534609o263924j4513405l896819M534309j863880r570406
40648G538706n659654J502660Q97440j422085L210763P474048J555681o381310
40640H716249k435267P798775O350073p691941j5776361q434214K382301M796139
40632d294246L930805Q182232J2545766Q116304j130154m308419q83222P24747
$$ plain form
40624 22883813 21534223 20541676 22962371 24706208 20379666 13602831 13185540 20208967
40616 20208967 26847555 28360170 28428337 30360456 30254120 23500507 13187665 6860280
40608 6860280 7599021 12483372 17567709 20227813 18579352 13261983 8928456 9581842
40600 9581842 12849911 13388930 12096486 16638914 30470731 45603783 50504415 43511939
40592 43511939 34339724 31956166 34385264 32717296 23347616 12519444 7909218 9394368
40584 9394368 11567322 12825404 16324889 22225404 25679345 24770778 23999843 25972148
40576 25972148 26078945 21218561 17475631 20877234 25731624 22692850 15065357 14619185
40568 14619185 21910877 24428612 16719559 8535198 7547401 7405171 1577210 -3027547
$$ packed form
40624B2883813j349590r92547K420695J743837m326542o776835m17291P023427
40616B0208967O638588J512615O8167J932119j06336o753613j0312842o327385
40608F860280P38741M884351N084337K660104j648461n317369m333527O53386
40600I581842L268069N39019j292444M542428J3831817J5133052M900632o992476
40592D3511939r172215k383558K429098j667968r369680j0828172m610226J485150
40584I394368K172954J258082L499485N900515L453941r08567p70935J972305
40576B5972148J06797m860384l742930L401603M854390l038774p627493m46172
40568A4619185P291692K517735p709053q184361r87797j42230n827961m604757
$$ plain form
40560 -3027547 2086091 10813004 11251221 4328716 389413 1816028 2825063 3672907
40552 3672907 10440939 20948991 25359052 23025188 25107392 36101547 45257438 42644623
40544 42644623 33060486 26415751 23151724 17972864 11978846 12188586 21385297 34147013
40536 34147013 41355282 36517774 21820193 9446173 10434531 20138055 23283338 16905667
40528 16905667 17004798 34545943 55861873 59709831 46665927 36838667 41507002 51951136
40520 51951136 56894169 57008953 58461155 63682710 73492451 88623956 103813022 109431350
40512 109431350 105662073 107420721 127591908 161424960 195637479 227969763 268131665
40505 268131665 321569973 381522625 436913917 479382356 501113866 494704023 460632308
$$ packed form
40560c027547N113638Q726913M38217o922505l939303J426615J009035Q47844
40552C672907O768032J0508052M410061k333864K082204J0994155R155891k612815
40544D2644623r584137o644735l264027n178860n994018K09740R196711J2761716
40536C4147013P208269m837508j4697581j2374020R88358R703524L145283o377671
40528A6905667R9131J7541145K1315930L847958j3043904r827260M668335J0444134
40520E1951136M943033J14784J452202N221555R809741J5131505J5189066N618328
40512A09431350l769277J758648K0171187L3833052L4212519L2332284M0161902
40505B68131665N3438308N9952652N5391292M2468439K1731510o409843l4071715
$$ plain form
40498 460632308 410303260 357158118 307559677 262989976 226189630 199248510 178220338
40491 178220338 156365875 133098594 114618520 104898438 100809214 97500273 93787535
40484 93787535 89902846 84530824 77565258 72105293 70037173 69181843 68793859 73568240
40476 73568240 86192966 99534411 104156037 101914404 103419490 112159052 120846988 125882997
40468 125882997 135629611 158784382 192121846 226482443 259468358 295751503 339187534
40461 339187534 390204806 445506767 493176142 513630992 495892261 451499449 403485580
40454 403485580 362335577 321261006 274177015 227443545 190783026 165604721 147378938
40447 147378938 133379273 123181439 115723256 109586875 102935767 91754152 73601685
$$ packed form
40498D60632308n0329048n3145142m9598441m4569701l6800346k6941120k1028172
40491A78220338k1854463k3267281j8480074r720082m089224l308941l712738
40484I3787535l884689n372022o965566n459965k068120q55330l87984M774381
40476G3568240J2624726J3341445M621626k241633J505086Q739562Q687936N036009
40468A25882997R746614K3154771L3337464L4360597L2985915L6283145M3436031
40461C39187534N1017272N5301961M7669375K0454850j7738731m4392812m8013869
40454D03485580m1150003m1074571m7083991m6733470l6660519k5178305j8225783
40447A47378938j3999665j0197834p458183o136381o651108j1181615j8152467
$$ plain form
40440 73601685 55221802 49395835 59537704 73322898 77171179 71716283 66553891 65042034
40432 65042034 63096240 59759535 58835498 60339179 59877960 57805404 59554067 64194514
40424 64194514 63171756 56780135 61818812 90853116 128484714 142177500 118828714
40417 118828714 79820938 55217243 52055036 55089682 51447092 43796143 40958417 45451228
40409 45451228 52772458 56734244 53020041 42236874 31581509 29104230 34172547 37800631
40401 37800631 34429602 28558128 26972293 29838689 33834151 38850620 45360454 49172734
40393 49172734 46533989 42431733 45698803 56039830 63985193 65153823 66569515 75331476
40385 75331476 88170016 97927856 105374185 117489665 135648568 151554413 155620702
$$ packed form
40440G3601685j8379883n825967J0141869J3785194L848281n454896n162392j511857
40432F5042034j945794l336705r24037J503681m61219k072556J748663M640447
40424F4194514j022758o391621N038677K9034304L7631598J3692786k3348786
40417A18828714l9007776k4603695l162207L034646l642590p650949k837726M492811
40409D5451228P321230L961786l714203j0783167j0655365k477279N068317L628084
40401C7800631l371029n871474j585835K866396L995462N016469O509834L812280
40393D9172734k638745m102256L267070J0341027P945363J168630J415692Q761961
40385G5331476J2838540R757840P446329J2115480J8158903J5905845M066289
$$ plain form
40378 155620702 145889873 128295107 110920250 98552654 90640319 83345146 73986947
40371 73986947 63549876 54971779 50164938 49078866 50003781 49900980 46295445 40313994
40363 40313994 36240919 36410637 38085699 37356119 34681703 33892371 36112139 37324604
40355 37324604 33095418 24932560 20903162 28395944 44864739 57763756 58401250 55900929
40347 55900929 70043386 105350860 138663998 141814151 114560346 84747570 74629037
40340 74629037 78156238 77215680 69730560 69659149 83497579 100440618 108582785 110786615
40332 110786615 118779818 137998964 164724733 194038758 222930661 245861271 254067279
40325 254067279 243343010 221334043 204540004 205777026 222414192 237126321 233285491
$$ packed form
40378A55620702r730829j7594766j7374857j2367596p912335p295173r358199
40371G3986947j0437071q578097m806841j086072R24915j02801l605535n981451
40363D0313994m073075J69718J675062p29580k674416p89332K219768J212465
40355C7324604m229186q162858m029398P492782J6468795J2899017O37494k500321
40347E5900929J4142457L5307474L3313138L150153k7253805k9812776j0118533
40340G4629037L527201r40558p485120p1411J3838430J6943039Q142167K203830
40332A10786615P993203J9219146K6725769K9314025K8891903K2930610Q206008
40325B54067279j0724269k2008967j6794039J237022J6637166J4712129l840830
$$ plain form
40318 233285491 211000330 185538856 169272231 159840721 148810298 135810825 126725567
40311 126725567 121286893 112463745 99461768 92103521 97287731 107623326 110257694 103398821
40303 103398821 96960455 97843238 101553798 100359747 94416015 90443528 91509250 92990074
40295 92990074 89801622 83811402 80287069 78627324 72298257 59808501 50202887 52474553
40287 52474553 62933091 69856765 69488953 69862471 77524100 87973523 93262996 93388058
40279 93388058 94645596 99905886 106128210 110863926 116968800 129501168 149050794 169260862
40271 169260862 183038915 192551579 209035198 237171951 262865241 265898488 244845021
40264 244845021 218707550 201067274 184972696 160733788 136476099 127661765 133015364
$$ packed form
40318B33285491k2285161k5461474j6266625r431510j1030423j2999473r085258
40311A26725567n438674q823148j3001977p358247N184210J0335595K634368o858873
40303A03398821o438366Q82783L710560j194051n943732l972487J065722J480824
40295I2990074l188452n990220l524333j659745o329067j2489756r605614K271666
40287E2474553J0458538O923674l67812L73518P661629J0449423N289473J25062
40279I3388058J257538N260290O222324M735716O104874J2532368J9549626K0210068
40271A69260862J3778053R512664J6483619K8136753K5693290L033247k1053467
40264B44845021k6137471j7640276j6094578k4238908k4257689q814334N353599
$$ plain form
40257 133015364 135489623 125153796 108204276 93442368 82237308 73865006 69415536
40250 69415536 66471513 59219999 48087252 41094636 41412670 41675995 36049627 30481004
40242 30481004 33841207 44095980 50789077 48447204 40968528 34230514 30152649 27913466
40234 27913466 26498191 25167596 23863059 23482657 24455133 25630606 25713962 24832690 23654752
40225 23654752 22160882 20467211 19845443 21635084 25277835 27860556 26038829 19604079
40217 19604079 13294671 12774995 17812295 22398039 23126021 23171457 25177690 25818585 22740858
40208 22740858 21212406 25929504 30867821 27247868 18416072 15340859 19066758 20761256
40200 20761256 19333097 23976707 35633920 41365257 34406475 25589979 25108318 26266471
$$ packed form
40257A33015364K474259j0335827j6949520j4761908j1205060q372302m449470
40250F9415536k944023p251514j1132747o992616L18034K63325n626368n568623
40242C0481004L360203J0254773O693097k341873p478676o738014m077865k239183
40234B7913466j415275j330595j304537l80402R72476J175473Q3356q81272j177938
40225B3654752j493870j693671o21768J789641L642751K582721j821727o434750
40217A9604079o309408n19676N037300M585744P27982M5436K006233O40895l077727
40208B2740858j528452M717098M938317l619953q831796l075213L725899J694498
40200B0761256j428159M643610J1657213N731337o958782q816496m81661J158153
$$ plain form
40192 26266471 19946368 13347244 18261537 28897437 29122947 17772086 9253939 9974970
40184 9974970 11306182 7978025 6993106 12902784 18610217 18617644 19741699 29339642 41517397
40175 41517397 44802240 37959744 29463936 25110957 23916460 23526332 22593181 19445782
40167 19445782 14391360 11906928 15060372 19113582 16406277 7188769 143472 1566394
40159 1566394 8800993 15601082 19639437 22308927 24140298 23649933 20026958 14846350
40151 14846350 10768282 9296456 10082809 12093899 14733952 17227170 17726180 15014390
40143 15014390 11364987 11261897 15735369 20103973 19761674 16461806 15424351 17088974
40135 17088974 16233760 10301099 4142067 3466342 6839002 8368444 6466280 5062530
$$ packed form
40192B6266471o320103o599124M914293J0635900K25510j1350861q518147P21031
40184I974970J331212l328157r84919N909678N707433P427J124055R597943J2177755
40175D1517397L284843o842496q495808m352979j194497l90128r33151l147399
40167A9445782n054422k484432L153444M053210k707305r217508p045297J422922
40159A566394P234599O800089M038355K669490J831371m90365l622975n180608
40151A4846350m078068j471826P86353K011090K640053K493218M99010k711790
40143A5014390l649403j03090M473472M368604l42299l299868j037455J664623
40135A7088974q55214n932661o159032o75725L372660J529442j902164j403750
$$ plain form
40127 5062530 6464692 8044862 7138361 4582475 1425622 -3231360 -8091346 -8079788 -1609731
40118 -1609731 4453719 3033900 -2865583 -5125656 -3720485 -6106697 -13053207 -14864845
40110 -14864845 -5578699 7469206 14026702 14000876 13252487 12208659 7446292 1057140
40102 1057140 -1222284 -343411 -3135358 -10014290 -12206941 -4576094 6006257 9912029
40094 9912029 7086034 4805699 6874891 10741965 13300860 13980827 12619996 9177487
40086 9177487 5790345 4570501 2706314 -5035858 -16606969 -20961088 -11376025 3136765
40078 3136765 7230511 -667272 -6042024 1511758 14410985 19519115 17040036 17111406
40070 17111406 21869094 23425807 19819393 19642367 25714970 26051257 10661680 -10659661
$$ packed form
40127E062530J402162J580170r06501k555886l156853m656982m859986J1558O470057
40118a609731O063450j419819n899483k260073J405171k386212o946510j811638
40110a4864845R286146J3047905O557496k5826p48389j043828m762367o389152
40102A057140k279424Q78873k791947o878932k192651P630847J0582351L905772
40094I912029k825995k280335K069192L867074K558895O79967j360831l442509
40086I177487l387142j219844j864187p742172j1571111m354119R585063J4512790
40078C136765M093746p897783n374752P553782J2899227N108130k479079P1370
40070A7111406M757688J556713l606414j77026O072603L36287j5389577k1321341
$$ plain form
40062 -10659661 -18876339 -10196519 1313983 4683170 4535219 10129615 20923942 28095146
40054 28095146 25211211 13137389 -2041710 -12448786 -12712767 -4470278 4650744 8503521
40046 8503521 7580564 5920569 5572097 6034248 6832097 7901024 8394297 7314317 5032954
40037 5032954 2771650 877748 -1208834 -3338599 -3864561 -782641 6371609 15554540
40029 15554540 22965898 24979837 20040363 9774763 -1334234 -8740325 -11680356 -13005442
40021 -13005442 -13544236 -9223475 1931222 11979305 9595211 -4308678 -15124286 -12579102
40013 -12579102 -3161806 1186542 12818 1501705 7530290 12083309 13006645 14804278
40005 14804278 18605616 18865700 13037658 6591922 4654422 5234913 4538019 2934371
$$ packed form
40062a0659661q216678Q679820J1510502L369187j47951N594396J0794327P171204
40054B8095146k883935j2073822j5179099j0407076k63981Q242489R121022L852777
40046H503521r22957j659995l48472M62151P97849J068927M93273j079980k281363
40037E032954k261304j893902k086582k129765n25962L081920P154250R182931
40029A5554540P411358K013939m939474j0265600j1108997p406091k940031j325086
40021a3005442n38794M320761J1154697J0048083k384094j3903889j0815608K545184
40013a2579102R417296M348348j173724J488887O028585M553019R23336J797633
40005A4804278L801338K60084n828042o445736j937500N80491o96894j603648
$$ plain form
39997 2934371 1594012 -992720 -4274975 -2641975 6831370 17050459 17348682 5826410
39989 5826410 -9215089 -18749212 -19890992 -14633496 -6333828 1648976 6263177 5413249
39981 5413249 -427790 -6104273 -3777802 8157842 19251035 17162995 4732478 -1645120
39973 -1645120 5551936 13525621 7681039 -6751566 -12944035 -7138558 -1549586 -3740124
39965 -3740124 -7226572 -5844278 -4411904 -7838172 -9721020 -1616921 12402302 20450495
39957 20450495 19093254 15688076 15430880 14834054 9686246 2483824 -1307345 -100665
39949 -100665 3436153 5999870 5864852 3912585 3448758 6389100 9331340 7256353 1964859
39940 1964859 1718609 9631153 17373783 15461062 6407241 1372873 5015416 10202973
$$ packed form
39997B934371j340359k586732l282255J633000R473345J0219089K98223j1522272
39989E826410j5041499r534123j141780N257496Q299668P982804M614201q49928
39981E413249n841039n676483K326471J1935644J1093193k088040j2430517o377598
39973a645120P197056P973685n844582j4432605o192469N805477N588972k190538
39965c740124l486448J382294J432374l426268j882848Q104099J4019223Q048193
39957B0450495j357241l405178k57196n96826n147808p202422l791169J206680
39949a00665L536818K563717j35018j952267m63827K940342K942240k074987n291494
39940A964859k46250P912544P742630j912721r053821n034368L642543N187557
$$ plain form
39932 10202973 8612392 742028 -7027818 -10631121 -10038891 -6030613 485654 6902769
39924 6902769 10064548 9598661 8719949 11167035 16983788 20695578 15108297 -140733
39916 -140733 -14496549 -15641198 -4097444 6194814 4783228 -2763761 -4004678 3147055
39908 3147055 9700877 10203391 9542971 13426151 19271770 20821740 17358133 13867890
39900 13867890 14498552 19462496 26508852 31974768 31758670 24935652 16179999 11566726
39892 11566726 11706367 11549798 7384657 1405349 -1906250 -1759613 -1283238 -2913711 -6050265
39883 -6050265 -9251920 -12143896 -13940517 -12456363 -7256531 -2570351 -3572044 -9412169
39875 -9412169 -13336857 -11207664 -6761725 -5810454 -7799405 -7021394 -1229835 5180907
$$ packed form
39932A0202973j590581p870364p769846l603303N92230M008278O516267O417115
39924F902769L161779m65887q78712K447086N816753L711790n587281j5249030
39916a40733j4355816j144649J1543754J0292258j411586p546989j240917P151733
39908C147055O553822N02514o60420L883180N845619J549970l463607l490243
39900A3867890O30662M963944P046356N465916k16098o823018q755653m613273
39892A1566726J39641j56569m165141n979308l311599J46637M76375j630473l136554
39883f050265l201655k891976j796621J484154N199832M686180j001693n840125
39875i412169l924688K129193M445939R51271j988951P78011N791559O410742
$$ plain form
39867 5180907 7547503 7317660 9856491 17018220 23780261 22911167 13012684 1423757
39859 1423757 -2281117 3672757 11273451 12102094 7016503 4051318 7656412 13278375
39851 13278375 13355497 6226833 -2525593 -6431587 -4267537 -8445 2045465 981729
39843 981729 -1748479 -5206923 -9029333 -11719309 -11749361 -10405896 -10567864 -12144485 -12015381
39834 -12015381 -9467163 -7892099 -9266323 -10840220 -9865551 -7726556 -6205896 -3559763
39826 -3559763 1828541 7707700 12253529 18038787 26267947 31064540 26508996 16511012
39818 16511012 10103939 9051251 8287430 6885241 8764035 12390165 10371697 1969395
39810 1969395 -3806516 -1830149 1355867 -1112073 -5339093 -3851978 2510963 7347644
$$ packed form
39867E180907K366596k29843K538831P161729O762041q69094r898483j1588927
39859A423757l704874N953874P600694Q28643n085591k965185L605094N621963
39851A3278375P7122p128664q752426l905994K164050M259092K053910j063736
39843I81729k730208l458444l822410k689976l0052J343465j61968j576621J29104
39834a2015381K548218J575064j374224j573897R74669K138995J520660K646133
39826c559763N388304N879159M545829N785258Q229160M796593m555544r997984
39818A6511012o407073j052688p63821j402189J878794L626130k018468q402302
39810A969395n775911J976367L186016k467940m227020J487115O362941M836681
$$ plain form
39802 7347644 8593786 8386675 6812032 3240961 1370581 5517298 12756803 15052448
39794 15052448 9281772 483044 -4618700 -3562047 1439193 5508343 4777544 1082752
39786 1082752 759641 5506328 7932423 1131272 -10498981 -16086393 -11668594 -2455853
39778 -2455853 6057533 11848446 12766488 7928880 3094391 5795564 13260314 14047387
39770 14047387 4949207 -2903589 -268620 6650909 7142429 3439327 6155484 15632955
39762 15632955 20110461 13801339 5980035 7283909 15053129 19008230 16378649 13780079
39754 13780079 16020555 20249926 22055297 21758887 22133558 23387112 23431658 21483238 18793577
39745 18793577 16220270 12947952 8095523 2924029 821523 4266470 11132098 14980053
$$ packed form
39802G347644J246142k07111j574643l571071j870380M146717P239505K295645
39794A5052448n770676q798728n101744J056653N001240M069150p30799l694792
39786A082752l23111M746687K426095o801151j1630253n587412M417799R212741
39778b455853Q513386N790913R18042m837608m834489K701173P464750P87073
39770A4047387r098180p852796K634969O919529M91520l703102K716157R477471
39762A5632955M477506o309122p821304J303874P769220L955101k629581k598570
39754A3780079K240476M229371J805371k96410L74671J253554M4546j948420k689661
39745A8793577k573307l272318m852429n171494k102506L444947O865628L847955
$$ plain form
39737 14980053 10930660 1228505 -6829371 -8495574 -4878715 1290199 9425305 18534242
39729 18534242 24194577 22109367 13902906 6219193 3906704 6015020 8231551 7487732
39721 7487732 4475263 2998186 6104407 11681099 13442300 8025009 -769507 -7003486
39713 -7003486 -9522242 -10669800 -10542430 -7334418 -2460901 -310267 -2408422 -5717043
39705 -5717043 -6993978 -5325216 -775654 5211098 8386639 5446090 -857448 -5293727
39697 -5293727 -8162870 -13023065 -16518919 -9674318 7403790 21084449 20563879 11564865
39689 11564865 6779726 9148552 13296902 18157379 26848165 35816747 35748604 25250580
39681 25250580 14090459 9463270 7377820 2342644 -1980535 1133082 9579734 14598080
$$ packed form
39737A4980053m049393r702155q057876j666203L616859O168914Q135106R108937
39729A8534242N660335k085210q206461p683713k312489K108316K216531p43819
39721G487732l012469j477077L106221N576692J761201n417291q794516o233979
39713g003486k518756j147558J27370L208012M873517K150634k098155l308621
39705e717043j276935J668762M549562N986752L175541k940549o303538m436279
39697e293727k869143m860195l495854O844601J7078108J3680659n20570q999014
39689A1564865m785139K368826M148350M860477Q690786Q968582o8143j0498024
39681B5250580j1160121m627189k085450n035176m323179L113617Q446652N018346
$$ plain form
39673 14598080 13049959 10141651 9623012 8410020 4001891 1432010 6673450 15181159
39665 15181159 14114482 -1481026 -19559647 -23119319 -9684339 6342618 11008092
39658 11008092 5265313 -88623 1048655 5493267 8041411 7367241 4511115 546698
39650 546698 -2501691 -2144485 963555 2770644 1484333 789344 4442511 9920402 11417993
39641 11417993 8118376 5175245 6329589 9731125 12023308 12395509 10957690 7501518
39633 7501518 4356316 5640607 9924905 9041665 173069 -6184356 686976 14352641
39625 14352641 18631671 11505872 7864516 15220554 21285471 13997614 1103466 -2504596
39617 -2504596 2521684 4425947 1377030 2291641 8781129 11676687 6943868 1708800
$$ packed form
39673A4598080j548121k908308n18639j212992m408129k569881N241440Q507709
39665A5181159j066677j5595508j8078621l559672J3434980J6026957M665474
39658A1008092n742779n353936J137278M444612K548144o74170k856126l964417
39650E46698l048389L57206L108040J807089j286311o94989L653167N477891J497591
39641A1417993l299617k943131J154344L401536K292183L72201j437819l456172
39633G501518l145202J284291M284298q83240q868596o357425O871332J3665665
39625A4352641M279030p125799l641356P356038O064917p287857j2894148l608062
39617b504596N026280J904263l048917R14611O489488K895558m732819n235068
$$ plain form
39609 1708800 1558846 3623570 5827110 11943534 22558893 30297459 29137767 21112647
39601 21112647 10452168 -777737 -8172974 -5566057 5259147 13938836 15200833 14764912
39593 14764912 17322675 18293338 13460817 7428771 5336723 4614612 2350394 2610053
39585 2610053 8439902 14290935 14536592 12027308 10193301 5116012 -5240761 -12602817
39577 -12602817 -10082465 -4076404 -2462173 573759 13069126 25777546 22102640 4528261
39569 4528261 -7088575 -3963453 2273748 1327536 -1696400 -10327 1851824 -2590322
39561 -2590322 -10099951 -13644455 -11876613 -6224860 3446218 13761512 16222306 8217929
39553 8217929 -397281 924820 9866178 16309218 16741048 16219097 18390584 20782858
$$ packed form
39609A708800j49954K064724K203540O116424J0615359P738566j159692q025120
39601B1112647j0660479j1229905p395237K606917J0825204Q679689J261997m35921
39593A4764912K557763R70663m832521o032046k092048p22111k264218K59659
39585B610053N829849N851033K45657k509284j834007n077289j0356773p362056
39577a2602817K520352O006061J614231L035932J2495367J2708420l674906j7574379
39569D528261j1616836L125122O237201r46212l023936J686073J862151m442146
39561b590322p509629l544504J767842N651753R671078J0315294K460794q004377
39553H217929q615210J322101Q941358O443040M31830n21951K171487K392274
$$ plain form
39545 20782858 20213906 17733157 16547050 17302222 16977729 12928921 7849174 8123319 14815094
39536 14815094 19400065 13677525 2004627 -3289115 1373534 6322222 2966922 -4589685
39528 -4589685 -6474517 -291901 7505783 10514534 8443081 5676363 6586557 11782144
39520 11782144 17987214 21969777 23580192 23569967 20886018 15277091 9965526 7485570
39512 7485570 5658209 2821595 3432320 11079978 19117291 18033407 10842212 9941776
39504 9941776 17706476 22190641 15980376 7697175 7819590 12671841 11672204 4222169
39496 4222169 -186953 4044026 12359423 17163908 15968081 12354247 11438504 13979604
39488 13979604 14908549 10158196 3804442 3194913 7607041 9164615 5867588 4769825
$$ packed form
39545B0782858n68952k480749j186107P55172l24493m048808n079747K74145O691775
39536A4815094M584971n722540j1672898n293742M662649M948688l355300p556607
39528d589685j884832O182616P797684L008751k071453k766718R10194N195587
39520A1782144O205070L982563J610415j0225k683949n608927n311565k479956
39512G485570j827361k836614O10725P647658Q037313j083884p191195r00436
39504I941776P764700M484165o210265q283201J22415M852251r99637p450035
39496D222169m409122M230979Q315397M804485j195827l613834r15743K541100
39488A3979604R28945m750353o353754o09529M412128J557574l297027j097763
$$ plain form
39480 4769825 9088075 11491558 5980624 -1537810 -1700828 5356666 12460371 15530928
39472 15530928 14383702 8394080 -1095084 -7799532 -7225279 -3588717 -3710968 -7146935
39464 -7146935 -8765716 -7760687 -6789991 -4699917 2016686 11392817 16799229 15881507
39456 15881507 12865410 11356773 9669925 4336451 -4925973 -14310724 -18463669 -14985054
39448 -14985054 -7446016 -1676067 1250388 4049776 5245432 -136410 -9383729 -11284850
39440 -11284850 -2745526 3182908 -4694635 -17714336 -19290579 -8987809 -1016024 -2013209
39432 -2013209 -4994508 -4935615 -5428173 -7285462 -4545212 3397665 8341777 7896669 11207648
39423 11207648 22095938 28365174 19302788 4528509 1462198 9600296 12516062 4004113
$$ packed form
39480D769825M318250K403483n510934p518434j63018P057494P103705L070557
39472A5530928j147226n989622r489164o704448N74253L636562j22251l435967
39464g146935j618781J005029R70696K090074O716603R376131N406412r17722
39456A5881507l016097j508637j686848n333474r262424r384751m152945L478615
39448a4985054P539038N769949K926455K799388J195656n381842r247319j901121
39440a1284850Q539324N928434p877543j3019701j576243J0302770P971785r97185
39432b013209k981299N8893m92558j857289K740250P942877M944112m45108L310979
39423A1207648J0888290O269236r062386j4774279l066311Q138098K915766q511949
$$ plain form
39415 4004113 -3479176 -448 6350060 3442207 -5633449 -8447883 -2823380 1543657
39407 1543657 -55796 -556815 5742678 13112508 13639697 9396694 7552768 8176363 6070192
39398 6070192 2485900 4958940 14499079 22183396 21707345 17435344 15745705 15814451 14826150
39389 14826150 15678266 21538467 27097104 24134962 14207174 7550548 9234561 13845334
39381 13845334 15304670 14933507 16412851 18269988 16540555 12412359 12086644 18546891
39373 18546891 26842436 29524688 25196568 19059662 15296262 12633972 9358413 8503920
39365 8503920 12993606 18251782 16740490 9574242 5944610 9423541 12843008 10184121
39357 10184121 5470436 4327660 4101654 -106248 -5342385 -5345074 -1259940 852862 411492
$$ packed form
39415D004113p483289L478728O350508k907853r075656k814434N624503M367037
39407A543657j599453n01019O299493P369830N27189m243003j843926O23595k106171
39398F070192l584292K473040R540139P684317m76051m272001j689639O8746r88301
39389A4826150Q52116N860201N558637k962142r927788o656626J684013M610773
39381A3845334J459336l71163J479344J857137j729433m128196l25715O460247
39373A8546891Q295545K682252m328120o136906l763400k662290l275559q54493
39365H503920M489686N258176j511292p166248l629632L478931L419467k658887
39357A0184121m713685j142776k26006m207902n236137k689M085134K112802m41370
$$ plain form
39348 411492 1352283 2650064 -732326 -7518178 -9970575 -5613299 -697945 682142
39340 682142 3090200 11022223 20003350 22253018 17849089 14621985 17608757 22759636
39332 22759636 22469769 15598217 9648622 11735835 19057467 22056260 17074775 10564201
39324 10564201 8446611 7374427 1808163 -5171110 -5480907 1965262 10044699 13257514
39316 13257514 12436947 10182090 7538108 5247313 3468149 846481 -2000177 -472320
39308 -472320 7184989 14283822 14146160 11137944 14179054 21270568 21426982 12204965 3608246
39299 3608246 1877687 951481 -4766359 -9665177 -6560091 863344 3605835 72295
39291 72295 -4317373 -6162862 -5690984 -2497822 3527659 8885990 9793279 7525796 5902427
$$ packed form
39348D11492R40791J297781l382390o785852k452397M357276M915354J380087
39340F82142K408058P932023Q981127K249668m403929l227104K986772N150879
39332B2759636k89867o871552n949595K087213P321632K998793m981485o510574
39324A0564201k117590j072184n566264o979273l09797P446169Q079437L212815
39316A3257514q20567k254857k643982k290795j779164k621668k846658J527857
39308d72320P657309P098833j37662l008216L041110P091514J56414r222017q596719
39299C608246j730559r26206n717840m898818L105086P423435K742491l533540
39291G2295m389668j845489M71878L193162O025481N358331R07289k267483j623369
$$ plain form
39282 5902427 5158897 2847152 -699289 -2408994 -1297139 634953 2109640 4219053
39274 4219053 8317545 13847437 17685931 15309892 5031461 -8058632 -15705222 -15613520
39266 -15613520 -13240388 -12650217 -10716901 -4414315 1134137 -1494236 -10657832 -17299180
39258 -17299180 -17705307 -17760075 -22555189 -27690944 -25196704 -14801883 -4328520 410259
39250 410259 1452485 3165394 5161208 4629909 3286303 6140976 12822586 16078397
39242 16078397 11804825 5335766 3470581 5161680 5970376 7181307 12291573 17266729
39234 17266729 14087781 3801693 -3778474 -4970297 -6926234 -13933126 -18767676 -14016298
39226 -14016298 -4310587 326106 -2054478 -5988049 -8485405 -10319662 -9947075 -4201248
$$ packed form
39282E902427p43530k311745l546441j709705J111855J932092J474687K109413
39274D219053M098492N529892L838494k376039j0278431j3090093p646590R1702
39266a5613520K373132N90171J933316O302586N548452k628373r163596o641348
39258a7299180m06127n4768m795114n135755K494240J0394821J0473363M738779
39250D10259J042226J712909J995814n31299j343606K854673O681610L255811
39242A6078397m273572o469059j865185J691099Q08696J210931N110266M975156
39234A7266729l178948j0286088p580167j191823j955937p006892m834550M751378
39226a4016298R705711M636693k380584l933571k497356j834257L72587N745827
$$ plain form
39218 -4201248 4937734 10555899 8889844 3161230 -953838 -183932 5834741 14973905
39210 14973905 22492435 23353039 16505015 6258265 -1246646 -3136583 -1789341 -1476438
39202 -1476438 -2699103 -1556019 3723201 8483356 7752721 4132926 3827240 6374808
39194 6374808 5698834 1335141 218513 5284116 10520371 10693711 8114414 5702773
39186 5702773 1538102 -4317466 -5783984 -642462 2908636 -2107299 -9530093 -8927511
39178 -8927511 -1048190 5516118 8669713 12660990 16391647 14077832 7544813 6094479
39170 6094479 11703412 14682098 8043777 -2534767 -7986562 -7715223 -6299350 -4125334
39162 -4125334 1371581 7637421 7252969 -2580895 -15065505 -20818377 -18154837 -13568276
$$ packed form
39218d201248R138982N618165j666055n728614m115068P69906O018673R139164
39210A4973905P518530Q60604o848024j0246750p504911j889937J347242L12903
39202a476438j222665J143084N279220M760155p30635l619795l05686K547568
39194F374808o75974m363693j116628N065603N236255J73340k579297k411641
39186E702773m164671n855568j466518N141522L551098n015935p422794O02582
39178h927511P879321O564308L153595L991277L730657k313815o533019j450334
39170F094479N608933K978686o638321j0578544n451795K71339J415873K174016
39162d125334N496915O265840l84452r833864j2484610n752872K663540M586561
$$ plain form
39154 -13568276 -11995586 -10477483 -4631808 2085504 2296676 -3035852 -4807286 -256324
39146 -256324 2019013 -3435224 -8465737 -3463639 7347363 12668051 10708947 8129317
39138 8129317 6254659 341376 -8684078 -13319575 -11034014 -6761203 -3077981 2393552
39130 2393552 8553075 9542078 4369683 -523584 -533261 2738466 7293683 12539506 14498754
39121 14498754 8678872 -708401 -4124438 -1122106 -859219 -5726804 -6224752 3238074
39113 3238074 14853138 19792700 19553262 18284313 14074639 5554753 -2289784 -6754543
39105 -6754543 -12412806 -19371966 -17175106 -1123075 15121720 16235760 6922592 3105496
39097 3105496 7496845 9072972 3605896 -749103 1422512 5489116 6616477 6202423
$$ packed form
39154a3568276J572690J518103N845675O717312K11172n332528j771434M550962
39146b56324K275337n454237n030513N002098J0811002N320688j959104k579630
39138H129317j874658n913283r025454m635497K285561M272811L683222N471533
39130B393552O159523R89003n172395m893267r677L271727M555217N245823J959248
39121A4498754n819882r387273l416037L002332K62887m867585m97948R462826
39113C238074J1615064M939562k39438j268949m209674q519886p844537m464759
39105f754543n658263o959160K196860J6052031J6244795J114040r313168l817096
39097C105496M391349J576127n467076m354999K171615M066604J127361m14054
$$ plain form
39089 6202423 6449818 7281576 9746731 14553956 17201074 12719780 4965622 2881785
39081 2881785 7877318 13021626 13825639 11374565 6304348 -909253 -5132539 -2111676
39073 -2111676 2666427 1264502 -2773743 -306795 5736418 3903938 -4807306 -6894410
39065 -6894410 273759 3671814 -1142960 -445057 13050150 24311204 18731367 5421816
39057 5421816 1524919 5653462 4856219 -1132274 -1470807 5322291 10329659 10895021 12058160
39048 12058160 12932266 7179839 -3087187 -8300282 -7007787 -7212034 -11423570 -13422223
39040 -13422223 -11102814 -9522479 -9204786 -4327303 4616991 9070505 7027933 6913908
39032 6913908 12111550 13966849 6743289 -1659579 -1959058 2671461 3434198 -483286
$$ packed form
39089F202423K47395Q31758K465155M807225K647118m481294p754158k083837
39081B881785M995533N144308Q04013k451074n070217p213601m223286L020863
39073b111676M778103j401925m038245K466948O043213j832480q711244k087104
39065f894410P168169L398055m814774O97903J3495207J1261054n579837j3309551
39057E421816l896897M128543p97243n988493l38533O793098N007368N65362J163139
39048A2058160Q74106n752427j0267026n213095J292495k04247m211536j998653
39040a3422223K319409J580335L17693M877483Q944294M453514k042572j14025
39032F913908N197642J855299p223560q402868k99479M630519P62737l917484
$$ plain form
39024 -483286 -3118252 -1387547 2888516 6182744 4101019 -5305836 -15181826 -14073670
39016 -14073670 -1614607 7530348 1840549 -11848447 -18518833 -14100906 -6386536 -1957991
39008 -1957991 -1005596 -2269389 -5146725 -7773669 -8279866 -6710822 -2893656 3727679
39000 3727679 9219669 6296327 -4750049 -12619718 -8859575 710703 5335014 4065781
38992 4065781 2971810 3167036 1422000 -962375 217405 3738012 5227794 5736973
38984 5736973 9106233 12621340 9723311 1279663 -4884656 -5505403 -4376695 -3562486
38976 -3562486 -999430 2520207 2666775 -556383 -1917455 466969 2584343 1788887
38968 1788887 -49222 -1478522 -2764476 -1783887 3867155 9742425 7590267 -2327592
$$ packed form
39024d83286k634966J730705M276063L294228k081725r406855r875990J108156
39016a4073670J2459063R144955n689799j3688996o670386M417927P714370M428545
39008a957991R52395j263793k877336k626944n06197J569044L817166O621335
39000C727679N491990k923342j1046376p869669L760143R570278M624311j269233
38992D065781j093971J95226j745036k384375J179780L520607J489782N09179
38984E736973L369260L515107k898029q443648o164319o20747J128708Q14209
38976c562486K563056L519637J46568l223158j361072K384424K117374p95456
38968A788887j838109j429300j285954R80589N651042N875270k152158r917859
$$ plain form
38960 -2327592 -9450561 -6302504 2753172 8708046 7840313 2067375 -4818387 -8744430
38952 -8744430 -8170932 -7068223 -10425305 -16312964 -17995572 -13960179 -9142356 -5971952
38944 -5971952 -1915400 3167969 5561736 5376485 7210016 10649310 8885950 467986
38936 467986 -5943792 -3232236 4946482 11015985 12730344 11320085 7366015 3329476
38928 3329476 3859643 8779674 11433714 8090200 3153609 1406978 1455940 557506 -652823
38919 -652823 -1742207 -3820618 -4482357 207343 5890165 2811091 -6959963 -7775948 6322766
38910 6322766 19189127 14617590 -176180 -6912620 -3483165 -2951501 -10241642 -16181736
38902 -16181736 -14274223 -9329344 -7391894 -7832539 -7727828 -5975309 -1743372 4591638
$$ packed form
38960b327592p122969L148057R055676N954874q67733n772938o885762l926043
38952h744430N73498J102709l357082n887659j682608M035393M817823L170404
38944e971952M056552N083369K393767j85251J833531L439294j763360q417964
38936D67986o411778K711556Q178718O069503J714359j410259l954070m036539
38928C329476N30167M920031K654040l343514m936591j746631M8962q98434j210329
38919f52823j089384k078411o61739M689700N682822l079074r771054q15985J4098714
38910F322766J2866361m571537j4793770o736440L429455N31664p290141n940094
38902a6181736J907513M944879J937450m40645J04711J752519M231937O335010
$$ plain form
38894 4591638 8890184 7261773 1287790 -5624261 -13184945 -19494350 -17415919 -4904881
38886 -4904881 6419963 4298714 -6471030 -11283874 -7258725 -3990772 -4812582 -2691330
38878 -2691330 3794723 5356292 -2602690 -11821764 -13696383 -9835294 -5590828 -2465874
38870 -2465874 -1087726 -2671394 -3844485 778794 7652167 6235846 -4191048 -10750424
38862 -10750424 -5296954 4700609 10100302 13094804 17286988 16057244 3259111 -12346721
38854 -12346721 -16640179 -9510048 -2364991 294179 3885230 9309640 8785565 -502740
38846 -502740 -8832882 -5874844 5536012 12853548 8631306 -1572730 -5723702 1253958
38838 1253958 11051791 10965596 -144856 -9117898 -4867121 7104255 12502210 7313766
$$ packed form
38894D591638M298546j628411n973983o912051p560684o309405K078431J2511038
38886d904881J1324844k121249j0769744m812844M025149L267953q21810K121252
38878b691330O486053J561569p958982r219074j874619L861089M244466L124954
38870b465874J378148j583668j173091M623279O873373j416321j0426894o559376
38862a0750424N453470R997563N399693K994502M192184j229744j2798133j5605832
38854a2346721m293458P130131P145057K659170L591051N424410n24075r288305
38846e02740q330142K958038J1410856P317536m222242j0204036m150972O977660
38838A253958R797833q6195j1110452q973042M250777J1971376N397955n188444
$$ plain form
38830 7313766 1039137 1388406 4617705 4330312 2553929 5795111 13850181 19406278
38822 19406278 18359326 14777551 13946083 14998972 13890660 10907646 10478733 13715662
38814 13715662 15653351 11811332 4405544 -452568 329387 5040582 10420867 14181956
38806 14181956 15771170 16894521 19688348 22447359 19863828 10442862 623059 -2724098
38798 -2724098 -1260451 -1504852 -4393961 -4960761 -1840735 -297054 -4179093 -10073170
38790 -10073170 -11752043 -7386260 -1280569 -450603 -8287824 -18825469 -20238283 -8966407
38782 -8966407 2915807 1514795 -10282054 -16879291 -11288753 -1957062 2278225 2611224
38774 2611224 2429433 279786 -3473373 -2467919 6078331 15207350 18472569 19208913
$$ packed form
38830G313766o274629L49269L229299k87393j776383L241182Q055070N556097
38822A9406278j046952l581775q31468J052889j108312k983014m28913L236929
38814A3715662J937689l842019p405788m858112P81955M711195N380285L761089
38806A4181956J589214J123351K793827K759011k583531r420966r819803l347157
38798b724098J463647k44401k889109n66800L120026J543681l882039n894077
38790a0073170j678873M365783O105691Q29966p837221j0537645j412814J1271876
38782h966407J1882214j401012j1796849o597237N590538R331691M235287L32999
38774B611224j81791k149647l753159J005454Q546250R129019L265219P36344
$$ plain form
38766 19208913 22526536 25312095 22593538 17432960 14925092 11609965 1676028 -9598065
38758 -9598065 -10345103 -19191 7666480 2108353 -11716215 -20857936 -18360519 -7078491
38750 -7078491 5258261 11756395 10508777 5551785 2211020 1350794 352610 -1226889
38742 -1226889 -686121 3277152 8827117 14193517 18935422 21136522 17254370 7412713
38734 7412713 -1401311 -910475 9160341 19480193 20677268 13763510 8196650 9080995
38726 9080995 10703864 6217694 -741775 -1033199 5575359 9655554 6441557 2032747
38718 2032747 2367895 4472293 3630457 1934828 3288670 5460194 3859088 -619756
38710 -619756 -3452727 -3102801 -1092036 1021522 742490 -4656450 -12235589 -13702021 -6639839
$$ packed form
38766A9208913L317623K785559k718557n160578k507868l315127r933937j1274093
38758i598065p47038J0325912P685671n558127j3824568r141721K497417J1282028
38750g078491J2336752O498134j247618m956992l340765q60226r98184j579499
38742a226889N40768L963273N549965N366400M741905K201100l882152r841657
38734G412713q814024M90836J0070816J0319852J197075o913758n566860Q84345
38726I080995J622869m486170o959469k91424O608558M080195l213997m408810
38718B032747L35148K104398q41836j695629J353842K171524j601106m478844
38710f19756k832971L49926K010765K113558k79032n398940p579139j466432P062182
$$ plain form
38701 -6639839 673660 1389393 -209817 1327361 942133 -7635210 -17019032 -14050201
38693 -14050201 -300 10344499 9650571 5576954 5741274 6981262 3545454 -3422802
38685 -3422802 -9138043 -11100626 -8597386 -2305053 3434587 3662748 -627178 -4575151
38677 -4575151 -7755310 -13137431 -18274369 -16776093 -9692155 -5729994 -7627305 -7965416
38669 -7965416 -2292698 3002987 1179546 -4563969 -6992597 -4427901 596530 5974225
38661 5974225 8730869 5538607 -966054 -3018340 761416 2156972 -3423717 -9039130
38653 -9039130 -8241056 -6346235 -10504840 -15694009 -11729449 -13723 7682852 5395032
38645 5395032 -1375625 -4998686 -2574399 5166317 13856060 15666004 7467499 -2217301
$$ packed form
38701f639839P313499P15733j599210J537178l85228q577343r383822K968831
38693a4050201J4049901J0344799o93928m073617J64320J239988l435808o968256
38685c422802n715241j962583K503240O292333N739640K28161m289926l947973
38677d575151l180159n382121n136938J498276P083938L962161j897311l38111
38669g965416N672718N295685j823441n743515k428628K564696N024431N377695
38661E974225K756644l192262o504661k052286L779756J395556n580689n615413
38653i039130P98074J894821m158605n189169L964560J1715726P696575k287820
38645E395032o770657l623061K424287P740716Q689743J809944q198505r684800
$$ plain form
38637 -2217301 -2375532 5515344 10270372 7822655 5080734 6019953 4986268 -1825521
38629 -1825521 -7704130 -4827974 4186348 10816545 12158908 11623817 11396341 10407425 8187549
38620 8187549 5419130 1308203 -5190895 -11653638 -13413138 -9015687 -1818949 4230736
38612 4230736 8211321 11172788 13494360 14420946 13268305 10053690 5151243 -847713
38604 -847713 -6565991 -9839947 -9495069 -7010111 -4707702 -1949343 4298331 13563129
38596 13563129 19522081 16916972 8760042 2429458 -80677 -2861016 -7326877 -8889568
38588 -8889568 -4343131 2717657 6874313 6938696 4117054 -893137 -4705917 -396963
38580 -396963 13205777 24648555 20662796 3390528 -11186790 -13077770 -8418054 -6881557
$$ packed form
38637b217301j58231P890876M755028k447717k741921R39219j033685o811789
38629a825521n878609K876156R014322O630197J342363n35091k27476r88916k219876
38620H187549k768419m110927o499098o462743j759500M397451P196738O049685
38612D230736L980585K961467K321572R26586j152641l214615m902447n998956
38604h47713n718278l273956L44878K484958K302409K758359O247674R264798
38596A3563129N958952k605109q156930o330584k510135k780339m465861j562691
38588h889568M546437P060788M156656O4383k821642n010191l812780M308954
38580c96963J3602740J1442778l985759j7272268j4577318j890980M659716J536497
$$ plain form
38572 -6881557 -7378947 -2875974 6297620 12508634 12394584 10867876 13057810 17928736
38564 17928736 21025727 19232308 12069381 2396190 -3650314 -2008446 2990052 2522289
38556 2522289 -4860240 -10607434 -8305671 -2935125 -3138871 -8712982 -12353711 -11446744
38548 -11446744 -10814562 -13590883 -15980548 -13278256 -6264449 1115959 6879629 10901607
38540 10901607 12292432 10099851 5604761 1557718 -557783 -1166999 -1014052 -123156
38532 -123156 1643417 3395935 2820137 -1960320 -9071649 -12848464 -9679817 -3344238
38524 -3344238 -1243140 -4908984 -7899146 -4730691 1633212 4127497 697734 -4745304
38516 -4745304 -8950366 -12533703 -16411805 -18936419 -18098020 -14088785 -8387005 -2496828
$$ packed form
38572f881557m97390M502973R173594O211014j14050j526708K189934M870926
38564A7928736L096991j793419p162927r673191o046504J641868M998498m67763
38556B522289p382529n747194K301763N370546k03746n574111l640729R06967
38548a1446744O32182k776321k389665K702292P013807P380408N763670M021978
38540A0901607J390825k192581m495090m047043k115501o09216J52947Q90896
38532a23156J766573J752518n75798m780457p111329l776815L168647O335579
38524c344238K101098l665844k990162L168455O363903K494285l429763n443038
38516d745304m205062l583337l878102k524614Q38399M009235N701780N890177
$$ plain form
38508 -2496828 1282857 635460 -3068188 -4469432 -846165 3115955 1572043 -2872639
38500 -2872639 -1941573 5150485 8415316 985185 -9965583 -12983202 -8677667 -7358391
38492 -7358391 -11839914 -12847737 -4066897 7343136 10634149 5137671 -2217490 -7732372
38484 -7732372 -11843218 -12664924 -7089157 1995768 6855466 4925763 2429809 5825995
38476 5825995 13304564 17080141 12169913 1392033 -7479307 -9193703 -6094733 -4921604
38468 -4921604 -8341525 -12016248 -11048310 -5945485 -3007 5596190 10939250 15143218
38460 15143218 18397963 22488518 25700886 22254541 11907106 4355056 6713238 12033964
38452 12033964 9716366 2628622 1978258 7972267 9558357 3700839 309282 4549849
$$ packed form
38508b496828L779685o47397l703648j401244L623267L962120j543912m444682
38500b872639R31066P092058L264831p430131j0950768l017619M305535J319276
38492g358391m481523j007823Q780840J1410033L291013n496478p355161n514882
38484g732372m110846q21706N575767R084925M859698j929703k495954L396186
38476E825995P478569L775577m910228j0777880q871340j714396L098970J173129
38468d921604l419921l674723R67938N102825N942478N599197N343060M203968
38460A5143218L254745M090555L212368l446345j0347435p552050K358182N320726
38452A2033964k317598p087744o50364N994009J586090n857518l391557M240567
$$ plain form
38444 4549849 8356133 5590791 2532611 4961861 6625444 1044538 -5003618 -1898944
38436 -1898944 6174125 7714596 2244381 -672022 1642885 1526641 -5194343 -12641100
38428 -12641100 -14256748 -10652903 -6059891 -3275400 -3483198 -5711621 -5906050 -1457892
38420 -1457892 3674194 3459119 -1511855 -5413723 -6062224 -5989560 -5588035 -2458334 2253457
38411 2253457 4175245 3384129 4783555 9235114 11084464 6918070 791439 -1940643
38403 -1940643 -848988 1777250 4280011 4566615 851981 -3962526 -3492288 3759016
38395 3759016 11495636 13495129 10092868 4745334 -821330 -5055758 -5097991 -867453
38387 -867453 2936497 2535198 -99544 -867830 1071995 3814564 5028428 1673574 -8031552
$$ packed form
38444D549849L806284k765342l058180K429250J663583n580906o048156L104674
38436a898944Q073069J540471n470215k916403K314907j16244o720984p446757
38428a2641100j615648L603845M593012K784491k07798k228423j94429M448158
38420a457892N132086k15075m970974l901868o48501P2664M01525L129701M711791
38411B253457J921788p91116J399426M451559J849350m166394o126631k732082
38403a940643J091655K626238K502761K86604l714634m814507M70238P251304
38395C759016P736620J999493l402261n347534n566664m234428m2233M230538
38387h67453L803950m01299k634742p68286J939825K742569J213864l354854r705126
$$ plain form
38378 -8031552 -19334071 -22381038 -13133808 826617 9242236 10194221 8450259 7259685
38370 7259685 6699568 6334888 4388656 -1982581 -10390618 -11978407 -3497542 4106667
38362 4106667 -1278279 -14339882 -18191910 -8397564 1504902 1589097 -192914 6934327
38354 6934327 17627430 18051596 7048081 -2305172 -1199616 5330361 8811428 8296951
38346 8296951 7262153 6431671 4780704 3490827 3961903 4041927 131427 -8174043 -18077504
38337 -18077504 -26378766 -29851733 -25538527 -14643642 -4441210 -1810768 -5388250 -8119320
38329 -8119320 -6832412 -4383297 -2528984 1093400 7136623 11961917 14391840 19151398
38321 19151398 28197044 33559975 26202366 9377596 -4578045 -9742671 -10872005 -11902283
$$ packed form
38378h031552j1302519l046967R247230J3960425Q415619R51985j743962j190574
38370G259685n60117l64680j946232o371237q408037j587789Q480865P604209
38362D106667n384946j3061603l852028R794346R902466Q4195j782011P127241
38354F934327J0693103M24166j1003515r353253J105556O529977L481067n14477
38346H296951j034798q30482j650967j289877M71076Q0024l910500q305470r903461
38337a8077504q301262l472967M313206J0894885J0202432K630442l577482k731070
38329h119320J286908K449115J854313L622384O043223M825294K429923M759558
38321A9151398R045646N362931p357609j6824770j3955641n164626j129334j030278
$$ plain form
38313 -11902283 -9296228 -399723 9421713 13880251 14535391 16123104 17349286 13726813
38305 13726813 7226580 4983591 8098296 9155875 3259105 -4574016 -6794577 -3585474
38297 -3585474 -1103721 -2188267 -3706275 -2189637 2405024 8952030 17253185 26214701
38289 26214701 32526669 33185849 28078332 19012906 8020235 -1995560 -7275698 -6766994
38281 -6766994 -4397894 -4729688 -7266443 -8672473 -9716096 -14478947 -21538781 -22414104
38273 -22414104 -13179533 -2587235 -2144749 -10853113 -16907015 -13632291 -6324380 -2394710
38265 -2394710 -2161533 -2383934 -2424505 -2325249 231541 5677697 8832355 5047891 -2174614
38256 -2174614 -5218967 -2647613 -33075 -1104476 -3739844 -5548253 -7968427 -12123216
$$ packed form
38313a1902283K606055Q896505R821436M458538O55140J587713J226182l622473
38305A3726813o500233k242989L114705J057579n896770p833121k220561L209103
38297c585474K481753j084546j518008J516638M594661O547006Q301155Q961516
38289B6214701O311968O59180n107517r065426j0992671j0015795n280138N08704
38281f766994K369100l31794k536755j406030j043623m762851p059834q75323
38273b2414104R234571J0592298M42486q708364o053902L274724P307911L929670
38265b394710K33177k22401m0571R9256K556790N446156L154658l784464p222505
38256b174614l044353K571354K614538j071401k635368j808409k420174m154789
$$ plain form
38248 -12123216 -14366994 -9673258 1479148 11855041 13489700 5074292 -6110549 -10439441
38240 -10439441 -5445736 1920118 4157451 2380387 3260539 8402881 12032352 9810233
38232 9810233 4526373 586043 -2433512 -6790780 -10478552 -8853893 -1102929 8613406
38224 8613406 15547952 16849772 11353743 1297487 -6349227 -5289497 2226229 7228983
38216 7228983 5500730 2861139 5826070 11024318 9537712 376564 -6794770 -4362053
38208 -4362053 2731380 3353886 -5292976 -14263732 -14089874 -5378992 3541436 6595702
38200 6595702 4619354 1490164 -801856 -2370674 -3025053 -1442805 3558021 11414043
38192 11414043 19089187 22221414 18462477 10279971 3293752 1140072 2975862 6340175
$$ packed form
38248a2123216k243778M693736J1152406J0375893J634659q415408j1184841m328892
38240a0439441M993705P365854K237333j777064Q80152N142342L629471k222119
38232I810233n283860l940330l019555m357268l687772J624659P750964R716335
38224H613406O934546J301820n496029j0056256p646714J059730P515726N002754
38216G228983j728253k639591K964931N198248j486606r161148p171334K432717
38208d362053P093433O22506q646862q970756J73858Q710882Q920428L054266
38200F595702j976348l129190k292020j568818o54379J582248N000826P856022
38192A1414043P675144L132227l758937q182506o986219k153680J835790L364313
$$ plain form
38184 6340175 10364333 14554353 16418583 13486773 7434226 3249144 3477301 5541971
38176 5541971 5934781 5079602 6121175 9845038 12834376 11070382 4501623 -2571811
38168 -2571811 -5912198 -6016367 -7328779 -11984372 -15872375 -13383817 -5446074 426474
38160 426474 -1265183 -8281068 -14330348 -15180496 -9942589 -540704 7426207 7544968 382289
38151 382289 -5194212 -3145173 1138825 -496746 -5566402 -4979939 1628236 5413655
38143 5413655 3834974 4796534 11394551 14538668 8286483 1580563 3790564 7481127
38135 7481127 -177492 -14103732 -15826413 -1151573 12479072 10278567 -1887639 -10090797
38127 -10090797 -10852050 -8334504 -2925740 6158985 12628450 8571272 -3858718 -14548521
$$ packed form
38184F340175M024158M190020J864230k931810o052547m185082K28157K064670
38176E541971L92810q55179J041573L723863K989338j763994o568759p073434
38168b571811l340387j04169j312412m655593l888003K488558P937743N872548
38160D26474j691657p015885o049280q50148N237907R401885P966911J18761p162679
38151C82289n576501K049039M283998j635571n069656N86463O608175L785419
38143E413655j578681R61560O598017L144117o252185o705920K210001L690563
38135G481127p658619j3926240j722681J4674840J3630645k200505j2166206q203158
38127a0090797p61253K517546N408764R084725O469465m057178j2429990j0689803
$$ plain form
38119 -14548521 -17635152 -14904184 -9627888 -4444514 -3116181 -6378588 -7567655 -759962
38111 -759962 7804160 6046682 -5518006 -11953601 -3913690 9804434 15119397 10251441
38103 10251441 3487851 -595975 -4171882 -8215730 -9635599 -6585899 -1073962 4565719
38095 4565719 9991173 14975083 17860726 16447055 9459742 -1607008 -11145667 -12850415
38087 -12850415 -6931647 -959392 -279160 -765565 4458280 14015330 19841433 18106477
38079 18106477 12236708 5713999 -1131593 -6311294 -5478098 894378 5574437 3834920
38071 3834920 90031 1100962 6331200 9611006 7786666 3508994 1224003 3592403
38063 3592403 9594586 13216306 7329580 -7018851 -18486291 -17632706 -8172573 -262949
$$ packed form
38119a4548521l086631K730968N276296N183374J328333l262407j189067O807693
38111g59962Q564122j757478j1564688o435595Q039911J3718124N314963m867956
38103A0251441o763590m083826l575907m043848j419869L049700N511937N639681
38095D565719N425454M983910K885643j413671o987313j1066750r538659j704748
38087a2850415N918768N972255O80232m86405N223845R557050N826103j734956
38079A8106477n869769o522709o845592n179701Q33196O372476M680059j739517
38071C834920l744889J010931N230238L279806j824340m277672k284991K368400
38063C592403O002183L621720n886726j4348431j1467440Q53585R460133P909624
$$ plain form
38055 -262949 3755997 8328789 11698080 5801135 -8327751 -16648283 -10514396 -3746
$$ packed form
38055b62949M018946M572792L369291n896945j4128886q320532O133887J0510650
$$ [...]
##END NTUPLES=NMR SPECTRUM
##END=
