##TITLE=31Pdec_2PBP507
 CDCl3, 24 sc
 5.7.2019
##JCAMPDX= 6.0         $$ Bruker NMR JCAMP-DX V2.0
##DATA TYPE= NMR SPECTRUM
##DATA CLASS= NTUPLES
##ORIGIN= UXNMR, Bruker Analytische Messtechnik GmbH
##OWNER= root
$$ XWIN-NMR		Version 3.5
$$ Fri Jul  5 16:25:04 2019 Russian Standard Time (UT+4h)  she@DPX200
##.OBSERVE FREQUENCY= 81.013821
##.OBSERVE NUCLEUS= ^31P
##.ACQUISITION MODE= SIMULTANEOUS
##.ACQUISITION SCHEME= undefined
##.AVERAGES= 24
##.DIGITISER RES= 17
##SPECTROMETER/DATA SYSTEM= spect
##.PULSE SEQUENCE= zgpg30
##.SOLVENT NAME= DMSO
##.SHIFT REFERENCE= (INTERNAL, DMSO, 0, 182.463)
##AUDIT TRAIL= $$ (NUMBER, WHEN, WHO, WHERE, WHAT)
$$ ##TITLE= Audit trail, XWIN-NMR		Version 3.5
$$ ##JCAMPDX= 5.01
$$ ##ORIGIN= Bruker BioSpin GmbH
$$ ##OWNER= she
$$ F:/spectra/data/she/nmr/P31/1/pdata/1/auditp.txt
$$ ##AUDIT TRAIL=  $$ (NUMBER, WHEN, WHO, WHERE, WHAT)
(   1,<2019-07-05 16:24:13.00 +0400>,<she>,<DPX200>,
      <created by zg, POWCHK disabled, PULCHK disabled
       configuration hash MD5:
       00 E9 B6 7A A2 85 ED C7 34 08 36 98 17 FE 4E 26
       data hash MD5: 32K
       6B D3 23 89 46 E8 18 20 ED AD 8A E6 CA C3 D0 00>)
(   2,<2019-07-05 16:24:15.56 +0400>,<she>,<DPX200>,
      <Start of raw data processing
       efp BC_mod = 2 LB = 1 FT_mod = 6 PKNL = 1 PHC0 = -3071.59 PHC1 = 551.5988 SI = 64K 
       data hash MD5: 64K
       E1 91 20 9A 43 AE 38 F5 29 59 92 7B 5D 04 15 B7>)
(   3,<2019-07-05 16:24:30.59 +0400>,<she>,<DPX200>,
      <pk PHC0 = 173.7771 PHC1 = -466.1999 
       data hash MD5: 64K
       5B 41 0F 30 76 0F 65 C0 D1 B0 89 42 E2 9F 16 DB>)
(   4,<2019-07-05 16:24:33.34 +0400>,<she>,<DPX200>,
      <abs ABSG = 5 
       data hash MD5: 64K
       D8 D8 0E B3 0C 57 DA 2C E9 80 E9 36 E0 7B A7 14>)
$$ ##END=
$$ 
$$ hash MD5
$$ A3 95 81 3B 55 2A 7C 61 9C 7C 93 3D 0B A7 93 E4
##$RELAX= 
##$RELAX= 
##$RELAX= 
##$RELAX= 
##$RELAX= 
##$RELAX= 
##$RELAX= 
##$RELAX= 
$$ Bruker specific parameters
$$ --------------------------
##$DU= <F:/spectra>
##$EXPNO= 1
##$NAME= <P31>
##$PROCNO= 1
##$TYPE= <nmr>
##$USER= <she>
##$AMP= (0..31)
100 100 100 100 100 100 100 100 100 100 100 100 100 100 100 100 100 100 
100 100 100 100 100 100 100 100 100 100 100 100 100 100 
##$AQSEQ= 0
##$AQ_mod= 1
##$AUNM= <au_zg>
##$AUTOPOS= <>
##$BF1= 81.014009
##$BF2= 200.13
##$BF3= 200.13
##$BF4= 200.13
##$BF5= 200.13
##$BF6= 200.13
##$BF7= 200.13
##$BF8= 200.13
##$BYTORDA= 1
##$CFDGTYP= 0
##$CFRGTYP= 5
##$CHEMSTR= <none>
##$CNST= (0..31)
1 1 145 1 1 1 1 1 1 1 1 1 1 1 1 1 1 1 1 1 1 1 1 1 1 1 1 1 1 1 1 1 
##$CPDPRG= <waltz16>
##$CPDPRG1= <>
##$CPDPRG2= <waltz16>
##$CPDPRG3= <>
##$CPDPRG4= <mlev>
##$CPDPRG5= <mlev>
##$CPDPRG6= <mlev>
##$CPDPRG7= <mlev>
##$CPDPRG8= <mlev>
##$CPDPRGB= <>
##$CPDPRGT= <>
##$D= (0..31)
0 1 0 0 0 0 0 0 0 0 0 0.03 2e-05 3e-06 0 0 0 0 0 0 0 0 0 0 0 0 0 0 0 0 
0 0 
##$DATE= 1562329452
##$DBL= (0..7)
120 120 120 11 120 120 24 19 
##$DBP= (0..7)
150 150 150 150 150 150 150 150 
##$DBP07= 0
##$DBPNAM0= <>
##$DBPNAM1= <>
##$DBPNAM2= <>
$$ [...]
##$SUBNAM3= <"">
##$SUBNAM4= <"">
##$SUBNAM5= <"">
##$SUBNAM6= <"">
##$SUBNAM7= <"">
##$SUBNAM8= <"">
##$SUBNAM9= <"">
##$SW= 369.568048894756
##$SWIBOX= (0..15)
0 1 3 0 0 0 0 0 0 0 0 0 0 0 0 0 
##$SW_h= 29940.119760479
##$TD= 32768
##$TD0= 1
##$TE= 0
##$TE2= 300
##$TE3= 300
##$TEG= 300
##$TL= (0..7)
0 120 53 12 22 120 120 120 
##$TP= (0..7)
150 150 150 150 150 150 150 150 
##$TP07= 0
##$TPNAME0= <>
##$TPNAME1= <>
##$TPNAME2= <>
##$TPNAME3= <>
##$TPNAME4= <>
##$TPNAME5= <>
##$TPNAME6= <>
##$TPNAME7= <>
##$TPOAL= (0..7)
0.5 0.5 0.5 0.5 0.5 0.5 0.5 0.5 
##$TPOFFS= (0..7)
0 0 0 0 0 0 0 0 
##$TUNHIN= 0
##$TUNHOUT= 0
##$TUNXOUT= 0
##$USERA1= <user>
##$USERA2= <user>
##$USERA3= <user>
##$USERA4= <user>
##$USERA5= <user>
##$V9= 5
##$VALIST= <valist>
##$VCLIST= <CCCCCCCCCCCCCCC>
##$VD= 0
##$VDLIST= <DDDDDDDDDDDDDDD>
##$VPLIST= <PPPPPPPPPPPPPPP>
##$VTLIST= <TTTTTTTTTTTTTTT>
##$WBST= 1024
##$WBSW= 4
##$XGAIN= (0..3)
0 0 0 0 
##$XL= 0
##$YL= 0
##$YMAX_a= 52533
##$YMIN_a= -69743
##$ZGOPTNS= <>
##$ZL1= 120
##$ZL2= 120
##$ZL3= 120
##$ZL4= 120
##$ABSF1= 182.463
##$ABSF2= -187.1042
##$ABSG= 5
##$ABSL= 3
##$ALPHA= 0
##$AQORDER= 0
##$ASSFAC= 0
##$ASSFACI= 0
##$ASSFACX= 0
##$ASSWID= 0
##$AUNMP= <proc_1d>
##$AZFE= 0.1
##$AZFW= 0.5
##$BCFW= 0
##$BC_mod= 2
##$BYTORDP= 0
##$COROFFS= 0
##$CY= -3
##$DATMOD= 1
##$DC= 0
##$DFILT= <>
##$DTYPP= 0
##$F1P= 0
##$F2P= 0
##$FCOR= 1
##$FTSIZE= 65536
##$FT_mod= 6
##$GAMMA= 0
##$GB= 0
##$INTBC= 1
##$INTSCL= 5.30512e-09
##$ISEN= 30
##$LB= 1
##$LEV0= 0
##$LPBIN= 0
##$MAXI= 10000
##$MC2= 0
##$MEAN= 0
##$ME_mod= 0
##$MI= 50
##$NCOEF= 0
##$NC_proc= -4
##$NLEV= 6
##$NOISF1= 182.463
##$NOISF2= 159.3651
##$NSP= 0
##$NTH_PI= 0
##$NZP= 0
##$OFFSET= 182.463
##$PC= 4
##$PHC0= -2897.813
##$PHC1= 85.39893
##$PH_mod= 1
##$PKNL= yes
##$PPARMOD= 0
##$PSCAL= 0
##$PSIGN= 0
##$REVERSE= no
##$SF= 81.0140089999434
##$SI= 65536
##$SIGF1= 159.3651
##$SIGF2= -187.1042
##$SINO= 113.3802
##$SIOLD= 16384
##$SREGLST= <1H.CDCl3>
##$SSB= 0
##$STSI= 65536
##$STSR= 0
##$SW_p= 29940.119760479
##$SYMM= 0
##$S_DEV= 0
##$TDeff= 32768
##$TDoff= 0
##$TI= <>
##$TILT= no
##$TM1= 0
##$TM2= 0
##$TOPLEV= 0
##$USERP1= <user>
##$USERP2= <user>
##$USERP3= <user>
##$USERP4= <user>
##$USERP5= <user>
##$WDW= 1
##$XDIM= 65536
##$YMAX_p= 305988027
##$YMIN_p= -2361616
$$ End of Bruker specific parameters
$$ ---------------------------------
##NTUPLES= NMR SPECTRUM
##VAR_NAME=  FREQUENCY,     SPECTRUM/REAL,   SPECTRUM/IMAG
##SYMBOL=    X,             R,               I
##VAR_TYPE=  INDEPENDENT,   DEPENDENT,       DEPENDENT
##VAR_FORM=  AFFN,          ASDF,            ASDF
##VAR_DIM=   65536,         65536,           65536
##UNITS=     HZ,            ARBITRARY UNITS, ARBITRARY UNITS
##FACTOR=    0.456856943014862, 1,           1
##FIRST=     14782.0589164792, 0,            0
##LAST=      -15158.0608439998, 0,           0
##MIN=       -15158.0608439998, -2361616,    0
##MAX=       14782.0589164792, 305988027,    0
$$ Real data points
##PAGE= N=1
##DATA TABLE= (X++(R..R)), XYDATA
$$ [...]
40854B14951J44844J12500J14682P3460p4463j95211j49569k1680M3995Q0500
$$ 214951 359795 472295 586977 660437 585974 390763 241194 219514 263509 344009
40844C44009J47850J09960j43388l67380k01731K72411N37302K72985k58131n58353
$$ 344009 491859 601819 458431 91051 -110680 161731 699033 972018 713887 155534
40834A55534m47682j67843m2950j24325j59599P0571L98173M03602j3320m09311
$$ 155534 -292148 -459991 -502941 -627266 -786865 -716294 -318121 85481 72161 -337150
40824c37150l46739K3122K17038J13448J3286O7149P5073o9219j47970j4056J31361
$$ -337150 -683889 -660767 -443729 -330281 -316995 -249846 -174773 -243992 -391962 -406018 -274657
40813b74657R0432K023M7143Q1667r3413k92984j92175Q5922Q7123k29542l33321
$$ -274657 -184225 -182202 -135059 -53392 -146805 -439789 -631964 -546042 -458919 -688461 -1021782
40802a021782Q8516N88822N60255R5174k02809j29362p9638k79865l47075Q4250
$$ -1021782 -933266 -344444 215811 310985 108176 -21186 -100824 -380689 -727764 -643514
40792f43514O76119P66468K66882k46776l09824n5134J23360N5301j69949l74355
$$ -643514 32605 799073 1065955 819179 509355 454221 577581 632882 462933 88578
40782H8578l63245n6469L21335L98927J41739m5474J38700M66099M98177J43293
$$ 88578 -274667 -331136 -9801 389126 530865 485391 624091 1090190 1588367 1731660
40772A731660l21837o13251n86425k01975L46949N91604K26815m18836o74492
$$ 1731660 1409823 796572 210147 8172 355121 946725 1173540 754704 80212
40763H0212l33604J21908J87389n9973j92735m7723J43360J53953M0587l5239
$$ 80212 -253392 -131484 55905 -4068 -196803 -244526 -101166 52787 93374 58135
40753E8135p9867j98807l21756k19917J17791L37393J69390j23132p2842K75000
$$ 58135 -21732 -220539 -542295 -762212 -644421 -307028 -137638 -260770 -333612 -58612
40743e8612L89379O5998k48540j68431L9068n6825l34240l63346j09659J16209
$$ -58612 330767 396765 148225 -20206 18862 -37963 -372203 -735549 -845208 -728999
40733g28999K31441L69278M21682J73768j63552j77109j4157k25375p24034o83766
$$ -728999 -497558 -128280 293402 467170 303618 126509 112352 -113023 -837057 -1520823
40723a520823J74595R40537P34161l1541l31000k6947J61490l7666j21998J39800
$$ -1520823 -1346228 -405691 328470 296929 -34071 -61018 100472 62806 -59192 80608
40713H0608K34892j66704n37307k87227K64084L45914j08765m18445j98781J63007
$$ 80608 315500 148796 -388511 -675738 -411654 -65740 -174505 -592950 -791731 -628724
40703f28724K07836N8118Q6818K96639L83471K19293n3461k89718m12131l14065
$$ -628724 -420888 -362770 -275952 20687 404158 623451 569990 280272 -131859 -445924
40693d45924J502K55643J92496l815L8528K35930J30906k98818m58050l0802M51168
$$ -445924 -444422 -188779 3717 -98 38430 274360 405266 106448 -351602 -382404 68764
40682F8764L60983j19165l66717k65356j80531k04961r1366J36105J60180l946
$$ 68764 429747 310582 -56135 -321491 -502022 -706983 -798349 -662244 -502064 -506010
40672e06010K2747K92967M03285J93386j0973l4714j30250l68952l74760j9731
$$ -506010 -483263 -190296 212989 406375 395402 360688 230438 -138514 -513274 -533005
40662e33005K05620k9240k82682m9842L72593L48749j05604m29256l82825j99050
$$ -533005 -327385 -356625 -639307 -689149 -316556 32193 -73411 -502667 -885492 -1084542
40652a084542k9102J67466K76709J32417q5173n2293J54199J93904O1458L8763
$$ -1084542 -1113644 -946178 -669469 -537052 -622225 -674518 -520319 -326415 -264957 -226194
40642b26194J20019L1148k01985k60549j22586r5076k20172k06843r156J06214
$$ -226194 -106175 -75027 -277012 -537561 -660147 -755223 -975395 -1182238 -1191394 -1085180
40632a085180J40243L74024O74439M90322j97428o19763l08735J89323J80140
$$ -1085180 -944937 -570913 103526 593848 396420 -223343 -532078 -342755 -162615
40623a62615j57830k04592R0843K74846J80595M3879n091l7173l5049M0168L0608
$$ -162615 -320445 -525037 -434194 -159348 21247 65126 60035 22862 -12187 27981 58589
40612E8589j56029k47866j2966K43310R3476k78394l33217m7471J07543K6674
$$ 58589 -97440 -345306 -358272 -114962 -21486 -299880 -633097 -680568 -573025 -546351
40602e46351J21503M89088O07340J59225l88550m20903J443L34414K82664q303
$$ -546351 -424848 64240 671580 830805 442255 21352 22795 357209 639873 631570
40592F31570k70772l06967l7703L50658M50886R3061l61298m27750r4575K20223
$$ 631570 360798 53831 16128 366786 817672 910733 549435 121685 27110 247333
40582B47333K02971r8946m56889o38413m66272K1578M63794M77761J23106j42993
$$ 247333 450304 351358 -105531 -743944 -1210216 -1188638 -724844 -247083 -123977 -266970
40572b66970l6649K22908K51978n131k72834l21282j79504j7047L5691m9993j89079
$$ -266970 -303619 -80711 171267 166136 -106698 -427980 -607484 -624531 -588840 -638833 -827912
40561h27912k11564k0524K40759L01301J06469q4666n9002L5434o8255k96483
$$ -827912 -1039476 -1060000 -819241 -517940 -411471 -496137 -555139 -519705 -587960 -884443
40551h84443k92833O2163M64866N90589M20798P9606l48960o64899n38144L9377
$$ -884443 -1177276 -1115113 -650247 -59658 361140 440746 91786 -573113 -1111257 -1071880
40541a071880N26612M27657l7262k31542L5443L55249L81803K06406K9270j18004
$$ -1071880 -545268 -117611 -154873 -386415 -350972 4277 386080 592486 621756 503752
40531E03752k02508j23331K8075j5059k43844k77451O6256M21229L63714j0992
$$ 503752 301244 177913 205988 190929 -52915 -330366 -264110 157119 520833 509841
40521E09841k92601l19735k32725j29134J1021J39077J54591P8161J4324n622
$$ 509841 217240 -102495 -335220 -464354 -453333 -314256 -159665 -81504 -67180 -72802
40511g2802K246N6927J27519J01664j4881m4163N0092K3792k33882l97898j57521
$$ -72802 -70556 -13629 113890 215554 200673 156510 206602 230394 -3488 -401386 -558907
40500e58907K38615L04035M4567r9813J1413N5992j11830j68712J13039M27842
$$ -558907 -320292 -16257 28310 -71503 -60090 -4098 -115928 -284640 -171601 256241
40490B56241L79195P0165r4173k4239j5214k36496m57246l77356n4388J51236
$$ 256241 635436 705601 611428 587189 571975 335479 -121767 -499123 -553511 -402275
40480d02275K3075k49202l23774j36708P3058J38426J35728J24241l580k30958
$$ -402275 -379200 -628402 -952176 -1088884 -1015826 -877400 -741672 -617431 -621011 -851969
40470h51969k54683Q7609M50433M12994J15474L3450K22638K88566J04602J9392
$$ -851969 -1106652 -1019043 -568610 -155616 -40142 -6692 215946 504512 609114 628506
40460F28506K11683L39930Q7104l42064n46783m38396j69714J43846L66010K82641
$$ 628506 840189 1180119 1267223 925159 378376 -60020 -229734 -85888 280122 562763
40450E62763r8372m06522l42293o3865R3825P2757J7581k7553o4049K0394K53247
$$ 562763 464391 57869 -284424 -348289 -254464 -181707 -164126 -191679 -255728 -235334 17913
40439A7913L80511J68892k16986m05380k74621j377J99586J80843r1769l76668
$$ 17913 398424 567316 350330 -55050 -329671 -331048 -131462 49381 -42388 -419056
40429d19056k86025J65409M37738K13379q2021M6923L20128J24803m34312o49688
$$ -419056 -705081 -539672 -101934 111445 29424 76347 396475 521278 86966 -562722
40419e62722l02646R4933K04753K75570M70086M80669J37934j93788k05369j16281
$$ -562722 -865368 -770435 -565682 -290112 179974 660643 798577 604789 399420 283139
40409B83139j74448j76224O3949K17362m5380l97851l04673J16999K89469R1154
$$ 283139 108691 -67533 -3584 213778 168398 -229453 -534126 -417127 -127658 -36504
40399c6504l2643J37874K78719J14495j57389k27851r8924M5547J15166J02126
$$ -36504 -69147 68727 347446 461941 304552 76701 -22223 23324 138490 240616
40389B40616K7723R563J46353K63681P4031l09020l89115k8171K26177q1032n45093
$$ 240616 268339 277902 424255 687936 761967 452947 63832 35661 261838 180806 -364287
40378c64287m40167J67331M87785K10497n3942J89559M80949J55221n08091o23639
$$ -364287 -804454 -637123 -149338 61159 7217 196776 677725 832946 324855 -298784
40368b98784l8137M38174K47405j74245j88853R8747J70425m5770j98963j58146
$$ -298784 -336921 101253 348658 174413 -14440 84307 254732 208962 9999 -148147
40358a48147r0068j9993J70393L50900K39797q2758k12791l8345J18437P2310
$$ -148147 -238215 -258208 -87815 263085 502882 420124 207333 168988 287425 359735
40348C59735M0747J61697J72626j42441n08328m97682j30348J64182J00244j64656
$$ 359735 400482 562179 734805 592364 84036 -413646 -543994 -379812 -279568 -444224
40338d44224k56428J637L82446M69899J59167j60480j22274O2661o8704m36082
$$ -444224 -700652 -699015 -316569 153330 312497 152017 29743 92404 23700 -412382
40328d12382m59066L2547M84372M40350J56516N0910K6726j83996l90045k30156
$$ -412382 -871448 -838901 -354529 85821 242337 293247 319973 135977 -254068 -484224
40318d84224J31033J77990j57785l93670k10612J68622L91196L96210L04192J64305
$$ -484224 -353191 -175201 -332986 -726656 -937268 -768646 -377450 18760 322952 487257
40308D87257l5960k54293l87704l44103j39241N4909P0252j7850P83Q8161r656
$$ 487257 451297 197004 -190700 -534803 -674044 -619135 -548883 -566733 -565950 -477789 -487445
40297d87445k40084j68744L06833N97861K13228m41336n92565j85059J58482J24992
$$ -487445 -727529 -896273 -589440 8421 221649 -219687 -812252 -997311 -838829 -713837
40287g13837K3751J12044K22553J99769J90219K90089L05118Q0665k20642l46427
$$ -713837 -690086 -578042 -355489 -155720 34499 324588 629706 710371 489729 143302
40277A43302k45513l7580J13178P1530j17423j87378R949K23988J52373p3695
$$ 143302 -102211 -139791 -26613 44917 -72506 -259884 -249935 -25947 126426 52731
40267E2731j32192r2867k63419n32351m41656L8971L80080K73626K7785k68J11247
$$ 52731 -79461 -172328 -435747 -968098 -1409754 -1370783 -990703 -717077 -689292 -689560 -578313
40256e78313J44315R8569L9826m2967o8022Q9786K73847J81123r1696j13071J71857
$$ -578313 -433998 -335429 -295603 -338570 -406592 -316806 -42959 138164 46468 -66603 105254
40245A05254L30370J75576J6719j177j39831l85022k55548K90504M93360q3411
$$ 105254 435624 611200 627919 626742 486911 101889 -153659 136845 630205 546794
40235E46794p19069n33558K11434N86663L68490J17463J35565J56833l539j87582
$$ 546794 -172275 -705833 -494399 92264 460754 578217 713782 870615 867076 679494
40225F79494k76888k91070j54240J61071L75114K52158L2777K9801M2611k42986
$$ 679494 402606 111536 -42704 118367 493481 745639 778416 808217 850828 607842
40215F07842n34370l28380J49824K00997k09748l88036n0987K74331J84579j8874
$$ 607842 73472 -254908 -105084 95913 -113835 -501871 -552858 -278527 -93948 -112822
40205a12822J5526J03554k8330k15001j53299J22727L61243M14245K63500p769
$$ -112822 -97296 6258 -22072 -237073 -390372 -267645 93598 507843 771343 763574
40195G63574j86182j54859j27986l05700m13882j02134L19144K24839k66217l79636
$$ 763574 577392 422533 294547 -11153 -425035 -527169 -208025 16814 -249403 -629039
40185f29039N9880L38520Q6157j13446J87091M69374J79010k50086j11717L71902
$$ -629039 -569159 -230639 -144482 -257928 -70837 398537 577547 327461 215744 587646
40175E87646M23963n5596m50803m22562k02645j1016J56450K14217M3091j71097
$$ 587646 1011609 956013 505210 82648 -119997 -131013 25437 239654 282745 111648
40165A11648j51093j6803q9007k92464k46738R4276L57916K96969L2265k05332
$$ 111648 -39445 -56248 -145255 -437719 -684457 -590181 -232265 64704 96969 -108363
40155a08363k40784K3864M19909N18025J74018j75798j55226m0833j95823l11737
$$ -108363 -349147 -325283 94626 612651 786669 610871 455645 414812 218989 -92748
40145i2748N3610N03327K78753m32985o57791j42276K99585J52591q1322Q0536
$$ -92748 -39138 464189 742942 309957 -347834 -490110 -190525 -37934 -119256 -38720
40135c8720K70541M0398k97884k43644N8964J70437O7910l3350j25203j84886
$$ -38720 231821 272219 -25665 -269309 -210345 -39908 28002 -5348 -130551 -315437
40125c15437J3536L84335L72090j51124m43496k1285M13494M7072o23854n40725
$$ -315437 -301901 82434 454524 303400 -140096 -161381 252113 299185 -324669 -865394
40115h65394J43255L04228k61968n23878K2691N50226L30983j33913q7994K67491
$$ -865394 -722139 -417911 -679879 -1203757 -1181066 -630840 -299857 -433770 -521764 -254273
40105b54273L08252O2945m4317m3757k38358m98423m40060r0998K14596L93650
$$ -254273 53979 116924 72607 28850 -209508 -707931 -1147991 -1238989 -1024393 -630743
40095f30743N20580M18389o2432n39820m81260J0250L36270K37568k1940j85123
$$ -630743 -110163 308226 245794 -294026 -775286 -765036 -428766 -191198 -213138 -398261
40085c98261j82867Q0314N39046O92762J74358m94591m55165J94391M76286J6229
$$ -398261 -581128 -500814 38232 730994 905352 410761 -44404 149987 626273 642502
40075F42502m36569k68969R3547M6692j97070j28386J33218J39373q3931j98426
$$ 642502 205933 -63036 30511 77203 -119867 -248253 -115035 24338 -59593 -258019
40065b58019j78776j62294j3347L33484M40771j8410n21881l59411K03613K96475
$$ -258019 -436795 -599089 -612436 -278952 161819 143409 -378472 -737883 -534270 -237795
40055b37795j52010l39842L4101L21195J08749r1638J89931N28756L29667j95622
$$ -237795 -389805 -729647 -695546 -374351 -265602 -357240 -167309 361447 691114 495492
40045D95492m17247k24304K9508J84092K97317K61006n0047l97110m24343j72668
$$ 495492 78245 -146059 -116551 67541 364858 625864 575817 178707 -245636 -418304
40035d18304M4225J20522J35244M7951j54541k01480R1801L64381J59864k81757
$$ -418304 -374079 -253557 -118313 -70362 -224903 -426383 -334582 29799 189663 -92094
40025i2094k99473J29988K83692j84503o55866m49765J84454M71108K02604r9752
$$ -92094 -391567 -261579 22113 -162390 -818256 -1268021 -1083567 -612459 -409855 -509607
40015e09607k4921K19241K43838O7449J8288J99175L21610J17329k79276n12944
$$ -509607 -534528 -315287 -71449 -4000 14288 213463 535073 652402 373126 -139818
40005a39818m58488k68705k6425L26969O38507N03983j40590o92176n48832P0427
$$ -139818 -598306 -867011 -893436 -566467 72040 576023 435433 -256743 -805575 -735148
39995g35148M05831J59464k47764l99263l44977k25427N7702N15477P95740N78058
$$ -735148 -329317 -169853 -417617 -816880 -1161857 -1387284 -1329582 -814105 -18365 559693
39985E59693K3919m40515o01026m84763j43414K90749N03013K90343j07843k57214
$$ 559693 583612 143097 -457929 -942692 -1086106 -795357 -292344 -2001 -109844 -367058
39975c67058p0583J46746J59717N1248r831j0452k6632p6538j19785j18876p2611
$$ -367058 -437641 -290895 -131178 -79930 -89761 -100213 -126845 -203383 -323168 -442044 -514655
39964e14655m0972r9104j98459j63582N3771K26764J42221n6811n8595J40119
$$ -514655 -555627 -654731 -853190 -1016772 -963001 -736237 -594016 -650827 -709422 -569303
39954e69303K35784J09126j2166J4916q415k24372l55628q8402L52984M26523
$$ -569303 -333519 -224393 -236559 -221643 -230058 -454430 -810058 -898460 -545476 -118953
39944a18953M6853k65977j24762J97489K12928p7125k50707j07095J09336J33260
$$ -118953 -72100 -338077 -462839 -265350 -52422 -129547 -380254 -487349 -378013 -244753
39934b44753J6656o2813q8946j25306r4911J47358N41547P71517N50997n1746
$$ -244753 -228097 -290910 -379856 -505162 -600073 -452715 88832 860349 1411346 1359600
39924A359600n91075o09842j14528L62994L21393j23390m07866k67837j7055J4226
$$ 1359600 768525 158683 44155 407149 728542 605152 197286 -70551 -87606 -73380
39914g3380m0571O8091J87273L387l67436m88778k58438q685P1442J58858L35876
$$ -73380 -113951 -45860 141413 144800 -222636 -711414 -969852 -978537 -907095 -748237 -412361
39903d12361L67097J51143j6867P7781J90614N7098j15029r919K02541J29310
$$ -412361 -45264 105879 89012 166793 357407 414505 299476 289557 492098 621408
39893F21408j55916k26896m9942l6670k77434l10418R7993M65622K87333j74074
$$ 621408 465492 238596 188654 151984 -125450 -435868 -337875 127747 415080 241006
39883B41006k83726J4845J89333r233k15145j13241M2488j22110m40667l88905
$$ 241006 -42720 -27875 161458 152225 -62920 -176161 -133673 -255783 -696450 -1085355
39873a085355J53291O64892N92997m908n56199o12257k58164J04068K48709K90420
$$ -1085355 -932064 -267172 325825 320917 -235282 -847539 -1105703 -1001635 -752926 -462506
39863d62506L86852M51126K93834m1726k93157l34190l02129l01095k14044K3903
$$ -462506 -75654 375472 669306 627580 334423 233 -301896 -602991 -817035 -793132
39853g93132J86610O7010j19357J2426M02495N59064K45831k04900m02042l65928
$$ -793132 -606522 -539512 -658869 -646443 -243948 315116 560947 356047 -45995 -411923
39843d11923k76181r6447K20628M28444K97352N8801J01711L24741K67853j18222
$$ -411923 -688104 -784551 -563923 -135479 161873 220674 322385 647126 914979 796757
39833G96757l45259j54367P7626m8090l40160l64322j06017J00155J16721R0285
$$ 796757 451498 297131 374757 326667 -13493 -377815 -483832 -383677 -266956 -176671
39823a76671Q0181l2580k52800l79539k75473m5417R3814P186k61186m65978l24543
$$ -176671 -96490 -129070 -381870 -761409 -1036882 -1082299 -988485 -981299 -1242485 -1708463 -2033006
39812b033006J34152M88121L98745O8836l3644J69348L05666J37482j36077k38387
$$ -2033006 -1898854 -1410733 -1011988 -943152 -976796 -807448 -501782 -364300 -500377 -738764
39802g38764j67744n7188O0161J90262K83981L34224L83144L43648M9205m02742
$$ -738764 -906508 -963696 -903535 -713273 -429292 -95068 288076 631724 680929 278187
39792B78187o25393m34313j13655R06n7727j06465j53193k16666j01063K50626
$$ 278187 -347206 -781519 -895174 -894268 -951995 -1058460 -1211653 -1428319 -1529382 -1278756
39782a278756M37906J33914k57093o7194N84677Q66251M31710j15327j79532L9922
$$ -1278756 -840850 -706936 -964029 -1031223 -446546 419705 851415 736088 556556 596478
39772E96478Q1599k9340n4120j04777l59184n31673k35523L11842N22273K68030
$$ 596478 678077 648737 594617 489840 130656 -401017 -636540 -324698 197575 465605
39762D65605n4494k00626k64518k44779j8085K21171R3417k81688l16472J52038
$$ 465605 411111 210485 -54033 -298812 -316897 -95726 -2309 -283997 -600469 -448431
39752d48431N70776N10810K34636J11052K3641k10915l40248j23732J16829k6399
$$ -448431 122345 633155 867791 978843 1002484 791569 451321 327589 444418 418019
39742D18019l25276k80967R502O337l48880n17150k15721J95368L15787K04172
$$ 418019 92743 -188224 -178722 -172385 -521265 -1038415 -1254136 -1058768 -742981 -538809
39732e38809J01779O7423P8538J64338K63257K19891N3752k6955K9416M0812n1508
$$ -538809 -437030 -369607 -291069 -126731 136526 356417 410169 383214 412630 453442 401934
39721D01934n7996R8951J96222M5792k25038l77485l32063j31286J36896K90543
$$ 401934 343938 442889 639111 684903 459865 82380 -249683 -380969 -244073 46470
39711D6470J82514m2643r7092q087p1255k66486j82120K71432N58438K77866k02951
$$ 46470 228984 186341 89249 81162 9907 -256579 -438699 -167267 391171 669037 466086
39700D66086l19227j46869j38027l02363k72334l7913L9180o2065N2079M20063
$$ 466086 146859 -10 -138037 -440400 -712734 -750647 -711467 -773532 -721453 -301390
39690c01390N05090L1787m85840m54616m1403J57014l321j70074j68961j69077
$$ -301390 203700 235487 -250353 -704969 -746372 -589358 -592679 -762753 -931714 -1100791
39680a100791j82260N2140N16569P27814M04121m1981n7214K66731L95610J67696
$$ -1100791 -1283051 -1230911 -714342 13472 417593 375612 318398 585129 980739 1148435
39670A148435r2572k08732l38004m47519k04139L49183N61708N1305o27105p10832
$$ 1148435 1055863 847131 509127 61608 -142531 206652 768360 819665 192560 -518272
39660e18272k83046m486n5607m3224J49506J69246p3066j67311Q7170L33900K79326
$$ -518272 -801318 -805804 -861411 -904635 -755129 -585883 -658949 -826260 -739090 -405190 -125864
39649a25864J29778J23556J21901j1175p7910N2661J28039m2131k15060j58829
$$ -125864 3914 127470 249371 238196 160286 212947 340986 298855 83795 -75034
39639g5034p5255j77063k35073r810K28169J29674r4722l3658J79931R1088k70502
$$ -75034 -150289 -327352 -562425 -572235 -344066 -214392 -309114 -342772 -162841 -71753 -342255
39628c42255m15989j60270J99383M25638N23841M11710k8470n20451n58621j19429
$$ -342255 -758244 -918514 -719131 -293493 230348 642058 613588 93137 -465484 -584913
39618e84913K64325K63087J28528J56791K20071Q2749j53927k07282k9016J43924
$$ -584913 -320588 -57501 71027 227818 447889 530638 376711 169429 140413 284337
39608B84337P3762k20723m36519k74034J52660L64161J58094m7655J67427N32641
$$ 284337 358099 137376 -299143 -573177 -420517 -56356 101738 54083 221510 754151
39598G54151M80386L8063k47547j90599j52412l18560m03082k12194L9886J48319
$$ 754151 1234537 1272600 1025053 834454 682042 363482 -39600 -251794 -211908 -63589
39588f3589J66565R6617j67167m35105l04282J53201L37088J6147k80667j11245
$$ -63589 102976 199593 32426 -402679 -706961 -553760 -216672 -200525 -481192 -592437
39578e92437J86100R4212k47959l29362n7320K33318L22498K15485p5223m38509
$$ -592437 -406337 -312125 -560084 -889446 -946766 -713448 -390950 -175465 -250688 -689197
39568f89197n41815k05530K50660M03883L12151L25004M56576L72608l3931m26666
$$ -689197 -1231012 -1436542 -1185882 -781999 -469848 -144844 311732 684340 650409 223743
39558B23743m37449o4723L56664M46547J07793l16214l39816Q6536M73928M10911
$$ 223743 -213706 -278429 78235 524782 632575 316361 -23455 63081 537009 947920
39548I47920N4386j86537k09395j91730k05092j68740q8447p4831j56282k32015
$$ 947920 1002306 815769 606374 414644 209552 40812 -47635 -122466 -278748 -510763
39538e10763j69145R7774M32455M86026R0044l56994k98112J48775K93143m9410
$$ -510763 -679908 -582134 -149679 336347 426391 69397 -228715 -79940 213203 163793
39528A63793k27044J58985N11569J70124m73965n51348l8987L03474J40396r9481
$$ 163793 -63251 95734 607303 777427 303462 -247886 -286873 16601 156997 57516
39518E7516o8369N5303P6720J13587K38072K84280J81313P9382K7641j07286l19736
$$ 57516 -10853 44450 121170 234757 472829 757109 938422 1017804 1045445 938159 618423
39507F18423m16021l50776k78007k36672j27541q656m1777j33482k2339K49412
$$ 618423 202402 -148374 -426381 -663053 -790594 -799250 -841027 -974509 -996848 -747436
39497g47436L57084K31280J52599K27783K03944m2307k21905n6466K95428M33366
$$ -747436 -390352 -159072 -6473 221310 425254 382947 161042 104576 400004 833370
39487H33370J65910l24213o19314l97770J75342M86993J80819l19614l68037k0003
$$ 833370 999280 675067 55753 -342017 -166675 320318 501137 181523 -186514 -206517
39477b06517J18635j09834k05328J03162L98305K69759o4845j87316j12596j10594
$$ -206517 -87882 -197716 -403044 -299882 98423 368182 303337 116021 3425 -107169
39467a07169j93427j64629j1880O8817k2537j58496j34854J03387L40267K66507
$$ -107169 -300596 -465225 -477105 -408288 -430825 -589321 -724175 -620788 -280521 -14014
39457a4014r0986k81663k3933L22319K63692m9531q9821J38208J17337k51490
$$ -14014 -105000 -386663 -410596 -88277 175415 125884 36063 174271 291608 40118
39447D0118m51830k31902R531l9118j33724n0307L69r9231l7917K95178M13476
$$ 40118 -411712 -643614 -634083 -673201 -806925 -857232 -856863 -956094 -994011 -698833 -285357
39436b85357k2855n48175n20504k2260L79682M26693K37285p6218l72704l73441
$$ -285357 -308212 -856387 -1376891 -1399151 -1019469 -592776 -355491 -431709 -804413 -1177854
39426a177854m4564K20936K05891K44910N43340O23830Q2157n62053n39457k0148
$$ -1177854 -1222418 -1001482 -795591 -550681 -7341 616489 698646 136593 -402864 -423012
39416d23012J97867m3054j77218J5213J59587J24923K09858L42446j0122q04262
$$ -423012 -225145 -268199 -445417 -430204 -270617 -145694 64164 406610 396488 -407774
39406d07774j113233l78094O63117R12244L56333p2611J24689M31893J97639l97487
$$ -407774 -1521007 -1899101 -1235984 -323740 32593 -40018 84671 516564 714203 316716
39396C16716n94848j21043L87574K13742m26097o26170n8568N38657M26774q1978
$$ 316716 -278132 -399175 -11601 202141 -223956 -850126 -908694 -370037 56737 -25241
39386b5241j71425K26229M14628O0551l57940l37455j5757J57532J3838k64973
$$ -25241 -196666 29563 444191 504742 146802 -190653 -206410 -48878 -35040 -300013
39376c00013l92212j89428K11562L87033J14685k30077j28034L23089N41370L01934
$$ -300013 -692225 -881653 -670091 -283058 -168373 -398450 -526484 -203395 337975 639909
39366F39909m6739k06497k45213k26673n4312J84889K07095J0268q3559J3442
$$ 639909 593170 386673 141460 -85213 -139525 45364 252459 262727 179168 192610
39356A92610K3172j47434k20970p2140N7701L2283O944n891k03819m55168l11209
$$ 192610 215782 68348 -152622 -224762 -167061 -134778 -127834 -133725 -337544 -792712 -1103921
39345a103921K05459M80162K74600J15501L28071M39046Q9234k14559J0156K56778
$$ -1103921 -898462 -418300 -143700 -28199 299872 738918 828152 613593 623749 880527
39335H80527j40665p36468n69165K66070P02716K88440l07578m52283l00604j83612
$$ 880527 739862 3394 -565771 -299701 403015 691455 383877 -68406 -369010 -552622
39325e52622n6568J28166J55449j3652p0914Q5925J26522j11160k82458j16680
$$ -552622 -609190 -481024 -325575 -339227 -410141 -324216 -197694 -308854 -591312 -707992
39315g07992J06712K9259j96670j77097J10285L27589K58132J0016j65865r9315
$$ -707992 -601280 -572021 -768691 -945788 -835503 -507914 -249782 -239766 -405631 -504946
39305e04946J50118K88730R0742k64333l81099j93877k6623o1327j00846K5445
$$ -504946 -354828 -66098 24644 -239689 -620788 -814665 -841288 -902615 -1003461 -978016
39295i78016J83300K31287K55440L09190K44155J8928j31221o0626M7893L0664
$$ -978016 -794716 -563429 -307989 1201 245356 264284 133063 72437 120330 150994
39285A50994P501N5990k2301l00954m44272j96795J57951K30541J05872L9485
$$ 150994 158495 214485 192184 -108770 -553042 -749837 -591886 -361345 -255473 -215988
39275b15988r4833m72068p00092k60939N29442P70874K66298j89410l1470K89783
$$ -215988 -310821 -782889 -1482981 -1743920 -1214478 -443604 -177306 -366716 -398186 -108403
39265a08403J51873k41304k85847K7312J97135P2207j0319J01726J39906m7586
$$ -108403 43470 -197834 -483681 -456369 -259234 -187027 -197346 -95620 44286 -3300
39255c300j95144n4974K03315K55423O5837j37801j91996j26502n7835q2205k00905
$$ -3300 -198444 -253418 -50103 205320 271157 133356 -58640 -185142 -242977 -325182 -526087
39244e26087k69822j28077J40023K16693l7775l30413k97873r646J67454J56997
$$ -526087 -795909 -923986 -783963 -567270 -605045 -935458 -1233331 -1242977 -1075523 -918526
39234i18526K65574N94880P35235L26292l31291n94928k98033J16849K40439R1470
$$ -918526 -652952 -58072 677163 1003455 672164 77236 -220797 -103948 136491 227961
39224B27961j51638l91834m52257r5024N35018Q38015M72686j32102l51128j99958
$$ 227961 76323 -315511 -767768 -862792 -327774 510241 982927 850825 499697 299739
39214B99739j48404k89385k54733O8235L03632J97447k0266p2514j7306K1468
$$ 299739 151335 -138050 -392783 -324548 -20916 176531 156265 83751 66445 87913
39204H7913J12573K48987J85577j44208l68069j84517J31436J18015j82808l37393
$$ 87913 200486 449473 635050 490842 122773 -61744 69692 187707 4899 -332494
39194c32494j93437j7786M722K2332K07634M80800O16313M56215J8983m58804
$$ -332494 -525931 -543717 -538995 -516663 -309029 171771 788084 1244299 1263282 804478
39184H04478o52900m79175j95747l7662O5876K13805K36801J3520j57775M3327
$$ 804478 151578 -327597 -523344 -561006 -495130 -281325 -44524 -31004 -188779 -145452
39174a45452L49678K20816k85384n14084j63425K88453K85136j10041m34126m07937
$$ -145452 204226 425042 139658 -374426 -537851 -249398 35738 -74303 -508429 -916366
39164i16366j01908K24657L19307J83507J30247L30589M17420j4950o19236o29304
$$ -916366 -1018274 -793617 -474310 -290803 -160556 170033 587453 572503 -46733 -676037
39154f76037j5081M07988J96965j34593n7926J95719K49349K53350L71910K54821
$$ -676037 -691118 -283130 -86165 -220758 -278684 -82965 166384 419734 791644 1046465
39144A046465k96579p11534m53157N6437J14144j17568k6436K83841K37205q1311
$$ 1046465 749886 38352 -414805 -358368 -244224 -361792 -388228 -104387 132818 51507
39134E1507r3014J29566r811l99732k85751L15513M70615r2869m49806k2385M63419
$$ 51507 -41507 88059 78248 -321484 -607235 -291722 178893 86024 -363782 -386167 77252
39123G7252K60036j77568j18379J41792r1941o05070o39721j74504J46524J08914
$$ 77252 337288 159720 41341 183133 91192 -513878 -1153599 -1328103 -1181579 -1072665
39113a072665M0266J5288j61981k89512M4827O19100P49101L53530M9036Q5259
$$ -1072665 -1032399 -1017111 -1179092 -1468604 -1423777 -804677 -55576 297954 346990 432249
39103D32249P115m02815o48464l65429M0532P1675q8675O440K94948L86432K39270
$$ 432249 439364 36549 -611915 -977344 -936812 -865137 -953812 -947372 -652424 -265992 -26722
39092b6722J46656J98021K00195P1572m9829p6591o9839p2902o4749o5320j09552
$$ -26722 119934 317955 518150 589722 539893 463302 393463 320561 255812 190492 80940
39081H0940j42125r0835m306L1618P1536K46078N29858P09791O05171K39398k05187
$$ 80940 -61185 -152020 -156326 -124708 -53172 192906 722764 1432555 2037726 2277124 2071937
39070B071937n34433o46500n50571l20572n5720J13783Q0119q1922j02249J50112
$$ 2071937 1537504 891004 340433 19861 -35859 77924 158043 76121 -26128 123984
39060A23984L80067J83053l32630n67028k16749K72204L03226o8461k90261j26710
$$ 123984 504051 687104 354474 -212554 -429303 -157099 146127 77666 -212595 -339305
39050c39305R6778P3321n4979M891K49321M28548L80483J47288j28092k90533
$$ -339305 -242527 -169206 -224185 -219294 30027 458575 839058 986346 858254 567721
39040E67721k56625j15445m4688n1801M3952K65695L27865L8435l35639l95261
$$ 567721 311096 195651 150963 99162 143114 408809 736674 775109 439470 44209
39030D4209j71694j9853k9138M2421K27355K12532r0695k86111r1654J83247J30487
$$ 44209 -127485 -147338 -176476 -134055 93300 305832 215137 -70974 -162628 20619 151106
39019A51106j10070j45076r086j7904j06387P4354M22371L93877j11634m84083
$$ 151106 41036 -104040 -113126 -131030 -237417 -163063 259308 653185 541551 57468
39009E7468k99306N6548N0750j61242p3398K96261M31696J21824k55610k86693
$$ 57468 -241838 -185290 -134540 -295782 -369180 -72919 358777 480601 224991 -61702
38999f1702J0499L36410M48989K83944m6908l08462l36422k05609j06500r9200
$$ -61702 -51203 285207 734196 1018140 971232 662770 326348 120739 14239 -84961
38989h4961j10597r9929p0707J3645J55640K20380Q0550j67101k83004j64074
$$ -84961 -195558 -295487 -366194 -352549 -196909 23471 104021 -63080 -346084 -510158
38979e10158O3246J83339N9406k26643l39202J1052O14113Q51919M36816j93494
$$ -510158 -446912 -263573 -204167 -430810 -770012 -758960 -144847 707072 1143888 950394
38969I50394m63637l58841k03533m8816K27082M19426J98664k40528l29650J6069
$$ 950394 486757 127916 -75617 -124433 102649 522075 720739 480211 150561 166630
38959A66630K61603J03180j11957m3467R9022M486j88160j73744J2304J34923
$$ 166630 428233 531413 419456 375989 475011 479497 291337 117593 129897 264820
38949B64820J39333O9636j20552l62264l70856r5970M5036k07474m28531j34169
$$ 264820 404153 473789 353237 -9027 -379883 -475853 -430817 -638291 -1066822 -1200991
38939a200991L57160L58961n2651j23661L36426O26079L17831m5561R1045L29321
$$ -1200991 -843831 -484870 -537521 -661182 -324756 301323 619154 573593 664638 993959
38929I93959J8555n60605n77178o802K96923m6480l77689r2838M26055M80776
$$ 993959 1012514 451909 -125269 -132071 164852 118372 -259317 -352155 73900 554676
38919E54676J11317j29330r4665q6243j67078q6769J42930J96671K1619n8772
$$ 554676 665993 536663 441998 355755 188677 101908 244838 441509 463128 404356
38909D04356P1974J43272K7965o1554p1325k45320n24921m08435K02202N95224
$$ 404356 476330 619602 647567 586013 514688 269368 -255553 -663988 -461786 133438
38899A33438K31464l64014l55124J49779L64618J03987n3486J62338L17729J12271
$$ 133438 364902 888 -354236 -204457 160161 264148 210662 373000 690729 803000
38889H03000j19834k9954K04145K63021J39995o1118l48809o05909n48009j81870
$$ 803000 683166 653212 857357 1120378 1260373 1199255 850446 244537 -303472 -485342
38879d85342R6673J08551J57182M11916N14696J92136j98639k25654r4726k41526
$$ -485342 -388669 -280118 -122936 288980 803676 995812 797173 571519 476793 235267
38869B35267n14291m08476L7945K43664j5350l01721k36394j2395K5475q0451
$$ 235267 -279024 -687500 -649555 -405891 -421241 -722962 -959356 -971751 -946276 -1026727
38859a026727n5260J56277L41286L12712R6828j14059j29007O5602K86472L63127
$$ -1026727 -1081987 -925710 -584424 -271712 -174884 -288943 -417950 -352348 -65876 297251
38849B97251L13423K29742J03584q3341k07571j54819l9251m1278j01066m0369
$$ 297251 610674 840416 944000 860659 653088 498269 459018 417740 316674 276305
38839B76305O8995j6804k63397l39761j33480O7815O7294Q1087L08551M91004
$$ 276305 345300 328496 65099 -274662 -408142 -340327 -273033 -191946 116605 607609
38829F07609K87396j01528j59621J17912J29362m14521r17526o43634K10284O85681
$$ 607609 895005 793477 633856 751768 881130 466609 -450917 -1094551 -884267 -198586
38819a98586K90734m17578o39140l05492O2279J67053J72712K46649L05338K58570
$$ -198586 92148 -325430 -964570 -1270062 -1207783 -1040730 -868018 -621369 -316031 -57461
38809e7461J60332L1903j72287l37194k26696J19016L14364J39054j33170j30070
$$ -57461 102871 134774 -37513 -374707 -601403 -482387 -168023 -28969 -162139 -292209
38799b92209J07710K48854J40291q6121k51373k48809l4132K79528M03046J66487
$$ -292209 -184499 64355 204646 118525 -132848 -381657 -415789 -136261 266785 433272
38789D33272k28454m38369l77507j94440L0027K85579M02686J64264k89428m72217
$$ 433272 204818 -233551 -611058 -805498 -775471 -489892 -87206 77058 -212370 -684587
38779f84587j34924L65718M78909J28586k30561k01394R3183K08040o4811m48488
$$ -684587 -819511 -453793 25116 153702 -76859 -278253 -185070 22970 -41841 -490329
38769d90329m93543o9658M80970O58097K85136k78736m53337o9083L71665K66320
$$ -490329 -983872 -1053530 -572560 85537 370673 91937 -361400 -430483 -58818 207502
38759B07502k72792m97921l5732N62656N76851Q5430k58802j79044L0797J31547
$$ 207502 -65290 -563211 -598943 -36287 540564 625994 367192 188148 218945 350492
38749C50492J79749J56300o9576l32440k76149K5854J07278j07120j56892J21387
$$ 350492 530241 686541 616965 284525 8376 34230 141508 34388 -122504 -1117
38739a117K68415K0349j96403k0583J93777J4123l04307k84465l0286N7294J6344
$$ -1117 267298 287647 91244 70661 264438 278561 -25746 -310211 -340497 -283203 -266859
38728b66859J50250L95800M59867L44595J89084j25297o28256q33821l40449L88626
$$ -266859 -116609 279191 739058 1083653 1272737 1147440 519184 -314637 -655086 -266460
38718b66460N58546J69387j10958l4520L7820o1409j10741r4366k24698l51271
$$ -266460 292086 461473 350515 315995 353815 292406 181665 87299 -137399 -488670
38708d88670j11826K86888K37881k23689l76133J1946K92542R106m23156m59932
$$ -488670 -600496 -313608 -75727 -299416 -675549 -663603 -371061 -361955 -785111 -1245043
38698a245043j49290K43661O55507R03271O29041j8547l09791J2129K66246p7907
$$ -1245043 -1394333 -1150672 -495165 408106 1037147 1018600 708809 720938 987184 909277
38688I09277n29673m19210J5091J27323m8633l2445J31871m793l69352l78052
$$ 909277 379604 -39606 -24515 102808 54175 21730 153601 148808 -220544 -598596
38678e98596R7737M64441K55297k60509n04611k91561O3413J70456M157p7434
$$ -598596 -500859 -36418 218879 -41630 -546241 -837802 -774389 -603933 -599776 -677210
38668f77210J72572M54475K89008j99764l59355Q176L21929J65142o7029Q2268
$$ -677210 -504638 -50163 238845 39081 -320274 -312098 9831 174973 107944 190212
38658A90212L20301J54170k28872l20181j55827j13033j52674q776J24874j07241
$$ 190212 510513 664683 435811 115630 -40197 -153230 -305904 -314680 -189806 -297047
38648b97047m23757k48215K42231K90061j91929m35158n6767L61716K56760r7287
$$ -297047 -720804 -969019 -726788 -436727 -628656 -1063814 -1120581 -758865 -502105 -599392
38638e99392j66948L6051J68337J20053k0000j94436k69431o1999K75399K99536
$$ -599392 -766340 -730289 -561952 -441899 -461899 -656335 -925766 -987765 -712366 -412830
38628d12830n0956k73962p0566J93050J38900r614P5249J82824r493k42703p0917
$$ -412830 -463786 -737748 -808314 -615264 -476364 -485978 -410729 -227905 -237398 -480101 -551018
38617e51018K94828K49248j90620l47418O2777N00460M44927R7315q9550j25180
$$ -551018 -256190 -6942 -197562 -544980 -482203 18257 463184 560499 470949 345769
38607C45769k87971n10382m46606p4717J90177N9671k38631k71133O4369M47204
$$ 345769 57798 -452584 -899190 -973907 -783730 -724059 -962690 -1233823 -1169454 -722250
38597g22250N15394K38906q9963j97009j16728r5083k14858k50179L748L72497
$$ -722250 -206856 32050 -57913 -254922 -371650 -466733 -681591 -931770 -928022 -555525
38587e55525M76978K39652j4591j9595R8334P8551q3067j95886j82649j11438
$$ -555525 -78547 161105 146514 126919 225253 303804 220737 24851 -157798 -269236
38577b69236k2660O2123M8501r3767j96899j38168r5721k50217l54090l2868N18152
$$ -269236 -291896 -229773 -181272 -275039 -471938 -610106 -705827 -956044 -1310134 -1343002 -824850
38566h24850O60109K45403j07364O9660L97878K71912k14647m55140k10101J78593
$$ -824850 -164741 80662 -26702 42958 440836 712748 498101 42961 -167140 11453
38556A1453L35378J90986j52325n09660o03166l05748J22367L26478L19846L48017
$$ 11453 346831 537817 385492 -124168 -727334 -1033082 -910715 -584237 -264391 83626
38546H3626L89561J87962k33356m97755l97309j42432J3162Q5842J71526K15166
$$ 83626 473187 661149 427793 -69962 -467271 -609703 -596541 -510699 -339173 -124007
38536a24007J34212j3462j09536r1226N1945K34976K39471m6339l40786k21320
$$ -124007 10205 -3257 -112793 -204019 -152074 82902 322373 276034 -64752 -286072
38526b86072K54646N01022J57725l79827m53024P636M18118K87486k18454n19691
$$ -286072 -31426 469596 627321 247494 -205530 -197894 220224 507710 289256 -230435
38516b30435k90080K01821L94776M3270n06853o85083l06367K65204N45463M02630
$$ -230435 -520515 -318694 76082 119352 -387501 -1072584 -1378951 -1113747 -568284 -165654
38506a65654P5202j41554j24318O6757K52566K27158o0724l63922l14784J24658
$$ -165654 -90452 -232006 -356324 -289567 -37001 190157 129433 -234489 -549273 -424615
38496d24615M95686L31624k26273n65965l91876m6642R3579J51079L49654M56599
$$ -424615 71071 402695 176422 -389543 -781419 -828061 -734482 -583403 -233749 222850
38486B22850J42815l31888m09953j12466L3021p3938J7713L83936M72170P4520
$$ 222850 365665 33777 -376176 -488642 -455621 -529559 -511846 -127910 344260 418780
38476D18780k25360l4681J54158j44998m89996k37953L21723M06784k8121l43118
$$ 418780 193420 158739 312897 167899 -322097 -560050 -238327 168457 140336 -202782
38466b02782k74747j31568o2776Q1020K16163R6766j06131M402L10830L37874
$$ -202782 -477529 -609097 -671873 -590853 -374690 -277924 -384055 -379653 -68823 269051
38456B69051J15745J25778L72193L28197q2618k91340q8627J641l13663n40681
$$ 269051 384796 510574 882767 1210964 1128346 837006 748379 750020 436357 -104324
38446a04324k59463J39879J21494j38744j33588J29108K13074m4776l62589m14261
$$ -104324 -363787 -223908 -102414 -241158 -374746 -245638 -32564 -77340 -439929 -854190
38436h54190j30710K61414L80085R0383k08482n2996L41171L28066j31680l53247
$$ -854190 -984900 -723486 -343401 -253018 -461500 -514496 -173325 154741 23061 -330186
38426c30186l7620K42623M2222k00350L6357M23437L37512j09883l20889j71513
$$ -330186 -367806 -125183 -82961 -283311 -246954 176483 513995 404112 83223 -88290
38416h8290k0698J7938J25193K30825R1035j18662Q5219P14379J169179J010080
$$ -88290 -108988 -91050 34143 264968 356003 237341 322560 1036939 2206118 3216198
38406C216198M48801n7615l34644m57398m90765m56717l91787k96482j25653R2164
$$ 3216198 3664999 3607384 3272740 2815342 2324577 1867860 1476073 1179591 1053938 1146102
38396A146102K06354R1785j66002k79501l2267M11253N90375K86410j56350k82952
$$ 1146102 1352456 1444241 1278239 998738 966471 1377724 1968099 2254509 2098159 1815207
38386A815207j61781k07488m57867n05542j98629R3225Q3660j8821N4564J87498
$$ 1815207 1653426 1445938 988071 482529 283900 377125 460785 441964 496528 684026
38376F84026J45608l5031j75975j92526l0254L04744N12802K19920l80623n81219
$$ 684026 829634 794603 618628 426102 395848 700592 1213394 1433314 1052691 471472
38366D71472j22107L85296L37740l6308j57352L0230J55706O2025j38243l84862
$$ 471472 349365 734661 1072401 1036093 878741 908971 1064677 1126702 988459 603597
38356F03597o00947n40936j34136K32594J70527j70737l63872k78104o8051J46402
$$ 603597 2650 -538286 -672422 -439828 -269301 -440038 -803910 -1082014 -1150065 -1003663
38346a003663K53649R0563k41800l06615N9767L93140K54087j02566j61943O5342
$$ -1003663 -750014 -659451 -901251 -1207866 -1148099 -754959 -500872 -603438 -765381 -700039
38336g00039J92714J31700R8921J34111R1900j2321m4936j3105K7256J30951K68937
$$ -700039 -507325 -375625 -276704 -142593 -50693 -63014 -107950 -121055 -93799 37152 306089
38325C06089K46953P1185M3624K30541K75484M4710o6286J48577K62211l8197
$$ 306089 553042 624227 667851 898392 1173876 1218586 1152300 1300877 1563088 1524891
38315A524891l63519l32939k46397m16926m86128j45599J20534j27225l55486
$$ 1524891 1161372 828433 582036 165110 -321018 -466617 -346083 -473308 -828794
38306h28794M3781N49375L54963j24744Q8545P56393P50854J534l84390k4046
$$ -828794 -785013 -235638 119325 -5419 83126 839519 1590373 1591907 1207517 1183471
38296A183471J97722k07731n17594j72889K41956O8927l45670l52180l1121J34425
$$ 1183471 1381193 1173462 655868 482979 724935 793862 448192 96012 64891 199316
38286A99316N9008k8925m8105l2543K1051M6533j1061L9971L65188O64487N48703
$$ 199316 258324 229399 181294 148751 169802 216335 205274 245245 610433 1274920 1823623
38275A823623K20398J22550J05021k41299o22604m16179J16992J26941l38477
$$ 1823623 2044021 2166571 2271592 2030293 1407689 991510 1108502 1235443 896966
38266H96966l79442J29408K97555j40556l34239J00840L96091J14070m6709L33723
$$ 896966 517524 646932 944487 803931 469692 570532 966623 1080693 1033984 1367707
38256A367707N10915O32l75151P7333N91584K33999m61910m36294J26450K73458
$$ 1367707 1878622 1879254 1504103 1581436 2173020 2407019 1945109 1508815 1635265 1908723
38246A908723r5478l45436l47444m06061l69014N1020M38419K40289j98166k10520
$$ 1908723 1813245 1467809 1120365 714304 345290 396310 834729 1075018 876852 666332
38236F66332k619j59682l93496l2273N72082M89068j06770j19666N69267Q29593
$$ 666332 663713 504031 110535 78262 650344 1139412 1032642 912976 1482243 2311836
38226B311836J89336l55363J2257O43876N34407j69418n90828m63135k49689k43503
$$ 2311836 2501172 2145809 2158066 2801942 3336349 3166931 2576103 2112968 1863279 1619776
38216A619776k45601o5147J67581K59752K38312K46791K64225Q7374l14573n73842
$$ 1619776 1374175 1309028 1476609 1736361 1974673 2221464 2485689 2573063 2258490 1684648
38206A684648l47097R0539J19705k95175n15876k59884m7360k39215l53831M1156
$$ 1684648 1337551 1428090 1547795 1252620 736744 476860 429500 190285 -163546 -122390
38196a22390M25160J33858m52675m74468J4722K23012o200l4262L54142N59354
$$ -122390 302770 436628 -16047 -490515 -475793 -252781 -258981 -293243 60899 620253
38186F20253K01671k61491k53737J69207N30527M68424m3326o32062p13506j49874
$$ 620253 821924 560433 306696 475903 1006430 1474854 1431528 799466 85960 -63914
38176f3914M07128L05094j79202k90331L6443J94001j7461j39893P0101K82020
$$ -63914 343214 648308 469106 178775 215218 409219 391758 251865 321966 603986
38166F03986K42913J20277M7996o9177j81608j00090M5680o7812l27644k89260
$$ 603986 846899 967176 1015172 945995 764387 664297 709977 642165 314521 25261
38156B5261N3968K58200K16119K33293K59589j26910p79401q88187j84735N43713
$$ 25261 79229 337429 553548 786841 1046430 919520 140119 -748068 -932803 -389090
38146c89090N94018K91061K62013M10512K72853p0051j44246R7966K34826O0270
$$ -389090 204928 495989 758002 1168514 1441367 1371316 1227070 1325036 1559862 1620132
38136A620132j82732k39841j39914k6397L1973J1485j06044k71560l43992k09276
$$ 1620132 1437400 1197559 1057645 1031248 1063221 1074706 968662 697102 353110 143834
38126A43834L1914O0509k96564o92863n52587J35877O72699N44846R4067p5242
$$ 143834 175748 236257 -60307 -753170 -1305757 -1169880 -497181 47665 141732 66490
38116F6490L6802N2744l4681L2549J63534P8459o6554J04886M37256M01701j5175
$$ 66490 103292 156036 121355 153904 317438 395897 329343 434229 871485 1273186 1258011
38105A258011k74727j76959j02142k54668l22771q6158J94078K12736K7282j17930
$$ 1258011 983284 806325 704183 449515 126744 40586 234664 447400 474682 356752
38095C56752n1576K35969M54134J53855n71193q60362k01338N92859M07155m43304
$$ 356752 305176 541145 995279 1149134 577941 -282421 -483759 109100 516255 72951
38085G2951o13813J86300P54594L00334m24848m51724p874J35788o2842j17113
$$ 72951 -540862 -354562 400032 700366 275518 -176206 -184080 -48292 -111134 -228247
38075b28247M8717J32852J13873K30712M75612N78672L86695l1887n02391p74991
$$ -228247 -179530 -46678 67195 297907 773519 1352191 1738886 1706999 1204608 429617
38065D29617o54485k52532R5575K32142K60294K49219J71106R2352Q9493N5747
$$ 429617 -224868 -477400 -381825 -149683 110611 359830 530936 623288 712781 768528
38055G68528o6299m5276K32872M00512J78375l8380J64446L75906M0303l92936
$$ 768528 702229 656953 889825 1290337 1468712 1430332 1594778 1970684 2010987 1618051
38045A618051r1035O29731O41966j61524o71494l34288J63344K42101J95930K37716
$$ 1618051 1527016 2156747 2798713 2637189 1965695 1631407 1794751 2036852 2232782 2470498
38035B470498J5353m40946m57202O5867K84787j86737o07151m15379j06594j57111
$$ 2470498 2485851 2044905 1587703 1653570 1938357 1751620 1144469 729090 622496 465385
38025D65385j62924K21622N05416K85838J6557J16455K19326J1082j12274Q9749
$$ 465385 302461 524083 1029499 1315337 1331894 1448349 1667675 1678757 1566483 1656232
38015A656232J45030j31461j11791M32355O88162K08662j68844K34241P10973
$$ 1656232 1801262 1669801 1558010 1990365 2678527 2887189 2718345 2952586 3663559
38006C663559M83829J57639N99631J315543J290799O86888L73849M16194L01411
$$ 3663559 4147388 4305027 4904658 6220201 7511000 8197888 8571737 8987931 9289342
37997I289342J13439K60164N32593N41936N44299P71145N98441m61378j597427
$$ 9289342 9402781 9662945 10195538 10737474 11281773 12052918 12651359 12189981 10592554
37988A0592554j762560j284264j148299j279235r11363j81709P5636j94498l29859
$$ 10592554 8829994 7545730 6397431 5118196 4206833 4025124 4100760 3906262 3576403
37979C576403k18876k55238l03298N0103M61411K67548k61841k86562J97354M49516
$$ 3576403 3357527 3102289 2798991 2849094 3310505 3578053 3316212 3029650 3227004 3676520
37969C676520K73577J13587Q7660L52P9556O53341J355335J651876J798075K228291
$$ 3676520 3950097 4063684 4151344 4151696 4231252 4884593 6239928 7891804 9689879 11918170
37959A1918170K440985J670727L01572n79548p10031n90327l02593L78165J054257
$$ 11918170 14359155 16029882 16331454 15751906 15041875 14451548 14148955 14527120 15581377
37950A5581377J137295Q89178Q33464N55012n61019j754272j555709L5238J352054
$$ 15581377 16718672 17607850 18441314 18996326 18435307 16681035 15125326 15160564 16512618
37941A6512618J088284m86047k209661l010291k454983j191331n12422q03755
$$ 16512618 17600902 17114855 14905194 11894903 9439920 8248589 7736167 6932412
37933F932412j061386n90845j06116k37951k93396K41988M01773m84012j149616
$$ 6932412 5871026 5280181 5174065 4936114 4642718 4884706 5286479 4802467 3652851
37924C652851l94048O66505M48061l25686m4868P98745O20340k64507l32982K79995
$$ 3652851 3258803 3925308 4373369 4047683 4002815 4801560 5421900 5157393 4824411 5104406
37914E104406K96392o0938L71057J203477J253645J005365J552290K042113J200828
$$ 5104406 5400798 5339860 5710917 6914394 8168039 9173404 10725694 12767807 13968635
37905A3968635L64320J554552L428672K905708K21263j491365j185420n38824
$$ 13968635 14332955 15887507 19316179 22221887 22443150 20951785 19766365 19227541
37897A9227541j08601R53048J701328L41112j794329j669825K43133Q06160j13444
$$ 19227541 19118940 20071988 21773316 22114428 20320099 18650274 18893407 19699567 19586123
37888A9586123J29658J499530J670191J481490L790024P245647Q159529Q105236
$$ 19586123 19715781 21215311 22885502 24366992 28157016 35402663 43562192 51667428
37880E1667428J1584758J6872680J9585123K5037467M2312803O1812598N5699357
$$ 51667428 63252186 80124866 99709989 124747456 167060259 228872857 284572214
37873B84572214J2739151l9765922o3852809n2968868l1688754k0178293j6548252
$$ 284572214 297311365 257545443 193692634 140723766 109035012 88856719 72308467
37866G2308467j2651626q886103q046441p584893m959719k630123k713725k985933
$$ 72308467 59656841 50770738 42724297 35139404 30179685 27549562 24835837 21849904
37858B1849904j728454q16216j274476j163965L8676J87487q80291o50483J047930
$$ 21849904 20121450 19305234 18030758 16866793 16905469 17092956 16212665 15562182 16610112
37849A6610112J639847J050020J789555L547396L662240K967266M731083Q101972
$$ 16610112 18249959 19299979 21089534 24636930 28299170 31266436 35997519 44099491
37841D4099491R609207J0339508J3657427J7557384J9532923K6716286M6081707
$$ 44099491 53708698 64048206 77705633 95263017 114795940 141512226 187593933
37834A87593933O3421691N0866259M106144m3854363n8823120m3224388k4547593
$$ 187593933 251015624 301881883 305988027 262133664 203310544 160086156 135538563
37827A35538563j7509480j4906921q868043j721131L754372Q524325R509859R28370
$$ 135538563 118029083 103122162 94254119 92532988 96287360 104811685 114321544 115249914
37819A15249914j3545032k1356592j7331170r665089o553621o265822m393268
$$ 115249914 101704882 80348290 63017120 53352031 46798410 40532588 36139320
37812C6139320k095659j875097j974080j73701J889240K346572K720106M761883
$$ 36139320 34043661 32168564 30194484 30020783 31910023 34256595 36976701 41738584
37804D1738584P742680J0985879J4381640J4669181P163553n927006j4759347
$$ 41738584 49481264 60467143 74848783 89517964 96681517 90754511 75995164
37797G5995164j3276400o445437k402076k357333k593560j752780q55434N22834
$$ 75995164 62718764 56273327 53871251 51513918 48920358 47167578 46312144 46834978
37789D6834978K855292L745982R78809l322444n489593n450349n461609n657641
$$ 46834978 49690270 53436252 54415061 51092617 45603024 40152675 34691066 29033425
37781B9033425m667631l074861k508961k480691j523983l60103o53635j661567
$$ 29033425 24365794 21290933 18781972 16301281 14777298 14417195 13763560 12101993
37773A2101993j347417J6215M51938k26958n01188j69806m26420j253455j378427
$$ 12101993 10754576 10770791 11222729 10995771 10494583 10324777 9898357 8644902 7266475
37764G266475o49609j46942j47331n4369O198m72684q78976k91127O73621P33181
$$ 7266475 6616866 6469924 6322593 6268224 6274422 5801738 4922762 4631635 5305256 6038437
37754F038437J34842N5759L95526J84739l28039q0156P13545R21882O28761Q86703
$$ 6038437 6173279 6229038 6624564 6809303 6481264 6401108 7114653 8036535 8665296 9551999
37744I551999J603615J695290J191038J203791J857013K181424K119308K698417
$$ 9551999 11155614 12850904 14041942 15245733 17102746 19284170 21403478 24101895
37736B4101895L932229M292056K750618L4348k471756l955544m219391l589278
$$ 24101895 28034124 32326180 35076798 35111146 32639390 28683846 24464455 20875177
37728B0875177k867008k521208k122905j340125q42325j157011j445416q10980
$$ 20875177 18008169 15486961 13364056 12023931 11181606 10024595 8579179 7768199
37720G768199l1295l32489j147143r91511n4757J61323m77183n69295K69457P83064
$$ 7768199 7736904 7404415 6257272 5265761 5211004 5372327 4895144 4325849 4595306 5378370
37710E378370L14539k31828j17876K22033L55281M91545N43648K9473p09225o43853
$$ 5378370 5692909 5461081 5343205 5565238 5920519 6412064 6955712 6985185 6275960 5632107
37700E632107K26416P52627N72970O37306J341735J690895R66884j57902q61504
$$ 5632107 5858523 6611150 7184120 7821426 9163161 10854056 11820940 11663038 10801534
37691A0801534j264510j613529j566032r93436m59405k85546j03891J94553J13362
$$ 10801534 9537024 7923495 6357463 5364027 4904622 4619076 4515185 4709738 4823100
37682D823100l92616o07299k79588o3251k62304k90913R5354K30387j79975l95028
$$ 4823100 4430484 3823185 3543597 3480346 3218042 2927129 3022483 3252870 3072895 2677867
37672B677867K5225L66857N0289l05256n17N18589M91730P9880j44987k22691
$$ 2677867 2703092 3069949 3120238 2814982 2814465 3333054 3824784 3904664 3759677 3536986
37662C536986m29122n16498j93868J65963R1544j74226j24520J72639L03887J84654
$$ 3536986 3107864 2591366 2397498 2563461 2655005 2480779 2356259 2528898 2832785 3017439
37652C017439j6909k41382m06215l23360o0652O9256O0120J69907K49091q8160
$$ 3017439 3000530 2759148 2352933 2029573 1968921 2038177 2098297 2268204 2517295 2429135
37642B429135n20751k61812N28397P29715O6616l22720K52663Q60399M99492k97543
$$ 2429135 1908384 1646572 2174969 2904684 2971300 2648580 2901243 3761642 4261134 3963591
37632C963591m49240K7430M27049O20600Q35389Q30637L27587k75852n16267o25721
$$ 3963591 3514351 3541781 3968830 4589430 5424819 6255456 6583043 6307191 5790924 5165203
37622E165203q75489q57306l11888O2325l54105r32043p40775n3204K18840M3127
$$ 5165203 4289714 3432408 3120520 3182845 2828740 1896697 1155922 1102718 1321558 1364685
37612A364685M5553K24213P9954k96540l96420k74633l10862l00337J53047O43389
$$ 1364685 1410238 1634451 1714405 1417865 1021445 746812 435950 135613 288660 932049
37602I32049M62500j60823m04020j92887j10991k00397M964L96855L75558m8707
$$ 932049 1394549 1233726 829706 636819 525828 325431 330395 727250 1102808 1054101
37592A054101k77680j72571r7937o1048J90921L89931R8413l48885l02401N0257
$$ 1054101 776421 603850 505913 444865 635786 1025717 1124130 775245 472844 523101
37582E23101R3573K1075M14095R11100P03083R1726M3000M29956L75087J11625
$$ 523101 616674 637749 1051844 1962944 2666027 2757753 2800753 3230709 3605796 3717421
37572C717421O07837J467897J370818O49511R90489K302339K759284K680129M898629
$$ 3717421 4325258 5793155 7163973 7813484 8803973 11106312 13865596 16545725 21444354
37563B1444354R366033J0775748M933677m639952j0227527r015323n119836l011131
$$ 21444354 30810387 41586135 46519812 41879860 31652333 22637010 17517174 14506043
37555A4506043k736432k334864j523299j156164j179535r71902n56580k16777
$$ 14506043 11769611 9434747 7911448 6755284 5575749 4603847 4047267 3830490
37547C830490J76508N94960N65072J34398J08342P16933J161876J082538J200582
$$ 3830490 4006998 4601958 5167030 5301428 5409770 6126703 7288579 8371117 9571699
37538I571699J850929K393846K983308N030099Q230542Q910106M005766m028594
$$ 9571699 11422628 13816474 16799782 21829881 30060423 38970529 42976295 38947701
37530C8947701r082130q302177m733166k602169k490806k437542j648801j000357
$$ 38947701 29865571 21563394 16830228 14228059 11737253 9299711 7650910 6650553
37522F650553r27829q76550n96660m50939m69508k94372m6507j91604n48815m53828
$$ 6650553 5722724 4846174 4249514 3798575 3329067 3034695 2988188 2796584 2247769 1793941
37512A793941L8621J35279l51154o40102k71202J84369J42566j05099p9608L0900
$$ 1793941 1832562 1967841 1616687 976585 705383 889752 1032318 927219 847611 878511
37502H78511j36387l30375r7343L88142N63746L14951n99j80703l08729l83375
$$ 878511 742124 411749 314406 702548 1266294 1581245 1580646 1399943 1091214 707839
37492G07839k85565n3282J56448K85976K99716Q9311k61759l76925r0763K06782
$$ 707839 422274 368992 525440 811416 1111132 1200443 938684 561759 470996 677778
37482F77778J10083j79311k00360L3710J38288L5195K6341K40826M33496L48387
$$ 677778 787861 608550 408190 441900 580188 615383 641724 882550 1316046 1664433
37472A664433J611l64827m49803j73329J08306m204k48345M9941P87457R14291
$$ 1664433 1666044 1301217 851414 678085 786391 782187 533842 583783 1371240 2285531
37462B285531j6086r29225o92675K02499M79836M6154j33773J91878K93989p1642
$$ 2285531 2269445 1340220 647545 850044 1329880 1376034 1242261 1434139 1728128 1656486
37452A656486k88743j57949k64860p18334p26989M7215P74863P03075K06377j3588
$$ 1656486 1367743 1209794 944934 226600 -500389 -453174 321689 1024764 1231141 1217553
37442A217553M0693N1355O7381J73829J20081j53973k24271Q3962L01234J26455
$$ 1217553 1258246 1309601 1376982 1550811 1670892 1516919 1292648 1376610 1677844 1804299
37432A804299n3163N2885Q3635j82410k69907R9468L45371K6633k69878O9613
$$ 1804299 1751136 1804021 1887656 1705246 1435339 1534807 1880178 1906811 1636933 1706546
37422A706546N02052J72215o21330r00278n49167k87966l60230l24763n0328P7398
$$ 1706546 2208598 2380813 1759483 859205 310038 22072 -338158 -662921 -713249 -635851
37412f35851m2954o8489J08224K35704K51244L08375L28356J40005n8659J6422
$$ -635851 -678805 -747294 -639070 -403366 -152122 156253 484609 624614 565955 582377
37402E82377J79146J12232j2126P2696O3301l68189p17983l12725M38880N32730
$$ 582377 761523 873755 861629 934325 997626 629437 -88546 -401271 37609 570339
37392E70339m8889l80642j58664o062j39207j0020M48166M88153p5059l55229
$$ 570339 521450 140808 -17856 -23918 -163125 -173145 275021 763174 688115 332886
37382C32886J20798N38113J76435l42155j33097M44626M34261j34769m11615j59438
$$ 332886 453684 991797 1168232 826077 692980 1137606 1571867 1437098 1025483 866045
37372H66045L3056j04761j35209J85214L95176M6013n77111q10744m36300J35843
$$ 866045 899101 794340 659131 844345 1239521 1285534 708423 -102321 -538621 -402778
37362d02778M11737L33689K05209K07221J79775l6149k58621k22614k9975J938
$$ -402778 8959 342648 547857 755078 934853 898704 640083 417469 387494 389432
37352C89432j34900j47572N0479K41736L16803L58616K92907o4926n22996n73500
$$ 389432 254532 106960 157439 399175 715978 1074594 1367501 1302575 779579 206079
37342B06079j22049K95942K46008o9402k37308k05905j59754j51453j31987j00916
$$ 206079 84030 379972 625980 556578 319270 113365 -46389 -197842 -329829 -430745
37332d30745j9550J88306L98337L24428m4295l20209k08234J13752K63236J09589
$$ -430745 -450295 -261989 136348 460776 416481 96272 -111962 1790 265026 374615
37322C74615j49196k10097O4579M48138M92327P0791l72537l92271j40105k3620
$$ 374615 225419 15322 79901 528039 1020366 1091157 718620 326349 186244 162624
37312A62624l7272N3737J20136r2733l20504j05648L45071M10689J01648R087
$$ 162624 125352 179089 299225 206492 -114012 -219660 125411 536100 637748 646835
37302F46835K10811J60871k11423k74104J60886M10588M3926m25855m40446k17832
$$ 646835 857646 1018517 807094 532990 693876 1104464 1148390 722535 282089 64257
37292F4257j73271k03832o3506J27110K01410K65198L45629K43185n394q5672
$$ 64257 -109014 -312846 -376352 -249242 -47832 217366 562995 806180 800786 715114
37282G15114j1192j13499k98715j12735L06067K79054j86569k73704K09530M03702
$$ 715114 703922 590423 291708 178973 485040 764094 577525 303821 513351 917053
37272I17053j04516n10244j69635L35058K74624o4750j05284J4643n3573j46565
$$ 917053 812537 302293 132658 467716 742340 677590 572306 586949 533376 386811
37262C86811p8556q7922k12421m9905L75716M68651J86914J67123L60087k9231
$$ 386811 308255 220333 7912 -41993 333723 802374 989288 1156411 1516498 1487267
37252A487267p87515o03228N85649J071671J57994n82359m7326N38989M4480m76200
$$ 1487267 699752 96524 682173 1753844 1911838 1329479 1282153 1821142 1865622 1389422
37242A389422N1925O01145J57769j68906N81508J063426K63262q7154J365687
$$ 1389422 1441347 2042492 2200261 2031355 2612863 3676289 3939551 3852397 5218084
37233E218084K628259J924491J417520L207516M769876L974136N501104J4199668
$$ 5218084 7846343 9770834 11188354 14395870 19165746 23139882 28640986 42840654
37225D2840654K3285876J9023485l61571j9255012k2896167j4039150n788776
$$ 42840654 66126530 85150015 84788444 65533432 42637265 28598115 22809339
37218B2809339m037971m519534l345824j912250j787200j647216o04928N0970
$$ 22809339 18771368 14251834 10906010 8993760 7206560 5559344 4954416 5005386
37210E005386l28527n71566j45751k6470n33690o83037j22401K95396J20017j87102
$$ 5005386 4676859 4105293 3959542 3933072 3399382 2716345 2593944 2889340 3009357 2822255
37200B822255l30668l54077o5197M82995O31103L27091N45946J431151J747843
$$ 2822255 2491587 2137510 2072313 2555308 3186411 3513502 4059448 5490599 7238442
37191G238442J392395K036502L744511M297824M276387Q324554J6718418J9982526
$$ 7238442 8630837 10667339 14411850 18709674 22986061 31310615 48029033 68011559
37183F8011559R299801r558613k0778913j7394777q074217l502388l852774l582499
$$ 68011559 77311360 67752747 46973834 29579057 21504840 18002452 14149678 10567179
37175A0567179j688972j073070j884859j712061m73342j33929o77925m58222L24037
$$ 10567179 8878207 7805137 5920278 4208217 3734875 3600946 2923021 2464799 2788836
37166B788836R5884q38355p90818J13334K34390n00342o11362J05713L65925j23133
$$ 2788836 2884720 2046365 1255547 1368881 1603271 1102929 491567 597280 963205 840072
37156H40072l32088J148J06177o6440J58643N25391J37859o68729o55213J56934
$$ 840072 507984 509132 615309 548869 707512 1232903 1370762 702033 46820 203754
37146B03754N10430J08019o9813K62449K51623l08133n01323j6603K43824k07510
$$ 203754 714184 822203 752390 1014839 1266462 958329 457006 440403 684227 476717
37136D76717o04243k77687L34954N68954M35411K10569l3978j79132p9664J7620
$$ 476717 -127526 -405213 -70259 498695 934106 1144675 1110697 931565 851901 869521
37126H69521k03130m24941j38763L46178K94573j71636k49175J42977K69546p1717
$$ 869521 666391 241450 102687 448865 743438 571802 322627 465604 735150 663433
37116F63433k57206l6862Q9671q2597j02347J75320K47414r4217l52325j65816
$$ 663433 406227 369365 459036 376439 274092 449412 696826 602609 250284 84468
37106H4468J94374L87295L63098Q3113l90287n58294o8591M70072K24285m39053
$$ 84468 278842 666137 1029235 1112348 722061 163767 95176 565248 789533 350480
37096C50480m21325K65392M74980j05637m24319P9680N21801J62259l44551j79021
$$ 350480 -70845 194547 669527 563890 139571 219251 741052 903311 558760 379739
37086C79739K44671J10689l88868m80556p4044K84630L11806J28756j24619k59563
$$ 379739 624410 735099 346231 -134325 -208369 76261 388067 516823 392204 132641
37076A32641k5219M13368M63424k38k91843O3116N62659N20767M1154l77556o45068
$$ 132641 107422 520790 984214 983976 692133 755249 1317908 1838675 1879829 1502273 857205
37065H57205q59897q03508l29136J56363K33429J29505K64203N17527N33997L89352
$$ 857205 -2692 -806200 -1135336 -978973 -745544 -616039 -351836 165691 699688 1089040
37055A089040L63306L78683K34561P7216R0694N1338k54996n15037l69685q0250
$$ 1089040 1452346 1831029 2065590 2142806 2233500 2284838 2029842 1514805 1145120 1064870
37045A064870j00251k89958k05471Q9601J69380N844o7405K336O371k729J63639
$$ 1064870 964619 674661 469190 558791 728171 734015 666610 668946 675317 672588 836227
37034H36227K95676K0936m78893o16934k70501Q7825J56539J30225J87895K03501
$$ 836227 1131903 1152839 673946 57012 -213489 -125664 30875 161100 348995 552496
37024E52496J01134L3344O2261M9786l6691p3233q6206k16951l28005q5580M41797
$$ 552496 653630 686974 749235 799021 762330 689097 602891 385940 57935 -27645 414152
37013D14152P00526L77486j48409l24503j12924R9600P5178o7698j27346o2859
$$ 414152 1114678 1492164 1343755 1019252 906328 1005928 1081106 1013408 886062 823203
37003H23203N0297J68515L07732M39637M35529K14243o2486r5823J86303N19654
$$ 823203 873500 1042015 1349747 1789384 2224913 2439156 2376670 2280847 2467150 2986804
36993B986804O40906N73876M84295M41900M63596N96001P85748Q53540P69732
$$ 2986804 3627710 4201586 4685881 5127781 5591377 6187378 6973126 7826666 8596398
36984H596398P56089R32592J098106J084066J063989J213773J307328J015888
$$ 8596398 9352487 10285079 11383185 12467251 13531240 14745013 16052341 17068229
36976A7068229M30318r2296m58287q25943j185347j362431j370207j347232j198498
$$ 17068229 17498547 17406251 16947964 16122021 14936674 13574243 12204036 10856804 9658306
36967I658306p30344j33001J30785j1206j26378M6448K26194J02670j41917j11260
$$ 9658306 8927962 8794961 8925746 8914540 8788162 8834610 9060804 9163474 9021557 8910297
36957H910297K44162O28342Q25640Q83336R29303R88003R75850Q02887M98480
$$ 8910297 9154459 9782801 10608441 11491777 12421080 13409083 14384933 15187820 15686300
36948A5686300K36439J47224J08670j40685o50698j161143j400681j348205j140599
$$ 15686300 15922739 16069963 16178633 16037948 15387250 14226107 12825426 11477221 10336622
36939A0336622q76119o24508n09118o03126p64625p31076m39358j54124j69864
$$ 10336622 9460503 8835995 8326877 7723751 6959126 6228050 5788692 5634568 5464704
36930E464704m23618n49010l52596p4817n2004k62743m14359l80927k93609k38776
$$ 5464704 5041086 4492076 4139480 4064663 4012659 3749916 3335557 2954630 2661021 2422245
36920B422245j63051r3708j45109k50398k05768n7585q1474k49820j46159L40709
$$ 2422245 2259194 2165486 2020377 1769979 1564211 1506626 1425152 1175332 1029173 1369882
36910A369882O58445L18190l38922n64142j98558K10224J97069j35994m10152
$$ 1369882 2028327 2346517 2007595 1443453 1244895 1455119 1652188 1516194 1106042
36901A106042l96056j26782J59456J92801k6837j82331o3280J36447J68279J36604
$$ 1106042 709986 583204 742660 935461 908624 726293 663013 799460 967739 1104343
36891A104343K26482K59601l5911m68864n86758l56420j47958p4301J17342M45661
$$ 1104343 1330825 1590426 1554515 1085651 498893 142473 -5485 -79786 37556 483217
36881D83217N44528K86576N6465J40135K65678P5632k78994l85880j95867l2303
$$ 483217 1027745 1314321 1370786 1510921 1776599 1852231 1573237 1187357 991490 959187
36871I59187o9435j22840J7068K59857L17626O6907k64483l26318o4821K01620
$$ 959187 889752 766912 783980 1043837 1361463 1428370 1163887 837569 772748 974368
36861I74368K02515N5298J9369P7967L9676o1063j7803J23855P6059j97931l69630
$$ 974368 1176883 1232181 1251550 1329517 1369193 1308130 1290327 1414182 1490241 1292310 922680
36850I22680k61421j36862k60332m42732l11823J18179M33948L54003N7038p9222
$$ 922680 661259 524397 264065 -178667 -490490 -372311 61637 415640 472678 393456
36840C93456M8958J69909K2639k62232l25437j00502Q1356J0330o7332J26417
$$ 393456 442414 612323 634962 372730 47293 -53209 28147 38477 -28855 97562
36830I7562M00504L69734N7883j66405j49759m7947N8445K00255K13750j04534
$$ 97562 498066 867800 925683 759278 609519 561572 620017 820272 1034022 929488
36820I29488m95140m08211J73857N77852L37465j80756l34384k5483L44967M44344
$$ 929488 434348 26137 199994 777846 1115311 934555 600171 574688 919655 1363999
36810A363999K21230j96400n11938l87792J33474N17632L44847j27951l07057
$$ 1363999 1585229 1388829 876891 489099 622573 1140205 1485052 1357101 1050044
36801A050044l5301K90803L14921J21561N963P2802J63748R0891j27150k71112
$$ 1050044 1014743 1305546 1620467 1742028 1747991 1820793 1984541 2075432 1948282 1677170
36791A677170j76419O4384K35370K60532J82258k6967l66439n70836l33169J72603
$$ 1677170 1500751 1565135 1800505 2061037 2243295 2216328 1849889 1279053 945884 1118487
36781A118487L65317J0101m43318m81549j61852J33095K67247L35672L00996L1925
$$ 1118487 1483804 1493905 1050587 569038 407186 540281 807528 1143200 1444196 1476121
36771A476121l83233o69817o70845m14003L588L71910L71981o6457n11526m59069
$$ 1476121 1092888 423071 -247774 -661777 -658189 -286279 85702 19245 -492281 -951350
36761i51350L0407M33927M64096L13628J91564K6251k10571k57537N0040L86548
$$ -951350 -920943 -487016 -22920 290708 482272 508523 297952 40415 90455 477003
36751D77003L07537p6010j95036J51210M62956K59944j95952k87614L8126K38818
$$ 477003 784540 708530 513494 664704 1127660 1387604 1191652 904038 942164 1180982
36741A180982N2656j42786l2257J05676o0931k85096j59634J42366J39696j17599
$$ 1180982 1233638 1090852 1058595 1164271 1103340 818244 658610 800976 940672 823073
36731H23073j14595K53944M96011L00503n7408k47380l14610l76818l44654j80109
$$ 823073 708478 962422 1458433 1758936 1701528 1454148 1139538 762720 418066 237957
36721B37957n0410j2943R2459K57839K08589j01801k97336j28158J50233J95779
$$ 237957 187547 174604 267063 524902 733491 631690 334354 206196 356429 552208
36711E52208L5205j30944k27474j86229R3321M28391L97619l8690l75719k91603
$$ 552208 587413 456469 228995 42766 136087 564478 962097 923407 547688 256085
36701B56085q4341p5856r0655O7310J39100p0090j75597J68008N40304L45300
$$ 256085 171744 95888 5233 72543 211643 141553 -34044 133964 674268 1019568
36691A019568j72405k56347J75694M29034J11220l65851m79123k44942r166K5660
$$ 1019568 847163 590816 766510 1195544 1306764 940913 461790 216848 207682 233342
36681B33342p7615j05339R0520L34448K44248j93674m60270k31506Q9838K4244
$$ 233342 155727 50388 140908 475356 719604 525930 65660 -165846 -76008 -51764
36671e1764j72794L7274M99952N71330J59395j76025j42646l0801n3403l4616
$$ -51764 -224558 -187284 312668 883998 1043393 867368 724722 693921 640518 605902
36661F05902J13140J80806P5068n0651j55246l19605l85144j26327K02419R8863
$$ 605902 719042 899848 974916 924265 769019 449414 64270 -62057 140362 239225
36651B39225l47856m89046j08512K63365K13547j069o894J53057K94283L76941
$$ 239225 -108631 -597677 -706189 -442824 -229277 -230346 -237240 -84183 210100 587041
36641E87041L00950m8581l60695j09840N53612P82034K34006l63490k99820R8003
$$ 587041 887991 839410 478715 368875 922487 1704521 1938527 1575037 1275217 1373220
36631A373220R3811l22322n73551m33972k05329j32231j46400j07426M6121K85898
$$ 1373220 1467031 1144709 571158 137186 -68143 -200374 -346774 -454200 -408079 -122181
36621a22181M28960K78250l4064j48108m0870o4940k68958k25395J93229M60507
$$ -122181 306779 585029 550965 402857 361987 297047 28089 -197306 -4077 456430
36611D56430K15760j38822j43296j9112j27379k26315L3234L18005J02204l68972
$$ 456430 672190 533368 390072 370960 243581 17266 50500 368505 470709 101737
36601A01737m13124j2556K14395N3765o1257J30867L47299L03886P1207j84860
$$ 101737 -311387 -323943 -109548 -55783 -117040 13827 361126 665012 736219 551359
36591E51359l40985k04002K45634N48654K55446l17139m19490L1701L36846R1869
$$ 551359 210374 6372 252006 800660 1056106 738967 319477 351178 688024 779893
36581G79893k81569l02319j12825o7595j36806j02828L398K2904j3209K5590J31468
$$ 779893 498324 196005 83180 15585 -121221 -224049 -220651 -197747 -210956 -185366 -53898
36570e3898K11531K28305J65749K4164p8710j093J74270K00227J2551k06413l22620
$$ -53898 157633 385938 551687 575851 497141 496048 670318 870545 883096 676683 354063
36559C54063l56563k96051r3321J33347J92512J34106J68733K68549J89887q2567
$$ 354063 -2500 -298551 -391872 -258525 -66013 68093 236826 505375 695262 612695
36549F12695k78350k79271k49506k65246j90246k475J31524J92582L25207M31460
$$ 612695 334345 55074 -194432 -459678 -649924 -652399 -520875 -328293 -3086 428374
36539D28374J94540l41589o69298n11375k00865j26483k05913j92297j13811p1800
$$ 428374 622914 281325 -387973 -899348 -1100213 -1226696 -1432609 -1624906 -1738717 -1810517
36529a810517N5779L33537M67719J85260k64884l60068K9721N00259N88711K22027
$$ -1810517 -1754738 -1421201 -953482 -768222 -1033106 -1393174 -1363453 -863194 -274483 -52456
36519e2456k37918l17818O9378M44687L05265j91231m40547k65783p7924j03886
$$ -52456 -290374 -608192 -538814 -94127 211138 19907 -420640 -686423 -764347 -868233
36509h68233p3065J22113J31285j21201r0853M68566Q78483N11860j51125k50883
$$ -868233 -941298 -819185 -687900 -809101 -899954 -431388 447095 958955 807830 556947
36499E56947J05943J48074k03275k85959P6467K96529P4489j82072j93121k15926
$$ 556947 662890 810964 607689 321730 398197 694726 769215 587143 394022 178096
36489A78096l43404j97123L07486O20204M10346R3418M0260p2343n37922q56140
$$ 178096 -165308 -362431 -54945 565259 975605 1069023 1109283 1036940 499018 -357122
36479c57122m29425L94787P42900M26901K2503r5404q3559o3178P9216K65436
$$ -357122 -786547 -391760 351140 778041 800544 705140 621581 558403 637619 903055
36469I03055K21313J7406M9110L23338L26530j48871n70584m21048L4973J73312
$$ 903055 1124368 1141774 1190884 1514222 1840752 1691881 1121297 700249 735222 908534
36459I08534r5927l29008k72583j08446j2981Q1500K02424J85839k7515k25372
$$ 908534 812607 483599 211016 102570 89589 171089 373513 559352 531837 306465
36449C06465k38816j91742k25478j93834P4164L67953L34175P5775P5608M22883
$$ 306465 67649 -124093 -349571 -543405 -469241 -101288 232887 308662 384270 807153
36439H07153N68793J30559m52422n03575r3680R5699j95752m79110l06808J23679
$$ 807153 1375946 1506505 1054083 550508 456828 552527 356775 -122335 -429143 -305464
36429c05464L67501L15724J27047p0888j44132O0033M01880M37905L5100l21604
$$ -305464 62037 377761 504808 433920 289788 349821 751701 1189606 1224706 903102
36419I03102k06582Q7997M6824k04751j45099J91910K13290k34841n44385k59820
$$ 903102 696520 784517 831341 626590 481491 673401 886691 651850 107465 -152355
36409a52355K45943L65658J14419j9945J57645L27998J41790l28198o40646m32277
$$ -152355 93588 459246 573665 553720 711365 1039363 1181153 852955 212309 -219968
36399b19968J43372M80793J96717l44012m61349n6613L11150K50629j6155j36603
$$ -219968 -76596 404197 600914 256902 -204447 -261060 50090 300719 284564 147961
36389A47961q4300N1475K72924M30194K21544k75197n12859k39080J00820Q8362
$$ 147961 63661 115136 388060 818254 1039798 764601 251742 12662 113482 201844
36379B01844l1272J00609K65101J18706r4585K7682K59824J49379q2500J03848
$$ 201844 170572 271181 536282 654988 560403 588085 847909 997288 914788 1018636
36369A018636M88180L10175m30743q45500m99754J550O6246q0022m5966J9378
$$ 1018636 1506816 1816991 1386248 540748 40994 42544 108790 28768 -17198 2180
36359B180j15568k17470m2809J54359Q9302j2099J51899L71704K87538P253j30043
$$ 2180 -113388 -330858 -373667 -219308 -130006 -142105 9794 381498 669036 676289 546246
36348E46246j10966r6944r737K44286M02439K03623j01392r3136J50525K15531
$$ 546246 435280 338336 328599 572885 975324 1178947 1077555 984419 1134944 1350475
36338A350475J3176j98139l11117m16161m60255l11870q0759L5153J13382L20582
$$ 1350475 1363651 1165512 854395 438234 -22021 -333891 -414650 -379497 -266115 54467
36328E4467N05387M06438J32854m168r821j06177k50192k24839q6638m2876k1529
$$ 54467 559854 966292 1099146 1094978 1085157 978980 728788 503949 417311 374435 352906
36317C52906J33255K06689p0154m11706l36605k787M1669j54782m3715L43988
$$ 352906 486161 692850 622696 210990 -125615 -128402 -86733 -241515 -285230 58758
36307E8758L51227j15712l24703K3644K43328j16293m17172j9544N59375M56612
$$ 58758 409985 294273 -30430 -6786 236542 120249 -296923 -316467 242908 699520
36297F99520j37303l44019n432K34116R7909P211J95623L05474Q3217j53407m1426
$$ 699520 562217 218198 212766 446882 544791 552002 747625 1053099 1136316 982909 941483
36286I41483K60960L25027K8860l18586l25590O3016M34226L01057k64640o14860
$$ 941483 1202443 1527470 1556330 1237744 912154 975170 1409396 1710453 1445813 830953
36276H30953l46697J36668K10859j02155k98214k05297r3907q1006L976J51840
$$ 830953 484256 620924 831783 729628 431414 226117 132210 51204 55180 207020
36266B07020J19920p5332j23735O193k6585k81125l06453J38100N85059M71434
$$ 207020 326940 251608 127873 134066 107481 -173644 -480097 -341997 243062 714496
36256G14496p0231m38486l68606j15951M9752J53822L03902M36656L69552K3193
$$ 714496 644265 205779 -162827 -278778 -229026 -75204 228698 665354 1034906 1058099
36246A058099m15485n65828k34160K49869L13134j27213m79887k53747K44627
$$ 1058099 642614 76786 -157374 92495 405629 278416 -201471 -455218 -210591
36237b10591L41175m7288l38405j63751J44984J31770j04175j34289J11765K69551
$$ -210591 130584 83296 -255109 -418860 -273876 -142106 -246281 -380570 -268805 746
36227G46J11491j52475k33625j43715m0406R4235L51717N62904L84841j90408
$$ 746 112237 -40238 -273863 -417578 -457984 -363749 -12032 550872 935713 745305
36217G45305o60380n49388p269L50336J89127j67505k00532J27281L52854J51644
$$ 745305 84925 -464463 -471732 -121396 67731 -99774 -300306 -173025 179829 331473
36207C31473k14311k27174K06429O10605N13058n811m48503m70621j72430J11670
$$ 331473 117162 -110012 96417 707022 1220080 1214269 765766 295145 122715 234385
36197B34385J59323J2307r4959K6841K67235K74494r4717m87374m42714j3641
$$ 234385 393708 406015 311056 337897 605132 879626 784909 297535 -145179 -158820
36187a58820K80474J39424j72716k57102q0874J00375J03224n7491k33156k14306
$$ -158820 121654 261078 88362 -168740 -249614 -149239 -46015 -103506 -336662 -550968
36177e50968P6920L69358K52872k57458o21480m27291R1760M01359K92333o3752
$$ -550968 -474048 -104690 148182 -109276 -730756 -1158047 -1066287 -664928 -372595 -436347
36167d36347m27499n73653l05870K60434O23913M70241J39718J28584L15123J89156
$$ -436347 -863846 -1437499 -1743369 -1482935 -859022 -388781 -249063 -120479 194644 383800
36157C83800k55347m53082j50279K20915K46116J04489J48838L14485L01465O8181
$$ 383800 128453 -324629 -474908 -253993 -7877 96612 245450 559935 861400 929581
36147I29581j96632l92147m84530l46680M5897L76886K99257m5088j47300J76958
$$ 929581 732949 340802 -143728 -490408 -444511 -67625 231632 186544 39244 216202
36137B16202N16617M18420k8327l67474l80909k47410j38844K4328K80596L61849
$$ 216202 732819 1151239 1122912 755438 374529 127119 -11725 12603 293199 655048
36127F55048J8954n03915o61981k90483K17587M64495M40168K63040o0149l75407
$$ 655048 674002 170087 -491894 -782377 -564790 -100295 339873 602913 542764 167357
36117A67357k90950K58192O71864L95766k45270m58410r8489K11595O5715k21798
$$ 167357 -123593 134599 806463 1202229 956959 498549 400060 611655 677370 455572
36107D55572k32189k3630J37053J89393J70321M7441j00289o0763J32704J38148
$$ 455572 223383 199753 336806 526199 696520 743961 643672 582909 715613 853761
36097H53761j41215k97931k7197L33885K63950j81604m82371l85785j26013L3060
$$ 853761 712546 414615 387418 721303 985253 803649 321278 -64507 -190520 -157460
36087a57460J00484J68597K12795J77531J01038Q4377J93444L70507M17132J79775
$$ -157460 -56976 111621 324416 501947 602985 687362 880806 1251313 1668445 1848220
36077A848220j92167l44125j75052Q62r0183k72547k02751J00437K89172J74209
$$ 1848220 1656053 1311928 1136876 1137738 1047555 775008 572257 672694 961866 1136075
36067A136075q0171k27602j92109m8688Q1499J12423P7866R3227J46732M4945
$$ 1136075 1055904 828302 636193 587505 669004 781427 859293 952520 1099252 1144197
36057A144197k85520n62966m33139O1318M94633N36324K58250l2026j21314l7376
$$ 1144197 858677 295711 -137428 -76110 418523 954847 1213097 1181071 1059757 1022381
36047A022381L1601n9144k50298l49198k73959j39323o8329l8849K3691J21873
$$ 1022381 1053982 994838 744540 395342 121383 -17940 -86269 -125118 -101427 20446
36037B0446K15940K58855J69993o6081k53811j64039R2447J44114r0038k42092
$$ 20446 236386 495241 665234 599153 345342 181303 273750 417864 327826 85734
36027H5734n4867K24048K46605O0520q4711j50718k06864j65208L1396J75315
$$ 85734 30867 254915 501520 562040 477329 326611 119747 -45461 -14065 161250
36017A61250R5737k8168n831j4428k18662l13480O551L81936K59548j41981j10071
$$ 161250 256987 228819 222988 208560 -10102 -323582 -317031 64905 324453 182472 72401
36006G2401L53358M52628j10172o13284m51225k4153M6016n6502K03784O62420
$$ 72401 425759 878387 768215 154931 -296294 -320447 -274431 -330933 -127149 535271
35996E35271O35642k9n89187n87797j58973J99764K26038j0483k79098l51865
$$ 535271 1170913 1170884 581697 -6100 -165073 34691 260729 250246 -28852 -380717
35986c80717j88140N871M0023J55O1450J46308M0268k01976k72324n6684K13552
$$ -380717 -568857 -562986 -522963 -522808 -461358 -315050 -274782 -476758 -749082 -805766 -592214
35975e92214L22701L22738L19579K52413N6926j30716j37669k2523J7651l9714
$$ -592214 -269513 53225 372804 625217 682143 551427 413758 391235 408886 369172
35965C69172k3711J21331K07167Q1772j17784j59919p0725p1974j90249j91245
$$ 369172 345461 466792 673959 755731 637947 478028 407303 335329 145080 -46165
35955d6165J8968J96937J40863J7984M9123Q2713j47633m73946m49275m2784K77900
$$ -46165 -27197 169740 310603 328587 377710 460423 312790 -161156 -610431 -653215 -375315
35944c75315K49109J43156K18235K80017Q8051j74313k06268q2548n1983p5678
$$ -375315 -126206 16950 235185 515202 603253 428940 222672 140124 88141 12463
35934A2463J3660P3332j56444n06171n04803p4286L39314M03863K66690J65367
$$ 12463 26123 99455 -56989 -563160 -1067963 -1142249 -802935 -399072 -132382 32985
35924C2985P0196p9830j21364O9683K74557J77425j84566m36079k93040J44650
$$ 32985 103181 23351 -98013 -28330 246227 423652 239086 -196993 -490033 -345383
35914c45383M84828L79320j30460n78454n38081j37500J12681L3784j9494J89807
$$ -345383 139445 518765 388305 -190149 -728230 -865730 -753049 -719265 -738759 -548952
35904e48952L48398J53850o4647J73246O13013N29148j15645m82136q7823M08536
$$ -548952 -200554 -46704 -111351 61895 674908 1204056 1088411 606275 518452 926988
35894I26988J53850o23669r38251m38558K08771L55414J58253R4025J90058J35463
$$ 926988 1080838 457169 -481082 -919640 -710869 -355455 -197202 -103177 86881 222344
35884B22344j19763k89374j94404K8516J71047J96830J97450K15113J53207j27435
$$ 222344 102581 -186793 -381197 -352681 -181634 15196 212646 427759 580966 453531
35874D53531n68113q14177n38208J13814O11477O38888L73533J04483r8365j82033
$$ 453531 -114582 -928759 -1466967 -1353153 -741676 -102788 270745 375228 276863 94830
35864I4830K2078M18257N06807N8175l90451k44435K10826K40656j46456k40157
$$ 94830 116908 535165 1041972 1100147 709696 465261 676087 916743 770287 530130
35854E30130J29099K77896j39192m88133k02321K69792K34660j11909j13219J88770
$$ 530130 659229 937125 797933 309800 107479 377271 611931 500022 386803 575573
35844E75573J94633j46306k54321M0928J98282j08922m60924l78236J3207L17621
$$ 575573 770206 623900 369579 410507 608789 499867 38943 -339293 -326086 -8465
35834h465M11664L39873Q0003k47438k85866Q1610M41762L80106N2144j20205
$$ -8465 403199 743072 823075 575637 289771 371381 813143 1193249 1245393 1125188
35824A125188q8326j14874k39959k43450q3243K9981J4357K2174J02826P8690
$$ 1125188 1036862 921988 682029 438579 355336 385317 399674 421848 524674 603364
35814F03364j27265l05346k58040q9383k3888p3138o7563M6266J23550N5930m8863
$$ 603364 476099 170753 -87287 -176670 -200558 -273696 -341259 -294993 -171443 -115513 -164376
35803a64376q140J70894K71711J37094j20697k43769j19020J26248K81355K25174
$$ -164376 -172516 -1622 270089 407183 286486 42717 -76303 49945 331300 556474
35793E56474j0875k47301k72428q1532O3206k2260j33737J9395K76867J92042
$$ 556474 545599 298298 25870 -55662 7544 -14716 -148453 -129058 147809 339851
35783C39851k23205l97482n6723K92016J08207l53213m54079j07746K68818N11702
$$ 339851 116646 -280836 -337559 -45543 62664 -290549 -744628 -852374 -583556 -71854
35773g1854P52220Q06592K82461n97682j005714o09279l0458J27275Q3222K49467
$$ -71854 680366 1486958 1769419 1171737 166023 -443256 -473714 -346439 -263217 -13750
35763a3750L88247O0165m80438n70087j33845K74050L45480K97564K86334J75299
$$ -13750 374497 434662 -45776 -615863 -749708 -475658 -130178 167386 453720 629019
35753F29019j0134J5574K49116K60856j46849n73207n78478k48609N8807K00701
$$ 629019 618885 634459 883575 1144431 997582 424375 -154103 -402712 -343905 -143204
35743a43204K13177R9589n5533k7463K08116L25024J20028j27558r6257L8007
$$ -143204 69973 169562 114029 86566 294682 619706 739734 612176 515919 553926
35733E53926r1220l92162m40133j61404Q1166R6880J11740K97215M50909L44072
$$ 553926 462706 70544 -369589 -530993 -449827 -352947 -241207 56008 506917 850989
35723H50989R3973l9575l6915p7673k28851l67077l72084k56890j05174L0712
$$ 850989 944962 905387 868472 790799 561948 194871 -177213 -434103 -539277 -508565
35713e08565J41438K07481J83282P3636o67R0588K91958L81345K32639n3383l25159
$$ -508565 -367127 -159646 23636 97272 96605 187193 479151 860496 1093135 1039752 714593
35702G14593n25588n82504l68442N8661L65984L24680J27441Q7648J75507J45737
$$ 714593 189005 -393499 -761941 -703280 -337296 -12616 114825 202473 377980 523717
35692E23717o197p1916m4400j16184k56970j87326J33723L52679K09540j06565
$$ 523717 517520 445604 401204 285020 28050 -159276 -25553 327126 536666 430101
35682D30101k59770j88674n8197R129j1990j09052k08585k12632j35845p3794
$$ 430101 170331 -18343 -76540 -67411 -79401 -188453 -397038 -609670 -745515 -819309
35672h19309q520J60152L58075L57840J33574n8365o0225j7673o6504p4664J08684
$$ -819309 -827829 -667677 -309602 48238 181812 123447 63222 45549 -20955 -95619 13065
35661A3065L56608M26507K71495K4024j91793k94763k41520j08590l5770j2909
$$ 13065 369673 796180 1067675 1091699 899906 605143 363623 255033 219263 206354
35651B06354Q7625K17962J68973l6700r9845N9040J29059m5573j51050L6020J63386
$$ 206354 293979 511941 680914 644214 544369 603409 732468 686895 535845 571865 735251
35640G35251j62168o49735o72645j81567K65526L23041J98946J67698K18217K63814
$$ 735251 573083 -76652 -749297 -930864 -665338 -342297 -143351 24347 242564 506378
35630E06378K88386J86112j66900n70445n90933j41752L43767M76232L54427K68405
$$ 506378 794764 980876 813976 243531 -347402 -489154 -145387 330845 685272 953677
35620I53677K33141O4190k45227m57717l62623m373L26693L25777j0140l29302
$$ 953677 1186818 1251008 1005781 548064 185441 181068 507761 833538 823398 494096
35610D94096l33229j74982k22575m74227n34323k20914J52016K54414J88767K21498
$$ 494096 160867 -14115 -236690 -710917 -1245240 -1466154 -1314138 -1059724 -870957 -649459
35600f49459L11856K13144p9403k73484j60068J50805L82871L49746O9801k58344
$$ -649459 -337603 -124459 -203862 -477346 -637414 -486609 -103738 246008 315809 57465
35590E7465l96120k62322J3281K61398M26213M93944L87587P6933k68317m08643
$$ 57465 -338655 -600977 -587696 -326298 99915 593859 981446 1058379 790062 381419
35580C81419l25590k25567k08966j05735K24660N57909N03530M2970l66301l36661
$$ 381419 55829 -169738 -378704 -484439 -259779 298130 801660 844630 478329 141668
35570A41668p203K17665K13050J56686J19148k9953k93719m50619l81872k31290
$$ 141668 134465 352130 565180 721866 841014 811061 517342 66723 -315149 -546439
35560e46439j37694o0270K9627M8130K810K2555P8065p192j50071j5588L71756
$$ -546439 -684133 -744403 -714776 -666646 -663836 -641281 -563216 -570408 -720479 -736067 -364311
35549c64311M79867M9093m18823l58962P0882L59746M01389L53120J36192k77324
$$ -364311 115556 164649 -254174 -613136 -542254 -182508 218881 572001 708193 430869
35539D30869m29211K0104N22432L17443l10653l94298J62070M28405j1806m32670
$$ 430869 1658 21762 544194 861637 550984 156686 318756 747161 735355 302685
35529C02685k40479J08359J1222k98216l16397j28973l2619J12486M60953O24059
$$ 302685 62206 170565 181787 -116429 -432826 -561799 -594418 -481932 -20979 603080
35519F03080K53169k39106k63313k594m1612l43269l74562o9712J09743J1791
$$ 603080 856249 617143 353830 351236 309624 -33645 -408207 -477919 -368176 -356385
35509c56385l4153R7622J31634l2547j18657K8534K12606K46840J43425q4562
$$ -356385 -390538 -292916 -161282 -193829 -312486 -283952 -71346 175494 318919 234357
35499B34357l96390n06202j51664L98587N74330K86478J2598M3061J40843O7974
$$ 234357 -162033 -668235 -819899 -421312 153018 439496 452094 495155 635998 703972
35489G03972n2228q8050j50624k55873j57729J96230M06453J46453l22080m76088
$$ 703972 651744 563694 413070 157197 -532 195698 602151 748604 426524 -49564
35479d9564j84352K35067M49736L57009K7350l46733n08197l41586j2978K00040
$$ -49564 -233916 1151 450887 807896 835246 488513 -19684 -361270 -374248 -174208
35469a74208J88574P0045K5845J20109K29895J68742n5530j87573o1831J18384
$$ -174208 14366 84411 110256 230365 460260 629002 573472 385899 324068 442452
35459D42452O0340j53553j83111K0413J33983j2701j80943j23047P1215K02085
$$ 442452 502792 349239 166128 186541 320524 307823 126880 3833 75048 277133
35449B77133K60114K91374J97277q4408l60163l85861j97104l0311J7114N6988
$$ 277133 537247 828621 1025898 941490 581327 195466 -1638 -31949 -14835 42153
35439D2153J69146K59609J96954J891j52348j27172K0330J22467J44487K01957
$$ 42153 211299 470908 667862 669753 517405 390233 410563 533030 677517 879474
35429H79474K70367J00569l63974p01322n02782k4749J06741j67537k29907K20330
$$ 879474 1149841 1250410 886436 185114 -317668 -342417 -235676 -403213 -633120 -412790
35419d12790N93638K27487n82354q80843k75070N92366Q45193L26516l75115o42420
$$ -412790 180848 408335 -174019 -1054862 -1329932 -737566 107627 434143 59028 -583392
35409e83392l92087J8454K68210L33099L14998K25635P8094J7367J17025J68044
$$ -583392 -975479 -957025 -688815 -355716 -40718 184917 263011 280378 397403 565447
35399E65447k4965k32805q4514K70172K74096j68987m78765k83482K7093J4594
$$ 565447 540482 307677 223163 493335 767431 598444 119679 -163803 -136710 -122116
35389a22116p2423J57302L89143M7392o29353p80772k10839L07640K08576j22835
$$ -122116 -194539 -37237 351906 399298 -230055 -1010827 -1221666 -914026 -705450 -828285
35379h28285j33610L7972J6026l4615K39967N86914M44267r0333l18761j2672
$$ -828285 -961895 -923923 -907897 -942512 -702545 -115631 328636 238303 -80458 -93130
35369i3130K71474J31792r0536r620J11192j21606m64377m06263l1764J35422
$$ -93130 178344 310136 219600 209980 321172 199566 -264811 -671074 -702838 -567416
35359e67416J7357N2569L84958O21662N11314K69734N6120k87005p13729p75012
$$ -567416 -550059 -497490 -112532 509130 1020444 1290178 1346298 1059293 345564 -429448
35349d29448l11087J61482J75360l6178o4203k1793j54161j97536J67930N53818
$$ -429448 -740535 -579053 -403693 -439871 -504074 -525867 -680028 -877564 -709634 -155816
35339a55816L47320k23667l41038J31388M66026K56920l8208J5436J61974N1051
$$ -155816 191504 -32163 -373201 -241813 224213 481133 442925 458361 620335 671386
35329F71386j39181j27296p0449k14180l89143k97190k700K33077L36229L21122
$$ 671386 532205 404909 334460 120280 -268863 -566053 -568753 -335676 553 321675
35319C21675J02314k67747m54374k61005O1913K15186K58740L13863K02982k04082
$$ 321675 423989 156242 -298132 -559137 -497224 -282038 -23298 290565 493547 289465
35309B89465n71096m85815q0626J72514J40424Q2978J44486K05329J85643J36118
$$ 289465 -281631 -767446 -848072 -675558 -535134 -452156 -307670 -102341 83302 219420
35299B19420O3699l4726m3221P8986R7169j69890m45559l21138Q1552K16158q7825
$$ 219420 283119 248393 205172 284158 381327 211437 -234122 -555260 -473708 -257550 -345375
35288c45375l66644k13192J42262K02217p1843k17588O6873M75773M68956l840
$$ -345375 -712019 -925211 -782949 -580732 -652575 -870163 -803290 -327517 141439 137599
35278A37599m03309l13954J2481R7067k2019M8943K70149J61884l14889n22167
$$ 137599 -265710 -579664 -567183 -470116 -492135 -443192 -173043 -11159 -326048 -848215
35268h48215r0855M72990N45340K50059P7442O9317m9587k52390l00366k20079
$$ -848215 -939070 -466080 79260 329319 406761 476078 426491 174101 -126265 -346344
35258c46344j65698l4297K66988M22145J37398k62043k64464J3171Q0954n4284
$$ -346344 -512042 -546339 -279351 142794 280192 18149 -246315 -233144 -152190 -206474
35248b06474P833K27093J79392q0153k0569M04022N76442J95267k79417m05097
$$ -206474 -198641 28452 207844 127691 107122 511144 1087586 1282853 1003436 598339
35238E98339l24368k71452j31385J63774L29334J75629o6105j50783j43957j14929
$$ 598339 273971 2519 -128866 34908 364242 539871 473766 322983 179026 64097
35228F4097M7526K89122L25698J50970J20643K99022K61437j62169n05115l90341
$$ 64097 111623 400745 726443 877413 998056 1297078 1558515 1396346 891231 500890
35218E00890j08258n8202j19059l3328N6723m1974j13513O0589K24151R9127o5457
$$ 500890 392632 334430 215371 182043 238766 196792 83279 143868 368019 467146 401689
35207D01689M3838J62979j00730m92057m69961j25022j7410k20198k52211M0075
$$ 401689 445527 608506 507776 15719 -454242 -579264 -596674 -816872 -1069083 -1029008
35197a029008K39340J18668K3220K65089O19834O83573L95105l685k76477l19007
$$ -1029008 -789668 -671000 -647780 -382691 237143 920716 1315821 1312136 1035659 716652
35187G16652j80949m8461m9937q6529j8596P5023M9040k9130l4497o4090k13372
$$ 716652 535703 487242 437305 350776 332180 407203 456243 427113 392616 328526 115154
35176A15154k43880P3922M16811K62152k46252m01573L32L38319J54108j60309
$$ 115154 -128726 -54804 362007 624159 377907 -23666 -23334 314985 469093 308784
35166C08784q8646J23911q0782n48473n30062J92285R04197Q86393L06583j36234
$$ 308784 220138 344049 263267 -285206 -815268 -622983 281214 1167607 1474190 1337956
35156A337956j88057k32438n33346p27108l51291L62307O65197K84849j95743
$$ 1337956 1149899 917461 384115 -342993 -694284 -331977 333220 618069 422326
35147D22326j70912J59386J98231p7066j20038K42048M67165J14446m74718o65248
$$ 422326 251414 410800 609031 531965 411927 653975 1121140 1235586 760868 95620
35137I5620l78243n2317M4057K8861J2512o8952j64564n6300K24921K74025j17248
$$ 95620 -282623 -334940 -290883 -262022 -249510 -318462 -483026 -539326 -314405 -40380 -157628
35126a57628n29648m32846K6709K09273p2835l05774j15714J63073J09782m0997
$$ -157628 -687276 -1120122 -1093413 -884140 -956975 -1262749 -1378463 -1215390 -1105608 -1146605
35116a146605J88582O48749P32882L23420o5545j31527j48883l28218m03874j59054
$$ -1146605 -958023 -309274 423608 747028 681483 549956 401073 72855 -331019 -490073
35106d90073J30194J38191o526j3709R8039J55493J51370R5405j39157m89838
$$ -490073 -359879 -221688 -228214 -241923 -143884 11609 162979 258384 119227 -370611
35096c70611n54110j41304L26176L63253R8789p008J39145K73508K53518J17590
$$ -370611 -924721 -1066025 -739849 -376596 -277807 -284815 -145670 127838 381356 498946
35086D98946j07039k83107j35336K70575L86960j8481l56910r9923K88897P3777
$$ 498946 391907 108800 -26536 244039 630999 612518 255608 155685 444582 518359
35076E18359m85873n17148M5784M23464K95924J22687J10950q9833m65867m37038
$$ 518359 32486 -484662 -438878 -15414 280510 403197 514147 424314 -41553 -478591
35066d78591P9834L48484k0342m45419l79779j04389n614J16902M19140M71681
$$ -478591 -398757 -50273 -70615 -516034 -895813 -1000202 -1005816 -888914 -469774 1907
35056A907M4283k71973K0158M22842K68083j30245m9392L71833L94493p7862m49416
$$ 1907 46190 -225783 -205625 217217 485300 355055 305663 677496 1071989 994127 544711
35045E44711m60491l95740l54432j36841J60086J95463N2030J43338M21880L78605
$$ 544711 84220 -311520 -665952 -802793 -642707 -447244 -395214 -251876 170004 548609
35035E48609p6066l88817j80647K63093M72758L07004j01706m88279n16665j24631
$$ 548609 472543 83726 -96921 166172 638930 945934 844228 355949 -160716 -285347
35025b85347K28793J06645k24967j94327J35374J90920j14424k63324n7369J07996
$$ -285347 -56554 50091 -174876 -369203 -233829 -42909 -157333 -420657 -478026 -370030
35015c70030J9242n6729j9678j16398k63321n34N81842P18626J83472k26423L5525
$$ -370030 -350788 -407517 -427195 -543593 -806914 -807448 -225606 493020 676492 450069 485594
35004D85594L48258l298n95870n90689r6663J57375R3460K16061N15280M53591
$$ 485594 833852 830554 234684 -356005 -452668 -295293 -201833 14228 529508 983099
34994I83099K334k38324l8945J52560L5173j52812k26015l37939m68698k86124
$$ 983099 985433 747109 708164 860724 895897 743085 517070 179131 -289567 -575691
34984e75691K16988N36370L89630R6109n2945k44139o04662p44333l08672L88635
$$ -575691 -358703 177667 567297 663406 610461 366322 -238340 -982673 -1291345 -902710
34974i02710P50868O44169L59478R0122j41337k40763j36218O748r700j13522
$$ -902710 -151842 492327 851805 941927 800590 559827 423609 430357 420657 307135
34964C07135j29851q0130m8640L7415J89799J55514j97064n02228l41564R5356
$$ 307135 177284 97154 48514 85929 275728 431242 234178 -268050 -609614 -514258
34954e14258K60494M4299j71428j87967j74762j69059L8046L89378M73835J59004
$$ -514258 -253764 -209465 -380893 -568860 -743622 -912681 -874635 -485257 -11422 147582
34944A47582j66737k14539j82951k52985j97726J12211K81680p576l32000p7240
$$ 147582 -19155 -233694 -416645 -669630 -867356 -755145 -473465 -481041 -813041 -890281
$$ [...]
##END NTUPLES=NMR SPECTRUM
##END=
