##TITLE=31Pdec_2PBDP4
 CDCl3, 24 sc
 30.7.2019
##JCAMPDX= 6.0         $$ Bruker NMR JCAMP-DX V2.0
##DATA TYPE= NMR SPECTRUM
##DATA CLASS= NTUPLES
##ORIGIN= UXNMR, Bruker Analytische Messtechnik GmbH
##OWNER= root
$$ XWIN-NMR		Version 3.5
$$ Tue Jul 30 14:07:46 2019 Russian Standard Time (UT+4h)  she@DPX200
##.OBSERVE FREQUENCY= 81.013821
##.OBSERVE NUCLEUS= ^31P
##.ACQUISITION MODE= SIMULTANEOUS
##.ACQUISITION SCHEME= undefined
##.AVERAGES= 24
##.DIGITISER RES= 17
##SPECTROMETER/DATA SYSTEM= spect
##.PULSE SEQUENCE= zgpg30
##.SOLVENT NAME= CDCl3
##.SHIFT REFERENCE= (INTERNAL, CDCl3, 0, 182.463)
##AUDIT TRAIL= $$ (NUMBER, WHEN, WHO, WHERE, WHAT)
$$ ##TITLE= Audit trail, XWIN-NMR		Version 3.5
$$ ##JCAMPDX= 5.01
$$ ##ORIGIN= Bruker BioSpin GmbH
$$ ##OWNER= she
$$ F:/spectra/data/she/nmr/P31/1/pdata/1/auditp.txt
$$ ##AUDIT TRAIL=  $$ (NUMBER, WHEN, WHO, WHERE, WHAT)
(   1,<2019-07-30 14:06:52.59 +0400>,<she>,<DPX200>,
      <created by zg, POWCHK disabled, PULCHK disabled
       configuration hash MD5:
       00 E9 B6 7A A2 85 ED C7 34 08 36 98 17 FE 4E 26
       data hash MD5: 32K
       6E 7B F9 BD 33 C6 5D FA D8 53 21 E2 CE 7E 04 C2>)
(   2,<2019-07-30 14:06:54.96 +0400>,<she>,<DPX200>,
      <Start of raw data processing
       efp BC_mod = 2 LB = 1 FT_mod = 6 PKNL = 1 PHC0 = -391.9433 PHC1 = 101.2 SI = 64K 
       data hash MD5: 64K
       53 CC 39 0E 51 D6 75 6F 66 2C B9 F4 C5 1B BA 6A>)
(   3,<2019-07-30 14:07:09.42 +0400>,<she>,<DPX200>,
      <pk PHC0 = 5.310051 PHC1 = 0 
       data hash MD5: 64K
       7E 02 2E AF 59 57 D1 E7 B8 AD 4D FB 54 EA 39 C1>)
$$ ##END=
$$ 
$$ hash MD5
$$ E7 A1 6F 23 80 87 7E 37 90 06 7D C1 FC DC 6C 62
##$RELAX= 
##$RELAX= 
##$RELAX= 
##$RELAX= 
##$RELAX= 
##$RELAX= 
##$RELAX= 
##$RELAX= 
$$ Bruker specific parameters
$$ --------------------------
##$DU= <F:/spectra>
##$EXPNO= 1
##$NAME= <P31>
##$PROCNO= 1
##$TYPE= <nmr>
##$USER= <she>
##$AMP= (0..31)
100 100 100 100 100 100 100 100 100 100 100 100 100 100 100 100 100 100 
100 100 100 100 100 100 100 100 100 100 100 100 100 100 
##$AQSEQ= 0
##$AQ_mod= 1
##$AUNM= <au_zg>
##$AUTOPOS= <>
##$BF1= 81.014009
##$BF2= 200.13
##$BF3= 200.13
##$BF4= 200.13
##$BF5= 200.13
##$BF6= 200.13
##$BF7= 200.13
##$BF8= 200.13
##$BYTORDA= 1
##$CFDGTYP= 0
##$CFRGTYP= 5
##$CHEMSTR= <none>
##$CNST= (0..31)
1 1 145 1 1 1 1 1 1 1 1 1 1 1 1 1 1 1 1 1 1 1 1 1 1 1 1 1 1 1 1 1 
##$CPDPRG= <waltz16>
##$CPDPRG1= <>
##$CPDPRG2= <waltz16>
##$CPDPRG3= <>
##$CPDPRG4= <mlev>
##$CPDPRG5= <mlev>
##$CPDPRG6= <mlev>
##$CPDPRG7= <mlev>
##$CPDPRG8= <mlev>
##$CPDPRGB= <>
##$CPDPRGT= <>
##$D= (0..31)
0 1 0 0 0 0 0 0 0 0 0 0.03 2e-05 3e-06 0 0 0 0 0 0 0 0 0 0 0 0 0 0 0 0 
0 0 
##$DATE= 1564481211
##$DBL= (0..7)
120 120 120 11 120 120 24 19 
##$DBP= (0..7)
150 150 150 150 150 150 150 150 
##$DBP07= 0
##$DBPNAM0= <>
##$DBPNAM1= <>
##$DBPNAM2= <>
##$DBPNAM3= <>
##$DBPNAM4= <>
##$DBPNAM5= <>
##$DBPNAM6= <>
##$DBPNAM7= <>
##$DBPOAL= (0..7)
0.5 0.5 0.5 0.5 0.5 0.5 0.5 0.5 
##$DBPOFFS= (0..7)
0 0 0 0 0 0 0 0 
$$ [...]
##$SUBNAM2= <"">
##$SUBNAM3= <"">
##$SUBNAM4= <"">
##$SUBNAM5= <"">
##$SUBNAM6= <"">
##$SUBNAM7= <"">
##$SUBNAM8= <"">
##$SUBNAM9= <"">
##$SW= 369.568048894756
##$SWIBOX= (0..15)
0 1 3 0 0 0 0 0 0 0 0 0 0 0 0 0 
##$SW_h= 29940.119760479
##$TD= 32768
##$TD0= 1
##$TE= 0
##$TE2= 300
##$TE3= 300
##$TEG= 300
##$TL= (0..7)
0 120 53 12 22 120 120 120 
##$TP= (0..7)
150 150 150 150 150 150 150 150 
##$TP07= 0
##$TPNAME0= <>
##$TPNAME1= <>
##$TPNAME2= <>
##$TPNAME3= <>
##$TPNAME4= <>
##$TPNAME5= <>
##$TPNAME6= <>
##$TPNAME7= <>
##$TPOAL= (0..7)
0.5 0.5 0.5 0.5 0.5 0.5 0.5 0.5 
##$TPOFFS= (0..7)
0 0 0 0 0 0 0 0 
##$TUNHIN= 0
##$TUNHOUT= 0
##$TUNXOUT= 0
##$USERA1= <user>
##$USERA2= <user>
##$USERA3= <user>
##$USERA4= <user>
##$USERA5= <user>
##$V9= 5
##$VALIST= <valist>
##$VCLIST= <CCCCCCCCCCCCCCC>
##$VD= 0
##$VDLIST= <DDDDDDDDDDDDDDD>
##$VPLIST= <PPPPPPPPPPPPPPP>
##$VTLIST= <TTTTTTTTTTTTTTT>
##$WBST= 1024
##$WBSW= 4
##$XGAIN= (0..3)
0 0 0 0 
##$XL= 0
##$YL= 0
##$YMAX_a= 11363
##$YMIN_a= -9209
##$ZGOPTNS= <>
##$ZL1= 120
##$ZL2= 120
##$ZL3= 120
##$ZL4= 120
##$ABSF1= 0
##$ABSF2= 0
##$ABSG= 0
##$ABSL= 0
##$ALPHA= 0
##$AQORDER= 0
##$ASSFAC= 0
##$ASSFACI= 0
##$ASSFACX= 0
##$ASSWID= 0
##$AUNMP= <proc_1d>
##$AZFE= 0.1
##$AZFW= 0.5
##$BCFW= 0
##$BC_mod= 2
##$BYTORDP= 0
##$COROFFS= 0
##$CY= -3
##$DATMOD= 1
##$DC= 0
##$DFILT= <>
##$DTYPP= 0
##$F1P= 0
##$F2P= 0
##$FCOR= 1
##$FTSIZE= 65536
##$FT_mod= 6
##$GAMMA= 0
##$GB= 0
##$INTBC= 1
##$INTSCL= 5.30512e-09
##$ISEN= 30
##$LB= 1
##$LEV0= 0
##$LPBIN= 0
##$MAXI= 10000
##$MC2= 0
##$MEAN= 0
##$ME_mod= 0
##$MI= 50
##$NCOEF= 0
##$NC_proc= -6
##$NLEV= 6
##$NOISF1= 182.463
##$NOISF2= 159.3651
##$NSP= 0
##$NTH_PI= 0
##$NZP= 0
##$OFFSET= 182.463
##$PC= 4
##$PHC0= -386.6332
##$PHC1= 101.2
##$PH_mod= 1
##$PKNL= yes
##$PPARMOD= 0
##$PSCAL= 0
##$PSIGN= 0
##$REVERSE= no
##$SF= 81.0140089999434
##$SI= 65536
##$SIGF1= 159.3651
##$SIGF2= -187.1042
##$SINO= 113.3802
##$SIOLD= 16384
##$SREGLST= <1H.CDCl3>
##$SSB= 0
##$STSI= 65536
##$STSR= 0
##$SW_p= 29940.119760479
##$SYMM= 0
##$S_DEV= 0
##$TDeff= 32768
##$TDoff= 0
##$TI= <>
##$TILT= no
##$TM1= 0
##$TM2= 0
##$TOPLEV= 0
##$USERP1= <user>
##$USERP2= <user>
##$USERP3= <user>
##$USERP4= <user>
##$USERP5= <user>
##$WDW= 1
##$XDIM= 65536
##$YMAX_p= 346763151
##$YMIN_p= -10537829
$$ End of Bruker specific parameters
$$ ---------------------------------
##NTUPLES= NMR SPECTRUM
##VAR_NAME=  FREQUENCY,     SPECTRUM/REAL,   SPECTRUM/IMAG
##SYMBOL=    X,             R,               I
##VAR_TYPE=  INDEPENDENT,   DEPENDENT,       DEPENDENT
##VAR_FORM=  AFFN,          ASDF,            ASDF
##VAR_DIM=   65536,         65536,           65536
##UNITS=     HZ,            ARBITRARY UNITS, ARBITRARY UNITS
##FACTOR=    0.456856943014862, 1,           1
##FIRST=     14782.0589164792, 0,            0
##LAST=      -15158.0608439998, 0,           0
##MIN=       -15158.0608439998, -10537829,   0
##MAX=       14782.0589164792, 346763151,    0
$$ Real data points
##PAGE= N=1
##DATA TABLE= (X++(R..R)), XYDATA
$$ [...]
42129b7333N63271J631317P55278p62257j140430m87232r7493k64738k05037K13535
42119A78881K33940j66968N6245J140553J645200M59009j301817j640732l81618
42110B22693P58911O33825o1133k27001K0272j41702p43089q86668o7928R93654
42100E01834J164611L22510m32624j71938N35216K15279j481950k968720k519718
42091d835500n27218R18979P28142O7982M14556J308337J167459j70341j152771
42082b080375q35761n9691K30597M39157J069735J257687R4436j365437j238161
42073b487813L33846J312684Q21871J88223M91941R39263N39182k20797m63271
42064A455129l39082k65872L483M64435K92388o42118j031977k10170M78195p7002
$$ y = [-27333, 535938, 2167255, 2922533, 2160276, 1019846, 532614, 435121, 170383, -34654, 178881, 412821, 245853, 302098, 1442651, 3087851, 3546860, 2245043, 604311, 222693, 981604, 1615429, 1554296, 1327295, 1347567, 1205865, 462776, -423892, -491820, 501834, 1666445, 1988955, 1556331, 1384393, 1919609, 2134888, 652938, -2315782, -4835500, -5362718, -4443739, -3715597, -3647615, -3233059, -1924722, -757263, -927604, -2080375, -2916136, -2975827, -2745230, -2306073, -1236338, 21349, 115785, -1249652, -2487813, -2153967, -841283, -19412, 168811, 660752, 1600015, 2139197, 1918400, 1455129, 1116047, 850175, 853658, 1318093, 1610481, 968363, -63614, -273784, 204411, 127409]
42054A27409o83395L1855R61150M08268o73446k31769J038975P12520r15408r92464
42044b16305R65996J964734M01854j333167q22632P31360R16981j62281q22877
42035A623663p12391o41200p79193q10886q00872n54668N70569K044296K038087
42026A977405K40071j142740p41315j77979q86818j197607O49445K729561K113678
42017C563701k15197r05364K43464L31772j308357j964670l55739J218407Q17632
42008A425649l18215m92061k67300o30502q24059k501Q46358N76554p5091N5765
41998B94597M55290J11341m02376Q2508J143957J393170O38295k40912j006924
41989B468946j954760k494729j642538Q2191R15456L47272p8888Q80500K153175
$$ y = [127409, -555986, -524131, 437019, 845287, 171841, -59928, 979047, 1691567, 776159, -216305, 749691, 2714425, 3116279, 1783112, 960480, 1691840, 2608821, 2446540, 1623663, 911272, 270072, -509121, -1320007, -2120879, -2675547, -2104978, -60682, 1977405, 2217476, 1074736, 333421, 155442, -731376, -1928983, -1279538, 1450023, 3563701, 3348504, 2443140, 2686604, 3018376, 1710019, -254651, -610390, 608017, 1425649, 1107434, 615373, 348073, -282429, -1106488, -1108989, -262631, 313923, 238832, 294597, 749887, 861228, 458852, 541360, 1685317, 3078487, 3716782, 3475870, 2468946, 514186, -1980543, -3623081, -3540890, -2625434, -2278162, -2357050, -1476550, 676625]
41980F76625J711519n60689k429565j923482L17538J868544J387263j42742j112948
41971b07937j211850r77981l92747P88847J785724J403184o1996r27844l98191
41962b00791N57973R14136Q13357N73171j28601j193133j413937o882J893654
41953A808947K339984Q40303j176664j899729p79931R73154J421212m125j564363
41944A958788j328517M0231J88732j222119j851450m23393J136320P86708l93488
41935a108188r9242J534605K446207J885665Q52452j29908j384291k408490k018657
41926d29847l87854Q67288R26627N37520L52183P1961m23842n79271k52467n6139
41916F26159k24510k96592k08160m67872r03236m97817R82187K264684K050467
$$ y = [676625, 2388144, 1827455, -602110, -2525592, -2208054, -339510, 1047753, 905011, -207937, -1419787, -2397768, -2790515, -2001668, -215944, 1187240, 1125244, 197400, -200791, 357182, 1271318, 2084675, 2657846, 2529245, 1336112, -77825, -84707, 1808947, 4148931, 4989234, 3812570, 1912841, 1132910, 2106064, 3527276, 3523151, 1958788, 630271, 670502, 859234, -362885, -2214335, -2637728, -1501408, -714700, -1108188, -1207430, 327175, 2773382, 4659047, 5511499, 5381591, 3997300, 1588810, -429847, -817701, 49587, 976214, 1513734, 1865917, 1937878, 1514036, 934765, 682298, 626159, 401649, 105057, -103103, -570975, -1474211, -1972028, -989841, 1274843, 3325310]
41907C325310M33340j479936k597041k367972j190039l58051o74847j216104o13342
41898f738682O94767J063089L65574J54147Q64930J088565L30335J62205J346244
41889f68826K032452O68447j158135j032030N14427R95159j33352j084189q63204
41880g29251l36738j19226L42986J123159J185637J11297j034808j209419n64774
41871a231137L17178J146468J484651Q46181k72689o45210m9146M33108K38209
41862B267613O1703K32516r2628j201917j795834r32253K62236K64703n00439
41853a434300n55777K25648P99094R22107J151863J215886K83796j123577j382130
41844A02610l08769K79503p29348j961755j481679N60269K229371K121045N83498
$$ y = [3325310, 3758650, 2278714, -318327, -2686299, -3876338, -4234389, -4909236, -6125340, -6738682, -6043915, -4980826, -4615252, -4461105, -3596175, -2507610, -2177275, -2015070, -668826, 1363626, 2032073, 873938, -158092, 356335, 1351494, 1218142, 133953, -729251, -1065989, -1185215, -842229, 280930, 1466567, 1577864, 543056, -666363, -1231137, -913959, 232509, 1717160, 2563341, 2290652, 1645442, 1596296, 2029404, 2267613, 2329316, 2561832, 2469204, 1267287, -528547, -1460800, -1198564, -933861, -1434300, -1990077, -1764429, -965335, -43228, 1108635, 2324521, 2608317, 1484740, 102610, -206159, 73344, -656004, -2617759, -4099438, -3539169, -1309798, 811247, 1394745]
41835A394745r07966j069605M6814R57020L94894q86544r85596L26126J118983
41826C88871K67355p36080j84810J037396Q35682q06313j884541j375139l08866
41817b766445J85703K41191L59904N43918O87619P77129N39595j07084l90100
41808G1430K68883P97063k07342j762086j322351J194190K648029J172403r23433
41799A936786p27278P63161M11437j911434l028402j247719J358238K197543J391966
41790A144298N65951J75148l62265r15684o97787K23559Q02955N13143k2578j82906
41780A243834l22807r96275j703961j315656K05875J396292J123301R2037l22964
41771f00324j03272j72378l86156K69292J347835R17444j254947k541629j046731
$$ y = [1394745, 486779, -582826, -536012, 421008, 815902, -70642, -1056238, -730112, 388871, 656226, -79854, -264664, 772732, 1608414, 802101, -1082440, -2457579, -2766445, -2580742, -2339551, -1979647, -1435729, -748110, 29019, 568614, 461530, 71430, 340313, 1137376, 930034, -832052, -2154403, -960213, 1687816, 2860219, 1936786, 1209508, 1972669, 2384106, 472672, -2555730, -3803449, -2445211, -247668, 1144298, 1710249, 1885397, 1523132, 607448, -90339, 133220, 936175, 1449318, 1426740, 1243834, 921027, -75248, -1779209, -3094865, -2888990, -1492698, -369397, -277360, -600324, -703596, -875974, -1262130, -992838, 354997, 1272441, 17494, -2524135, -3570866]
41762c570866J373916J755502L37236k63895O41752J142325K18847q47819r98722
41753b11724q15074o87181O5844J247953J229586l36215j335279l33790J020358
41744a55522O47388o11267n64718O96648J270553P53348M62960O42742O0381j339518
41734A862995j805413n45687Q90131R45324Q2701n44420r08377j361806j375551
41725b760103m65024N49404O79232M94796J183754K299646K134937M10390j016637
41716C510395o89958M91678P18114k68055j194446j203788o76686k61429q2389
41707C43436o1852k21203l66158j08357M60478O64457J88434l81612m00469o5809
41697E1345N5650j4834J76320O84612J129211J287676J153501O41219j47776o28021
$$ y = [-3570866, -2196950, -441448, -104212, -368107, 273645, 1415970, 1634817, 786998, -211724, -1026798, -1713979, -1648135, -400182, 829404, 493189, -842090, -1175880, -155522, 491866, -119401, -684119, 12529, 1283082, 2036430, 2499390, 3142132, 3202513, 1862995, 57582, -488105, 402026, 1347350, 1430051, 885631, -22746, -1384552, -2760103, -3225127, -2675723, -1996491, -1501695, -317941, 1981705, 4116642, 4527032, 3510395, 2820437, 3312115, 4030229, 3762174, 2567728, 1363940, 687254, 425825, 343436, 281584, 60381, -305777, -414134, 46344, 710801, 899235, 517623, 117154, 51345, 106995, 92161, 268481, 953093, 2082304, 3369980, 4523481, 5164700, 5016924, 4388903]
41687D388903l81033J62710L86150M06117M46944j04080j630270k727798j621935
41678f74292Q02598J536684l47275k189549j624087J24496N98386p1544q6247
41669a930830N53620K90764q00303r07254K89682R47575K50562k22948N90977
41660i38155J244006K77079j147555j089934L1217L34308k96040k09146R38526
41651h55694J403988K26969j023392m93415J238584K024704J069840l08207p12556
41642B570821l49793l29665r49286j266140l61331J278450J981317P42342j336981
41633A979734k052844o76813J167337J610154P07362k99709j027060j789880j924095
41624b305814l40961J984915K345218J74009j558999n65457J149193M23288j880883
$$ y = [4388903, 4007870, 4170580, 4556730, 4962847, 5409791, 5305711, 3675441, 947643, -674292, 128306, 1664990, 1317715, -871834, -2495921, -2371425, -1773039, -1844583, -1930830, -1377210, -1086446, -1886749, -2794003, -2504321, -1556746, -1306184, -1529132, -938155, 305851, 582930, -564625, -1654559, -1623342, -1289034, -1585074, -1794220, -855694, 548294, 775263, -248129, -741544, 497040, 2521744, 3591584, 3283377, 2570821, 2221028, 1891363, 942077, -324063, -685394, 593056, 2574373, 3316715, 1979734, -73110, -749923, 417414, 2027568, 2734930, 2435221, 1408161, -381719, -2305814, -2646775, -661860, 1683358, 1857367, 298368, -267089, 882104, 1305392, -575491]
41615e75491k190133j7615J386097N31680j21106J070886J740268l18174k796178
41606a289766k072041J194451L197050K558616J277176O50280k28195j663371
41598C624200k212304j183224J70246P88912J059869J225532N86325q60664j811509
41589A387383j550406q74514m65980K8445P00972R16493P74505J191385J849804
41580C958087J127287j018533k297033j479178l39087n80036j000136J16735J638856
41571A26962J248945p18014j773495j006381J50941O21808Q47221J160137J022508
41562A680632K82048l37042l68801j07921J29022K53684K8593n83073r56937o82531
41552f62326m35469q37869j041923R9219J893916K466023J360080n1572o56393
$$ y = [-575491, -2765624, -2783239, -1397142, -865462, -986568, 84318, 1824586, 1506412, -1289766, -3361807, -2167356, 1029694, 3588310, 4865486, 5515766, 5287571, 3624200, 1411896, 228672, 398918, 1187830, 2247699, 3473231, 4059556, 3198892, 1387383, -163023, -1037537, -1503517, -1475072, -774100, 142393, 916898, 2108283, 3958087, 5085374, 4066841, 1769808, 290630, -48457, -628493, -1628629, -1511894, 126962, 1375907, 657893, -1115602, -2121983, -1971042, -1349234, -502013, 658124, 1680632, 1962680, 1625638, 1256837, 1148916, 1277938, 1531622, 1560215, 977142, 20205, -662326, -1097795, -1935664, -2977587, -2878368, -984452, 1481571, 2841651, 2790079, 2133686]
41543B133686n81042j68866M36582O29472j73787j208096j011367L36708J057902
41534A451192J21669j435887k037967j328667j14864N30299M5297q69519n83802
41525d222249J301539K738522J731728n93489j480392o17532j62120p76870o68424
41516b749287P64686J440473K09447q33853K81119J988470J578735o04512j868659
41507B06619j097668L15570R22596O53813P1930k99382j39286J56220k77618j176225
41497f63431r30860Q88587K195001J195861p72847j230768k66504O3124p00729
41488b22566j000750j85122O19262P47230Q86319J301755J162289K42713m14036
41479C137094k04674J00269k64765r80552j408636j315202n74556O48510J290029
$$ y = [2133686, 1552644, 1383778, 1820360, 2449832, 2276045, 1067949, 56582, 393290, 1451192, 1572861, 136974, -1900993, -3229660, -3344524, -2814225, -2768928, -3638447, -4222249, -2920710, -182188, 1549540, 956051, -524341, -1141873, -1303993, -2080863, -2749287, -1984601, -544128, -334681, -1168534, -887415, 1101055, 2679790, 2075278, 206619, -891049, -575479, 347117, 1000930, 1072860, 773478, 634192, 790412, 512794, -663431, -1594291, -705704, 1489297, 2685158, 1912311, 681543, 415039, 478163, -222566, -1223316, -1408438, -789176, -41946, 844373, 2146128, 3308417, 3551130, 3137094, 2932420, 3032689, 2767924, 1787372, 378736, -936466, -1511022, -862512, 427517]
41470D27517L80595j139114j183374M68903J577378N83810j189699j521508k47258
41461a842750R43053Q78420j593n60777k60578L24376J45105q76711j382096l26190
41451b959741J267930J552391M97334k88214j69137j1338n9799M95508J374476
41442A699410R71468q06577j723888n19097J059984J006083j40786q73597j135942
41433d62942j276114n37275J184026J910526M71005q93900K39112K175834J547824
41424D358096j016016j714080J96409J291243j99459j639803o96559Q83470N46522
41415B009823r67811j456104q95579n29141j27313J015177J732974N58889j248036
41406I2879j146733O25333J258618k97731j865767j456605J26379R98992P06769
$$ y = [427517, 808112, -331002, -1514376, -1045473, 531905, 1115715, -73984, -1595492, -1842750, -899697, -21277, -22870, -583647, -844225, -519849, -374744, -1251455, -2633551, -2959741, -1691811, -139420, 357914, 69700, -99437, -110775, -170574, 324934, 1699410, 2670878, 1864301, 140413, -378684, 681300, 1687383, 1546597, 673000, -462942, -1739056, -2276331, -1092305, 818221, 1289226, 395326, 634438, 2810272, 4358096, 3342080, 1628000, 1824409, 3115652, 2916193, 1276390, 579831, 1463301, 2009823, 1042012, -414092, -1309671, -1838812, -1966125, -950948, 782026, 1340915, 92879, -1053854, -428521, 830097, 532366, -1333401, -2790006, -2663627, -1664635, -957866]
41397i57866K1691m02390k34473O27386J588984J661869P69517j12052m57666
41388B505000p42960j099017p63448L76671J019016L40403m28251L04997J944238
41379C456649K328684O46646j561237k339986j298390L88165J187778M42908r88608
41370B262609j478185n53594L60853j14758j249876j272157n4086Q11483N48545
41361g39166J23345K96317M26772l8428l93290j2733M27215K51655J55740Q80939
41351A378366J503477O96173r36331j532142o82574K61062N24645P60718J256051
41342C229445J033428m53440k033874k205309j003201L01305Q09272P05970P49681
41333A133277J346189J845531J024248j026387k103688n06598J919780J602518
$$ y = [-957866, -936175, -1338565, -1573038, -945652, 643332, 2305201, 3074718, 2962666, 2505000, 1762040, 663023, -100425, 276246, 1295262, 1635665, 1207414, 1512411, 3456649, 5785333, 6431979, 4870742, 2530756, 1232366, 1620531, 2808309, 3251217, 2262609, 784424, 230830, 591683, 476925, -772951, -2045108, -2099194, -1287711, -739166, -615821, -319504, 107268, 68840, -324450, -337183, 90032, 341687, 497427, 1378366, 2881843, 3578016, 2641685, 1109543, 426969, 688031, 1212676, 1973394, 3229445, 4262873, 3809433, 1775559, -429750, -1432951, -1131646, -322374, 383596, 1133277, 2479466, 4324997, 5349245, 4322858, 2219170, 1712572, 3632352, 5234870]
41325E234870j554600l419264j375807J756364J826477o87979j902235n47523
41317f69697P19108P245j143381p88621M04874P10359L2102n40036n62780k10641
41307b041468N56646J495540J610137M42282q65668r84127k43111J32193K8799
41298A31223K69956P56503L69289j047705j986142j227062M08585J076259K25637
41289a023457q60435p58367M80180J600690J637834P58018k26993o91548m39685
41280D76237L49421J038527Q34420k64257j139221q24957J60218N39564J15481
41271A285433j31235K12335L01924n15232j560641j751247r71356L1889N81547
41262b516583N00604J37634J91415Q65278J147427l8018j795769j793535N42036
$$ y = [5234870, 3680270, 261006, -1114801, 641563, 2468040, 1780061, -122174, -669697, 49411, 56656, -1086725, -1875346, -1470472, -760113, -728011, -1268047, -1830827, -2041468, -1484822, 10718, 1620855, 2063137, 1197469, 213342, -29769, 102424, 131223, 401179, 1157682, 1526971, 479266, -1506876, -2733938, -2325353, -1249094, -1023457, -1883892, -2642259, -2162079, -561389, 1076445, 1834463, 1607470, 915922, 476237, 825658, 1864185, 2698605, 2434348, 1295127, 470170, 630388, 1169952, 1285433, 1154198, 1366533, 1668457, 1153225, -407416, -2158663, -3130019, -3098130, -2516583, -2015979, -1878345, -1686930, -821652, 325775, 287757, -1508012, -3301547, -2759511]
41253b759511K829794K767942J003487l56966p99358j182373j453510p62236M90370
41244b22361Q29149M0002n41957l42691l21009r21624j050941j4469J038813Q40503
41234f66585R5316M72131K029216K912751J650523j037642k932507k530177m49101
41225d56075J379721J830115J425025R10897m07j479941k139853n94853J819464
41216B694093K066310l95926k529719j829708L88214J279053M40690l20080j23025
41207A669902J95038K848l32810n73074r47852j256345r66024l10493m2227l0050
41197b591087N73443J603148J748084O07133m46484j85814P60613R82294K53266
41188C304596n01607o84174n72894n88633o71638m11272M47951J524817J862821
$$ y = [-2759511, 70283, 2838225, 3841712, 3484746, 2685388, 1503015, 49505, -712731, -222361, 606788, 646790, 104833, -237858, -558867, -1480491, -2531432, -2545901, -1507088, -666585, -571269, -99138, 1930078, 4842829, 6493352, 5455710, 2523203, -6974, -456075, 923646, 2753761, 4178786, 5089683, 5089276, 3609335, 1469482, 874629, 2694093, 4760403, 4364477, 1834758, 5050, 393264, 1672317, 2113007, 1792927, 1669902, 1864940, 1867788, 1534978, 961904, 14052, -1242293, -2208317, -2518810, -2561037, -2591087, -2017644, -414496, 1333588, 1940721, 1494237, 1308423, 2069036, 3051330, 3304596, 2802989, 2118815, 1545921, 957288, 285650, -125622, 322329, 1847146, 3709967]
41179C709967R11311n65312j196954o77542P2480M82778R18882J306348N93651
41170E555609j402792k884087k279809o30753l203k56348L56594J591482R91860
41161A038553j889084l700700j662305K172647L493509J487545o91460q56693
41153f07988k95727p23616j382629p67760N81259R65725K16830l27150k1894N60691
41143a802259J068427J724337K175778J493632k41997j552012j355076k92789
41135A218041K95009K1882m50718m22699K19369R82224J060431P7777j256460
41126A744856j750640j179593n14119m93164p30332o16114k94379j49386m0876
41117d023747K35229L36945J4671j68883L66843J111448J093578L75914l9116
$$ y = [3709967, 4621278, 4055966, 2859012, 2181470, 2253950, 2736728, 3655610, 4961958, 5555609, 4152817, 1268730, -1011079, -1641832, -1645035, -1901383, -1544789, 46693, 1038553, -850531, -4551231, -6213536, -4040889, -547380, 940165, 248705, -607988, -903715, -1627331, -3009960, -3777720, -3196461, -2230736, -2013906, -2341056, -2362950, -1802259, -733832, 990505, 3166283, 4659915, 4417918, 2865906, 1510830, 1218041, 1513050, 1534932, 1084214, 661515, 880884, 1863108, 2923539, 3001316, 1744856, -5784, -1185377, -1699496, -2192660, -2922992, -3539106, -3833485, -3982871, -4023747, -3788518, -3451573, -3436902, -3605785, -3238942, -2127494, -1033916, -658002, -697118]
41108f97118K72642O48765M45277j46939o01440p52808p60068p95317q95302q32127
41098d114435k27979Q41022J592570J406066O94494K94884K69846Q7151k69254
41089E74365l38218j95067l07109l45872N75490K132091K548410Q61995j573831
41080C932254k663659j866286k09019J141493J487347O28227o79970r93030P418
41071G84775O64812m10664j943988j551701O32197J918214R47368m17371m1685
41062E81957J363433J568324J18599j400654j821597j441035p37085L63772J578318
41053A74032J927772J005258k55831p67257o32040o13444p38083l08050P69244
41044E61601J493943R77479l27165j093912o97898J47826M24101N464n28193q68886
$$ y = [-697118, -424476, 224289, 669566, 522627, -78813, -831621, -1591689, -2387006, -3282308, -4114435, -4342414, -3501392, -1908822, -502756, 191738, 486622, 756468, 843619, 574365, 236147, 41080, -266029, -611901, -36411, 2095680, 4644090, 5506085, 3932254, 1268595, -597691, -806710, 334783, 1822130, 2450357, 1770387, 777357, 784775, 1449587, 1038923, -905065, -2456766, -1824569, 93645, 1041013, 623642, 581957, 1945390, 3513714, 3632313, 2231659, 410062, -1030973, -1768058, -1404286, 174032, 2101804, 3107062, 2851231, 2083974, 1451934, 838490, 100407, -207643, 561601, 2055544, 3033023, 2705858, 1611946, 914048, 1061874, 1485975, 1491439, 963246, 94360]
41034I4360j088011r49210o1434J074899J203226R7915p54079k10118O72119K00804
41024B80471j165307j375541J9160J193344R36347K30786R2711k01196j268705
41015a257930j695583n284K483235K998715J118041q42190j155260m27835J84540
41006A400449N60428P88273M10252o13890j365074j171751m42702K16487P13802
40997D96274Q61269K37248p45805q34755K46048J092346N74638n78249j066686
40988B82328q38943n66468k64768L56724R12369Q83956N41254K79798k61837j311247
40978A3166j934429j210791J53700P59779N92503P44694J405934J616547R32589
40969C073692k2246o75602r78094p98885l0540P29496P22550J70181k10683n39341
$$ y = [94360, -993651, -1942861, -2004295, -929396, 273830, 371745, -382334, -592452, 79667, 280471, -884836, -2260377, -2241217, -1047873, -111526, 119260, 211971, 10775, -1257930, -2953513, -2958797, -475562, 2523153, 3641194, 2799004, 1643744, 1215909, 1400449, 1960877, 2749150, 3159402, 2545512, 1180438, 8687, -434015, -217528, 496274, 1357543, 1594791, 848986, 14231, 260279, 1352625, 1927263, 1349014, 282328, -556615, -1123083, -1387851, -1031127, -118758, 765198, 1306452, 1586250, 1324413, 13166, -1921263, -3132054, -2978354, -2218575, -1626072, -881378, 524556, 2141103, 3073692, 3051446, 2375844, 1397750, 598865, 568325, 1297821, 2020371, 2190552, 1979869, 1440528]
40959A440528j263808j610259k87359K128064L284038K057101o0501j180506j174561
40950C332737q69992m99403j6523Q3945n83244j405542j433703n73182M47993
40941a516914R29213O75824P6581j17519L75821P69313J81666q90698j118816
40932f35529l26362L54496M26694O01954J017102N45289j206579k643890k116514
40923c983339r5634J655315K214305J810494Q51235k77633j035744j240043j242637
40914a343681j053870j51253J199338J539369J42782j586166j783469m96537P01586
40905b831901Q93064N56060M83549P91026Q32026j46057j765394k149636r6034
40896c433297K470894K261214o90733k548693j032995J377917J506183J43384
$$ y = [1440528, 176720, -1433539, -1720898, 407166, 3691204, 5748305, 5687804, 4507298, 3332737, 2462745, 1963342, 1946819, 2030764, 1447520, 41978, -1391725, -1964907, -1516914, -587701, 88123, 164704, 47185, 423006, 1192319, 1373985, 483287, -635529, -961891, -607395, -180701, 421253, 1438355, 1983644, 777065, -1866825, -3983339, -4078973, -2423658, -209353, 1601141, 2452376, 2174743, 1138999, -101044, -1343681, -2397551, -2548804, -1349466, 189903, 332685, -1253481, -3036950, -3533487, -2831901, -1938837, -1382777, -899228, -108202, 723824, 577767, -1187627, -3337263, -3433297, -962403, 1298811, 608078, -1940615, -2973610, -1595693, -89510, 53874]
40888E3874p0583P54797P01325O6299O53165J825211J192908q67975j303747N00692
40878C505966J514842J07033j327696n84233P22764J76687j303286j172794M65397
40869B104680J104486l02976k041666k144189o04246J060518J529715Q92133M30235
40860B028690R03615J268948J62331j563795j601801K16933J283987J31168j260463
40851A569613p09120O21410K09363j684946k464711j161998N09494J016724P50098
40842a344073N57856L61344r1245l88064r5663N62715J149777J510532J505930
40833C729109Q41897m47304j698352k143905j649059p58233J3959P72542J760817
40824D21471K320424J263521j071015k262111p93641J293605R12703j380209k027765
$$ y = [53874, -16709, 738088, 1439413, 1505712, 2158877, 3984088, 5176996, 4309021, 3005274, 3505966, 5020808, 5127841, 3800145, 3215912, 3938676, 4115363, 2812077, 1639283, 2104680, 3209166, 2906190, 864524, -1279665, -1883911, -823393, 706322, 1598455, 2028690, 2932305, 4201253, 4363584, 2799789, 1197988, 1414921, 2698908, 2830076, 1569613, 860493, 1481903, 1691266, 6320, -2458391, -3620389, -3110895, -2094171, -1344073, -786217, -424873, -516118, -904182, -999845, -437130, 712647, 2223179, 3729109, 4571006, 4123702, 2425350, 281445, -1367614, -2125847, -2111888, -1339346, 421471, 2741895, 4005416, 2934401, 672290, -121351, 1172254, 2084957, 704748, -1323017]
40815a323017k6120J456315K32587j476955j001837M16391L03755m58637N07443
40806a370075K305288K013977j14739r85711p8853j88209k070372k662492k52479
40797c403665K421693K507216J189229Q31018Q12161n33631j968021j032488J421305
40788B244817K025222K6789j648650r24516P03875R86606J14390l81636k83656
40779B863241n33486j254671j505975q78645j72318j95160n98479m10246N27053
40770b158686J246341R83163K67092N6121J73547l06379j141397q53173Q17777
40761i15594J906260R50631n42419k06722J429176J599210m15095k135698j679217
40752i468l54071j12517m30411K34491J280002P85775j007780j616088n1747J571511
$$ y = [-1323017, -1349137, 107178, 339765, -1137190, -2139027, -1722636, -1418881, -1877518, -1370075, 935213, 2949190, 2834451, 1848740, 1769887, 1581678, -488694, -3151186, -3403665, -981972, 1525244, 2714473, 3545491, 4357652, 3824021, 1856000, 823512, 2244817, 4270039, 4296828, 2648178, 1723662, 2427537, 3414143, 3528533, 3146897, 2863241, 2329755, 1075084, -430891, -1309536, -1481854, -1677014, -2275493, -2685739, -2158686, -912345, 70818, 337910, 394031, 567578, 261199, -880198, -1733371, -915594, 990666, 1941297, 1398878, 1192156, 2621332, 4220542, 3805447, 1669749, -9468, -363539, -476056, -906467, -671976, 608026, 1393801, 386021, -1230067, -1281814, 289697]
40742B89697J083191q45146k034260j691636o38513L50964R95662R48915K16655
40733a324471k57485K69273R70152N91556l57215k06397J104440J690705N94162
40724C074720p97165j039130o89584q63821j163019o26397K81288M12343O6908
40715a343857N60083J851086K366986J390736O3122m57002m91583q46379j394767
40706A698425j455726q71370j2364P63807J095819N71495o78994j676287j466527
40697b031722j91760J075013J454513R78099L13148j2820j29899n52709j301018
40688c99155j538678n15406J243502K252400J670514J25429j168618j610043j336964
40679a277019o80114Q2308O47503P39791L03297l69116o80968j32662J030226
$$ y = [289697, 1372888, 527742, -1506518, -3198154, -3836667, -3485703, -2490041, -1541126, -1324471, -1581956, -1312683, -342531, 249025, -108190, -314587, 789853, 2480558, 3074720, 2277555, 1238425, 548841, -314980, -1477999, -2104396, -1823108, -1410765, -1343857, -783774, 1067312, 3434298, 4825034, 4888156, 4431154, 3939571, 3093192, 1698425, 242699, -628671, -641035, 122772, 1218591, 1790086, 1111092, -565195, -2031722, -2223482, -1148469, 306044, 1284143, 1597291, 1584471, 1454572, 901863, -399155, -1937833, -2453239, -1209737, 1042663, 2713177, 2838606, 1669988, 59945, -1277019, -1957133, -1874825, -1227322, -487531, -184234, -553350, -1234318, -1366980, -336754]
40670c36754J737218J084320o13211k086808k360144j425741R0651J420187J937218
40661e53064J560248Q95310N11495J69657o55002j619347j698995o50987N13974
40652a526711Q63350O87225Q42370J409895J542184N41203j188722k305438j769545
40643i04189q8793R77834L94213p95470p69853O52129J849261J669435P62713
40634C747280K33384r460p01861j648772j756003o18931P42899J091040M37910
40625A517486k18807m43649q30884j558864j417312M99985K636069K367879j64454
40616B387449j719657m92134J144999L37178j680953j502691J065317K783111
40608B322619J949185L60958j79263k29785n36756l49313N61396O59291q01275
$$ y = [-336754, 1400464, 2484784, 1871573, -215235, -2575379, -4001120, -3910469, -2490282, -553064, 1007184, 1902494, 2413989, 2583646, 1928644, 309297, -1389698, -2040685, -1526711, -663361, 23864, 866234, 2276129, 3818313, 4359516, 3170794, 865356, -904189, -992982, -15148, 379065, -416405, -1186258, -534129, 1315132, 2984567, 3747280, 3980664, 3971204, 3269343, 1620571, -135432, -754363, -11464, 1079576, 1517486, 1298679, 855030, 24146, -1534718, -2952030, -2452045, 184024, 2551903, 2387449, 667792, 175658, 1320657, 1657835, -23118, -1525809, -460492, 2322619, 4271804, 4632762, 4453499, 4223714, 3686958, 3337645, 3899041, 4558332, 3757057]
40599C757057k096986j769081j024447j318233j468401K22197K424752K325411
40591A052269L3341j389848k85105J632010J966783L74025j788019k956812k204901
40582c566257O6756K012796K025116N83198n61911p44284o44184n28807J32297
40573a225280J229106J733191J189428K65118m16594q43436q76389j75320Q68517
40564A748341J241564O44932k41710r69996j725720k341403k066352p58170O15867
40555c852647J122371Q31083L46299k0626l48207p63665j073083o18425R83755
40546c393145K682220K598869N89142j013583n01759O40356J54169j191740q47620
40537b83091J051446J548359m92181k568078k354998p37416L34409P46919J310234
$$ y = [3757057, 1660071, -109010, -1133457, -2451690, -3920091, -3697894, -1273142, 1052269, 1085610, -304238, -589343, 1042667, 3009450, 3383475, 1595456, -1361356, -3566257, -3499501, -1486705, 538411, 1121609, 559698, -184586, -828770, -1357577, -1225280, 3826, 1737017, 2926445, 3191563, 2774969, 1931533, 1055144, 879824, 1748341, 2989905, 3634837, 3393127, 2423131, 697411, -1643992, -3710344, -4468514, -3852647, -2730276, -1899193, -1552894, -1573520, -1921727, -2685392, -3758475, -4376900, -3393145, -710925, 1887944, 2477086, 1463503, 961744, 1602100, 1756269, 564529, -283091, 768355, 2316714, 1824533, -743545, -3098543, -3835959, -3501550, -2754631, -1444397]
40528a444397J778445J576706J120788P82045j84552k041476l126488j874195
40520c413124O05430J844478J312343N58874M49930J99398p03406j326283p11359
40511a183719O41850J436292J147127L69470j28890k27526k51914k57076L1315
40502A576929M83676M24872k95122p93340n17088l08772q82020j107829L07283
40493a111411K060506J653982n29371j423789j10831O74677p69596k055100o33137
40484b244070J880922K307429Q67323J91178O17720P1724j742056k488046j011761
40475a549637Q65313J227052M86784p956J0231P8939O9149J16029L19584P60080
40465B375568J065523L16671j504198k614640j588250K45363N97132j76264J35718
$$ y = [-1444397, 334048, 1910754, 3031542, 3813587, 3629035, 1587559, -1538929, -3413124, -2807694, -963216, 349127, 908001, 1357931, 1557329, 853923, -472360, -1183719, -541869, 894423, 2041550, 2411020, 2282130, 2054604, 1802690, 1545614, 1576929, 2060605, 2485477, 2190355, 1397015, 879927, 571155, -310865, -1418694, -1111411, 949095, 2603077, 2073706, 649917, 539086, 1213763, 444167, -1610933, -2244070, -363148, 1944281, 2811604, 3002782, 3620502, 3692226, 1950170, -537876, -1549637, -684324, 542728, 1029512, 1021556, 1031787, 1110726, 1179875, 1295904, 1615488, 2375568, 3441091, 3757762, 2253564, -361076, -1949326, -1703963, -1106831, -1283095, -1147377]
40456a147377J452990J231162j007910k263077o01773J806755K154150R40799
40448B565719J41300l38048j556750k559979j629348L92734J073283K75284J11547
40439a524258J028115R79673q10173k105937j057003R35552J526932R12786R50445
40430H36132J826585J807450J49940j624090j827308o79802M04643P55255Q18263
40421B467068R41471O79785l64640j493245j412052N5135J385312J110006k46596
40412C122244r24477m97354l84694j362176j996953p79553J249272J742896M39314
40403F08519o47768m83237l48740j201120j720463m67401J520126K130889J242123
40394F32928M76133M58284K79332m66235j002835r24671p62121p02779k68857
$$ y = [-1147377, 305613, 1536775, 528865, -1734212, -2335985, -529230, 1624920, 2565719, 2707019, 2368971, 812221, -1747758, -3377106, -2984372, -1911089, -1635805, -1524258, -496143, 483530, -326643, -2432580, -3489583, -2554031, -1027099, -114313, 836132, 2662717, 4470167, 4620107, 2996017, 1168709, 488907, 893550, 1648805, 2467068, 3408539, 4088324, 3723684, 2230439, 818387, 873522, 2258834, 3368840, 3122244, 2197767, 1700413, 1315719, -46457, -2043410, -2822963, -1573691, 169205, 608519, -39249, -522486, -871226, -2072346, -3792809, -4260210, -2740084, -609195, 632928, 1109061, 1567345, 1846677, 1380442, 377607, -547064, -1309185, -2011964, -2280821]
40385b280821M13202N00892q2499n14210o33163r65755j006617M07730K475883
40376a685358K625495M39019j111754m1932J452653N03886j816035k309122o31131
40367b574279P16271N82372J93893K40199l5509o32071m27518N31783Q23614J84622
40357c96623q3224L49249L38642j85449J83295J376529J271225o60802j854804
40348C38038o02145J010531M22016j240022j102143P47216J493614K6303j606684
40339e13276j369327K67750J495594J320122R2535j055134j049489O3040R25320
40330A77135M77070n26820n18310O43316J489904R17247o19398j865803j894847
40321a720506n47266J404162K536582K013193O07407j29223L00021R20390O24674
$$ y = [-2280821, -1867619, -1366727, -1449226, -1963436, -2596599, -3562354, -4568971, -4161241, -1685358, 940137, 1379156, 267402, 225470, 1678123, 2182009, 365974, -1943148, -2574279, -1858008, -1275636, -1081743, -841544, -877053, -1509124, -1936642, -1404859, -581245, -396623, -479847, -130598, 208044, 22595, 205890, 1582419, 2853644, 2192842, 338038, -264107, 746424, 1168440, -71582, -1173725, -426509, 1067105, 1093408, -513276, -1882603, -1614853, -119259, 1200863, 1293398, 238264, -811225, -748185, 177135, 654205, 127385, -390925, 252391, 1742295, 2659542, 2040144, 174341, -1720506, -2267772, -863610, 1672972, 3686165, 4293572, 4164349, 4464370, 5384760, 6009434]
40312F009434o53124k027648k411094j333705M49799J389282P62049l66622m50962
40303A367409N31832J201247P59686j00404m44019l44743l99338o32762n73312
40294A365596j52322J66871K14033M16197Q95982Q45098l62024j692674j337598
40285C59159O16402J762610N51469j359553j400811K32027J096778J67814j149340
40276H76555j571372j309967o35294P07723K040032J851915K32013q06229l33342
40267A052034K45893k3791L5940J133430J576765K2611j841027j711042j45835
40258C44978P67802P63613Q88352R50815J98377m87531J25724R42490o578k039877
40248B448165k673110j561999n79642j98235R62749K758605K944266P69494j641093
$$ y = [6009434, 5356310, 3328662, 917568, -416137, 33662, 1422944, 2184993, 1818371, 1367409, 1899241, 3100488, 3860174, 3759770, 3315751, 2971008, 2571670, 1938908, 1365596, 1213274, 1380145, 1594178, 2010375, 2906357, 3751455, 3389431, 1696757, 359159, 975561, 2738171, 3289640, 1930087, 529276, 761303, 1858081, 2025895, 876555, -694817, -2004784, -2640078, -1932355, 107677, 1959592, 2191605, 1385376, 1052034, 1297927, 1274136, 1310076, 2443506, 4020271, 4042882, 2201855, 490813, 344978, 1112780, 1876393, 2764745, 3715560, 3913937, 3426406, 3552130, 4494620, 4488042, 2448165, -224945, -1786944, -2366586, -2564821, -1602072, 1156533, 4100799, 4870293, 3229200]
40239C229200k386718j812030p38236P63181K007062J668654J31457n19986K19848
40230B562432M77797n74344j228363m41312K80311j49920l10097P97091J358633
40221B772228j80813j943655j389459N10127Q95905m44352j232173o61714k62923
40212a936829r63002j781236j597493l51944J446682K829376K427714J47671j749917
40203a528978j124377R74700J705084M60638o96762m16703M66272R83781J286658
40194B110313J390600P48876k80567m20534L62235M72248p10367j608110r35875
40185A128819J78796l440j097303j265892r497J207185J005598l08754j297229
40176d61717q90676O88536K103377K093135P78291m30142m70971J75909L16207
$$ y = [3229200, 842482, -969548, -1707784, -944603, 1062459, 2731113, 2862570, 2342584, 2562432, 3040229, 2465885, 1237522, 796210, 1076521, 926601, 616504, 1413595, 2772228, 2591415, 647760, -741699, -231572, 664333, 219981, -1012192, -1673906, -1936829, -2899831, -4681067, -6278560, -6630504, -5183822, -2354446, 73268, 220939, -1528978, -2653355, -1678655, 26429, 487067, -209695, -626398, -160126, 823655, 2110313, 3500913, 4249789, 3969222, 3548688, 3910923, 4383171, 3672804, 2064694, 1128819, 1307615, 1304175, 206872, -1059020, -1068517, 138668, 1144266, 835512, -461717, -1352393, -663857, 1439520, 3532655, 4310946, 3880804, 3409833, 3585742, 3901949]
40167C901949l34226r81490j043984q48637q27058o90884J4925R24328J187001
40158A301924P04361J83692j23894o61359j156785l78089J644103K558920O98325
40149D771198j898199j903570L41907J217003n87250k070804p43648J600115K014607
40140B741359P95239R9945O0014p52185k074417k104666n10491J101240J479914
40131H35952O04368j116989k570825j787621J558397M345440L442045L12094q91816
40122D731045N19134J070945j064662l264766k773881o06926P59861J029943J271210
40113A671903J384923O02151o71815j341480j203577p84764l47588K0081J17796
40104e52370N4010O5403k99999j491287k369429j227834J240408K256300R94414
$$ y = [3901949, 3567723, 2586233, 1542249, 693612, -133446, -824330, -809405, 114923, 1301924, 2006285, 2189977, 2066083, 1404724, 247939, -130150, 1513953, 4072873, 4771198, 2872999, 969429, 1311336, 2528339, 1941089, -129715, -873363, 726752, 2741359, 3536598, 3636543, 3696557, 2944372, 869955, -1234711, -1745202, -643962, 835952, 1440320, 323331, -2247494, -4035115, -2476718, 1868722, 5310767, 5622861, 4731045, 5250179, 6321124, 5256462, 1991696, -782185, -1389111, -629250, 400693, 1671903, 3056826, 3658977, 2987162, 1645682, 442105, -342659, -690247, -670166, -552370, -498360, -432957, -732956, -2224243, -4593672, -5821506, -4581098, -2324798, -1330384]
40095a330384j20957O57358J688519R22963o68127q76800K23499Q30029K84649
40086A610749o27651j276367j395205p15052K07763Q2333r24416q29433Q84324
40077b982955J841369N94869o07999M13371J694910L57706k086165j895391O67734
40068b002551J826567N50674l41787L81196M94689j016899j781453l26745J242357
40059i73952R81033J87114M36802N95114n82758j533883m95594J117833R84264
40050G15973j51875J29341J733621K321094J124634l20427r82826j336792j618703
40041A614040j362544p77449o04195n35573L36139J481890J335509p9689r43700
40032D64428m98503j14598p35070j157156r8369J503506J762536N22365o79152
$$ y = [-1330384, -1451341, -793983, 894536, 1817499, 1149372, 272572, 496071, 1326100, 1610749, 983098, -293269, -1688474, -2403526, -2195763, -2113430, -3037846, -3867279, -2982955, -1141586, -546717, -1154716, -741345, 953565, 1311271, -774894, -2670285, -2002551, -175984, 374690, 32903, 414099, 908788, -108111, -1889564, -2216309, -973952, 7081, 194195, 630997, 1226111, 643353, -890530, -1386124, -268291, 715973, 564098, 693439, 2427060, 4748154, 5872788, 5552361, 4569535, 3232743, 1614040, 251496, -525953, -1130148, -1665721, -1329582, 152308, 1487817, 1408128, 464428, -34075, -148673, -883743, -2040899, -2139268, -635762, 1126774, 1649139, 969987]
40023I69987q58124n02837l55966l76270j67832K29090L48610q7199p10254p20309
40013b231104K29328J343596J330573k042j268996j141160q8480K73676n29351
40004b083960j153690l98263J031742J522065P54793j30471l71729l75959m93937
39995a699409k70876M43095P66164J54449m23270Q5133R42059O86130l77575n19229
39985b13329N91419J259023M62728n34877k17178R31754J379843P64577m3617
39976D380343m14911l86806j03353J86887m5493r34699j736871j772741j382636
39967b210280j149369p48069L70229J561103J518207K19662p99718m26023O59670
39958a004588J053830M87855j2597K90155O93849J0749j411880j570347N11400
$$ y = [969987, 111863, -390974, -746940, -1123210, -1291042, -1061952, -713342, -800541, -1510795, -2231104, -2001776, -658180, 672393, 670351, -598645, -1739805, -1828285, -1554609, -2083960, -3237650, -3635913, -2604171, -1082106, -327313, -457784, -829513, -1205472, -1699409, -1970285, -1527190, -761026, -606577, -1029847, -944714, -2655, 683475, 305900, -213329, 378090, 1637113, 2099841, 1564964, 1347786, 2279540, 3659383, 4423960, 4380343, 3965432, 3578626, 3475273, 3662160, 3616667, 2681968, 945097, -827644, -2210280, -3359649, -4107718, -3737489, -2176386, -658179, -438517, -1238235, -1664258, -1004588, 49242, 537097, 524500, 814655, 1508504, 1519253, 107373, -1462974, -951574]
39949i51574K783895K417748k19457j843604q87264M30759j59287j452712j063699
39940i45195N45562J051698K33583l8944N65688K86703j262547j950462n09398
39931b023312J308372J340212n6777j083681j023846l73658K68749K56324r03144
39922b290761k254724j700587J061673L311043K644343K72837q93598l10368K99224
39913A39082K84406O66417J511507J329707l23814j855265k091729j825047j887095
39904d051831j462807K97458K353661K995048K083981P41849l92717j229808j297158
39895C7676l03140P90890P89899J35225K59710J179142J329859M31j617098k213934
39885C88660j780511p82161N60741J504439R11236q25705j541582l12794Q30333
$$ y = [-951574, 1832321, 4250069, 4030612, 2187008, 1299744, 1730503, 1571216, 118504, -945195, -399633, 652065, 885648, 846704, 1412392, 1699095, 436548, -1513914, -2023312, -714940, 625272, 568495, -515186, -1539032, -1912690, -1643941, -1387617, -2290761, -4545485, -6246072, -5184399, -1873356, 770987, 1043824, 150226, -160142, 139082, 423488, 1089905, 2601412, 3931119, 3607305, 1752040, -339689, -2164736, -4051831, -5514638, -5217180, -2863519, 131529, 2215510, 2957359, 2564642, 1334834, 37676, -265464, 525426, 1315325, 1450550, 1710260, 2889402, 4219261, 4219692, 2602594, 388660, -1391851, -2174012, -1613271, -108832, 802404, -23301, -1564883, -1877677, -1047344]
39876a047344l2949j410073o21535J620182J902525o21543k770708k063313j26653
39867e171411K76911o00141n19603R79502K186154K007539J151293N99505M33308
39858A343057L06906L8393l71790o93238o25045l75102m52366n06293M92039K181741
39848A338302K393830J55021k267801k187625k93197N46193m49973j302645o32601
39839b700496O80211J363574J175039K10599j247215j994218j020270M70457L24056
39830b738263j080891j130671P50571J961588R50011k93454K55432J235541L90095
39821B99959j471850j702116J27007J860452J878489N95420p17232j035685m8325
39812b13881J210407J005257o57773j477760j48299J369760Q00685p97706q71645
$$ y = [-1047344, -1080293, -2490366, -3111901, -1491719, 410806, -210737, -2981445, -5044758, -5171411, -4894500, -5494641, -6014244, -5034742, -2848588, -841049, 310244, 909749, 1343057, 1649963, 1688356, 1316566, 623328, -1717, -376819, -829185, -1335478, -843439, 1338302, 3732132, 3887153, 1619352, -568273, -861470, -315277, -765250, -2067895, -2700496, -2020285, -656711, 518328, 728927, -518288, -2512506, -3532776, -3062319, -2738263, -3819154, -4949825, -4199254, -2237666, -1287655, -1581109, -1325677, -90136, 299959, -1171891, -2874007, -2747000, -886548, 991941, 1587361, 870129, -165556, -213881, 996526, 2001783, 1344010, -133750, -282049, 1087711, 1888396, 1090690, 219045]
39803B19045L84840O04199o19113j317197p72542m61828r86356r79979J03466
39794c825465P60016J29824l72322N49210J953885K299051J588972O04871n44263
39785C143779j749752k033602p75281J031154J893675J498096M42136q02103j752087
39776H96015j644299l76354Q82957R57798J06596m89546k21099N48327J137956
39767A798351J130612O35659J76990l3109n03168j459562j902834r19933M42826
39758f34168L77305p00376n33882J189313J878516L6833k042947j433240J216434
39749f46212K691117J435696j104688k721358k426941p15646Q30680P03561p09874
39740b663665j210503L23663K219472K401106J226276L22297j47863r81715j657144
$$ y = [219045, 603885, 1208084, 588971, -728226, -1500768, -1962596, -2948952, -3928931, -3825465, -3065449, -2935625, -3307947, -2758737, -804852, 1494199, 3083171, 3688042, 3143779, 1394027, -639575, -1414856, -383702, 1509973, 3008069, 3450205, 2648102, 896015, -748284, -1124638, -241681, 716117, 822713, 333167, 112068, 660395, 1798351, 2928963, 3564622, 3741612, 3708503, 3205335, 1745773, -157061, -1076994, -634168, -256863, -957239, -1491121, -301808, 1576708, 1613541, -429406, -1862646, -646212, 2044905, 3480601, 2375913, -345445, -2772386, -3488032, -2657352, -1953791, -2663665, -3874168, -3550505, -1331033, 1070073, 2296349, 2618646, 2470783, 1489068, -168076]
39731a68076r50916N92481J148350M71351N3124L58182J75024q43393j177423
39722c41296J23017J726477J795149K69600j444213k081619j230186N61181J852961
39713A231071J447974q4138r22625l57098M10451J99221n54832p46671k01740
39704D21613L49971K68504m70216j232072j106767K2310R36546N23606n31502
39695h18007p84560m36057q57298j729372j014971J474426K898330J303275j286820
39686a251054j685486P6878J430026J228669N63360J45488n29190j248890p21421
39677a991620J067598K051534P89960j375852k095350r88606L88885R30883R58492
39668b64076R09164L56304j058351k428784k220082j60705K091578K581801J130009
$$ y = [-168076, -1118992, -526511, 621839, 1093190, 1146314, 1504496, 1679520, 836127, -341296, -218279, 1508198, 3303347, 3572947, 2128734, 47115, -1183071, -621890, 1231071, 2679045, 2594907, 1672282, 1315184, 1725635, 1924856, 1370024, 623353, 421613, 771584, 1040088, 569872, -662200, -1768967, -1746657, -810111, -286505, -818007, -1602567, -2038624, -2895922, -4625294, -5640265, -4165839, -1267509, 35766, -1251054, -2936540, -2859662, -1429636, -200967, 362393, 507881, -21309, -1270199, -1991620, -924022, 1127512, 1917472, 541620, -1553730, -2542336, -2153451, -1222568, -264076, 645088, 1001392, -56959, -2485743, -4705825, -4866530, -2774952, -193151, 936858]
39659I36858o53792j309935r05298l60716r3898J37085M59166O42730N62024L74185
39649b11591K32790K22876N15857J111917J452574Q91278k75495q61089k85333
39640B793784N06531K75003p20717j086734m31468P43o33572j211539k89518J387206
39630E89719J641809N8407j311199r27578J97921M03581j77882m50893l76543
39621c52658m31727k7522J449987K592927J346050j541353k830107j149683J147663
39612B03577J456531K33776n06016k93990r7630k96676n00004o42745p70035l54866
39602a568078P86075J521355P76300o65973j188005o72581k76652l15150j31898
39593a734607J31148m07704j360738j106280N42788J559523O32280p05927k68851
$$ y = [936858, 283066, -1026869, -1932167, -2292883, -2386781, -2249696, -1790530, -1147800, -585776, -211591, 21199, 244075, 759932, 1871849, 3324423, 4215701, 3940206, 3079117, 2793784, 3300315, 3575318, 2854601, 1767867, 1336399, 1337142, 703570, -507969, -797487, 589719, 2231528, 2289935, 978736, 51158, 249079, 652660, 474778, 23885, -352658, -784385, -811907, 638080, 3231007, 4577057, 3035704, 205597, -944086, 203577, 1660108, 1893884, 1387868, 1093878, 996248, 699572, 199568, -443177, -1213212, -1568078, -782003, 739352, 1515652, 849679, -338326, -1010907, -1287559, -1602709, -1734607, -1603459, -2011163, -3371901, -4478181, -3935393, -2375870, -1743590, -2449517, -2718368]
39584b718368J621025K738396K025778M70739p69723j541527j869196j395752
39576a438628k35989N95837L40169m78653p56624j38296Q30362J458859J293947
39567A470984J53131j499938k404850j537507N66028K114946J894704L66554j115172
39558H880j607164r53182M48936J808035K316899J816410Q60784r261o24327p79087
39548C286923k46909N12391N33523k65138p52108k78782K33440k39774j165368
39539A618198j303128m55658O75684J579196J789134O59210j334650k127868o49190
39530D50928J123317P67373q29257q53002Q98972J808611P20126o04679p69823
39521B712566n35635n31691j8838J007005J156358K30903j83780J79583m67350
$$ y = [-2718368, -1097343, 1641053, 3666831, 4137570, 3367847, 1826320, -42876, -1438628, -1674617, -1078780, -738611, -1217264, -1973888, -2112184, -1281822, 177037, 1470984, 1624115, 124177, -2280673, -3818180, -3252152, -1137206, 757498, 1124052, 8880, -1598284, -2551466, -2102530, -294495, 2022404, 3838814, 4699598, 4690337, 4066010, 3286923, 3040014, 3552405, 4085928, 3820790, 3068682, 2789900, 3023340, 2783566, 1618198, 315070, -140588, 535096, 2114292, 3903426, 4562636, 3227986, 1100118, 450928, 1574245, 2341618, 1512361, 659359, 1558331, 3366942, 4087068, 3482389, 2712566, 2176931, 1645240, 1626402, 2633407, 3789765, 4020668, 3836888, 4016471, 3549121]
39512C549121k220320k304602L10380K409872J331206p89777p52611N35814L70361
39503B439444o62105k00752R92386K89271j554582j129534J691783L048510J060024
39494E974445j471427j571164J1975Q94248M04114n88864j181041p02978Q50974
39485B620282K066535J426504l86113j273442p73059k95110m57027n06518l37956
39476B084096n93972p66919J58706J172017K75164j771499j938461L29459K157532
39467A106123J869629J215495J718746K077351R42700n84129j151411j389841
39459E804663k078968k283775j159048K61706O91457L56267n5099m84609o71214
39450C81380j36764L74488l56549j444058p44247J360799K243690J581794J793652
$$ y = [3549121, 1328801, -975801, -665421, 1744451, 3075657, 2285880, 1533269, 2069083, 2439444, 1777339, 1576587, 2568973, 2858244, 1303662, 174128, 1865911, 4914421, 5974445, 4503018, 2931854, 2943829, 3838077, 4242191, 3653327, 2472286, 1769308, 2620282, 4686817, 6113321, 5727208, 4453766, 3680707, 3385597, 2928570, 2422052, 2084096, 1490124, 723205, 881911, 2053928, 2329092, 557593, -1380868, -1051409, 1106123, 2975752, 4191247, 5909993, 7987344, 8930044, 8345915, 7194504, 5804663, 3725695, 1441920, 282872, 544578, 1236035, 1592302, 1537203, 1052594, 381380, 244616, 619104, 262555, -1181503, -1925750, -564951, 1678739, 3260533, 5054185]
39441E054185L036930K203596j335870l511796j679490J187546J472010K87413
39433F714524N32433J944765K575026K368326K148921J681259J310411K543911
39425B1819576M791754N112675L237727K515192L975143M926609N395240Q855557
39417F0629473J4303168J7409635K3337924M4191778P3484124P8144270L5262779
39410C46763151l1064917p1052199o5387632l9718507k3342070j7247279r961927
39403H8988620j876130J176654K674798Q217001J5063083K2234667L8260517O2112258
39395B36851468O8132751L2634464k8407400p0234319o9648201m5898784k8227657
39388I5202322k2049991j6256830p468747k122016k422016l693942l352944l242786
$$ y = [5054185, 8091115, 10294711, 8958841, 5447045, 3767555, 4955101, 6427111, 6714524, 7246957, 9191722, 11766748, 14135074, 16283995, 17965254, 19275665, 21819576, 26611330, 31724005, 34961732, 37476924, 41452067, 46378676, 51773916, 60629473, 74932641, 92342276, 115680200, 159871978, 233356102, 311500372, 346763151, 315698234, 244646035, 179258403, 139539896, 116197826, 98950547, 88988620, 87112490, 88289144, 90963942, 99180943, 114244026, 136478693, 174739210, 236851468, 304984219, 337618683, 309211283, 238976964, 169328763, 123429979, 95202322, 73152331, 56895501, 49426754, 47304738, 44882722, 41188780, 37835836, 34593050]
39380C4593050m123897m536991m376508m604129m380915k501400m16557k51320
39372I401333j176047j024680m4395J82147P3197R71059J942478J048204r60340
39363A0412956j476771k12751N07012l73123j270334r03602j91038m04362j224653
39354D863334j542710j026160j89931L21385J36023n16531p24736J80133J512351
39345C013158J770225N04383j018113j386629p44944l40483o65105q75103l15412
39336e8023K17404l56073j425413j241443M50706J816817J555376O06880K73270
39327A839501J96573l05311l71690Q58910J947383Q93197j384226j973747l48238
39318A352352R10488K75984n00360M59529J992744J642141p03620k573990j884193
$$ y = [34593050, 30469153, 25932162, 21555654, 16951525, 12570610, 10069210, 9652653, 9401333, 8225286, 7200606, 7156211, 7338358, 7411555, 8382614, 10325092, 11373296, 10412956, 8936185, 8723434, 9230446, 8857323, 7586989, 6683387, 6492349, 6087987, 4863334, 3320624, 2294464, 2104533, 2425918, 2561941, 2045410, 1320674, 1500807, 3013158, 4783383, 5287766, 4269653, 2883024, 2138080, 1797597, 1132492, 257389, -58023, 159381, -196692, -1622105, -2863548, -2412842, -596025, 959351, 1566231, 1839501, 2036074, 1730763, 1359073, 2217983, 4165366, 5058563, 3674337, 1700590, 1352352, 2262840, 2538824, 2038464, 2497993, 4490737, 6132878, 5429258, 2855268, 971075]
39309I71075Q24478K938862K339604k46552j794360o16187J312125J068745j045128
39300E752662k272797j789525j400458j696383q53803J562867K822962J141832
39292C267357j069317p01851J271957J483102n87090k124127j405945Q2728L60415
39283E77229m15340q59783m87560o228j10176n63266m18405P87969K073650J854643
39273B432733R484j706796j784994o42216L76216O88126M27406k49354q29984
39264a279379l70717J129119K101999J331044k52143q89145l82055J61889L05404
39255A856016M80260O13564J17194q35070j395016j419310j515269j687117j225012
39246e009760j40793N42658L72387K34925R02496J695265J464625L96764j57287
$$ y = [971075, 1795553, 4734415, 7074019, 6827467, 5033107, 4416920, 5729045, 6797790, 5752662, 3479865, 1690340, 289882, -1406501, -2260304, -697437, 2125525, 3267357, 2198040, 1496189, 2768146, 4251248, 3664158, 1540031, 134086, 216814, 577229, 161889, -697894, -1185454, -1191682, -1301858, -1865124, -2283529, -1495560, 578090, 2432733, 2442217, 735421, -1049573, -1691789, -1315573, -627447, -200041, -449395, -1279379, -1650096, -520977, 1581022, 2912066, 2659923, 1770778, 1388723, 1550612, 1856016, 2336276, 2949840, 3067034, 2231964, 836948, -582362, -2097631, -3784748, -5009760, -5150553, -4607895, -4235508, -4000583, -3098087, -1402822, 61803, 458567, 301280]
39237C01280L82855J000829O50493r7061M2652Q35366O26098r59080j978778r59885
39227a55231O97131Q26356j23022r9408Q63492P42390p37080j420426m11654M43231
39217F25779j09546o62742K5067O88428j0687r43364n72271L63305M19308k1709
39207a98432L5341J45494k25750r3430R70953J127432o57084j881962j53384K334032
39197A403210J841912q47216j762637k40735O07854k95341n84439O17301J094097
39188A834006J2186n04323K22651r2674j854663j741755J553804L990326K108463
39179E528021j360309j891962j29197J59164j196266j159717N38513R46571n80095
39170H54723j104304P14389K239966J225159p66894j225489l68520J07150n4560
$$ y = [301280, 684135, 1684964, 2335457, 2238396, 2281048, 3116414, 3742512, 2783432, 804654, -155231, 541900, 1368256, 1245234, 1145826, 2009318, 2751708, 2014628, 594202, 182548, 625779, 516233, -146509, -121442, 566986, 556299, -387065, -959336, -596031, -176723, -198432, -163091, -17597, -243347, -336777, 634176, 1761608, 1104524, -777438, -930822, 1403210, 3245122, 2397906, 635269, 394534, 1002388, 707047, 122608, 739909, 1834006, 1846192, 1341869, 1564520, 1471846, -382817, -2124572, -570768, 3419558, 5528021, 4167712, 2275750, 2146553, 2305717, 1109451, -50266, 488247, 1434818, 854723, -249581, 464808, 2704774, 3929933, 3163039, 1937550, 1569030, 1676180, 1621620]
39161A621620j27117l13426j054787j391264j59630J601806J543805n35184k035818
39152h49995j139017N44570L25947j538361k124748j32244K124984J989780J18522
39143f80562p88862Q9700J077246R55131M35218M16614O48804O88725N78130N1163
39133C471307j261990k318222j342294J086209J815173n17355k959854k150905
39125d177931R18557K512828J391335k32770m61659K01346O47330P56860P00625
39116B256521L95152J21819K69252K32520r35879k531519k479842j86401K297644
39107e60733K703279J071989p87272j423244o94760N66657J164596M03330j061408
39098A382434j643475n43889J233442J880657O34412j479533k639366k020851
$$ y = [1621620, 1494503, 1181077, 126290, -1264974, -1424604, 177202, 1721007, 1185823, -849995, -1989012, -1444442, -1118495, -2656856, -4781604, -4913848, -2788864, -799084, -680562, -1469424, -1379724, -302478, 652653, 1087871, 1504485, 2153289, 2842014, 3420144, 3471307, 2209317, -108905, -1451199, -364990, 1450183, 932828, -2027026, -4177931, -3259374, -746546, 644789, 412019, -49640, 151706, 799036, 1555896, 2256521, 2651673, 2773492, 3042744, 3275264, 2339385, -192134, -2671976, -2858377, -560733, 2142546, 3214535, 2427263, 1004019, 309259, 875916, 2040512, 2443842, 1382434, -261041, -804930, 428512, 2309169, 2943581, 1464048, -1175318, -3196169]
39090c196169n99110J44758J55458N67908J497629J529935J39831r64945l07494
39081a032199R44811Q74344m5706R356Q42439N84002q11070j234196L1083J132293
39071A295157Q32559L20315O23311O07528p20271j871839r28936J331289K380679
39062C869792J291646n27018j431202r80288K73814J215700P82713q26207j989141
39053A679809j527079j00324J004405J501223J510354N35060j383691k416844
39045H02913q41102K150325L453088J927005m53792j529431j298401p95044k83682
39036C131879L58459O00915j07703j155560j296295k84953P58295P17337k38774
39027B483600r16459m72766O05796R93514O1509j252533j414308r2807J389273
$$ y = [-3196169, -3795279, -3650521, -3495063, -2927155, -1429526, 100409, 240240, -724705, -1032199, -87388, 786956, 741250, 750606, 1593045, 2177047, 1365977, 131781, 162864, 1295157, 2127716, 2448031, 3071342, 3678870, 2958599, 1086760, 157824, 1489113, 3869792, 5161438, 4634420, 3203218, 2222930, 2496744, 3712444, 4495157, 3668950, 1679809, 152730, 52406, 1056811, 2558034, 4068388, 4603448, 3219757, 802913, -38189, 2112136, 5565224, 7492229, 7038437, 5509006, 4210605, 3415561, 3131879, 3490338, 4091253, 3983550, 2827990, 1531695, 1246742, 2005037, 2722374, 2483600, 1567141, 1094375, 1700171, 2693685, 2755194, 1502661, 88353, -4454, 1384819]
39018A384819J546380L55160q92878j173567p33796m15547m16094k10295M32102
39009a23716J002085J024687O91404L62078J283m20332n81844m87069p71780j483578
38999g86782j373873L11140K051081J781922M90q58564p5201N61968o0215q13573
38989G38393p72787p87955j280506q09680J302724K953033K073402j68494j263365
38980A984765r38264l88203N50703K480208L830559K558652o2168p77315O40785
38971I879722J230198p1697r06681J03380J237117J464140K605898N399956O838202
38962B7780235M570019J253141R07873K889663L356582J458584j03640l29671
38954D1782786j488081m636060p242209o909134m710268l011070k162530j321160
$$ y = [1384819, 2931199, 3286359, 2393481, 1219914, 486118, 70571, -345523, -555818, -123716, 878369, 1903056, 2594460, 2956538, 2957821, 2537489, 1955645, 1468576, 696796, -786782, -2160655, -1849515, 201566, 1983488, 1983978, 1125414, 1050213, 1612181, 1551966, 738393, -34394, -822349, -2102855, -2912535, -1609811, 1343222, 3416624, 3248130, 1984765, 1046501, 658298, 1209001, 3689209, 7519768, 10078420, 10016252, 9238937, 9879722, 11109920, 11038223, 10131542, 10234922, 11472039, 12936179, 15542077, 20942033, 27780235, 32350254, 33603395, 34511268, 37400931, 40757513, 42216097, 42112457, 41782786, 40294705, 35658645, 28416436, 21507302, 16797034, 13785964, 11623434, 10302274]
38946A0302274q14004j451740k471811k256495p24287O44700R44555N71488j7195
38937D727485q24364j483988j243114j71229O50881N92238K21676J36152k4787
38928B580950o77986j221886q58068J0055K92484r9655k11413L20697P96150Q72905
38918A804233J189381J923567J940004M53805j341421j611879l41017Q22714Q42858
38909E682245J62843m46437n86399L5835J155612J394344j79167j975918j435345
38900C807613R93390J800351n97867l207507k631817J18430J438584L45713r44009
38891A122881r72235o34384p15009n18320L31891R11720P22136N80539Q71685
38882A700904O08731o72606j626108j008970L60458R30050O64421N07527M36744
$$ y = [10302274, 9488270, 8036530, 5564719, 3308224, 2583937, 3228637, 4173192, 4744680, 4727485, 3903121, 2419133, 1176019, 1004790, 1655671, 2247909, 2469585, 2605737, 2580950, 1902964, 681078, -176990, -166935, 125549, 25894, -185519, 135178, 931328, 1804233, 2993614, 4917181, 6857185, 7310990, 5969569, 4357690, 4016673, 4839387, 5682245, 5845088, 5398651, 4812252, 4848087, 6003699, 7398043, 7218876, 5242958, 3807613, 4801003, 6601354, 6003487, 2795980, 164163, 282593, 1721177, 2066890, 1122881, 150646, -483738, -1198747, -1717067, -1385176, -473456, 248680, 829219, 1700904, 2309635, 1637029, 10921, -998049, -637591, 292459, 956880, 1464407, 1901151]
38873A901151k76945j264737j193578J69687J381824J226545K35993j82098M87184
38864B485026J435775J535734M52266j066321j834226j282672J7022Q98064O70747
38855C311415k93629r40440n81931K59071K88359q93798j910192j195213O96262
38846a260096J547468N21137o06197r9017J099902Q69327p10500j379344j39996
38837a57316J186850O78507q44153j085091L19666J310479M92412p48138k24190
38828I29026J757663K565925Q18075j631343k157705p92998K22889j77583p17584
38819H16365k17022N43862L52119l89460m83000N2544K55964M7255K66123R61365
38809B206115J094734K66845n02383l12258K51777O2268q48572j373377q89944
$$ y = [1901151, 1624206, 359469, -834109, -664422, 717402, 1943947, 2179940, 1997842, 2485026, 3920801, 5456535, 5908801, 4842480, 3008254, 1725582, 1742604, 2640668, 3311415, 3017786, 2077346, 1495415, 1754486, 2042845, 1149047, -761145, -1956358, -1260096, 287372, 808509, 202312, 103295, 1203197, 2072524, 1362024, -17320, -157316, 1029534, 1708041, 863888, -221203, 98463, 1408942, 1901354, 1153216, 929026, 2686689, 5252614, 6070689, 4439346, 2281641, 1488643, 1711532, 1533949, 816365, 599343, 1143205, 1495324, 1105864, 622864, 675408, 931372, 978627, 1244750, 2206115, 3300849, 3567694, 3065311, 2753053, 3004830, 3067098, 2218526, 845149, -44795]
38800d4795J7919N02646N26741N74604O04510L4050r96451j168662K98834J979270
38790B328666J676848m28442j699872o97167P97460O02487o36246r07831k84360
38781G51543m75030j491214j416638K92186J763525J651119Q74822M69834j40035
38772B280112j356475j844313n54755J146969J279734R5580p15805p16482o26945
38763a012380l23711Q10248J890096J267736n67745j133411L56824J563259M04995
38754C255911j889978k634908j355741P0963K81424k31585m85270k51968L25544
38745b915608J209991K020393J901963N47128j032599j414564l80625Q71421J180127
38736A987627O13153j2277l39221o45817r81396q53105o1094O76885M70842n45416
$$ y = [-44795, -26876, 475770, 1002511, 1577115, 2181625, 2215675, 1219224, 50562, 349396, 2328666, 4005514, 3577072, 1877200, 1180033, 1977493, 2579980, 1943734, 1035903, 751543, 276513, -1214701, -2631339, -2339153, -575628, 1075491, 1950313, 2420147, 2280112, 923637, -920676, -1475431, -328462, 951272, 1046852, 331047, -385435, -1012380, -1336091, -525843, 1364253, 2631989, 2064244, 930833, 1287657, 2850916, 3255911, 1365933, -1268975, -2624716, -2553753, -2272329, -2503914, -2989184, -3241152, -2915608, -1705617, 314776, 2216739, 2763867, 1731268, 316704, -63921, 807500, 1987627, 2600780, 2588503, 2249282, 1603465, 622069, -231036, -292130, 384755, 855597, 310181]
38726C10181j257767q75185J63349P97507O72210M69795P58886R49790J20025
38717B108791j191714j166146O89365K266348J492167o43900j538287r09325q63729
38708B43570j904615j742589P14319K889110K150541k40307j351684j034148j126089
38699a401892j413924M3502K789727L740280J741079p29026j435765j164848j309689
38690H59444j333026m23529N02866M53829K75867R41234J431771M10977j211471
38681A907962j514282m71970L97456N71873P05853P97310J85225q09628j011648
38672G58151j44215R31927J530124J422560L08343j504549k392248j138582R22939
38663F94450J285401l19216j648644j118777M68427J513297J351071K33906r73290
$$ y = [310181, -947586, -1822771, -1659422, -861915, -189705, 280090, 1038976, 1988766, 2108791, 917077, -249069, 440296, 2706644, 4198811, 3554911, 2016624, 1107299, 243570, -1661045, -3403634, -2689315, 199795, 2350336, 2110029, 758345, -275803, -1401892, -2815816, -2772314, 17413, 3757693, 5498772, 4769746, 3333981, 2169133, 859444, -473582, -897111, -394245, 59584, 335451, 1276685, 2708456, 3119433, 1907962, 393680, -78290, 319166, 891039, 1596892, 2394202, 2579427, 1769799, 758151, 613936, 1545863, 3075987, 4498547, 4806890, 3302341, 910093, -228489, 694450, 1979851, 1660635, 11991, -1106786, -638359, 874938, 2226009, 2459915, 1486625]
38654A486625j052297J96301J064483M0299j640512j630761k36525J32500p89275
38645b429162o32937J211563K128943O60987q92416l55501P94250M10761m29743
38636D66745K91379J451037N96713j508617j873148j22379J224186J049398P05002
38627B280316P13609o7991j457674j541036j92821K57202q85436j182775O16158
38618a460448J928277M25136j933130j877472K01437J404345R81073N71704O72196
38609I13118J70250q15299p45240M06049P95274j72969q92593m03722K22695K20022
38599c02415M47278J196513J041708n00162j345880J1498J587308P02498j637778
38590A200568k105615j50421J375738Q24686q5795L47724J037526L89427p86246
$$ y = [1486625, 434328, 630629, 1695112, 1735411, 94899, -1535862, -1772387, -1639887, -2429162, -3062099, -1850536, 278407, 939394, 46978, -308523, 485727, 896488, 466745, 758124, 2209161, 2805874, 1297257, -575891, -698270, 525916, 1575314, 2280316, 2993925, 2925934, 1468260, -72776, -265597, -8395, -893831, -2076606, -1460448, 467829, 892965, -1040165, -2917637, -2716200, -1311855, -330782, 240922, 913118, 1083368, 268069, -477171, -71122, 724152, 551183, -341410, -745132, -522437, -302415, 144863, 1341376, 2383084, 1882922, 537042, 548540, 2135848, 2838346, 1200568, -905047, -1055468, 320270, 1144956, 1059161, 1406885, 2444411, 2833838, 2047592]
38581B047592p80224M4379O7371o55245n99787L87951P42203j16583q24839m58573
38571a45755K7828k41972l45181P67901K126878J967655L90832q93663j120185
38562B534338j099071j351429j290103o26116j19698k87960n47648l32504P027
38553c113164J65105O58032J665735K085113J010104n49804q60583K5224M60481
38544A546243j67528n62407L31086J623838J672366J49127j727595k497752j602403
38535a235025K23382J428595J124571K30638L38023J326875J327710m66817k321491
38526A976461k275972p74003L11191L41070R5475r772j84880j20037O38379J245892
38516A243804L29643j561501k101345l68158J783034K315072J410330L21268o02302
$$ y = [2047592, 1267368, 1311747, 1379118, 723873, 124086, 512037, 1254240, 1137657, 312818, -145755, -117927, -359899, -705080, 62821, 2189699, 4157354, 4548186, 3654523, 2534338, 1435267, 83838, -1206265, -1832381, -1952079, -2240039, -2787687, -3120191, -3113164, -2948059, -2290027, -624292, 1460821, 2470925, 1921121, 1060538, 1085762, 1546243, 1378715, 816308, 1147394, 2771232, 4443598, 4592725, 2865130, 367378, -1235025, -1011643, 416952, 1541523, 1772161, 2110184, 3437059, 4764769, 4297952, 1976461, -299511, -1073514, -762323, -421253, -325778, -335550, -520430, -640467, -2088, 1243804, 1573447, 11946, -2089399, -2457557, -674523, 1640549, 3050879, 3372147, 2769845]
38507B769845j387910j306492J5813J246018Q80623m12883p39933P3583L43838
38498A482502o13364j365610o82162N92055R12334K05441l48651p1296O00435
38489G11684R83530R22962O82140M24616m7896r46241j861035j896161q09791
38480a836192M42725R14457Q97652J073090J010469r6601j468605j274565N49142
38471B11572J756563Q87382o29354o64746N26756R01451l83203k025772k416119
38462a835470j314203K41062R78510N37586M924P33610K178560K023938n05847
38453C042670k706690j587689J745809L199576J191086j347714j297880M53390
38445B692558Q10171q92001k147269r71879J434591K347325Q67307j233502j770532
$$ y = [2769845, 1381935, 75443, 91256, 1337274, 2217897, 1805014, 1065081, 1138664, 1482502, 869138, -496472, -1178634, -586579, 325755, 531196, 182545, 111249, 711684, 1695214, 2618176, 3300316, 3724932, 3677036, 2730795, 869760, -1026401, -1836192, -1393467, -479010, 418642, 1491732, 2502201, 2405600, 936995, -337570, 211572, 1968135, 2855517, 2226163, 1561417, 2088173, 2989624, 2606421, 580649, -1835470, -3149673, -2908611, -1930101, -1392515, -1387591, -653981, 1524579, 3548517, 3042670, 335980, -1251709, 494100, 3693676, 4884762, 3537048, 2239168, 2692558, 3502729, 2610728, 463459, -508420, 926171, 3273496, 4140803, 2907301, 1136769]
38436A136769n27522R05330J232813O95927J71284j19426m05997n25435j98848
38427B364895J81904J8043m17885l83147l9617k38572q39768o05313P48489J696146
38417B485175R47139o80622j433132r00751q0683K79256L20851L66078N23799
38408A827110Q35722J045645M82064j016752k321799k091741n38107P91411R73789
38399a2658N19144J33660k68169q50503j033863k00238J141861J665234P87893
38390A882361n04995o85127N33791J717811J308999m14485j526532q00730P52967
38381B264060J212387O0171j563614k481250k357743j205396P21835K300237K046834
38372I97521J2562j668372j042698J264833K743607J892040l10490j789992j568123
$$ y = [1136769, 609247, 1514577, 2747390, 3443317, 3614601, 3495175, 3089178, 2563743, 2364895, 2546799, 2564842, 2146957, 1763810, 1724193, 1485621, 645853, 40540, 789029, 2485175, 3432314, 2751692, 1318560, 417809, 337126, 616382, 937233, 1303311, 1827110, 2662832, 3708477, 4190541, 3173789, 851990, -1239751, -1777858, -986447, -12658, 506486, 640146, 371977, -478526, -1512389, -1712627, -570766, 1094468, 1882361, 1377366, 692239, 1226030, 2943841, 4252840, 3838355, 2311823, 1511093, 2264060, 3476447, 3536618, 1973004, -508246, -2865989, -4071385, -3349550, -1049313, 997521, 1010083, -658289, -1700987, -436154, 2307453, 4199493, 3889003, 2099011, 530888]
38363E30888l80574M17916K06241n30975r16132o02959K2730L84428K44894k13606
38353h37149n53693l49675M08552J164708J318811Q51330J51957n27110r24188
38344G03543m18195J179922K545768J870667n73711k217560j405997L99883Q68781
38335B953101R3517j42557L82685J07415j290475k025469j133837j64322n86913
38326a806855j223359j18484K109464K883713J303845p37937j256941m17134L92280
38317A128592M44335m6941o40215r23531n68768K88349R88322R90173L71564l64461
38307A667419o45309q6570J019351J500684L67036j730923k854238j930856P9903
38298b613503J485311J604372Q04650l95051j504287j872741j179580K4120Q22026
$$ y = [530888, 150314, 568230, 774471, 243496, -672636, -1275595, -1252865, -868437, -623543, -837149, -1390842, -1740517, -1331965, -167257, 1151554, 2002884, 2154841, 1627731, 703543, 285348, 1465270, 4011038, 5881705, 5307994, 3090434, 1684437, 2084320, 2953101, 3046618, 2904061, 3286746, 3394161, 2103686, 78217, -1055620, -1219942, -1806855, -3030214, -3148698, -1039234, 1844479, 3148324, 2410387, 1153446, 736312, 1128592, 1572927, 1525986, 885771, -37760, -606528, -318179, 670143, 1660316, 2031880, 1667419, 1022110, 935540, 1954891, 3455575, 3822611, 2091688, -762550, -2693406, -2613503, -1128192, 476180, 1280830, 885779, -618508, -2491249, -3670829, -3646709, -2824683]
38289b824683Q66941M65085K5653j60141J09272P33107J244375J247488O83046
38280B390143m25700j900760k875677k209203m1766J838405J985951J006426M33557
38271B01376N95215O66600K67113k50770p38138j196154j049900J76990J598576
38262B70908J783843Q35265K03562L33271J00219j014199j819350j263879m1374
38253f11734N62738L79652R5776K10364R26074K096854K687799J464417j051837
38244F760103k604126k070735r35786p93669r45580j03775R42063N42871q40497
38235d9131j270566n18487j94378o93329m72706J072710K280738J787491N53372
38226B495714P4556J15074l14979r06970o56493J22644M7327j116836j819792
$$ y = [-2824683, -1957742, -1492657, -1467004, -1627145, -1517873, -784766, 459609, 1707097, 2390143, 1964443, 63683, -2811994, -5021197, -5062963, -3224558, -1238607, -232181, 201376, 796591, 1463191, 1730304, 1479534, 741396, -454758, -1504658, -1327668, 270908, 2054751, 2890016, 3093578, 3426849, 3527068, 2512869, 693519, -570360, -611734, -48996, 330656, 426432, 636796, 1562870, 3659724, 6347523, 7811940, 6760103, 4155977, 2085242, 1149456, 355787, -589793, -693568, 248495, 791366, -49131, -1319697, -1838184, -2032562, -2725891, -3198597, -2125887, 154851, 1942342, 2495714, 2570270, 2685344, 2370365, 1463395, 806902, 929546, 976873, -139963, -1959755]
38217a959755o96694J592619K944029J986307n11011k362453k110332l89474R87807
38208e18957J078029M75154J15192J94941M43536P11459Q73100O72153P0252o11972
38198C502887j123083j430654j346078o33026L01390N45660j17436q12092p60520
38189a872952k07811K30497L74263J61309n69312j296509q13806R75031K185871
38180h33419J273440m68573m56541J414100K503995J222541q55010j517094q34068
38171A449371k10864P2640N89232R22904J54990j084343j116571L1855M29007
38162A238221n77432j101344P2119J046903k95358k466445k228491L59604J865312
38153b086911P36783n21114L30007J669092R65627q70828r63780Q86058J991575
$$ y = [-1959755, -2656449, -1063830, 1880199, 3866506, 3355495, 993042, -1117290, -1506764, -518957, 559072, 1034226, 1149418, 1344359, 1787895, 2499354, 3372454, 4044607, 4114859, 3502887, 2379804, 949150, -396928, -1029954, -728564, -182904, -300340, -1112432, -1872952, -2080763, -1850266, -1476003, -1314694, -1884006, -3180515, -3994321, -3019290, -833419, 440021, -28552, -485093, 929007, 3433002, 4655543, 3800533, 2283439, 1449371, 1238507, 1311147, 1900379, 2823283, 2978273, 1893930, 777359, 809214, 1238221, 660789, -440555, -368436, 678467, 383109, -2083336, -4311827, -3952223, -2086911, -1350128, -1871242, -1541235, 127857, 1093484, 222656, -741124, 144934, 2136509]
38144B136509R29069p55259j262839p28476j20682K10643K16919j63407m63672
38135a195j05011L55374k04875j421574j590571k64273J018285J161771Q66540
38126a85529P71588J60590j279311k151258j325646J52106O67378L60410L06031
38117b523641M84707K47760r7571J08466L78987j19338p78794k40573J372044
38108a167953K381379J657485k59612j898861j936768j81140J698951J422771
38100A716252q86578k224800o51413J772764J959723K74105n51151P9904K99323
38091A788129m39521n10290O03928J190927L18115o18942l55202M68813R20698
38082C366655J051541P05599p49754k553000k657435q29866N99085L03284r7650
$$ y = [2136509, 3065578, 2310319, 1047480, 319004, 198322, 408965, 625884, 462477, -1195, -106206, 249168, 44293, -1377281, -2967852, -3232125, -2213840, -1052069, -185529, 586059, 746649, -532662, -2683920, -4009566, -3857460, -3190082, -2829672, -2523641, -2038934, -1791174, -1888745, -1780279, -1401292, -1520630, -2299424, -2539997, -1167953, 1213426, 2870911, 2611299, 712438, -1224330, -1405470, 293481, 1716252, 829674, -1395126, -2046539, -273775, 1685948, 1960053, 1408902, 1488806, 1788129, 1348608, 838318, 1442246, 2633173, 2951288, 2332346, 1977144, 2445957, 3366655, 4418196, 5123795, 4374041, 1821041, -836394, -1666260, -1067175, -763891, -861541]
38073h61541Q13470J626635O89511q63052j085252m51417n41711r50864k34500
38064a858721J099500J278584K88413l53140l35682n48205p33561J88972J532948
38055E59108J265038o44249j804196r73938K79243L89936R9789O61071J487880
38046A319682J193745j01667r91323p89106j79864n3967m56382p34300m42774
38037a235956j2101k43824r66388q62722O88718K311794K228920N80589j062086
38028A426944j877079j970831j030077J117950K811531J847029j073996k510140
38020a258669q16430J603212J833752K81248p18632n33611l96525q27111r57334
38011a790100k45368P18179J193619J000237K61487o80217j165937p94652m9114
$$ y = [-861541, -48071, 1578564, 2268075, 1405023, 319771, -131646, -673357, -1624221, -1858721, -759221, 519363, 807776, 454636, 118954, -429251, -1162812, -973840, 559108, 1824146, 1179897, -624299, -1598237, -1318994, -929058, -829269, -168198, 1319682, 2513427, 2411760, 1420437, 631331, 451467, 397500, -58882, -793182, -1235956, -1248057, -1491881, -2458269, -3320991, -2632273, -320479, 1908441, 2489030, 1426944, -450135, -2420966, -3451043, -2333093, 478438, 2325467, 1251471, -1258669, -2075099, -471887, 1361865, 1643113, 924481, 390870, -5655, -832766, -1790100, -2035468, -1317289, -123670, 876567, 1138054, 457837, -708100, -1502752, -1551866]
38002a551866K09608k38292q46310r66954l71878N41414R21639L81206k38517
37993b159950J30363J014312R12899k11662o59690J28781M13631p68140j360719
37984b560175O48666L390068L172792j60416k809090k167403J82897J358972P96005
37975A852316j85090o67908o11504j82380J78213j66069j004157j150983j66456
37966b104018P30782L94949n08924o11451O9534M21603J40517l0L75435P52387
37956c39216Q08645Q81819J076995Q69310M6353p16089p70295m30336m06392p04174
37946C16620p18633k24168L42295N69018N17166M04902K95258K21204K03455J0834
37936A937951o11155j250048r55637M58849J742625J490635k13785k040147k883877
$$ y = [-1551866, -1342258, -1580550, -2426860, -3393814, -3765692, -3224278, -2302639, -1921433, -2159950, -2029587, -1015275, -102376, -314038, -973728, -844947, -431316, -1199456, -2560175, -1911509, 1478559, 4651351, 4490935, 1681845, -485558, -302661, 1056311, 1852316, 1667226, 999318, 387814, 205434, 383647, 217578, -786579, -1937562, -2104018, -1373236, -978287, -1487211, -2098662, -2029128, -1607525, -1467008, -1467038, -1091603, -339216, 469429, 1351248, 2428243, 3297553, 3343906, 2627817, 1857522, 1427186, 1020794, 316620, -402013, -626181, -283886, 285132, 802298, 1207200, 1502458, 1723662, 1927117, 1937951, 1326796, 76748, -878889, -420040, 1322585, 2813220, 2599435, 559288, -2324589]
37927b324589k367784m55994K191775L783617K876590M65315r16922m96044K0137
37918B776101m58042o52839M58207J291354L9850j997454j984846K34259J988249
37909A694839J661156L36749o07808j225218j717926j503295m79332L75162M97487
37900i68186M55090N45460K05014m96701m10291P17094J384406N69999o06849
37891A395036o83789j7453J60366l00142p68192j034213r32363J32544J891566
37882a56640K555382J045876j065843j523111m49199K83633k4590n08013o76722
37873e19227p61375m59825P05227J954819K040765J283021R24678P07049o59984
37864E215148k579213k667222m41451J462163Q97251r42137j613274p17633L76607
$$ y = [-2324589, -4692373, -5148367, -2956592, 827025, 3703615, 4168930, 3252008, 2755964, 2776101, 2318059, 1665220, 2123427, 3414781, 3454631, 1457177, -527669, -293410, 1694839, 3355995, 3692744, 3084936, 1859718, 141792, -1361503, -1840835, -1465673, -968186, -513096, 32364, 237378, -259323, -669614, 47480, 1431886, 2001885, 1395036, 711247, 693794, 854160, 554018, -214174, -1248387, -2180750, -2048206, -156640, 2398742, 3444618, 2378775, 855664, 406465, 690098, 665508, 157495, -519227, -1280602, -1740427, -1035200, 919619, 2960384, 4243405, 5168083, 5875132, 5215148, 2635935, -31287, -472738, 989425, 1886676, 944539, -668735, -1386368, -1009761]
37855a009761Q21210P73993M64901J28677K90258J041362J513437R12317l84095
37846D552299j368278j488374p75632L35283R17646K59919q74064q34039M77806
37837A202566J082552k58493k017145j944976j25945J375623J214720j10434j271182
37828h52714j207359K14888J773546J833100M78977l23234M08132J045500k6362
37819C344474j619591j560174j73148M14151k20397n55160j95157m71833j544734
37810b581569j514172M50282K230700J596645n19999j305912J06625J685695J344553
37801A492848m08215j204812J33952J976676J904466M5508r50303K57335J563536
37792D810991N63822j625797j973462j28212J279618Q07782j15711j78277j41629
$$ y = [-1009761, -188551, 585442, 1050343, 1179020, 1469278, 2510640, 4024077, 4936394, 4552299, 3184021, 1695647, 920015, 1255298, 2172944, 2432863, 1558799, 724760, 1202566, 2285118, 2026625, 9480, -1935496, -2061441, -685818, 528902, 418468, -852714, -2060073, -1845185, -71639, 1761461, 2240438, 1917204, 2325336, 3370836, 3344474, 1724883, 164709, -8439, 405712, 185315, -369845, -565002, -1036835, -2581569, -4095741, -3645459, -1414759, 181886, -338113, -1644025, -1537400, 148295, 1492848, 1084633, -120179, 13773, 1990449, 3894915, 3940423, 2990120, 3247455, 4810991, 5374813, 3749016, 1775554, 1647342, 2926960, 3734742, 3619031, 3440754, 3299125]
37783C299125p27409r48412o7037P19189J97825q05280q86795k28612K32386N01045
37773A286025Q11027M82385p48384j372117l4365J984744K201924L50031j488078
37764C473192j816572j017619M2370Q94092R81800l408j159167j228375n12540
37755c46227m22090j015686p24073R76665K318335J660906j42794j074715q26281
37746D04040q98311j980046k603422j102437J776172L304969K001880m97466j529284
37737a123905o51537M02638N70181N15223P04390M17713m81323o59242M70149
37728A64287J281557L54056j079293j054797m3622Q0187o25904m13475R07239
37719d29765J506479N43108o11672o72169q9333J85581N9482j03013m6951M14047
$$ y = [3299125, 2571716, 1623304, 1556267, 2275456, 2473281, 1668001, 781206, 552594, 784980, 1286025, 2097052, 2579437, 1831053, 458936, 424571, 2409315, 4611239, 4961270, 3473192, 1656620, 639001, 681371, 1575463, 2557263, 2553855, 1394688, 166313, -346227, -768317, -1784003, -2508076, -1531411, 786924, 2447830, 2305036, 1230321, 404040, -494271, -2474317, -5077739, -6180176, -4404004, -1099035, 902845, 405379, -1123905, -1775442, -1372804, -802623, -287400, 416990, 834703, 353380, -305862, 164287, 1445844, 1799900, 720607, -334190, -377812, -297625, -923529, -1337004, -429765, 1076714, 1619822, 1008150, 335981, 246648, 432229, 491711, 388698, 341747, 755794]
37709G55794R68162O28649p52154j494697l93076Q66877M5897j617042r01649
37700a893239K010091L303125J348040r65347j095294m52524j077658j980564
37692h03370j435857k71708o7157k61061K26936N74699K6789J53912K027136L165130
37682C335449R25500k681386l535938j604472l60332p02441o9465K201321L281303
37673G89539J751586n3268k41963j71154j052031j241564M79876J866495N17539
37664B645055j917703k060932O3316J377492N33584o16886l25972P72421J183857
37655A654232N54358m53106j103187r91487k98013K26945J30442r9173P0525J28103
37645a80361o71670j733090j576621N1283J581998J464404j15105j623281j736935
$$ y = [755794, 1723956, 2352605, 1600451, 105754, -287322, 579555, 625452, -991590, -1893239, 116852, 3419977, 4768017, 3802670, 2707376, 2254852, 1177194, -803370, -2239227, -2510935, -2578092, -2839153, -2612217, -2037518, -2010729, -1856817, 170319, 3335449, 4260949, 1579563, -1956375, -3560847, -3921179, -4623620, -4693085, -2491764, 789539, 2541125, 2487857, 2245894, 2074740, 1022709, -218855, 261021, 2127516, 2645055, 727352, -1333580, -1270264, 107228, 640812, 23926, -302046, 470375, 1654232, 2208590, 1755484, 652297, -339190, -637203, -410258, -279816, -378989, -308464, -180361, -852031, -2585121, -4161742, -4110459, -2528461, -1064057, -1179162, -2802443, -4539378]
37636d539378l18805J624918K681017K106390M94242p62639q17422q4396M39354
37627H23281L89575L28063P58669J161818N24181j129505k404778k156281q42806
37618b547783L27888R54688J251320R52207k31183j358327j040407M04826J117966
37609a68805L78337m23834j00966O00771N42897Q2266J61211N67272M67926l0005
37599B077070j50851J92867M42255M18124L34688J56769j98855m30329l75532
37590B466206m21285o47419l34631P35797J382900O80761l16194n9467R20533
37581D407201P59353p18790j703471j265259n81227p42097j094181o79848J01262
37572a517057L75928K60631K94182K32453l76108r33784l60224J189317K213873
$$ y = [-4539378, -4858183, -3233265, -552248, 1554142, 2048384, 1285745, 468323, 383927, 823281, 1212856, 1540919, 2299588, 3461406, 3985587, 2856082, 451304, -1704977, -2547783, -2219895, -1265207, -13887, 938320, 707137, -651190, -1691597, -1286771, -168805, 209532, -214302, -315268, 285503, 828400, 910666, 1071877, 1639149, 2107075, 2077070, 1926219, 2119086, 2561341, 2979465, 3314153, 3470922, 3272067, 2841738, 2466206, 2044921, 1397502, 1062871, 1798668, 3181568, 3862329, 3546135, 3486668, 4407201, 5166554, 4447764, 2744293, 1479034, 897807, 155710, -938471, -1618319, -1517057, -1141129, -880498, -586316, -353863, -729971, -1663755, -2023979, -834662, 1379211]
37563A379211J660098J18680j004395j011600l59543N7830k24113r00534j148459
37554a432825l13143J352656K620599K320638O45340r04583j180406o15198l31147
37545B161931n13755n52660m45894p77334j255022p43453P63148J641980R17306
37536A196247l32584q56253j092599j757938j942766n39708J393839J872408J039104
37527a020250P47798J336202J197161k25420j366007j127185m55419m24092n77103
37518a914315k38078J19166p7911m26462n26830p37977j051931o47486M35832
37509e065992P50804j84990n93858Q70447K639140K443188Q37097K20694J048527
37500B965057J424626L42476r20314r99508k30686K86970O8615p11238j476201
$$ y = [1379211, 3039309, 3157989, 2153594, 1141994, 782451, 840281, 616168, -284366, -1432825, -1745968, -393312, 2227287, 4547925, 5193265, 4288682, 3108276, 2493078, 2161931, 1648176, 1095516, 649622, -127712, -1382734, -2126187, -1363039, 278941, 1196247, 863663, 7410, -1085189, -2843127, -4785893, -5325601, -3931762, -2059354, -1020250, -272452, 1063750, 2260911, 2035491, 669484, -457701, -913120, -1337212, -1914315, -2152393, -2033227, -2111138, -2537600, -3064430, -3802407, -4854338, -5501824, -5065992, -4315188, -4500178, -5094036, -4223589, -1584449, 858739, 1695836, 1916530, 2965057, 4389683, 4732159, 3811845, 2812337, 2581651, 2868621, 2937236, 2225998, 749797]
37491G49797j401497l18523O46606M50690k14909r4465K86602n38370j969283
37482b403352j664428O53868K298566J588616K17718P4790J58041j008376j980406
37473b064963n39849K016095K231718j43409j639115m57642R89623L50550q93275
37464a50267k41996J483641J538628k22686j240794l98455N29269N8324p65755
37455E89909l87565P76226J205896M86094n81137j280761j340004o34654M43248
37446g22748Q49513R6917q16409o04165N67375J451553J463832J059405O46955
37437C992228J68369l61488q31757j380099j840210j232460R02028K943029K663731
37428E023371M07451j045328l62199N14209m10144j934904j564143M76482J414752
$$ y = [749797, -651700, -970223, -323617, 127073, -87836, -182301, 104301, -434069, -2403352, -4067780, -3413912, -1115346, 473270, 690988, 765778, 923819, -84557, -2064963, -2604812, -588717, 1643001, 1499592, -139523, -597165, 392458, 743008, -150267, -392263, 1091378, 2630006, 2407320, 1166526, 768071, 1297340, 1355664, 589909, 202344, 978570, 2184466, 2670560, 2089423, 808662, -531342, -1165996, -722748, 126765, 223682, -592727, -1196892, -629517, 822036, 2285868, 3345273, 3992228, 4160597, 3799109, 2967352, 1587253, -252957, -1485417, -583389, 2359640, 5023371, 5430822, 4385494, 4023295, 4537504, 4127360, 2192456, 628313, 1104795, 2519547]
37419B519547q0045k156008k473395j035963M61235R95911R59867J077424J431981
37410A700554J526083R10628k75387j329814j658893j373578j012470p83690m12561
37401b709128L03671J138174J658949J564211Q45058j19802p04327n65993j1341
37392A399472L78936L87151K21276J34907K48159N28282O47313J31929r37287
37383C140138j640041j177152o472N37072j93436j406299j795994r28582L98839
37374c071927J042035P06512K02568L46435Q27075P38064J10736p6603L50235
37365A175130K56476q12926j436319m22083R71729P46839n74125o13885R80735
37356B71571J734822J81071j685472j274730Q50846J952013R78507m33410o43302
$$ y = [2519547, 2439502, 283494, -2189901, -3225864, -2764629, -1768718, -808851, 268573, 1700554, 3226637, 4137265, 3861878, 2532064, 873171, -500407, -1512877, -2296567, -2709128, -2405457, -1267283, 391666, 1955877, 2800935, 2681133, 1976806, 1410813, 1399472, 1778408, 2165559, 2386835, 2521742, 2769901, 3298183, 3945496, 4077425, 3140138, 1500097, 322945, 316473, 853545, 660109, -746190, -2542184, -3470766, -3071927, -2029892, -1323380, -1120812, -774377, 52698, 790762, 901498, 824895, 1175130, 1431606, 618680, -817639, -1239722, -267993, 478846, -95279, -709164, 271571, 2006393, 2187464, 501992, -772738, 78108, 2030121, 3008628, 2575218, 1931916]
37347A931916j5315J54510m27873q82924m52573N54809J108214O18247l62387
37338B226624q11300n11242j73268k72885m83305n24722p20393j105179p97887
37329c173557P57925K436353K464829P27317r82842j144051j07967O92720M35930
37320B106657m66896r24246j78447J252273J669504K703k360575k594587J13140
37311a380474L072974L093307L65465j955295j844456n40746j64205p31738p72431
37302h57599L8451N22585J14160k46825K37215R42693R18062K98922k10849n05849
37292A250966p80613o89766Q6595Q34532N58729m03717p26511j10104K77164k85314
37282A1961q80133l60139R10516J550683R21534l17793j153251j169709o99251
$$ y = [1931916, 1916601, 2071111, 1643238, 760314, 307741, 862550, 1970764, 2589011, 2226624, 1415324, 904082, 730814, 457929, -25376, -550098, -1270491, -2375670, -3173557, -2415632, 20721, 2485550, 3212867, 2230025, 1085974, 978007, 1670727, 2106657, 1639761, 715515, 537068, 1789341, 3458845, 3461548, 1100973, -1493614, -1380474, 1692500, 4785807, 5151272, 3195977, 1351521, 810775, 646570, -85168, -857599, -819148, -296563, -182403, -429228, -192013, 750680, 1668742, 1967664, 1756815, 1250966, 470353, -219413, -132818, 701714, 1260443, 856726, 130215, 20111, 297275, 11961, -868172, -1228311, -317795, 1232888, 2154422, 1836629, 683378, -486331, -1185582]
37273a185582l66004m00062l47114K49776R42721P73705k86330j031369n55587
37264b205846N44887J048728O90819K46554L30033O94111O84590R5589m11780
37255A717685J52195J747436K669785J193548j948056l819882k704455l13527
37247a305271M28514r02711k026773j179370Q34901K070682J836173J043457P56192
37238A555794J036427J134112M58829p58545j763799k137123k078160j744267
37230d296732p37387J275399L604885M817676M250653K943722K580784L372023
37222A7811023L475927J199239k399571m249525l110731j416349k001030m008384
37214E300599m072905j250282J602033J894046N22654j56281K77944N64660J20516
$$ y = [-1185582, -1551586, -1951648, -2298762, -2048986, -1106265, -332560, -618890, -1650259, -2205846, -1660959, -612231, 78588, 325142, 655175, 1349286, 2033876, 2129465, 1717685, 1869880, 3617316, 6287101, 7480649, 5532593, 1712711, -991744, -1305271, -876757, -1779468, -3806241, -4985611, -4150710, -2080028, -243855, 799602, 1555794, 2592221, 3726333, 4185162, 3426617, 1662818, -474305, -2552465, -4296732, -5034119, -3758720, -153835, 4663841, 8914494, 11858216, 14439000, 17811023, 21286950, 22486189, 20086618, 15837093, 12726362, 11310013, 9308983, 5300599, 1227694, -22588, 1579445, 3473491, 3996145, 3839864, 4117808, 4682468, 4802984]
37205D802984n42973r61232q67180P1115J401334J604745J6737j774737j874017
37196A876776o28677K77587M45190O72813R04618K94448r26602j565283j385873
37187c5003j140109p69960N03559K153833K349723N19266j630665k199597j010072
37178a259025P84564J812841J191962n65430j458464k42222J523194J393637l65815
37169B815242j305777p11870l36347r41878j030604Q2733P69611N3895n12912
37160a117907L48651J316220Q71059p9537r6057J84463l76340r10789p9672J237203
37150A297294J276930L19770j63678k65435r64910j571137o39766J043464J241442
37141A573974q0254o50708L55300J187821P28916K46537Q86991J589584Q89010
$$ y = [4802984, 4260011, 3298779, 2431599, 2502714, 3904048, 5508793, 5525530, 3750793, 1876776, 1248099, 1525686, 1970876, 2643689, 3548307, 3842755, 2916153, 1350870, -35003, -1175112, -1945072, -1441513, 712320, 3062043, 3581309, 1950644, -248953, -1259025, -474461, 1338380, 2530342, 1964912, 506448, 264226, 1787420, 3181057, 2815242, 1509465, 797595, 461248, -480630, -1511234, -1428501, -658890, -604995, -1117907, -769256, 546964, 1418023, 1338486, 1242429, 1426892, 1050552, 139763, 60091, 1297294, 2574224, 2893994, 2730316, 2464881, 1499971, -71166, -710932, 332532, 1573974, 1493720, 843012, 1198312, 2386133, 3115049, 3361586, 4248577, 5838161, 6727171]
37132F727171p48055j721616j405206m39299K64575P8096r97986j948819j489288
37123a680427K48349J484430Q10043j084364k149023j155632J023092K152116
37115c51416R07671j350049j780523L90905K559690K098924n8589r70079l7003
37106A409531N06026o23297j883292j495784M8809J081604R50308J73453n73618
37097d06260q59110o21212l00370j88929K49652J387502K074451Q57422j488903
37088G04243k482750j268918M11978J027284J070399J350249J417747P76852j6128
37079B990956n83347j484586k616713k478462m20140J791967K145287R35582k25827
37070E4717p60096r92750p93318J7215P13528O22464L19323N27836O61260p8323
$$ y = [6727171, 5979116, 4257500, 2852294, 2412995, 2677570, 2755666, 1757680, -191139, -1680427, -1432078, 52352, 862395, -221969, -2370992, -3526624, -2503532, -351416, 556255, -793794, -2574317, -2183412, 376278, 2475202, 2416613, 1446534, 1409531, 1915557, 1292260, -591032, -2086816, -2038007, -956403, -6095, 167358, -406260, -1265370, -1886582, -2186952, -2375881, -2126229, -738727, 1335724, 2193146, 704243, -1778507, -3047425, -2635447, -1608163, -537764, 812485, 2230232, 3007084, 2990956, 2407609, 923023, -1693690, -4172152, -4592292, -2800325, -655038, 280544, 54717, -705379, -1698129, -2491447, -2474232, -1760704, -1138240, -818917, -291081, 370179, 291856]
37060B91856r39186n81210P42028J520470J144064L22001l18142p10708o97535
37051G73638j48110M32061M44783J03969o5612j61847m34908n09056j21946J950
37041C14922q03826j787334j687115n68928L90271N73576L64341L21124P64384
37032b118585J648638K167263J349627k73791q72771n1827K80283r51250j947806
37023g70219j048469K20630k70701j357095n11191J529891J757292L644p68751
37014a214969N00681J376153K11993j328796j311770k24192P07732J358873J580260
37005A655965O43710r02284j142418J72599Q48795j89902j063871k59834P21940
36996D84700O8733j223235j220722k32704J95262k1042j8490R9226p2281Q1892
$$ y = [291856, -647330, -1228540, -486512, 1033958, 2178022, 2500023, 2181881, 1471173, 773638, 625528, 1057589, 1502372, 1606341, 1540729, 1378882, 943974, 434918, 312972, 314922, -488904, -2276238, -3963353, -4532281, -4142010, -3568434, -3204093, -2882969, -2118585, -469947, 1697316, 3046943, 2773152, 1900381, 1848554, 2128837, 1177587, -770219, -1818688, -1598058, -1868759, -3225854, -3737045, -2207154, -449862, -446218, -1214969, -714288, 661865, 873858, -454938, -1766708, -1990900, -1283168, 75705, 1655965, 2299675, 1397391, 254973, 427572, 1276367, 1086465, 22594, -237240, 484700, 553433, -669802, -1890524, -2123228, -1927966, -1949008, -1967498, -1868272, -1940553, -1858661]
36986a858661Q51766Q78704o77576j951025p46986J901250L000100J700466k01848
36977B896190j267850j574648j266232k34190Q42572J060730P47649P08892N33048
36968B446161n14642j536298j099027J61995L43965n76102q10633L5895L48113
36959a200573n21904j034538j1484J534595J985419J052947m54369j471203j020581
36950a141691Q15422K149583J175341j100277j883929n15206Q04376O26512J94900
36941A125031P91019J425137P00202p74342j474981j198939p24888k75575L14112
36932i3224P16262N94133L11441K46047J02990l31409n54966j81540M05960Q10939
36922B026633J094415J012882j2994j546777k076954j115317m4752P883k39438
$$ y = [-1858661, -1006895, -128191, -805767, -2756792, -3503778, -1602528, 1397572, 3098038, 2896190, 1628340, 53692, -1212540, -1446730, -604158, 456572, 1204221, 1913113, 2446161, 1931519, 395221, -703806, -541811, -197846, -773948, -1584581, -1548686, -1200573, -1722477, -2757015, -2768499, -1233904, 751515, 1804462, 1350093, -121110, -1141691, -326269, 1823314, 2998655, 1898378, 14449, -500757, 303619, 930131, 1125031, 1916050, 3341187, 4041389, 3267047, 1792066, 593127, -131761, -407336, -93224, 623038, 1217171, 1528612, 1774659, 1877649, 1546240, 991274, 809734, 1215694, 2026633, 3121048, 4133930, 4120936, 2574159, 497205, -618112, -662864, -654981, -894419]
36913h94419J97435Q17946P47018L20352J74542q5527q74029j390900r29054l75511
36903b292147p92978j474854j131726j16136L78472N12061J160135J759953J066807
36894i30413k76734l11063J034583J644092N54775o34980n09785M1398l27754
36885B84119j069458p56609N51286J450704J265879P41372O97297Q83813M71228
36876D519631o77814j594479j290107j53931L57095k55378o29881M80534K059064
36867B814734K016382K39068j138814p46884K59582J59079q59050j285460o48498
36858H10139l6912l14682q24610l86315Q78719J501353O36829o40703p71598O3965
36848I16185L94480l4601R1343J081137J273562k01138j573816j113949j4155
$$ y = [-894419, -696984, 120962, 867980, 1188332, 1362874, 1277347, 403318, -987582, -1916636, -2292147, -3085125, -4559979, -5691705, -5807841, -5429369, -4917308, -3757173, -1997220, -930413, -1207147, -1518210, -483627, 1160465, 1715240, 1080260, 570475, 611873, 284119, -785339, -1541948, -990662, 460042, 1725921, 2467293, 3164590, 4048403, 4519631, 3841817, 2247338, 957231, 803300, 1160395, 905017, 275136, 755670, 2814734, 4831116, 5070184, 3931370, 3184486, 3444068, 3603147, 2744097, 1458637, 810139, 773227, 458545, -366065, -752380, 126339, 1627692, 2264521, 1623818, 852220, 916185, 1310665, 1276064, 1367407, 2448544, 3722106, 3520968, 1947152, 833203, 819048]
36839H19048l34133j404727j045525M93293R23283k9786k31590R29702J525645
36830A645210P87415N01740J354714J147555j274853l233216k039776O59864J353947
36821I02600j60152j141172m09458N28214M25847k85588r17326j165213n18110
36812b740358R88879J798244O59587j022492r14092O30515J231068M59073J90215
36803A280639Q27428M41081j403260k150671k82182J874117J536145m22046j130545
36794E70706L5489J280857J423354Q03971j82304j333123j783949q30362N79730
36785E64369Q45078j8488o92702q03197j046922j269423m57570J107450J675335
36776i6070O32641m51843k16560N72533M79159m82759j249642j262212o59420
$$ y = [819048, 484915, -919812, -1965337, -1472044, -548761, -578547, -810137, 119565, 1645210, 2432625, 2934365, 4289079, 5436634, 4161781, 928565, -1111211, -451347, 902600, 742448, -398724, -808182, -279968, 145879, -139709, -1057035, -2222248, -2740358, -1751479, 46765, 706352, -316140, -1230232, -599717, 631351, 1090424, 1280639, 2108067, 2549148, 1145888, -1004783, -1286965, 587152, 2123297, 1701251, 570706, 606195, 1887052, 3310406, 4114377, 3932073, 2598950, 815001, -15361, 564369, 1409447, 1390959, 698257, -104940, -1151862, -2421285, -2878855, -1771405, -96070, 536571, 84728, -131832, 440701, 919860, 437101, -812541, -2074753, -2734173]
36767b734173K49757Q89091O39965j07276j27595O60371O79905p49247j787113
36758b386315o78491J247254J347728l50064j401087q61887k66582m08316N2778
36749c704982J726847K788280J798134J96443J6758P35497N71008l54055n76818
36740C197112j89387n56926j426263r90211Q20667J639829K00656j579617j436492
36731c20632p424M67107l73984p17300M85329J897862J581545m93241k358391
36722A60871k277007o11550P78059P99027J70002Q208K31005J37566j44798K2577
36712g26040M53698M33736J15164K31279N71579K90451l08960o4567Q04649O97234
36702B498223o57500j508447q91479j20036m19985j036659r54539n67607k29376
$$ y = [-2734173, -2484416, -1595325, -955360, -1062636, -1190231, -529860, 150045, -599202, -2386315, -3064806, -1817552, -469824, -819888, -2220975, -3082862, -3349444, -3757760, -3704982, -1978135, 810145, 2608279, 2804722, 2821480, 3556977, 4127985, 3773930, 3197112, 3007725, 2450799, 1024536, 34325, 854992, 2494821, 2695477, 1115860, -320632, -328056, 139051, -234933, -952233, -466904, 1430958, 3012503, 2519262, 160871, -2116136, -2727686, -1949627, -1150600, -980598, -972390, -741385, -603819, -748617, -726040, -272342, 161394, 276558, 507837, 1079416, 1369867, 1060907, 996340, 1800989, 2498223, 1840723, 332276, -559203, -679239, -1099224, -2135883, -3090422, -3658029, -3887405]
36693c887405Q07024K297247K063344n84508k574378j091811J844797K171627
$$ y = [-3887405, -3080381, -783134, 1280210, 695702, -1878676, -2970487, -1125690, 1045937]
$$ [...]
##END NTUPLES=NMR SPECTRUM
##END=
