##TITLE=31Pdec_2PBDP3
 CDCl3, 124 sc
 30.7.2019
##JCAMPDX= 6.0         $$ Bruker NMR JCAMP-DX V2.0
##DATA TYPE= NMR SPECTRUM
##DATA CLASS= NTUPLES
##ORIGIN= UXNMR, Bruker Analytische Messtechnik GmbH
##OWNER= root
$$ XWIN-NMR		Version 3.5
$$ Tue Jul 30 14:19:33 2019 Russian Standard Time (UT+4h)  she@DPX200
##.OBSERVE FREQUENCY= 81.013821
##.OBSERVE NUCLEUS= ^31P
##.ACQUISITION MODE= SIMULTANEOUS
##.ACQUISITION SCHEME= undefined
##.AVERAGES= 124
##.DIGITISER RES= 17
##SPECTROMETER/DATA SYSTEM= spect
##.PULSE SEQUENCE= zgpg30
##.SOLVENT NAME= CDCl3
##.SHIFT REFERENCE= (INTERNAL, CDCl3, 0, 182.463)
##AUDIT TRAIL= $$ (NUMBER, WHEN, WHO, WHERE, WHAT)
$$ ##TITLE= Audit trail, XWIN-NMR		Version 3.5
$$ ##JCAMPDX= 5.01
$$ ##ORIGIN= Bruker BioSpin GmbH
$$ ##OWNER= she
$$ F:/spectra/data/she/nmr/P31/1/pdata/1/auditp.txt
$$ ##AUDIT TRAIL=  $$ (NUMBER, WHEN, WHO, WHERE, WHAT)
(   1,<2019-07-30 14:17:23.48 +0400>,<she>,<DPX200>,
      <continue with go, POWCHK disabled, PULCHK disabled
       configuration hash MD5:
       00 E9 B6 7A A2 85 ED C7 34 08 36 98 17 FE 4E 26
       data hash MD5: 32K
       97 C5 E9 21 82 C8 E5 67 2E C4 F0 AE 7A 58 C5 26>)
(   2,<2019-07-30 14:18:45.81 +0400>,<she>,<DPX200>,
      <Start of raw data processing
       efp BC_mod = 2 LB = 1 FT_mod = 6 PKNL = 1 PHC0 = -386.6332 PHC1 = 101.2 SI = 64K 
       data hash MD5: 64K
       04 27 BC D0 AF BB 08 FA 65 26 46 53 9F 35 26 56>)
(   3,<2019-07-30 14:18:59.48 +0400>,<she>,<DPX200>,
      <pk PHC0 = -1.485415 PHC1 = 0 
       data hash MD5: 64K
       00 42 6B 7C 79 8F 49 CE EF 89 9A AC 91 3D 1D EA>)
(   4,<2019-07-30 14:19:03.35 +0400>,<she>,<DPX200>,
      <abs ABSG = 5 
       data hash MD5: 64K
       0E AA BB BC 4F 27 7A AE A4 97 EA 8A 3A 99 F6 90>)
$$ ##END=
$$ 
$$ hash MD5
$$ 92 1D 55 2F 1E 3D 6D 77 85 24 E9 0A 9C 56 BD 09
##$RELAX= 
##$RELAX= 
##$RELAX= 
##$RELAX= 
##$RELAX= 
##$RELAX= 
##$RELAX= 
##$RELAX= 
$$ Bruker specific parameters
$$ --------------------------
##$DU= <F:/spectra>
##$EXPNO= 1
##$NAME= <P31>
##$PROCNO= 1
##$TYPE= <nmr>
##$USER= <she>
##$AMP= (0..31)
100 100 100 100 100 100 100 100 100 100 100 100 100 100 100 100 100 100 
100 100 100 100 100 100 100 100 100 100 100 100 100 100 
##$AQSEQ= 0
##$AQ_mod= 1
##$AUNM= <au_zg>
##$AUTOPOS= <>
##$BF1= 81.014009
##$BF2= 200.13
##$BF3= 200.13
##$BF4= 200.13
##$BF5= 200.13
##$BF6= 200.13
##$BF7= 200.13
##$BF8= 200.13
##$BYTORDA= 1
##$CFDGTYP= 0
##$CFRGTYP= 5
##$CHEMSTR= <none>
##$CNST= (0..31)
1 1 145 1 1 1 1 1 1 1 1 1 1 1 1 1 1 1 1 1 1 1 1 1 1 1 1 1 1 1 1 1 
##$CPDPRG= <waltz16>
##$CPDPRG1= <>
##$CPDPRG2= <waltz16>
##$CPDPRG3= <>
##$CPDPRG4= <mlev>
##$CPDPRG5= <mlev>
##$CPDPRG6= <mlev>
##$CPDPRG7= <mlev>
##$CPDPRG8= <mlev>
##$CPDPRGB= <>
##$CPDPRGT= <>
##$D= (0..31)
0 1 0 0 0 0 0 0 0 0 0 0.03 2e-05 3e-06 0 0 0 0 0 0 0 0 0 0 0 0 0 0 0 0 
0 0 
##$DATE= 1564481663
##$DBL= (0..7)
120 120 120 11 120 120 24 19 
##$DBP= (0..7)
150 150 150 150 150 150 150 150 
##$DBP07= 0
##$DBPNAM0= <>
##$DBPNAM1= <>
##$DBPNAM2= <>
$$ [...]
##$SUBNAM3= <"">
##$SUBNAM4= <"">
##$SUBNAM5= <"">
##$SUBNAM6= <"">
##$SUBNAM7= <"">
##$SUBNAM8= <"">
##$SUBNAM9= <"">
##$SW= 369.568048894756
##$SWIBOX= (0..15)
0 1 3 0 0 0 0 0 0 0 0 0 0 0 0 0 
##$SW_h= 29940.119760479
##$TD= 32768
##$TD0= 1
##$TE= 0
##$TE2= 300
##$TE3= 300
##$TEG= 300
##$TL= (0..7)
0 120 53 12 22 120 120 120 
##$TP= (0..7)
150 150 150 150 150 150 150 150 
##$TP07= 0
##$TPNAME0= <>
##$TPNAME1= <>
##$TPNAME2= <>
##$TPNAME3= <>
##$TPNAME4= <>
##$TPNAME5= <>
##$TPNAME6= <>
##$TPNAME7= <>
##$TPOAL= (0..7)
0.5 0.5 0.5 0.5 0.5 0.5 0.5 0.5 
##$TPOFFS= (0..7)
0 0 0 0 0 0 0 0 
##$TUNHIN= 0
##$TUNHOUT= 0
##$TUNXOUT= 0
##$USERA1= <user>
##$USERA2= <user>
##$USERA3= <user>
##$USERA4= <user>
##$USERA5= <user>
##$V9= 5
##$VALIST= <valist>
##$VCLIST= <CCCCCCCCCCCCCCC>
##$VD= 0
##$VDLIST= <DDDDDDDDDDDDDDD>
##$VPLIST= <PPPPPPPPPPPPPPP>
##$VTLIST= <TTTTTTTTTTTTTTT>
##$WBST= 1024
##$WBSW= 4
##$XGAIN= (0..3)
0 0 0 0 
##$XL= 0
##$YL= 0
##$YMAX_a= 14194
##$YMIN_a= -16041
##$ZGOPTNS= <>
##$ZL1= 120
##$ZL2= 120
##$ZL3= 120
##$ZL4= 120
##$ABSF1= 182.463
##$ABSF2= -187.1042
##$ABSG= 5
##$ABSL= 3
##$ALPHA= 0
##$AQORDER= 0
##$ASSFAC= 0
##$ASSFACI= 0
##$ASSFACX= 0
##$ASSWID= 0
##$AUNMP= <proc_1d>
##$AZFE= 0.1
##$AZFW= 0.5
##$BCFW= 0
##$BC_mod= 2
##$BYTORDP= 0
##$COROFFS= 0
##$CY= -3
##$DATMOD= 1
##$DC= 0
##$DFILT= <>
##$DTYPP= 0
##$F1P= 0
##$F2P= 0
##$FCOR= 1
##$FTSIZE= 65536
##$FT_mod= 6
##$GAMMA= 0
##$GB= 0
##$INTBC= 1
##$INTSCL= 5.30512e-09
##$ISEN= 30
##$LB= 1
##$LEV0= 0
##$LPBIN= 0
##$MAXI= 10000
##$MC2= 0
##$MEAN= 0
##$ME_mod= 0
##$MI= 50
##$NCOEF= 0
##$NC_proc= -9
##$NLEV= 6
##$NOISF1= 182.463
##$NOISF2= 159.3651
##$NSP= 0
##$NTH_PI= 0
##$NZP= 0
##$OFFSET= 182.463
##$PC= 4
##$PHC0= -388.1186
##$PHC1= 101.2
##$PH_mod= 1
##$PKNL= yes
##$PPARMOD= 0
##$PSCAL= 0
##$PSIGN= 0
##$REVERSE= no
##$SF= 81.0140089999434
##$SI= 65536
##$SIGF1= 159.3651
##$SIGF2= -187.1042
##$SINO= 113.3802
##$SIOLD= 16384
##$SREGLST= <1H.CDCl3>
##$SSB= 0
##$STSI= 65536
##$STSR= 0
##$SW_p= 29940.119760479
##$SYMM= 0
##$S_DEV= 0
##$TDeff= 32768
##$TDoff= 0
##$TI= <>
##$TILT= no
##$TM1= 0
##$TM2= 0
##$TOPLEV= 0
##$USERP1= <user>
##$USERP2= <user>
##$USERP3= <user>
##$USERP4= <user>
##$USERP5= <user>
##$WDW= 1
##$XDIM= 65536
##$YMAX_p= 230419752
##$YMIN_p= -291908697
$$ End of Bruker specific parameters
$$ ---------------------------------
##NTUPLES= NMR SPECTRUM
##VAR_NAME=  FREQUENCY,     SPECTRUM/REAL,   SPECTRUM/IMAG
##SYMBOL=    X,             R,               I
##VAR_TYPE=  INDEPENDENT,   DEPENDENT,       DEPENDENT
##VAR_FORM=  AFFN,          ASDF,            ASDF
##VAR_DIM=   65536,         65536,           65536
##UNITS=     HZ,            ARBITRARY UNITS, ARBITRARY UNITS
##FACTOR=    0.456856943014862, 1,           1
##FIRST=     14782.0589164792, 0,            0
##LAST=      -15158.0608439998, 0,           0
##MIN=       -15158.0608439998, -291908697,  0
##MAX=       14782.0589164792, 230419752,    0
$$ Real data points
##PAGE= N=1
##DATA TABLE= (X++(R..R)), XYDATA
$$ [...]
$$ plain form
3982 -40562268 -57929033 -69553990 -60624038 -35297288 -17134352 -14014352 -1645342
3975 -1645342 38148165 79347847 79757246 38759375 -3018422 -20439810 -28247622 -41109825
3967 -41109825 -41722800 -11109699 29876333 38055847 2390632 -41521815 -53922657 -31785118
3959 -31785118 -2465938 10510241 6428882 -674524 1527376 15339171 33669753 44872371
3951 44872371 40047889 20019602 -4964401 -24776545 -37457177 -45172212 -45935420 -36635215
3943 -36635215 -22308215 -12105871 -5641299 4059811 11942106 2921450 -19108653 -24940698
3935 -24940698 -1333580 19062891 -2843998 -52244114 -72271968 -38411059 9058208
3928 9058208 16747770 -21750086 -68719612 -84836621 -57993180 -8977255 20873820
$$ packed form
3982d0562268j7366765j1624957Q929952K5326750J8162936L120000J2369010
3975a645342L9793507M1199682M09399m0997871m1777797j7421388p807812j2862203
3967d1109825o12975L0613101M0986032Q179514l5665215m3912447j2400842K2137539
3959c1785118K9319180J2976179m081359p103406K201900J3811795J8330582J1202618
3951D4872371m824482k0028287k4984003j9812144j2680632p715035p63208R300205
3943c6635215J4327000J0202344O464572R701110P882295r020656k2030103n832045
3935b4940698K3607118K0396471k1906889m9400116k0027854L3860909M7469267
3928I058208P689562l8497856m6969526j6117009K6843441M9015925K9851075
$$ plain form
3921 20873820 6488590 -27388931 -31516494 112335 18252567 -8140051 -40921810
3914 -40921810 -27561432 21735392 55011597 58030429 61571318 74043197 61884442
3907 61884442 11865337 -33965781 -33986930 -5600135 4143883 -13236058 -22516126 -1666825
3899 -1666825 26333809 26750691 903167 -13849181 8821287 48092479 59523718 34297294
3891 34297294 14888505 37022783 74744470 72239804 22182377 -22883726 -21510957
3884 -21510957 8389846 25368509 17916123 1559662 -12920183 -22315673 -17280709 8087093
3876 8087093 38892744 51345934 39399906 17515710 3131344 6445823 27781469
3869 27781469 52917981 60182898 43767589 20876308 6750799 -3301485 -15344698
$$ packed form
3921B0873820j4385230l3877521m127563L1628829J8140232k6392618l2781759
3914d0921810J3360378M9296824L3276205L018832L540889J2471879j2158755
3907F1884442n0019105m5831118k1149K8386795R744018j7379941r280068K0849301
3899a666825K8000634M16882k5847524j4752348K2670468L9271192J1431239k5226424
3891C4297294j9408789K2134278L7721687k504666n0057427m5066103J372769
3884b1510957K9900803J6978663p452386j6356461j4479845r395490N034964K5367802
3876H087093L0805651J2453190j1946028k1884196j4384366L314479K1335646
3869B7781469K5136512P264917j6415309k2891281j4125509j0052284j2043213
$$ plain form
3862 -15344698 -17972062 -310877 26111999 44425562 58220743 77351242 90314907
3855 90314907 78468122 50204028 31372745 24183787 5544748 -31326710 -62707965
3848 -62707965 -68957803 -57117256 -38957250 -11029817 28504641 62493361 71509856
3841 71509856 56299491 30914083 4575537 -18334379 -31632591 -33442467 -30665212
3834 -30665212 -27361066 -18382860 -4612257 -1622258 -17114115 -30168547 -14553896 21005121
3826 21005121 39331657 24960230 3977400 2210213 6729299 -7503013 -28858227
3819 -28858227 -22414840 8457994 13882973 -30680201 -79587487 -78938663 -49033534 -57071147
3811 -57071147 -114819782 -157071757 -134550005 -79096311 -49193247 -51452698 -53859352
$$ packed form
3862a5344698k627364J7661185K6422876J8313563J3795181J9130499J2963665
3855I0314907j1846785k8264094j8831283p188958j8639039l6871458l1381255
3848f2707965o249838J1840547J8160006K7927433L9534458L3988720R016495
3841G1509856j5210365k5385408k6338546k2909916j3298212j809876K777255
3834c0665212L304146Q978206J3770603K989999j5491857j3054432J5614651L5559017
3826B1005121J8326536j4371427k0982830j767187M519086j4232312k1355214
3819b8858227O443387L0872834N424979m4563174m8907286O48824K9905129q037613
3811e7071147n7748635m2251975K2521752N5453694K9903064k259451k406654
$$ plain form
3804 -53859352 -46631987 -45252060 -49687938 -44269391 -31502515 -27874891 -29463830 -16897623
3796 -16897623 7642278 22555778 24344365 28233362 32331740 19233025 -3872270 -7413214
3788 -7413214 9263713 9220087 -24320027 -59008582 -61272785 -39208968 -17016691 643537
3780 643537 15569176 18797094 12477926 19099794 40771786 40029362 -4205810 -49975197
3772 -49975197 -44179004 -721663 19537029 -4821046 -36865074 -45378782 -40543640 -39441487
3764 -39441487 -39569839 -41445519 -60227618 -93261960 -104464496 -66631799 -3029266 35100901
3756 35100901 24019034 -14305484 -41384260 -36546142 -8000470 18319436 21626309
3749 21626309 3663520 -17094729 -27670675 -30890904 -33589800 -33577606 -23011711 -531905
$$ packed form
3804e3859352P227365J379927m435878N418547J2766876L627624j588939J2566207
3796a6897623K4539901J4913500J788587L888997M098378j3098715k3105295l540944
3788g413214J6676927m3626l3540114l4688555k264203K2063817K2192277J7660228
3780F43537J4925639L227918o319168O621868K1671992p42424m4235172m5769387
3772d9975197N796193M3457341K0258692k4358075l2044028q513708M835142J102153
3764c9441487j28352j875680j8782099l3034342j1202536L7832697O3602533L8130167
3756C5100901j1081867l8324518k7078776M838118K8545672K6319906L306873
3749B1626309j7962789k0758249j0575946l220229k698896J2194J0565895K2479806
$$ plain form
3741 -531905 23173086 32212668 21486542 7058254 11779602 34929718 47555485 29139931
3733 29139931 -2468885 -13878519 726453 19805161 30967425 41512849 52207257
3726 52207257 47859758 23851539 548583 -2574907 7258705 8647447 -6740936 -30416734
3718 -30416734 -51246879 -62645143 -61775950 -50366627 -33561988 -15242487 886316
3711 886316 7485864 1180404 -8078061 -10057005 -15135205 -40732554 -73609753 -73645126
3703 -73645126 -30565789 8723746 -4918635 -58015213 -94006437 -86506994 -59667195
3696 -59667195 -39285780 -22100557 -3784796 -1214161 -22160336 -37491106 -14779959
3689 -14779959 32339937 59042434 49534130 32390239 32954296 40841282 36893930 25267042
$$ packed form
3741e31905K3704991R039582j0726126j4428288M721348K3150116J2625767j8415554
3733B9139931l1608816j1409634J4604972J9078708J1162264J0545424J0694408
3726E2207257m347499k4008219k3302956l123490R833612J388742j5388383k3675798
3718c0416734k0830145j1398264Q69193J1409323J6804639J8319501J6128803
3711H86316O599548o305460r258465j978944n078200k5597349l2877199l5373
3703g3645126M3079337L9289535j3642381n3096578l5991224P499443K6839799
3696e9667195K0381415J7185223J8315761K570635k0946175j5330770K2711147
3689a4779959M7119896K6702497r508304j7143891N64057P886986l947352j1626888
$$ plain form
3681 25267042 18455873 11794223 -1456890 -5485878 16254382 42464997 32516264 -13183090
3673 -13183090 -44948557 -28763014 8380588 16424593 -15155868 -52167095 -58444853
3666 -58444853 -27156787 17697190 37536371 12100740 -31008490 -38825909 214776
3659 214776 37133910 32088760 13382780 29709286 67760616 68745501 18929940 -30221995
3651 -30221995 -38555907 -23568146 -14354798 -6040623 13018762 26776219 18296882 4758677
3643 4758677 11507186 28777062 26892377 3956523 -11764129 -3184735 16391744 25209261
3635 25209261 16228092 -2042231 -15870148 -18398476 -17076755 -22451735 -27459670 -14046358
3627 -14046358 13441603 24135414 4195926 -19252558 -19705119 -14301279 -34562920 -70586722
$$ packed form
3681B5267042o811169o661650j3251113m028988K1740260K6210615r948733m5699354
3673a3183090l1765467J6185543L7143602Q044005l1580461l7011227o277758
3666e8444853L1288066M4853977J9839181k5435631m3109230p817419L9040685
3659B14776L6919134n045150j8705980J6326506L8051330R84885m9815561m9151935
3651c0221995q333912J4987761R213348Q314175J9059385J3757457q479337j3538205
3643D758677O748509J7269876j884685k2935854j5720652Q579394J9576479Q817517
3635B5209261q981169j8270323j3827917k528328J321721n374980n007935J3413312
3627a4046358K7487961J0693811j9939488k3448484m52561N403840k0261641l6023802
$$ plain form
3619 -70586722 -82355160 -62041752 -47303240 -65869387 -97850724 -105809871 -79891994
3612 -79891994 -39614242 -6636460 11682731 21093987 31234278 42148671 39115658
3605 39115658 9536797 -36212895 -72165368 -84195348 -78415489 -64562582 -46090423
3598 -46090423 -27038696 -13510547 -5667543 -442088 -2178654 -16996104 -37438065 -48599003
3590 -48599003 -49696201 -52590617 -58354130 -54907061 -40879618 -30074192 -24772033 -6253750
3582 -6253750 35284659 78940012 95972290 81320135 49215379 10898608 -27229775
3575 -27229775 -53669449 -58804336 -49283618 -42036333 -44725819 -50937468 -52432131 -48290360
3567 -48290360 -43298619 -42082101 -42882480 -36657535 -19109105 -3304177 -7657285 -27641391
$$ packed form
3619g0586722j1768438K0313408J4738512j8566147l1981337p959147K5917877
3612g9891994M0277752L2977782J8319191R411256J0140291J0914393l033013
3605C9115658k9578861m5749692l5952473j2029980N779859J3852907J8472159
3598d6090423J9051727J3528149P843004N225455j736566j4817450k0441961j1160938
3590d8599003j097198k894416n763513L447069J4027443J0805426N302159J8518283
3582f253750M1538409M3655353J7032278j4652155l2104756l8316771l8128383
3575b7229775k6439674n134887R520718P247285k689486o211649j494663M141771
3567d8290360M991741J216518q00379O224945J7548430J5804928m353108j9984106
$$ plain form
3559 -27641391 -34754296 -12929112 17663371 25399493 4571781 -24969555 -45043852
3552 -45043852 -51290125 -47161598 -42152225 -49070349 -65949793 -66448582 -28044555 31549739
3544 31549739 65498681 48128525 -1510886 -47408922 -69303688 -63062500 -30066768
3537 -30066768 17348413 51137215 47168264 11227375 -23724740 -28686571 -3758552
3530 -3758552 27038582 41884829 39872879 34276096 31640371 25546023 12928562 4959899
3522 4959899 10516055 16586139 1956881 -30266747 -50653854 -38397506 -4007780 28628945
3514 28628945 48090187 54158205 45571884 25092953 8731943 12355459 29729830 37181795
3506 37181795 21495165 -6700068 -27661209 -30571782 -16022872 8134000 28747459
$$ packed form
3559b7641391p112905K1825184L0592483P736122k0827712k9541336k0074297
3552d5043852o246273M128527N009373o918124j6879444m98789L8404027N9594294
3544C1549739L3948942j7370156m9639411m5898036k1894766O241188L2995732
3537c0066768M7415181L3788802l968951l5940889l4952115m961831K4928019
3530c758552L0797134J4846247k011950n596783k635725o094348j2617461p968663
3522D959899N556156O070084j4629258l2223628k0387107J2256348L4389726L2636725
3514B8628945J9461242O068018q586321k0478931j6361010L623516J7374371P451965
3506C7181795j5686630k8195233k0961141k910573J4548910K4156872K0613459
$$ plain form
3499 28747459 34439748 28137823 27725135 47539443 80930040 105245999 102785883 74753654
3491 74753654 37861122 11234439 4783775 15373569 32200313 46197517 54099451
3484 54099451 54418485 43498348 19029198 -13435193 -41058427 -53245629 -50700739 -43347096
3476 -43347096 -37524734 -27039202 -2450015 29316925 43107819 22275581 -17169932
3469 -17169932 -41743860 -40449853 -35796448 -49090085 -68453713 -64458823 -29887690 11194649
3461 11194649 32515353 31268796 24541672 31094635 57444103 91422289 108397354 94714109
3453 94714109 66122013 50752787 52920090 50708278 34194211 23943648 36184126
3446 36184126 49715004 33598493 -3213927 -21157779 -8329230 3044975 -11174082
$$ packed form
3499B8747459N692289o301925m12688J9814308L3390597K4315959k460116k8032229
3491G4753654l6892532k6626683o450664J0589794J6826744J3997204P901934
3484E4099451L19034j0920137k4469150l2464391k7623234j2187202K544890P353643
3476d3347096N822362J0485532K4589187L1766940J3790894k0832238l9445513
3469a7169932k4573928J294007M653405j3293637j9363628L994890L4571133M1082339
3461A1194649K1320704j246557o727124O552963K6349468L3978186J6975065j3683245
3453I4714109k8592096j5369226K167303k211812j6514067j0250563J2240478
3446C6184126J3530878j6116511l6812420j7943852J2828549J1374205j4219057
$$ plain form
3439 -11174082 -28665486 -16795181 14569501 26557392 8672036 -8031441 2604048
3432 2604048 28595062 42437696 36155148 20203201 2846128 -13188499 -22945696 -24038554
3424 -24038554 -24341064 -31662047 -39821796 -37241440 -24586585 -10466748 4467698 21186977
3416 21186977 24349730 -4987963 -55026924 -86393919 -80187366 -60321233 -54152132 -54910435
3408 -54910435 -45003152 -34194555 -42554879 -59051942 -54091118 -29636367 -19403697 -34670771
3400 -34670771 -46682319 -35435729 -21309415 -27122928 -37468765 -23279896 12081383
3393 12081383 38358693 38228578 19164424 -3660287 -15826410 -6593699 15642685 22484302
3385 22484302 1763759 -18304543 -5676423 28679336 50128964 53637476 60688959
$$ packed form
3439a1174082j7491404J1870305L1364682J1987891j7885356j6703477J0635489
3432B604048K5991014J3842634o282548j5951947j7357073j6034627r757197j092858
3424b4038554l02510p320983q159749K580356J2654855J4119837J4934446J6719279
3416B1186977L162753k9337693n0038961l1366995O206553J9866133O169101p58303
3408e4910435R907283J0808597q360324j6497063M960824K4454751J0232670j5267074
3400c4670771j2011548J1246590J4126314n813513j0345837J4188869L5361279
3393A2081383K6277310j30115j9064154k2824711j2166123R232711K2236384O841617
3385B2484302k0720543k0068302J2628120L4355759K1449628L508512P051483
$$ plain form
3378 60688959 70570069 58523214 25806688 7527658 17842202 28455576 20712832
3371 20712832 19334007 46398214 76584086 74640015 51922066 44994329 53832267 44313787
3363 44313787 8076165 -20640787 -15083900 8586502 17724259 2288517 -24412301
3356 -24412301 -46873755 -56959334 -53206363 -41138866 -29840694 -24250848 -24618727 -31928625
3348 -31928625 -45926655 -58774627 -59513598 -45499495 -23596416 -2329970 11324470
3341 11324470 12715035 5527111 1828348 7639251 15326010 19371195 28772959 49195918
3333 49195918 63842487 53064091 26923117 15453563 28203644 45410138 49270007
3326 49270007 41394502 27527845 9092509 -4466392 1489492 22088884 31174766 14347627
$$ packed form
3378F0688959R881110j2046855l2716526j8279030J0314544J0613374p742744
3371B0712832j378825K7064207L0185872j944071k2717949o927737Q837938r518480
3363D4313787l6237622k8716952N556887K3670402R137757j5435742k6700818
3356b4412301k2461454j0085579L752971J2067497J1298172N589846l67879p309898
3348c1928625j3998030j2847972p38971J4014103K1903079K1266446J3654440
3341A1324470J390565p187924l698763N810903P686759M045185R401764K0422959
3333D9195918J4646569j0778396k6140974j1469554J2750081J7206494L859869
3326D9270007p875505j3866657j8435336j3558901N955884K0599392R085882j6827139
$$ plain form
3318 14347627 -13411116 -30837890 -32752052 -22555138 -4007632 9978268 2831879
3311 2831879 -19521472 -30470388 -22760412 -20625907 -36297730 -44771852 -26191786 -3291009
3303 -3291009 -3084013 -7128716 18271387 60336185 74975191 54984082 35934533 35986240
3295 35986240 37618021 33291643 39374993 51643407 36350036 -11316815 -44548368 -30947207
3287 -30947207 -2464827 -4242567 -27843968 -36612790 -29267363 -30675993 -38176051 -28162389
3279 -28162389 -8370883 -13324026 -45628499 -68032410 -62120590 -51627310 -53615401 -48092484
3271 -48092484 -18666606 11688250 14110921 -2795736 -12816093 -15905366 -30489516
3264 -30489516 -53114471 -57423679 -33471875 -4460568 868369 -20704280 -45597939
$$ packed form
3318A4347627k7758743j7426774j914162J0196914J8547506J3985900p146389
3311B831879k2353351j0948916P709976K134505j5671823q474122J8580066K2900777
3303c291009K06996m044703K5400103M2064798J4639006j9991109j9049549N1707
3295C5986240J631781m326378O083350J2268414j5293371m7666851l3231553J3601161
3287c0947207K8482380j777740k3601401q768822P345427j408630p500058J0013662
3279b8162389J9791506m953143l2304473k2403911N911820J0493280j988091N522917
3271d8092484K9425878L0354856K422671j6906657j0020357l089273j4584150
3264c0489516k2624955m309208K3951804K9011307N328937k1572649k4893659
$$ plain form
3257 -45597939 -45214311 -11180182 34316511 57719161 48607705 27376725 15236274 11630416
3249 11630416 9567450 13481445 24169867 23011648 -4855443 -42663862 -61985243 -61737632
3241 -61737632 -60306480 -55776360 -27048045 23509858 61106719 61898216 38155175 9700256
3233 9700256 -21786379 -54110921 -67114283 -48215814 -17831334 -4833147 -8454399
3226 -8454399 -7468811 2697962 7206035 1431013 -2133007 1521754 1098774 -8110700
3218 -8110700 -11111120 4993611 27250475 28201900 -1458422 -40170189 -57110926 -43157299
3210 -43157299 -17627190 -3904285 -2704006 3588034 21498141 33835254 23382634
3203 23382634 -592676 -11107486 5243168 35729304 58019373 60510305 47410775
$$ packed form
3257d5597939L83628L4034129M5496693K3402650r111456k1230980j2140451l605858
3249A1630416k062966L913995J0688422j158219k7867091l7808419j9321381K47611
3241f1737632J431152M530120K8728315N0557903L7596861P91497k3743041k8454919
3233I700256l1486635l2324542j3003362J8898469L0384480J2998187l621252
3226h454399R85588J0166773M508073n775022l564020L654761m22980r209474
3218h110700l000420J6104731K2256864R51425k9660322l8711767j6940737J3953627
3210d3157299K5530109J3722905J200279O292040J7910107J2337113j0452620
3203B3382634k3975310j0514810J6350654L0486136K2290069K490932j3099530
$$ plain form
3196 47410775 31205417 20117381 9270727 -12227590 -42000093 -60112592 -51685156
3189 -51685156 -25803840 -1742359 15279771 30678180 40164969 31749519 6998650
3182 6998650 -17583005 -32337416 -41364681 -45819003 -39052128 -24253748 -17708170 -23356422
3174 -23356422 -20954762 4821242 35744752 38757883 7587918 -30769684 -48930827
3167 -48930827 -44063181 -30543623 -22092153 -24822000 -36720640 -47640237 -46199722 -32202334
3159 -32202334 -18627677 -17329599 -25389912 -29600160 -23444309 -14923067 -14074400 -15105872
3151 -15105872 193856 34998654 61453255 48133285 4597354 -20439909 2714008
3144 2714008 43715058 49277763 13078572 -16916448 -3988989 29358164 33789716 -2384237
$$ packed form
3196D7410775j6205358j1088036j0846654k1498317k9772503j8112499Q427436
3189e1685156K5881316K4061481J7022130J5398409R486789q415450k4750869
3182F998650k4581655j4754411r027265m454322O766875J4798380O545578n648252
3174b3356422K401660K5776004L0923510L013131l1169965l8357602j8161143
3167d8930827M867646J3519558Q451470k729847j1898640j0919597J440515J3997388
3159c2202334J3574657J298078q060313m210248O155851Q521242Q48667j031472
3151a5105872J5299728L4804798K6454601j3319970m3535931k5037263K3153917
3144B714008M1001050N562705l6199191k9995020J2927459L3347153M431552l6173953
$$ plain form
3136 -2384237 -40747801 -40060885 -112297 42469074 51889599 25404475 -5381539 -5366569
3128 -5366569 27906898 62894003 73217225 68571275 74959144 93971452 102343221 89413165
3120 89413165 71042565 61103977 52880072 40284125 34711344 42192659 42888423 17786505
3112 17786505 -17026939 -29540154 -17504286 -6819348 -7858649 -4315167 10761244
3105 10761244 18642568 6517886 -9929331 -10891597 291640 9015669 11267525 9438359
3097 9438359 3036009 -1948425 8673065 33774759 48605314 37810875 20409637 22154655
3089 22154655 39015095 49902456 49477425 43342812 27376927 2759189 -3205873 30367247
3081 30367247 72387359 69226708 20375071 -18433678 -14914422 1950494 -14249 -6308541
$$ packed form
3136b384237l8363564O86916L9948588M2581371R420525k6485124l0786014J4970
3128e366569L3273467L4987105J0323222m645950O387869J9012308Q371769j2930056
3120H9413165j8370600r938588q223905j2595947n572781P481315O95764k5101918
3112A7786505l4813444j2513215J2035868J0684938j039301L543482J5076411
3105A0761244P881324j2124682j6447217r62266J1183237Q724029K251856j829166
3097I438359o402350m984434J0621490K5101694J4830555j0794439j7401238J745018
3089B2154655J6860440J0887361m25031o134613j5965885k4617738n965062L3573120
3081C0367247M2020112l160651m8851637l8808749L519256J6864916j964743o294292
$$ plain form
3073 -6308541 5746009 17777307 2431997 -20095152 -5470827 43481372 74325423
3066 74325423 58706504 30038968 32447968 60296940 70288929 39247939 -10785938
3059 -10785938 -41651958 -38466314 -17002719 -103221 5449203 7125575 8304984 1895067
3051 1895067 -15850582 -34759213 -40227198 -26935916 1568207 37942723 68006147
3044 68006147 72668452 46567885 10639181 -6710251 221777 13346812 17357601 14693527
3036 14693527 13651802 15099969 16276752 17677177 18950973 14656883 1827758 -11988232
3028 -11988232 -16091382 -11536834 -11793697 -26107791 -47288243 -60455799 -60257755 -52352832
3020 -52352832 -39256884 -15589152 17349786 41944989 40348348 16534105 -8094179
$$ packed form
3073f308541J2054550J2031298j5345310k2527149J4624325M8952199L0844051
3066G4325423j5618919k8667536K409000K7848972R991989l1040990n0033877
3059a0785938l0866020L185644K1463595J6899498N552424J676372J179409o409917
3051A895067j7745649j8908631n467985J3291282K8504123L6374516L0063424
3044F8006147M662305k6100567l5928704j7349432O932028J3125035M010789k664074
3036A4693527j041725J448167J176783J400425J273796m294090j2829125j3815990
3028a1988232m103150M554548k56863j4314094k1180452j3167556J98044P904923
3020e2352832J3095948K3667732L2938938K4595203j596641k3814243k4628284
$$ plain form
3013 -8094179 -19588915 -22224563 -25432339 -30753787 -33515819 -28851100 -14474026 5387760
3005 5387760 19141235 18759989 10402462 5948338 7217049 9112470 13759051 26543895
2997 26543895 40508532 41317415 27385115 9040428 -9995994 -30962767 -43118381
2990 -43118381 -33988416 -17151863 -20641495 -42914722 -52498599 -40135441 -34356034 -48486062
2982 -48486062 -51708127 -20934375 14837896 19508003 9161384 21721982 49260012
2975 49260012 50624138 20528303 -4425497 -6807527 -7131833 -16494423 -16281610 2485884
2967 2485884 19914575 23364362 27427029 40438793 44035679 26491563 6958796 3806917
2959 3806917 4705298 -7212862 -20056480 -13512698 4565448 10359328 2193023 -729296
$$ packed form
3013h094179j1494736k635648l207776n321448k762032M664719J4377074J9861786
3005E387760J3753475l81246q357527m454124J268711J895421M646581J2784844
2997B6543895J3964637Q08883j3932300j8344687j9036422k0966773j2155614
2990d3118381R129965J6836553l489632k2273227r583877J2363158N779407j4130028
2982d8486062l222065L0773752L5772271M670107j0346619J2560598K7538030
2975D9260012J364126l0095835k4953800k382030l24306r362590K12813J8767494
2967B485884J7428691L449787M062667J3011764L596886j7544116j9532767l151879
2959C806917Q98381j1918160j2843618O543782J8078146N793880q166305k922319
$$ plain form
2951 -729296 7495425 11663806 2702266 -7491053 -3750363 12416805 25947785 25182845
2943 25182845 13143330 3996786 7485943 17094293 18089110 6534764 -6634366 -9173259
2935 -9173259 4092797 33722992 71883821 95834268 83425605 42136485 7955573
2928 7955573 6983779 29590134 48421593 48829075 34836872 18713929 13016773 21461789
2920 21461789 31181844 25650691 8847205 832245 5304760 2151243 -19148535 -41078897
2912 -41078897 -47044190 -47372024 -57105372 -65428983 -50261877 -12631045 24406719 43881220
2904 43881220 44731326 31765442 13267344 1920228 2213776 3099825 -3815400 -8602781
2896 -8602781 -214382 12291129 13680229 6758196 2390013 -4485800 -25030766 -49213325
$$ packed form
2951g29296Q224721M168381q961540j0193319L740690J6167168J3530980p64940
2943B5182845j2039515r146544L489157R608350R94817j1554346j3169130k538893
2935i173259J3266056K9630195L8160829K3950447j2408663m1289120l4180912
2928G955573r71794K2606355J8831459M07482j3992203j6122943n697156Q445016
2920B1461789R720055n531153j6803486q014960M472515l153517k1299778k1930362
2912d1078897n965293l27834r733348q323611J5167106L7630832L7037764J9474501
2904D3881220Q50106j2965884j8498098j1347116K93548Q86049o915225m787381
2896h602781Q388399J2505511J389100o922033m368183o875813k0544966k4182559
$$ plain form
2888 -49213325 -53653426 -35077661 -12920446 777597 10839429 17164275 8102711 -17051892
2880 -17051892 -38796074 -39863177 -22637488 1872277 27686047 49590982 59285651
2873 59285651 55478778 49084474 50806839 59266327 65515074 64006066 57023145 52525464
2865 52525464 56256978 61042212 48884409 12097390 -32855075 -62226483 -69122651 -59753560
2857 -59753560 -35914915 268342 31551804 39339847 31432927 32745704 46104408 46576275
2849 46576275 22084237 -3246004 1242865 36440203 77597933 99693811 89888979
2842 89888979 52497126 14115785 7415141 34451318 59108371 50505530 20216701
2835 20216701 -199789 -3635546 -5550203 -7719955 5563223 32423288 42780012 17041116
$$ packed form
2888d9213325m440101J8575765K2157215J3698043J0061832O324846r061564k5154603
2880a7051892k1744182j067103J7225689K4509765K5813770K1904935R694669
2873E9285651l806873o394304J722365Q459488O248747j509008o982921m497681
2865E2525464L731514M785234j2157803l6787019m4952465k9371408o896168R369091
2857e9753560K3838645L6183257L1283462P788043p906920J312777J3358704M71867
2849D6576275k4492038k5330241M488869L5197338M1157730K2095878r804832
2842H9888979l7391853l8381341o700644K7036177K4657053q602841l0288829
2835B0216701k0416490l435757j914657k169752J3283178K6860065J0356724k5738896
$$ plain form
2827 17041116 -22473014 -36242095 -15265252 11534186 14844473 -3505708 -18256588
2820 -18256588 -9975825 17430576 42099553 43405453 20863916 -2950070 -4120325 14039907
2812 14039907 21638337 -1430989 -38136086 -55923421 -49574431 -44438252 -57305179 -74933845
2804 -74933845 -78569643 -70155976 -61431304 -53877203 -46226474 -47630540 -61982126 -68133222
2796 -68133222 -40194813 12813144 48504460 36958740 -9283696 -53996596 -73227865
2789 -73227865 -69763277 -63707317 -73100406 -96101043 -110235911 -94822723 -52832698 -5826877
2781 -5826877 26463364 34054841 14923645 -19252060 -41862825 -33327357 -3186177 22368420
2773 22368420 30862349 28890636 25352843 26649238 40687828 64686968 75297038 54610807
$$ packed form
2827A7041116l9514130j3769081K0976843K6799438L310287j8350181j4750880
2820a8256588Q280763K7406401K4668977J305900k2541537k3813986j170255J8160232
2812A4039907P598430k3069326l6705097j7787335O348990N136179j2866927j7628666
2804g4933845l635798Q413667Q724672P554101P650729j404066j4351586o151096
2796f8133222K7938409N3007957L5691316j1545720m6242436m4712900j9231269
2789g3227865L464588O055960r393089k3000637j4134868J5413188M1990025M7005821
2781e826877L2290241P591477j9131196l4175705k2610765Q535468L0141180K5554597
2773B2368420Q493929j971713l537793J296395J4038590K3999140J0610070k0686231
$$ plain form
2765 54610807 21710518 12553652 31021205 47992187 48229816 46308117 52033580 53818632
2757 53818632 46439074 43141238 46744690 40030211 21153579 16560347 36773420 50284887
2749 50284887 30738510 4301832 14194130 53865993 72850084 44744257 -2623976
2742 -2623976 -27289820 -18400116 4689289 20767947 25351082 27729234 34363088 37745724
2734 37745724 27694382 10504267 2414466 3770470 -1644021 -18832658 -35145626 -45421597
2726 -45421597 -55935758 -56074043 -21269493 38445750 69563550 43014405 -938380
2719 -938380 -9389525 10315526 13775114 -9046113 -31699609 -44402818 -60830925 -78579309
2711 -78579309 -78248784 -60503923 -43236429 -23502526 16520503 65631612 87637660
$$ packed form
2765E4610807l2900289r156866J8467553J6970982K37629j921699N725463J785052
2757E3818632p379558l297836L603452o714479j8876632m593232K0213073J3511467
2749E0284887j9546377k6436678R892298L9671863J8984091k8105827m7368233
2742b623976k4665844Q889704K3089405J6078658M583135K378152O633854L382636
2734C7745724j0051342j7190115q089801J356004n414491j7188637j6312968j0275971
2726d5421597j0514161j38285L4804550N9715243L1117800k6549145m3952785
2719i38380q451145J9705051L459588k2821227k2653496j2703209j6428107j7748384
2711g8579309L30525J7744861J7267494J9733903M0023029M9111109K2006048
$$ plain form
2704 87637660 72589698 44402879 15913603 -19970163 -50834737 -46351685 -11998448
2697 -11998448 7155144 -5446001 -13158108 7698440 25640699 10830798 -10243415
2690 -10243415 564323 27940230 29427869 3460902 -15303846 -14342911 -13686841 -25643856
2682 -25643856 -42664485 -61222095 -82853021 -93303415 -73190589 -30930298 2182295
2675 2182295 10033850 180832 -22413982 -60446904 -100633171 -113863899 -88748580 -45948468
2667 -45948468 -13456679 -3977489 -17318881 -44216740 -64032812 -58882325 -35925061
2660 -35925061 -18766301 -13868087 -5022502 14912414 29619990 26726652 19320499 25331030
2652 25331030 39774479 43084391 28519819 8006410 -4693737 -7043505 -6455727 -10810780
$$ packed form
2704H7637660j5047962k8186819k8489276l5883766l0864574M483052L4353237
2697a1998448J9153592j2601145p712107K0856548J7942259j4809901k1074213
2690a0243415J0807738K7375907J487639k5966967j8764748R60935O56070j1957015
2682b5643856j7020629j8557610k1630926j0450394K0112826M2260291L3112593
2675B182295P851555r853018k2594814l8032922m0186267j3230728K5115319M2800112
2667d5948468L2491789R479190j3341392k6897859j9816072N150487K2957264
2660c5925061J7158760M898214Q845585J9934916J4707576k893338p406153O010531
2652B5331030J4443449L309912j4564572k0513409j2700147k349768N87778m355053
$$ plain form
2644 -10810780 -17764697 -14661533 3080419 16496948 1237370 -36910577 -62449683
2637 -62449683 -53495003 -27846295 -15284665 -20533611 -28896948 -34041053 -40029869 -44803172
2629 -44803172 -42654019 -38164490 -37188668 -28023916 4392053 45241432 58497926 37899823
2621 37899823 22645586 44629986 82502631 93251895 73463707 57868596 63129435
2614 63129435 66548805 45452463 7799927 -27591643 -54654109 -68340824 -54846855
2607 -54846855 -16865301 11064224 503629 -30131529 -41317639 -29144183 -23302062
2600 -23302062 -32162509 -27818152 5128212 39690286 43312670 19610965 -5841307 -21455192
2592 -21455192 -31504439 -38311079 -43130241 -53047686 -68332768 -73120924 -56408426 -32939713
$$ packed form
2644a0810780o953917L103164J7741952J3416529j5259578l8147947k5539106
2637f2449683Q954680K5648708J2561630n248946q363337n144105n988816m773303
2629d4803172K149153M489529R75822R164752L2415969M0849379J3256494k0598103
2621C7899823j5254237K1984400L7872645J0749264j9788188j5595111N260839
2614F3129435L419370k1096342l7652536l5391570k7062466j3686715J3493969
2607e4846855L7981554K7929525j0560595l0635158j1186110J2173456N842121
2600b3302062q860447M344357L2946364L4562074L622384k3701705k5452272j5613885
2592b1455192j0049247o806640m819162r917445j5285082m788156J6712498K3468713
$$ plain form
2584 -32939713 -25742769 -36465992 -50014083 -59270096 -66051234 -65434292 -50665909 -30522669
2576 -30522669 -22670273 -30772400 -43200890 -50965189 -52411242 -46061510 -35109644 -32701886
2568 -32701886 -45580605 -59884857 -61437734 -59695465 -68248210 -72661140 -48689433 -6629540
2560 -6629540 17041391 12281879 5066895 11698227 20457646 25265649 37300641 49915211
2552 49915211 34085093 -9097584 -31638705 -4685522 34103382 35505340 10091386
2545 10091386 1627798 13385664 11439349 -9680598 -16154860 6586637 27428701 13968987
2537 13968987 -26505019 -61146473 -65515214 -39184246 -6491995 -513297 -26409896
2530 -26409896 -47273541 -30827432 49930 -3326545 -43250336 -73198033 -66252840
$$ packed form
2584c2939713P196944j0723223j3548091r256013o781138O16942J4768383K0143240
2576c0522669P852396q102127j2428490p764299j446053O349732J0951866K407758
2568c2701886j2878719j4304252j552877J742269q552745m412930K3971707M2059893
2560f629540K3670931m759512p214984O631332Q759419M808003J2034992J2614570
2552D9915211j5830118m3182677k2541121K6953183L8788904J401958k5413954
2545A0091386q463588J1757866j946315k1119947o474262K2741497K0842064j3459714
2537A3968987m0474006l4641454m368741K6330968L2692251N978698k5896599
2530b6409896k0863645J6446109L0877362l376475l9923791k9947697O945193
$$ plain form
2523 -66252840 -41995841 -20623817 2436152 24397826 27037888 20735131 46473287
2516 46473287 103982229 126439997 68811695 -19070094 -56578013 -36869023 -13336577
2509 -13336577 -7141757 8465163 40000682 52174184 23561194 -23663787 -60685572
2502 -60685572 -80026653 -78615978 -51080210 -11046251 13690703 16873776 15855900 15572055
2494 15572055 5677550 -3557946 14560970 52104999 63370583 31009505 -5870427
2487 -5870427 -12019635 -4116111 -10718415 -22892707 -20674030 -17230230 -36173488 -66181853
2479 -66181853 -76223233 -61223687 -40540065 -25673497 -18524094 -24895097 -40285570
2472 -40285570 -40124938 -14108044 9770278 7272004 12244 16814197 37822763 25982715
$$ packed form
2523f6252840K4256999K1372024K3059969K1961674K640062o302757K5738156
2516D6473287N7508942K2457768n7628302q7881789l7507919J9708990K3532446
2509a3336577O194820J5606920L1535519J2173502k8612990m7224981l7021785
2502f0685572j9341081J410675K7535768M0033959K4736954L183073j017876k83845
2494A5572055r894505r235496J8118916L7544029J1265584l2361078l6879932
2487e870427o149208P903524o602304j2174292K218677L443800j8943258l0008365
2479f6181853j0041380J4999546K0683622J4866568P149403o371003j5390473
2472d0285570J60632K6016894K3878322k498274p259760J6801953K1008566j1840048
$$ plain form
2464 25982715 -5160703 -11592350 4543233 58180 -28632076 -33869312 3298904 41931286
2456 41931286 49175382 43367546 43985075 31583476 -8741650 -48550537 -57135202 -44922762
2448 -44922762 -32639737 -13550878 18286299 37942609 27650999 12941689 19279132
2441 19279132 23922570 -2091124 -33057247 -25176069 6672573 9569783 -19839877 -31320568
2433 -31320568 -6765562 11979520 -3723338 -24191325 -16417925 407244 -11588560
2426 -11588560 -49634206 -77364816 -73714388 -48911145 -23539969 -11122689 -12542763
2419 -12542763 -15119709 -6645137 4300092 -1165627 -16472932 -9686406 27401828 57146349
2411 57146349 46015849 14618645 7556610 27004889 31235071 -1661141 -40998527
$$ packed form
2464B5982715l1143418o431647J6135583m485053k8690256n237236L7168216L8632382
2456D1931286P244096n807836O17529j2401599m0325126l9808887q584665J2212440
2448d4922762J2283025J9088859L1837177J9656310j0291610j4709310O337443
2441A9279132M643438k6013694l0966123P881178L1848642K897210k9409660j1480691
2433c1320568K4555006J8745082j5702858k0467987P773400J6825169j1995804
2426a1588560l8045646k7730610L650428K4803243K5371176J2417280j420074
2419a2542763k576946Q474572J0945229n465719j5307305O786526L7088234K9744521
2411E7146349j1130500l1397204p062035J9448279M230182l2896212l9337386
$$ plain form
2404 -40998527 -45100938 -12905523 21383807 31825893 22510938 10610935 2946653 -5532433
2396 -5532433 -17288544 -25277666 -23289079 -18529374 -26372640 -50206728 -71982849 -68917167
2388 -68917167 -38744150 -3038734 16039332 17414177 15462564 17631491 18082474 14401181
2380 14401181 15928894 24833639 22463276 -4687446 -32696411 -22359166 23332168 54879237
2372 54879237 42627061 16501746 15990130 29031721 16507794 -21605569 -47788285
2365 -47788285 -47611942 -44276145 -49259482 -42613489 -16798353 -292525 -13502075 -32514370
2357 -32514370 -25754378 -3834414 -1160107 -21500138 -33407560 -16334310 14339537
2350 14339537 30496321 21902775 1509661 -7572806 9696214 44953168 70191806
$$ packed form
2404d0998527m102411L2195415L4289330J0442086r314955j1900003p664282q479086
2396e532433j1756111p989122J988587M759705p843266k3834088k1776121L065682
2388f8917167L0173017L5705416J9078066J374845j951613K168927M50983l681293
2380A4401181J527713Q904745k370363k7150722k8008965J0337245M5691334L1547069
2372E4879237j2252176k6125315n11616J3041591j2523927l8113363k6182716
2365d7788285J76343L335797m983337O645993K5815136J6505828j3209550j9012295
2357c2514370O759992K1919964K674307k0340031j1907422J7073250L0673847
2350A4339537J6156784q593546k0393114r082467J7269020L5256954K5238638
$$ plain form
2343 70191806 65109171 39012793 19672245 24880279 50464823 78626506 89832027
2336 89832027 74380380 43046721 20988883 21474976 30958562 29047062 15636191 5658454
2328 5658454 2707547 -5931313 -27010572 -47685712 -50187707 -33217483 -12876343 -4383939
2320 -4383939 -7331735 -10897196 -10248361 -9530671 -6543152 12157151 48473014 76976563
2312 76976563 73269204 52045472 50265690 72357184 82806868 60985996 31132679
2305 31132679 22075298 28505600 35196450 49704302 79101223 98440334 81094486 45187346
2297 45187346 29568838 32660592 17507884 -24228885 -56972494 -57586975 -47327062 -52687193
2289 -52687193 -67680362 -73049825 -65330045 -48395513 -20749032 9474962 19096947 264853
$$ packed form
2343G0191806n082635k6096378j9340548N208034K5584544K8161683J1205521
2336H9832027j5451647l1333659k2057838M86093R483586j911500j3410871r977737
2328E658454k950907q638860k1079259k0675140k501995J6970224K0341140Q492404
2320d383939k947796l565461O48835P17690K987519J8700303L6315863K8503549
2312G6976563l707359k1223732j779782K2091494J0449684k1820872k9853317
2305C1132679r057381O430302O690850J4507852K9396921J9339111j7345848l5907140
2297D5187346j5618508L091754j5152708m1736769l2743609o14481J0259913n360131
2289e2687193j4993169n369463P719780J6934532K7646481L0223994R621985j8832094
$$ plain form
2281 264853 -22419854 -24865268 -15232088 -12330005 -12520234 -5188423 -4493894 -31523193
2273 -31523193 -71325680 -82520838 -53460304 -19037029 -12198982 -23989780 -26165683
2266 -26165683 -13808591 -6278818 -15963470 -34325590 -47115662 -50417355 -49382233 -47873435
2258 -47873435 -41891340 -22328454 13398078 51351495 68746053 57398091 35731074
2251 35731074 29750156 42563234 50344637 31276568 -7461155 -37022592 -38636683 -21849042
2243 -21849042 -10142842 -14018322 -23292472 -23776564 -14367177 -4503835 -261039 -352473
2235 -352473 -4494351 -16056973 -31857259 -37778069 -24701832 -5115321 -1557752 -17560029
2227 -17560029 -32417532 -29016640 -13931732 -1763766 7557398 22463943 40574165
$$ packed form
2281B64853k2684707k445414R633180K902083j90229P331811O94529k7029299
2273c1523193l9802487j1195158K9060534L4423275O838047j1790798k175903
2266b6165683J2357092P529773r684652j8362120j2790072l301693J035122J508798
2258d7873435N982095J9562886L5726532L7953417J7394558j1347962k1667017
2251C5731074n980918J2813078P781403j9068069l8737723k9561437j614091J6787641
2243b1849042J1706200l875480r274150m84092R409387R863342M242796r1434
2235c52473m141878j1562622j5800286n920810J3076237J9586511L557569j6002277
2227a7560029j4857503L400892J5084908J2167966R321164J4906545J8110222
$$ plain form
2220 40574165 51981727 55205367 53238378 40084777 11303913 -16829762 -22986145 -14178483
2212 -14178483 -15936422 -27782742 -22592235 765187 4168816 -27760092 -51610294 -28569724
2204 -28569724 7768608 -2987356 -52989937 -74501741 -42045665 -7792570 -18686228
2197 -18686228 -50282483 -54239927 -31975866 -20429611 -27971775 -27237696 -5601067 12576603
2189 12576603 -368094 -40990996 -79913258 -89359571 -64057488 -23843329 4338131
2182 4338131 11527410 9678901 8369617 2473610 -9134511 -9987521 11184859 35785334
2174 35785334 34535642 6006429 -23442054 -34790808 -31450167 -20204574 757497
2167 757497 28206830 46004520 42108882 24430876 12082866 16605620 35018651 54265415
$$ packed form
2220D0574165J1407562L223640j966989j3153601k8780864k8133675o156383Q807662
2212a4178483j757939j1846320N190507K3357422L403629l1928908k3850202K3040570
2204b8569724L6338332j0755964n0002581k1511804L2456076L4253095j0893658
2197a8686228l1596255l957444K2264061J1546255p542164P34079K1636629J8177670
2189A2576603j2944697m0622902l8922262r446313K5302083M0214159K8181460
2182D338131P189279j848509j309284n896007j1608121q53010K1172380K4600475
2174C5785334j249692k8529213k9448483j1348754L340641J1245593K0962071
2167G57497K7449333J7797690l895638j7678006j2348010M522754J8413031J9246764
$$ plain form
2159 54265415 60322099 50733683 39324760 39290532 41834246 25965390 -6576162 -23759344
2151 -23759344 -3078479 34562531 48400267 28010761 966925 -6953581 2220846
2144 2220846 16805847 37528512 66429650 88630393 86004800 64504452 49316734
2137 49316734 52941866 65055303 75543929 87828201 101281982 99594059 72483386
2130 72483386 36228482 14604169 7464320 -3126721 -20799378 -29856392 -22569336 -11281364
2122 -11281364 -7898474 -8196968 -4321652 927504 1378438 -1310753 -2047645 138653 5269801
2113 5269801 15195415 27678463 35514399 36065964 33473552 28212944 14814712 -6286993
2105 -6286993 -26203796 -40613584 -51567729 -52375851 -29717512 9199721 31588667 18016452
$$ packed form
2159E4265415O056684r588416j1408923l4228K543714j5868856l2541552j7183182
2151b3759344K0680865L7641010J3837736k0389506k7043836p920506R174427
2144B220846J4585001K0722665K8901138K2200743k625593k1500348j5187718
2137D9316734L625132J2113437J0488626J2284272J3453781j687923k7110673
2130G2483386l6254904k1624313p139849j0591041j7672657r057014P287056J1287972
2122a1281364L382890k98494L875316N249156M50934k689191p36892K186298N131148
2113E269801R925614J2483048P835936N51565k592412n260608j3398232k1101705
2105f286993j9916803j4409788j0954145q08122K2658339L8917233K2388946j3572215
$$ plain form
2097 18016452 -9794118 -19306467 -10580719 -6539173 -12990690 -17512607 -21489214 -39766704
2089 -39766704 -64714795 -62835538 -21449189 24965889 33083793 788959 -35872572
2082 -35872572 -43782854 -17548558 24596480 53465517 45582704 4197406 -38595997
2075 -38595997 -53183857 -43730473 -38094279 -51101036 -70641104 -77092511 -61724574 -26603221
2067 -26603221 16590999 43715607 32458824 -8831657 -39952415 -31497078 -161427
2060 -161427 14474387 1890584 -10419714 1368398 29067938 51964699 63234238
2053 63234238 63921052 49183724 20316611 -1608934 3241305 23819359 30305090 13271170
2045 13271170 -9586525 -23879778 -32050804 -34234707 -21545277 2049589 14409729
$$ packed form
2097A8016452k7810570r512349Q725748M041546o451517m521917l976607j8277490
2089c9766704k4948091J879257M1386349M6415078Q117904l2294834l6661531
2082c5872572p910282K6234296M2145038K8869037p882813m1385298m2793403
2075c8595997j4587860R453384N636194j3006757j9540068o451407J5367937L5121353
2067b6603221M3194220K7124608j1256783m1290481l1120758Q455337L1335651
2060a61427J4635814j2583803j2310298J1788112K7699540K2896761J1269539
2053F3234238O86814j4737328k8867113k1925545M850239K0578054O485731j7033920
2045A3271170k2857695j4293253q171026k183903J2689430K3594866J2360140
$$ plain form
2038 14409729 5324312 -8180412 -11352417 -15689465 -33453889 -47637300 -35179558 -8687667
2030 -8687667 -3945108 -27596883 -46184606 -32855586 -764796 19958655 19338777 9392445
2022 9392445 3068105 4494595 11097702 13743550 1283484 -24308101 -42421971 -35130734
2014 -35130734 -12350060 -4140843 -25625765 -59667350 -79709523 -80003912 -72267288 -59688475
2006 -59688475 -33125608 4691337 32362775 39888307 47289002 72692602 95965550
1999 95965550 82377607 36410011 629257 -324005 16921754 31967390 45975157
1992 45975157 56505612 43718986 5294314 -25817660 -26096778 -16073907 -20127440 -20966325
1984 -20966325 5824766 36196583 26165522 -16511985 -40496139 -28209596 -15059224
$$ packed form
2038A4409729r085417j3504724l172005m337048j7764424j4183411J2457742K6491891
2030h687667M742559k3651775j8587723J3329020L2090790K0723451o19878r946332
2022I392445o324340J426490O603107K645848j2460066k5591585j8113870P291237
2014c5130734K2780674Q209217k1484922l4041585k0042173k94389P736624J2578813
2006e9688475K6562867L7816945K7671438P525532P400695K5403600K3272948
1999I5965550j3587943m5967596l5780754r53262J7245759J5045636J4007767
1992D5975157J0530455j2786626l8424672l1111974k79118J0022871m053533q38885
1984b0966325K6791091L0371817j0031061m2677507k3984154J2286543J3150372
$$ plain form
1977 -15059224 -26408538 -44088154 -48880971 -51407006 -60601474 -60191206 -40493352 -21733371
1969 -21733371 -21979388 -30053774 -32998816 -41583478 -61486629 -65509475 -27601433 32524504
1961 32524504 70321400 70973616 55461811 41573548 26738472 6038196 -16166199
1954 -16166199 -32086342 -32035006 -5725122 40815133 75746799 68215656 23633635 -21347280
1946 -21347280 -35727433 -15209239 24372533 57992109 62161287 33432734 -3959420
1939 -3959420 -21390153 -14709366 -779478 7009285 6834836 483046 -5881048 1527096
1931 1527096 28591681 56691588 58808047 32922331 4697501 -4478279 1001080 3336559
1923 3336559 -6540123 -22591907 -31333847 -23896552 -6052103 4931806 -494574 -10730206
$$ packed form
1977a5059224j1349314j7679616m792817k526035r194468M10268J9697854J8759981
1969b1733371k46017q074386k945042q584662j9903151m022846L7908042O0125937
1961C2524504L7796896O52216j5511805j3888263j4835076k0700276k2204395
1954a6166199j5920143N1336K6309884M6540255L4931666p531143m4582021m4980915
1946b1347280j4380153K0518194L9581772L3619576M169178k8728553l7392154
1939c959420j7430733O680787J3929888P788763j74449o351790o364094P408144
1931A527096K7064585K8099907K116459k5885716k8224830r175780N479359K335479
1923C336559r876682j6051784q741940P437295J7844449J0983909n426380j0235632
$$ plain form
1915 -10730206 -6094305 16764261 40587170 46132398 29503415 3321358 -13942695
1908 -13942695 -11931505 3692793 17955239 21236050 14060953 1032807 -10870262 -11251063
1900 -11251063 3130270 18974599 23906598 30085591 57130448 91958959 96907962 66134566
1892 66134566 39735471 44168845 52358972 29680634 -10247365 -29616433 -23394207 -15556075
1884 -15556075 -15127468 -13286883 -12328201 -20795006 -28658852 -22819683 -18450116 -37409209
1876 -37409209 -63242426 -59196996 -27821944 -9234855 -18403323 -28472222 -23148517 -20323134
1868 -20323134 -29496011 -28699213 -5164769 17388403 16213368 4582241 6222214 20496272
1860 20496272 34710737 46995648 55528392 47648113 21645765 -385292 -1611210 6358641
$$ packed form
1915a0730206M635901K2858566K3822909N545228j6628983k6182057j7264053
1908a3942695K011190J5624298J4262446L280811p175097j3028146j1903069l80801
1900a1251063J4381333J5844329M931999O178993K7044857L4828511M949003l0773396
1892F6134566k6399095M433374Q190127k2678338l9927999j9369068O222226P838132
1884a5556075M28607J840585R58682q466805p863846N839169M369567j8959093
1876c7409209k5833217M045430L1375052J8587089r168468j0068899N323705K825383
1868b0323134r172877P96798K3534444K2553172j175035j1631127J639973J4274058
1860B0496272J4214465J2284911Q532744p880279k6002348k2031057j225918P969851
$$ plain form
1852 6358641 7021278 4701161 7872117 8885656 1909356 -76145 10329622 13772057
1844 13772057 -6749101 -33553801 -38697414 -25547987 -17522368 -18342084 -14031407 -5819260
1836 -5819260 -9762474 -26053321 -36416286 -32987384 -26643832 -25384626 -25031248 -23232154
1828 -23232154 -24574822 -29332386 -31822156 -31269728 -32200293 -34559373 -33763841 -27867905 -15897977
1819 -15897977 4401235 27025414 34783067 18536649 -9169449 -32213134 -51702448
1812 -51702448 -73311201 -85329660 -69450417 -27272442 21314764 59957860 80479816
1805 80479816 75558613 47098670 15784482 2670045 5040371 6043652 359483 -6661849
1797 -6661849 -14810953 -23191173 -18659923 6634616 35005516 44917879 43667178 51107595
$$ packed form
1852F358641O62637k320117L170956J013539o976300j985501J0405767L442435
1844A3772057k0521158k6804700n143613J3149427Q025619q19716M310677Q212147
1836e819260l943214j6290847j0362965L428902O343552J259206L53378J799094
1828b3232154j342668m757564k489770N52428r30565k359080P95532N895936J1969928
1819a5897977K0299212K2624179P757653j6246418k7706098k3043685j9489314
1812e1702448k1608753j2018459J5879243M2177975M8587206L8643096K0521956
1805H0479816m921203k8459943l1314188j3114437K370326J003281n684169p021332
1797f661849q149104q380220M531250K5294539K8370900R912363j250701P440417
$$ plain form
1789 51107595 60238758 47452390 17639140 2258044 9528078 12295243 -5817593 -24954067
1781 -24954067 -22628475 -5263378 7332627 5932263 -10154545 -35641935 -50085259
1774 -50085259 -31337804 9967778 34257250 24620781 9725544 19901560 45696731
1767 45696731 60223700 60330068 60907733 63334073 53897447 26605837 -9715277 -41879318
1759 -41879318 -59962869 -63011205 -63147168 -71375172 -76729294 -60443415 -35306330 -40663307
1751 -40663307 -83313383 -114800436 -92979274 -40119072 -8922189 -11720987 -18915074
1744 -18915074 -13489152 -7965364 -10873500 -12556454 -8892964 -10293497 -20034465 -26409776
1736 -26409776 -23133126 -18299936 -16546257 -9060781 10787598 33701195 43614724 35557809
$$ packed form
1789E1107595R131163j2786368k9813250j5381096P270034K767165j8112836j9136474
1781b4954067K325592J7365097J2596005j400364j6086808k5487390j4443324
1774e0085259J8747455M1305582K4289472r636469j4895237J0176016K5795171
1767D5696731J4526969J06368N77665K426340r436626k7291610l6321114l2164041
1759d1879318j8083551l048336j35963q228004n354122J6285879K5137085n356977
1751d0663307m2650076l1487053K1821162N2860202L1196883k798798p194087
1744a8915074N425922N523788k908136j682954L663490j400533r740968o375311
1736b6409776L276650M833190J753679P485476J9848379K2913597R913529q056915
$$ plain form
1728 35557809 22862436 28113959 59891792 94486631 93788112 50619814 1175288 -20266419
1720 -20266419 -20312602 -21479432 -19723979 2465805 34683231 46886979 35593095 27529548
1712 27529548 34875397 37869436 18111965 -16844361 -47786031 -60247497 -45164889
1705 -45164889 -7784177 23063949 20646933 -3959931 -18235977 -16612381 -18851018 -23887753
1697 -23887753 -9461006 18232843 24083032 5180881 -896524 12103161 -92473
1690 -92473 -46577432 -63547811 -20170351 -996623 -96241677 -245461202 -291908697
1683 -291908697 -190487615 -64347104 -31962705 -67140439 -76647310 -41984382 -15477970
1676 -15477970 -21006418 -32166729 -32467927 -34449525 -39426844 -28334292 -511875 16845707
$$ packed form
1728C5557809j2695373N251523L1777833L4594839o98519m3168298m9444526k1441707
1720b0266419m6183j166830J755453K2189784L2217426J2203748j1293884q063547
1712B7529548P345849K994039j9757471l4956326l0941670j2461466J5082608
1705d5164889L7380712L0848126k417016k4606864j4276046J623596k238637n036735
1697b3887753J4426747K7693849N850189j8902151o077405J2999685j2195634
1690i2473m6484959j6970379M3377460J9173728r5245054j49219525m6447495
1683b91908697J01421082J26140511L2384399l5177734r506871L4662928K6506412
1676a5477970n528448j1160311l01198j981598m977319J1092552K7822417J7357582
$$ plain form
1668 16845707 9022924 -5441744 -5340260 4733173 7827138 -388430 -10592539 -13065650
1660 -13065650 -5890606 2111530 -4185516 -29286478 -55915772 -62022038 -46382402 -24124077
1652 -24124077 -1000203 29085736 61383096 77060006 69186265 53516114 45248042
1645 45248042 42052110 38986301 41638387 50577228 49054775 24223680 -10416419 -31175948
1637 -31175948 -33225734 -25569284 -7104238 27460148 60987959 60522731 18046579 -35581026
1629 -35581026 -66299204 -69091466 -55956063 -32381713 -3479863 12053956 -1123010
1622 -1123010 -28262289 -37349596 -21488255 -9371891 -25994654 -58484992 -72824059
1615 -72824059 -54489460 -19316935 10218019 24494672 22323828 2580509 -29373654
$$ packed form
1668A6845707p822783j4464668J01484J0073433L093965q215568j0204109k473111
1660a3065650P175044Q002136o297046k5100962k6629294o106266J5639636K2258325
1652b4124077K3123874L0085939L2297360J5676910p873741j5670151q268072
1645D5248042l195932l065809K652086Q938841j522453k4831095l4640099k0759529
1637c1175948k049786P656450J8465046L4564386L3527811m65228m2476152n3627605
1629c5581026l0718178k792262J3135403K3574350K8901850J5533819j3176966
1622a123010k7139279r087307J5861341J2116364j6622763l2490338j4339067
1615g2824059J8334599L5172525K9534954J4276653k170844j9743319l1954163
$$ plain form
1608 -29373654 -53605643 -47496222 -10506521 29411978 41836388 25865540 9679856
1601 9679856 16402598 37925871 49306716 42840240 34960775 39000693 45942658 40715681
1593 40715681 25943672 15214975 8701115 -7430850 -36453056 -61778899 -67535154
1586 -67535154 -55416264 -35383153 -14555214 -4927004 -24790604 -72821691 -111489778
1579 -111489778 -100995854 -48377289 -695481 11662212 1685647 -7356789 -13082772
1572 -13082772 -18722602 -13973410 5527536 19673445 12470542 4932484 28428770 73030869
1564 73030869 95183126 75409995 36246360 1318770 -27674026 -45056017 -31473307
1557 -31473307 8687660 33067901 13475724 -21889253 -28665888 -8454915 3244735
$$ packed form
1608b9373654k4231989O109421L6989701L9918499J2424410j5970848j6185684
1601I679856O722742K1523273J1380845o466476p879465M039918O941965n226977
1593D0715681j4772009j0728697o513860j6131965k9022206k5325843n756255
1586f7535154J2118890K0033111K0827939R628210j9863600m8031087l8668087
1579a11489778J0493924N2618565M7681808J2357693r976565r042436n725983
1572a3082772n639830M749192J9500946J4145909p202903p538058K3496286M4602099
1564G3030869K2152257j9773131l9163635l4927590k8992796j7381991J3582710
1557c1473307M0160967K4380241j9592177l5364977o776635K0210973J1699650
$$ plain form
1550 3244735 -4608918 -11632959 -10901908 -20630280 -47247688 -71301514 -77968335 -72249091
1542 -72249091 -57041550 -26723782 7908726 20117361 7212321 -311976 12282483
1535 12282483 16806820 -10943030 -45542131 -47055474 -22255274 -13805951 -38699115 -72782602
1527 -72782602 -91408195 -90902175 -70620167 -29522687 12255231 20874704 -8180945 -39050741
1519 -39050741 -41524883 -27501046 -27339396 -48470944 -73897511 -87637666 -85003921 -67055054
1511 -67055054 -39523064 -11946898 11397257 33617110 52901709 58283297 44200022
1504 44200022 18492758 -9737383 -36761648 -53106321 -45042898 -19700342 -9805002
1497 -9805002 -34710547 -71098694 -82481044 -65591122 -46149219 -39865726 -41981381 -46664975
$$ packed form
1550C244735p853653p024041P31051r728372k6617408k4053826o666821N719244
1542g2249091J5207541L0317768L4632508J2208635j2905040p524297J2594459
1535A2282483M524337k7749850l4599101j513343K4800200Q449323k4893164l4083487
1527g2782602j8625593N06020K0282008M1097480M1777918Q619473k9055649l0869796
1519c9050741k474142J4023837J61650k1131548k5426567j3740155K633745J7948867
1511f7055054K7531990K7576166K3344155K2219853J9284599N381588j4083275
1504D4200022k5707264k8230141k7024265j6344673Q063423K5342556R895340
1497i805002k4905545l6388147j1382350J6889922J9441903O283493k115655m683594
$$ plain form
1489 -46664975 -49721538 -37528644 -2514463 31960117 32874016 5927343 -9647059 -972998
1481 -972998 -185613 -27629276 -52690749 -39869724 -6129076 4277360 -13720834 -23287252
1473 -23287252 -4686221 19916037 26477075 22853992 28889422 44154530 51240675 39295025
1465 39295025 12958112 -13554547 -23836041 -9768567 18281132 39135569 43060308
1458 43060308 37260827 25949720 -683677 -47256384 -94347096 -113354513 -95634041
1451 -95634041 -55867364 -11815574 26188624 49171952 49838971 33662748 17652827
1444 17652827 10871107 3931889 -15157207 -41211288 -56975112 -55135336 -45783861 -40921042
1436 -40921042 -39992661 -35464837 -26481886 -18938417 -13835402 -4549601 11500728 26096031
$$ packed form
1489d6664975l056563J2192894L5014181L4474580R13899k6946673j5574402Q674061
1481i72998P87385k7443663k5061473J2821025L3740648J0406436j7998194r566418
1473b3287252J8601031K4602258O561038l623083O035430J5265108P086145j1945650
1465C9295025k6336913k6512659j0281494J4067474K8049699K0854437L924739
1458D3060308n799481j1311107k6633397m6572707m7090712j9007417J7720472
1451i5634041L9766677M4051790L8004198K2983328O67019j6176223j6009921
1444A7652827o781720o939218j9089096k6054081j5763824J839776R351475M862819
1436d0921042R28381M527824Q982951P543469N103015R285801J6050329J4595303
$$ plain form
1428 26096031 31369708 32247910 38388119 45605240 37072653 7332612 -24638120 -35105533
1420 -35105533 -23039563 -8407908 -6039451 -12779274 -21701758 -35587277 -56915355 -72865984
1412 -72865984 -64651001 -33008092 -3771561 -2541530 -28925357 -59619983 -71867103
1405 -71867103 -59550540 -31953707 -4500171 11576048 18119743 28431271 50384349
1398 50384349 72274094 73933857 52478567 27163631 15628560 15821383 17314266 19045724
1390 19045724 24361957 26820557 16653525 -826848 -8892898 -3982929 -2541735 -17043408
1382 -17043408 -36957866 -43267324 -34175282 -25258731 -27362740 -34885822 -36641079 -30195204
1374 -30195204 -22617028 -22355899 -33642045 -54974348 -78349255 -91160170 -84506767 -62887266
$$ packed form
1428B6096031N273677Q78202O140209P217121q532587k9740041l1970732j0467413
1420c5105533J2065970J4631655K368457o739823q922484j3885519k1328078j5950629
1412g2865984Q214983L1642909K9236531J230031k6383827l0694626j2247120
1405g1867103J2316563K7596833K7453536J6076219O543695J0311528K1953078
1398E0384349K1889745J659763k1455290k5314936j1535071J92823J492883J731458
1390A9045724N316233K458600j0167032j7480373q066050M909969J441194j4501673
1382a7043408j9914458o309458R092042Q916551k104009p523082j755257O445875
1374c0195204P578176K61129j1286146k1332303k3374907j2810915O653403K1619501
$$ plain form
1366 -62887266 -42669628 -36104090 -37947381 -33725433 -20496760 -9728375 -6625959 175599
1358 175599 17633280 29317557 16627094 -6891847 -6658623 24634231 54622146 57658466
1350 57658466 49438069 56038469 68841134 59173010 27696782 6302458 8745869 10057204
1342 10057204 -12625221 -43007882 -48654515 -26188954 -2434588 3839152 2203274 10527197
1334 10527197 27961722 35096941 17685871 -14173012 -34075446 -29807808 -21511513 -38349337
1326 -38349337 -76880309 -98813796 -78678263 -38139398 -17067959 -22307288 -27109762
1319 -27109762 -16266341 -5605041 -11128356 -22318202 -20250299 -6076859 5525221
1312 5525221 11288696 19950180 32348866 37803780 30980888 18992916 9593466 3589004
$$ packed form
1366f2887266K0217638O565538j843291M221948J3228673J0768385L102416O801558
1358A75599J7457681J1684277j2690463k3518941K33224L1292854K9987915L036320
1350E7658466q220397O600400J2802665r668124l1476228k1394324K443411J311335
1342A0057204k2682425l0382661n646633K2465561K3754366O273740j635878Q323923
1334A0527197J7434525P135219j7411070l1858883j9902434M267638Q296295j6837824
1326c8349337l8530972k1933487K0135533M0538865K1071439n239329m802474
1319b7109762J0843421J0661300n523315j1189846K067903J4173440J1602080
1312E525221N763475Q661484J2398686N454914o822892j1987972r399450o004462
$$ plain form
1304 3589004 1167349 3895644 5933572 -4661177 -26842327 -37697764 -15292401 31743939
1296 31743939 68225033 68163092 40088858 14875552 13798979 31413895 45606318 39735523
1288 39735523 15544922 -11749254 -28354460 -32306940 -32259704 -39041213 -57066421 -78911282
1280 -78911282 -87051774 -67451906 -27466902 3374277 -1293017 -37301252 -72881848
1273 -72881848 -79199165 -53118201 -11687041 25100633 42324418 33145412 5905543
1266 5905543 -16817490 -18469744 -6401483 1350118 4294831 17691038 39957147 43564913
1258 43564913 13623729 -20957400 -18543799 19822245 51407245 48073001 25036391
1251 25036391 7309683 -3479675 -12305455 -8309102 12645780 22494957 -5723147 -47614790
$$ packed form
1304C589004k421655K728295K037928j0594749k2181150j0855437K2405363M7036340
1296C1743939L6481094o1941k8074234k5213306j076573J7614916J4192423n870795
1288C9735523k4190601k7294176j6605206l952480M7236o781509j8025208k1844861
1280g8911282q140492J9599868L9985004L0841179m667294l6008235l5580596
1273g2881848o317317K6080964M1431160L6787674J7223785r179006k7239869
1266E905543k2723033j652254J2068261P751601K944713J3396207K2266109L607766
1258D3564913k9941184l4581129K413601L8366044L1585000l334244k3036610
1251B5036391j7726708j0789358q825780L996353K0954882R849177k8218104m1891643
$$ plain form
1243 -47614790 -50361664 -9029971 20048912 -2719365 -44827074 -50295762 -16192883
1236 -16192883 12549322 8283233 -14572446 -33716613 -43888087 -43829051 -27077440 2563405
1228 2563405 24764987 23893849 7232292 -3900963 5509906 32694997 57156215 54917118
1220 54917118 24055551 -7821178 -15060903 -7346509 -13634263 -37974247 -55687496 -53978779
1212 -53978779 -49251419 -56137274 -64208923 -58479954 -43186254 -31834973 -30084525 -39139040
1204 -39139040 -58207662 -73249214 -64357028 -38089367 -30534431 -60484624 -100300513
1197 -100300513 -113541459 -101292047 -88044687 -81877959 -76547742 -74853309 -77295494 -62362667
1189 -62362667 -15421076 32046895 32554972 -10010369 -43227638 -39310888 -24468517 -25988520
$$ packed form
1243d7614790k746874M1331693K9078883k2768277m2107709n468688L4102879
1236a6192883K8742205m266089k2855679j9144167j0171474N9036J6751611K9640845
1228B563405K2201582q71138j6661557j1133255R410869K7185091K4461218k239097
1220E4917118l0861567l1876729p239725P714394o287754k4339984j7713249J708717
1212e3978779M727360o885855q071649N728969J5293700J1351281J750448r054515
1204c9139040j9068622j5041552Q892186K6267661P554936k9950193l9815889
1197a00300513j3240946J2249412J3247360O166728N330217J694433k442185J4932827
1189f2362667M6941591M7467971N08077m2565341l3217269L916750J4842371j520003
$$ plain form
1181 -25988520 -32130868 -24776884 -15757863 -22602320 -33736798 -26564604 -2934125 18659316
1173 18659316 32026644 40826281 39707190 22301968 -228355 -11372695 -14415030 -24258564
1165 -24258564 -37688161 -32645670 1357661 47584078 78762024 79132224 51909885 16023515
1157 16023515 -6128689 -7645794 -2553683 -5824374 -14007966 -14298239 -4921813 5139213
1149 5139213 9648345 5828509 -10590154 -35748361 -50003074 -38506681 -16298363 -13766699
1141 -13766699 -37244107 -62842496 -71369953 -69860719 -72631467 -79397511 -82179409 -79162956
1133 -79162956 -69961341 -48642989 -14648686 16481341 25760808 11423258 -11036298
1126 -11036298 -25730306 -26607297 -16781492 -7164680 -11235312 -29590782 -41597623 -25656206
$$ packed form
1181b5988520o142348P353984R019021o844457j1134478P172194K3630479K1593441
1173A8659316J3367328Q799637j119091j7405222k2530323j1144340l042335r843534
1165b4258564j3429597N042491L4003331M6226417L1177946L70200k7222339l5886370
1157A6023515k2152204j517105N092111l270691q183592k90273R376426J0061026
1149E139213M509132l819836j6418663k5158207j4254713J1496393K2208318K531664
1141a3766699k3477408k5598389q527457J509234k770748o766044k781898L016453
1133g9162956R201615K1318352L3994303L1130027R279467j4337550k2459556
1126a1036298j4694008q76991R825805R616812m070632j8355470j2006841J5941417
$$ plain form
1118 -25656206 10145515 31777898 21632185 4452559 15892593 52402880 73381892
1111 73381892 55673745 23652292 11849621 16728077 9409254 -14079768 -26581346
1104 -26581346 -17156142 -13687498 -40875124 -78056529 -84218047 -54662155 -26984673 -30994550
1096 -30994550 -54800802 -67614807 -59775286 -47069731 -41672073 -32845774 -3300460 39567076
1088 39567076 61147002 37825893 -8973533 -32767786 -15561135 16830258 36198322
1081 36198322 45065909 55889065 61502336 50504459 35468395 36429513 44447375 31404503
1073 31404503 -6026423 -40980599 -56809004 -64534354 -73719518 -73721541 -56642311 -36369475
1065 -36369475 -29531707 -33960518 -38762910 -40503171 -37885463 -26373980 -11067615 -9981698
$$ packed form
1118b5656206L5801721K1632383j0145713j7179626J1440034L6510287K0979012
1111G3381892j7708147l2021453j1802671M878456p318823k3489022j2501578
1104b6581346R425204L468644k7187626l7181405o161518K9555892K7677482m009877
1096c0994550k3806252j2814005P839521J2705555N397658Q826299K9545314M2867536
1088C9567076K1579926k3321109m6799426k3794253J7206651L2391393J9368064
1081C6198322Q867587J0823156N613271j0997877j5036064R61118Q017862j3042872
1073C1404503l7430926l4954176j5828405p725350r185164k023J7079230K0272836
1065c6369475O837768m428811m802392j740261K617708J1511483J5306365J085917
$$ plain form
1057 -9981698 -30755112 -57531589 -73708987 -82567861 -90738947 -88198572 -65350851 -36994699
1049 -36994699 -25821573 -29809507 -28655674 -17142348 -8819460 -9030303 -8320340 -4626539
1041 -4626539 -9042466 -22860798 -28342574 -12142626 15830077 35310461 36635615 23178667
1033 23178667 4229799 -8805895 -10017588 -8357272 -18823713 -39622722 -50273809
1026 -50273809 -38189494 -13915590 7196016 23329743 35349385 33445501 11993562
1019 11993562 -13231669 -22303806 -18987047 -21758720 -32398065 -36384427 -32662138 -35544141
1011 -35544141 -40896139 -19813273 35873546 84985392 79997988 25797542 -30604209
1004 -30604209 -60014158 -70506011 -69879008 -45946054 1320760 38441043 35373230 7082198
$$ packed form
1057i981698k0773414k6776477j6177398q858874q171086K540375K2847721K8356152
1049c6994699J1173126l987934J153833J1513326Q322888k10843P09963L693801
1041d626539m415927j3818332n481776J6199948K7972703J9480384J325154j3456948
1033B3178667j8948868j3035694j211693J660316j0466441k0799009j0651087
1026e0273809J2084315K4273904K1111606J6133727J2019642j903884k1451939
1019A1993562k5225231r072137L316759k771673j0639345l986362L722289k882003
1011c5544141n351998K1082866N5686819M9111846m987404n4200446n6401751
1004c0604209k9409949j0491853O27003K3932954M7266814L7120283l067813k8291032
$$ plain form
996 7082198 -8261576 -3245471 -6107333 -33955662 -68870112 -87711912 -91947506 -93380652
988 -93380652 -87724025 -62727996 -25532943 -1800453 -5048146 -21089056 -29116491 -27751134
980 -27751134 -30345802 -40660287 -47501666 -46037855 -50396680 -73025911 -99038510 -97795537
972 -97795537 -60634721 -11608968 23019971 39283250 42402224 30099920 7456176
965 7456176 2119711 36712878 89949618 112244145 84429828 38536664 13170426 9692865
957 9692865 4961221 -10319697 -23784429 -23345677 -11294570 1937038 9213699 12327322
949 12327322 19150208 32615412 43927885 43897944 38169709 38892093 43167026 37093104
941 37093104 22791783 20154672 33840382 39892020 19038508 -14759219 -35434909 -38994742
$$ packed form
996G082198j5343774N016105k861862k7848329l4914450j8841800m235594j433146
988i3380652N656627K4996029L7195053K3732490l247693j6040910q027435J365357
980b7751134k594668j0314485o841379J463811m358825k2629231k6012599J242973
972i7795537L7160816M9025753L4628939J6263279L118974j2302304k2643744
965G456176n336465L4593167N3236740K2294527k7814317m5893164k5366238l477561
957I692865m731644j5280918j3464732M38752J2051107J3231608P276661L113623
949A2327322O822886J3465204J1312473k9941n728235P22384M274933o073922
941C7093104j4301321k637111J3685710O051638k0853512l3797727k0675690l559833
$$ plain form
933 -38994742 -38486746 -38301522 -33927074 -27699878 -24389144 -17667981 210550 20964227
925 20964227 30205358 28552185 24661645 14216490 -12728164 -47215209 -65965772 -60429193
917 -60429193 -43407056 -28669411 -21426733 -24488954 -33642325 -32181523 -13595939 -3852237
909 -3852237 -31275671 -76569335 -88409881 -53862418 -15572404 -6835942 -9494721 1211559
901 1211559 8829963 -11431957 -40873219 -41906737 -19207972 -12452106 -32456617 -45911318
893 -45911318 -28334813 4076463 25682816 33007289 31158604 16641741 -7084963 -18883893
885 -18883893 -7576327 3877041 -15434318 -61710560 -100519321 -109590191 -98196309
878 -98196309 -84300274 -71788669 -56720847 -41495086 -32307116 -29755558 -30463508 -33542721
$$ packed form
933c8994742N07996J85224M374448O227196L310734O721163J7878531K0753677
925B0964227R241131j653173l890540j0445155k6944654l4487045j8750563N536579
917f0429193J7022137J4737645P242678l062221r153371J460802J8585584R743702
909c852237k7423434m5293664j1840546L4547463L8290014Q736462k658779J0706280
901A211559P618404k0261920k9441262j033518K2698765O755866k0004511j3454701
893d5911318J7576505L2411276K1606353P324473j848685j4516863k3726704j1798930
885a8883893J1307566J1453368j9311359m6276242l8808761r070870J1393882
878i8196309J3896035J2511605J5067822J5225761R187970K551558p07950l079213
$$ plain form
870 -33542721 -38076741 -37587705 -25585001 -6850858 4381410 996291 -7106063 -4737262
862 -4737262 8746525 16664613 3645253 -26157917 -52282485 -58224287 -45634597 -28410039
854 -28410039 -16885294 -11716113 -10960432 -15406451 -23126031 -25289642 -16201186 -5494997
846 -5494997 -9867933 -30284511 -48040048 -50127989 -48314889 -60243930 -77499107 -70984743
838 -70984743 -32899554 2806075 -3604763 -47288271 -80300199 -66412566 -21816843
831 -21816843 7701008 1281739 -20057896 -28786227 -23714124 -17999798 -11438224 4853220
823 4853220 24282022 30376699 27294627 38467227 65791190 75912550 44948307 -4321251
815 -4321251 -32678682 -34389395 -29657506 -21750362 2947719 36378384 47733359 27899212
$$ packed form
870c3542721m534020M89036J2002704J8734143J1232268l385119q102354K368801
862d737262J3483787P918088j3019360k9803170k6124568n941802J2589690J7224558
854b8410039J1524745N169181P55681m446019p719580k163611R088456J0706189
846e494997m372936k0416578j7755537k087941J813100j1929041j7255177O514364
838g0984743L8085189L5705629o410838m3683508l3011928J3887633M4595723
831b1816843K9517851o419269k1339635q728331N072103N714326O561574J6291444
823D853220J9428802O094677l082072J1172600K7323963J0121360l0964243m9269558
815d321251k8357431j710713M731889P907144K4698081L3430665J1354975j9834147
$$ plain form
807 27899212 3349029 -4671801 -5890164 -13892034 -22917614 -28674772 -43400833 -67473330
799 -67473330 -72704582 -42835038 -8549323 -8460083 -31975885 -38557464 -22550448 -16431361
791 -16431361 -32031048 -43706045 -38864200 -41569724 -65585665 -81858448 -62635963 -29511037
783 -29511037 -22370869 -39016220 -42746518 -19993422 7941556 28891310 55394450 85689109
775 85689109 86462158 39854520 -16542483 -27815186 9990597 48070498 49430410 28527828
767 28527828 19898999 29970940 35161183 15332836 -26011498 -68606349 -89504913 -74356983
759 -74356983 -28442183 22043183 49515147 48691717 34970471 20085247 -357269 -31331822
751 -31331822 -60440993 -66100696 -42653836 -9699811 7088333 1820276 -8733885 -8332150
$$ packed form
807B7899212k4550183q020830j218363q001870r025580n757158j4726061k4072497
799f7473330n231252K9869544L4285715Q9240k3515802o581579J6007016O119087
791a6431361j5599687j1674997M841845k705524k4015941j6272783J9222485L3124926
783b9511037P140168j6645351l730298K2753096K7934978K0949754K6503140L0294659
775H5689109P73049m6607638n6397003j1272703L7805783L8079901J359912k0902582
767B8527828q628829J0071941N190243j9828347m1344334m2594851k0898564J5147930
759g4356983M5914800N0485366K7471964q23430j3721246j4885224k0442516l0974553
751c1331822k9109171n659703K3446860L2954025J6788144n268057j0554161M01735
$$ plain form
743 -8332150 -1904045 -6451198 -23694087 -33880949 -22605934 -2360208 5338501 2150013
735 2150013 9911350 35488720 56278951 48158906 15531666 -15430172 -24955532 -13198438
727 -13198438 5961357 14656991 597257 -31450125 -58798230 -60484425 -38851872 -15812986
719 -15812986 -7522810 -8467460 -1905719 19084568 44536768 59220083 57027332 42926099
711 42926099 24902693 8920949 -182656 -754173 1264182 -1424833 -3897749 7033311
703 7033311 29000522 38464157 22154042 1230277 5001402 29887095 47250781 45899433
695 45899433 40041072 36093233 21257198 -8203300 -34183587 -42481204 -38207105 -27018976
687 -27018976 -6861025 10809826 738984 -37737687 -69088494 -69112502 -58296000 -64340394
$$ packed form
743h332150O428105m547153j7242889j0186862J1275015K0245726P698709l188488
735B150013P761337K5577370K0790231q120045l2627240l0961838r525360J1757094
727a3198438J9159795Q695634j4059734l2047382k7348105j686195K1632553K3038886
719a5812986Q290176r44650O561741K0990287K5452200J4683315k192751j4101233
711D2926099j8023406j5981744r103605n71517K018355k689015k472916J0931060
703G033311K1967211R463635j6310115k0923765L771125K4885693J7363686j351348
695D5899433n858361l947839j4836035k9460498k5980287q297617M274099J1188129
687b7018976K0157951J7670851j0070842l8476671l1350807k4008J0816502o044394
$$ plain form
679 -64340394 -77821177 -74634929 -59045304 -49772989 -41778797 -19151833 7613833 15395146
671 15395146 9541980 12969910 22497390 16864514 2910114 9163300 32896674 40029701
663 40029701 24864429 22319824 44912862 53421268 16332309 -38998852 -65291833 -57318146
655 -57318146 -44812958 -45290465 -52851135 -57783458 -51711858 -26731071 8268546 23911078
647 23911078 4750843 -24671269 -28879964 -5794958 17091498 20124045 6205159 -12293639
639 -12293639 -23452930 -20802113 -13247556 -20441821 -45404892 -64844225 -60812242 -46496108
631 -46496108 -43555905 -49750865 -48888512 -38151389 -24292506 -6577662 14309739 23808830
623 23808830 12674560 -4983687 -15302404 -28429674 -51096646 -56508110 -21107479
$$ packed form
679f4340394j3480783L186248J5589625R272315P994192K2626964K6765666P781313
671A5395146n853166L427930R527480n632876j3954400O253186K3733374P133027
663D0029701j5165272k544605K2593038Q508406l7088959n5331161k6292981P973687
655e7318146J2505188m77507p560670m932323O071600K4980787L4999617J5642532
647B3911078j9160235k9422112m208695K3085006K2886456L032547j3918886j8498798
639a2293639j1159291K650817P554557p194265k4963071j9439333M031983J4316134
631d6496108K940203o194960Q62353J0737123J3858883J7714844K0887401R499091
623B3808830j1134270j7658247j0318717j3127270k2666972n411464L5400631
$$ plain form
616 -21107479 23093341 20354943 -27815704 -61739252 -49060214 -23010434 -20719464 -30045353
608 -30045353 -23958939 -9064808 -6301317 -11111005 -7399888 -1477296 -8211902 -17105709
600 -17105709 -5918956 18757735 26067851 5160069 -22197869 -35430825 -37708081 -39965050
592 -39965050 -43530914 -46843773 -53429188 -64376613 -74038469 -79405403 -83481711 -84562617
584 -84562617 -73919986 -51265658 -31542054 -26545517 -28300128 -22227889 -11032542 -11925979
576 -11925979 -31124026 -53985836 -63322061 -56683376 -41346905 -23712294 -12012636 -18827094
568 -18827094 -46299989 -73224395 -72833441 -45318773 -19126007 -15439781 -23434829 -17842246
560 -17842246 8419285 37263631 44719003 21301917 -20168073 -51821680 -53049176 -30685684
$$ packed form
616b1107479M4200820k738398m8170647l3923548J2679038K6049780K290970r325889
608c0045353O086414J4894131K763491m809688L711117N922592o734606q893807
600a7105709J1186753K4676691P310116k0907782k7357938j3232956k277256k256969
592c9965050l565864l312859o585415j0947425r661856n366934m076308j080906
584h4562617J0642631K2654328J9723604M996537j754611O072239J1195347q93437
576a1925979j9198047k2861810r336225O638685J5336471J7634611J1699658o814458
568a8827094k7472895k6924406L90954K7514668K6192766L686226p995048N592583
560a7842246K6261531K8844346P455372k3417086m1469990l1653607j227496K2363492
$$ plain form
552 -30685684 -9898593 -3074773 -424723 5061328 2913313 -12279591 -22870588 -12986066
544 -12986066 2682780 -1451827 -22885117 -36785420 -34399246 -28442067 -22567953 -5282399
536 -5282399 20979829 32639433 17078420 -10712442 -33554899 -52126296 -68375003
529 -68375003 -71889308 -59449429 -49280131 -56894174 -70852400 -70118377 -52376871 -27461202
521 -27461202 3168412 37956799 57216020 40613622 290232 -28318876 -30919340
514 -30919340 -27040228 -33751960 -40589345 -32775518 -18600936 -13550780 -10135602 11518525
506 11518525 45597065 58624917 33805502 -3800148 -21922532 -23992683 -34494251
499 -34494251 -52465240 -50994674 -24204336 -1332510 -1292044 -4702956 6863575 13499623
$$ packed form
552c0685684K0787091O823820K650050N486051k148015j5192904j0590997R884522
544a2986066J5668846m134607k1433290j3900303K386174N957179N874114J7285554
536e282399K6262228J1659604j5561013k7790862k2842457j8571397j6248707
529f8375003l514305J2439879J0169298p614043j3958226P34023J7741506K4915669
521b7461202L0629614L4788387J9259221j6602398m0323390k8609108k600464
514c0919340L879112o711732o837385P813827J4174582N050156L415178K1654127
506A1518525L4078540J3027852k4819415l7605650j8122384k070151j0501568
499c4494251j7970989J470566K6790338K2871826M0466l410912J1566531O636048
$$ plain form
491 13499623 -7717754 -33049032 -21592418 16265801 28041644 -1483839 -28579191
484 -28579191 -21858321 -9365741 -28326104 -64911027 -78051313 -58637009 -31460908
477 -31460908 -14811458 -9470374 -16682576 -37802987 -61302220 -72617231 -71659764 -63770043
469 -63770043 -44402751 -11717911 18431172 31385469 34740633 38637190 31239960 2369207
461 2369207 -23146540 -11586667 27021182 48581258 35324029 10493100 -8517224
454 -8517224 -32624173 -66480222 -87269464 -76215182 -45399207 -17024540 1788100
447 1788100 9654071 -168612 -23818965 -38421682 -27427376 -1455912 17920141 20576891
439 20576891 5316707 -25010074 -53158270 -52883769 -21651813 9212650 13640953 3308947
$$ packed form
491A3499623k1217377k5331278J1456614L7858219J1775843k9525483k7095352
484b8579191O720870J2492580j8960363l6584923j3140286J9414304K7176101
477c1460908J6649450N341084p212202k1120411k3499233j1315011R57467P889721
469f3770043J9367292L2684840L0149083J2954297L355164L896557p397230k8870753
461B369207k5515747J1559873L8607849K1560076j3257229k4830929j9010324
454h517224k4106949l3856049k0789242J1054282L0815975K8374667J8812640
447A788100P865971r822683k3650353j4602717J0994306K5971464J9376053K656750
439B0576891j5260184l0326781k8148196K74501L1231956L0864463M428303j0332006
$$ plain form
431 3308947 4157467 18427577 30369620 33530986 30190639 18420097 3385047 6825323
423 6825323 37402314 63896352 50700859 13326155 2500020 31844963 58071576
416 58071576 43500991 4904540 -18582340 -19820450 -21988298 -39533105 -65143128 -87098704
408 -87098704 -98830578 -95813447 -80936167 -70171496 -75557750 -82992511 -65070201 -20617804
400 -20617804 15692928 14395772 -10532049 -20770666 -5286129 7503630 -6236788
393 -6236788 -29710742 -30236548 -7349010 9004724 7174468 12102571 42003099 71418904
385 71418904 63038766 23419220 -2593414 8955294 35978499 49671203 51070831 53767862
377 53767862 53499023 38116976 14556653 1102176 -2089436 -11244240 -27322545 -28800872
$$ packed form
431C308947Q48520J4270110J1942043L161366l340347j1770542j5035050L440276
423F825323L0576991K6494038j3195493l7374704j0826135K9344943K6226613
416E8071576j4570585l8596451k3486880j238110k167848j7544807k5610023k1955576
408h7098704j1731874L017131J4877280J0764671n386254p434761J7922310M4452397
400b0617804L6310732j297156k4927821j0238617J5484537J2789759j3740418
393f236788k3473954n25806K2887538J6353734j830256M928103K9900528K9415805
385G1418904q380138l9619546k6012634J1548708K7023205J3692704J399628K697031
377E3767862k68839j5382047k3560323j3454477l191612r154804j6078305j478327
$$ plain form
369 -28800872 -3524598 30323806 46246636 39171773 21320178 179805 -23157356
362 -23157356 -39970284 -36806897 -15036793 5340560 6035010 -13207553 -39720805 -59470533
354 -59470533 -61762466 -44870732 -22976302 -16380768 -26830235 -33103577 -20850976 -5171813
346 -5171813 -8774649 -27878635 -40757730 -45082329 -60364879 -88624939 -99658484 -71768729
338 -71768729 -27311393 -5382485 -10712764 -14436353 -1784816 7291658 -7974455 -35823704
330 -35823704 -47470828 -34962056 -18131253 -17081330 -30735730 -44692260 -50724126 -52354958
322 -52354958 -55221537 -59014147 -60451596 -59556381 -58250964 -53669674 -38158702 -8758888
314 -8758888 25623342 49115978 50757954 32352579 7885788 -5141774 -4518 10489256
$$ packed form
369b8800872K5276274L3848404J5922830p074863j7851595k1140373k3337161
362b3157356j6812928L163387K1770104K0377353O94450j9242563k6513252j9749728
354e9470533k291933J6891734K1894430O595534j0449467o273342J2252601J5679163
346e171813l602836j9103986j2879095m324599j5282550k8260060j1033545K7889755
338g1768729M4457336K1928908n330279l723589J2651537R076474j5266113k7849249
330c5823704j1647124J2508772J6830803J049923j3654400j3956530o031866j630832
322e2354958k866579l792610j437449Q95215J305417M581290J5510972K9399814
314h758888L4382230K3492636J641976j8405375k4466791j3027562N137256J0493774
$$ plain form
306 10489256 5387747 -18792883 -38786715 -28891624 7527019 39496456 42288966 21829814
298 21829814 1786852 -6651499 -13945641 -32015712 -53375980 -57969256 -40105443 -19523097
290 -19523097 -18225295 -31581469 -34885002 -19097543 -4968337 -13185781 -33321215 -37278637
282 -37278637 -16883024 8257586 18161762 11246465 -5377335 -26886809 -45401179 -48961044
274 -48961044 -36968815 -26135778 -29419172 -37168165 -31655766 -13888868 -1339932 -1898041
266 -1898041 -5819571 -5359453 -7396962 -19915978 -37489457 -49042637 -51646257 -47234896
258 -47234896 -33342387 -10057386 7822676 1472407 -26161948 -48956419 -48939512 -37451264
250 -37451264 -35020985 -40718014 -37715604 -24685164 -21585439 -38997850 -58458762 -55165679
$$ packed form
306A0489256n101509k4180630j9993832R895091L6418643L1969437K792510k0459152
298B1829814k0042962q438351p294142j8070071k1360268m593276J7863813K0582346
290a9523097J297802j3356174l303533J5787459J4129206q217444k0135434l957422
282c7278637K0395613K5140610R904176o915297j6623800k1509474j8514370l559865
274d8961044J1992229J0833037l283394p748993N512399J7766898J2548936n58109
266a898041l921530M60118k037509j2519016j7573479j1553180k603620M411361
258d7234896J3892509K3285001J7880062o350269k7634355k2794471J6907J1488248
250c7451264K430279n697029L002410J3030440L099725j7412411j9460912L293083
$$ plain form
242 -55165679 -30196504 -7024677 -1271311 -6838237 -10450534 -7669479 -2209192 1222964
234 1222964 -607698 -8154492 -17242299 -23055443 -27359950 -36209562 -48478984 -53107989
226 -53107989 -42676573 -25778010 -19672448 -30514070 -45443126 -47610347 -37771741 -35169122
218 -35169122 -52077802 -72218008 -66561313 -32744041 -3844732 -7148173 -27169470 -28237055
210 -28237055 -6376917 5752585 -12268710 -39419426 -43918615 -23352812 1231714
203 1231714 15730147 18915713 9608148 -10004392 -22998937 -11582438 16053748 30774867
195 30774867 18374437 -4537187 -14706943 -8119267 3533113 8292746 -1579220 -27682719
187 -27682719 -58018562 -71373818 -59740800 -39082116 -28817730 -28981385 -28066399 -23896075
$$ packed form
242e5165679K4969175K3171827N753366n566926l612297K781055N460287L432156
234A222964j830662p546794r087807n813144m304507q849612j2269422m629005
226e3107989J0431416J6898563O105562j0841622j4929056k167221R838606K602619
218c5169122j6908680k0140206N656695L3817272K8899309l303441k0021297j067585
210b8237055K1860138J2129502j8021295k7150716m499189K0565803K4584526
203A231714J4498433L185566r307565j9612540j2994545J1416499K7636186J4721119
195C0774867j2400430k2911624j0169756O587676J1652380M759633r871966k6103499
187b7682719l0335843j3355256J1633018K0658684J0264386j63655R14986M170324
$$ plain form
179 -23896075 -21187147 -14806312 4343177 25283184 18753962 -26506459 -81808678 -105781201
171 -105781201 -88262963 -56292460 -39030976 -37660041 -32503872 -11615505 15220093
164 15220093 29736732 25375462 9370792 -11662550 -38389299 -67501736 -83939612
157 -83939612 -75624184 -51708423 -33444791 -27788459 -23797176 -16148926 -13988406 -17933834
149 -17933834 -7169969 31365047 71843238 71956670 26833220 -20929899 -32309866 -15688651
141 -15688651 -7961539 -24702888 -46006880 -48345790 -33992118 -22466406 -22048673 -21159672
133 -21159672 -9233177 3381350 -3327843 -29285200 -48825080 -41919538 -20238712 -9803704
125 -9803704 -15223418 -17985678 -7975996 2450037 149392 -10399766 -19104726 -26658181
$$ packed form
179b3896075K708928O380835J9149489K0940007o529222m5260421n5302219k3972523
171a05781201J7518238L1970503J7261484J370935N156169K0888367K6835598
164A5220093J4516639m361270j6004670k1033342k6726749k9112437j6437876
157h3939612Q315428K3915761J8263632N656332L991283P648250K160520l945428
149a7933834J0763865L8535016M0478191J13432m5123450m7763119j1379967J6621215
141a5688651P727112j6741349k1303992k338910J4353672J1525712M17733Q89001
133b1159672J1926495J2614527o709193k5957357j9539880O905542K1680826J0435008
125i803704n419714k762260J0009682J0426033k300645j0549158q704960p553455
$$ plain form
117 -26658181 -38129609 -50884563 -59710987 -65041938 -65862566 -53983016 -27829045 -3764032
109 -3764032 1084288 -7425777 -8675861 2522589 8568506 -5427163 -29875524 -40264361
101 -40264361 -24356312 3844583 18642751 12359133 5061528 15066121 26057744 5837791
93 5837791 -39407197 -59179745 -24209689 29175796 47487951 30135018 15157779 12187042
85 12187042 -3788779 -35132214 -47607644 -25754987 644690 5124849 2763183 15393905
77 15393905 30506456 24824176 5424558 -2975129 4961157 17724902 30857755 41980592
69 41980592 37265761 11260864 -12587183 -10624243 2394545 -5952324 -34375706 -49425953
61 -49425953 -34590967 -6417859 17062237 32796631 36859673 24010624 7321924 7374132
$$ packed form
117b6658181j1471428j2754954q826424n330951q20628J1879550K6153971K4065013
109c764032M848320q510065j250084J1198450O045917j3995669k4448361j0388837
101d0264361J5908049K8200895J4798168o283618p297605J0004593J0991623k0219953
93E837791m5244988j9772548L4970056N3385485J8312155j7352933j4977239k970737
85A2187042j5975821l1343435j2475430K1852657K6399677M480159k361666J2630722
77A5393905J5112551n682280j9399618q399687P936286J2763745J3132853J1122837
69D1980592m714831k6004897k3848047J962940J3018788q346869k8423382j5050247
61d9425953J4834986K8173108K3480096J5734394M063042j2849049j6688700N2208
$$ plain form
53 7374132 15746432 811740 -40681755 -70073761 -59738711 -29959852 -14270000 -14983173
45 -14983173 -15773078 -15013936 -19735399 -23005841 -14518919 -3497510 -7129837 -23824672
37 -23824672 -39176789 -50771201 -65061169 -75464078 -66974381 -41967063 -21168516 -17038253
29 -17038253 -22385829 -26518365 -27258124 -24887388 -18341620 -11076668 -9618086 -12921860 -11695073
20 -11695073 -740668 13585533 17826890 18506 -39678890 -80354791 -91979952 -67594967
12 -67594967 -35761978 -27264730 -38232259 -43418972 -36330889 -31391802 -30696326 -18768507
4 -18768507 4373483 14331725 45335 -14585806
0 -14585806
$$ packed form
53G374132Q372300j4934692m1493495k9392006J0335050K9778859J5689852p13173
45a4983173p89905P59142m721463l270442Q486922J1021409l632327j6694835
37b3824672j5352117j1594412j4289968j0402909Q489697K5007318K0798547M130263
29a7038253n347576m132536p39759K370736O545768P264952J458582l303774J226787
20a1695073J0954405J4326201M241357j7808384l9697396m0675901j1625161K4384985
12f7594967L1832989Q497248j0967529n186713P088083M939087O95476J1927819
4a8768507K3141990R958242j4286390j4631141
0a4585806
$$ Imaginary data points
##PAGE= N=2
##DATA TABLE= (X++(I..I)), XYDATA
$$ plain form
65535 39907388 43825313 24463055 7177202 14497476 35116137 43747214 35098950 23737800
65527 23737800 20890561 25519717 32956389 40205286 44206419 43592543 42213803 45383339
65519 45383339 53048791 60589891 64862897 65204598 59867127 46891461 29640325 17096676
65511 17096676 15176136 19023578 17627301 7534641 -966279 4577269 21849861 34215975
65503 34215975 30500589 18534266 13353494 16188734 13772604 -1815383 -21169472 -28383249
65495 -28383249 -17751308 3422124 22764297 29651078 20835570 6690605 7176189 31463589
65487 31463589 62258819 70819881 50074673 22525873 9949193 6599959 -6024402
65480 -6024402 -26769223 -35577155 -25773159 -15412633 -18599204 -23304556 -12475046 6190550
$$ packed form
65535C9907388L917925j9362258j7285853P320274K0618661Q631077q648264j1361150
65527B3737800k847239M629156P436672P248897M001133o13876j378740L169536
65519D5383339P665452P541100M273006L41701n337471j2975666j7251136j2543649
65511A7096676j920540L847442j396277j0092660q500920N543548J7272592J2366114
65503C4215975l715386j1966323n180772K835240k416130j5587987j9354089p213777
65495b8383249J0631941K1173432J9342173O886781q815508j4144965M85584K4287400
65487C1463589L0795230Q561062k0745208k7548800j2576680l349234j2624361
65480f024402k0744821q807932R803996J0360526l186571m705352J0829510J8665596
$$ plain form
65472 6190550 11854856 5310525 8758514 28591432 40360352 21362113 -17234278 -43841874
65464 -43841874 -42208978 -21489948 1733310 17753316 23343953 20270973 16065149 17942149
65456 17942149 23710822 23920065 14292872 2076835 -1486383 6320023 15067476 10655072
65448 10655072 -7469794 -21200139 -13615493 7000211 14454273 -1539936 -22615378
65441 -22615378 -29575281 -27683371 -30979130 -34603681 -22324907 4561340 25861912 29065686
65433 29065686 19674727 4505562 -17317887 -42367338 -57555117 -53790532 -34737435
65426 -34737435 -8778147 16823577 32712884 32812182 25870326 26330684 29953951 16608496
65418 16608496 -15664091 -39544049 -34415761 -15372366 -8928001 -14759897 -12738219 2105378
$$ packed form
65472F190550N664306o544331L447989J9832918J1768920j8998239l8596391k6607596
65464d3841874J632896K0719030K3223258J6020006N590637l072980m205824J877000
65456A7942149N768673K09243r627193j2216037l563218P806406Q747453m412404
65448A0655072j8124866j3730345P584646K0615704P454062j5994209k1075442
65441b2615378o959903J891910l295759l624551J2278774K6886247K1300572L203774
65433B9065686r390959j5169165k1823449k5049451j5187779L764585J9053097
65426c4737435K5959288K5601724J5889307R9298o941856M60358L623267j3345455
65418A6608496l2272587k3879958N128288J9043395O444365n831896K021678J4843597
$$ plain form
65410 2105378 14691109 15919784 12463551 10729068 8984646 6587164 5881785 4668255
65402 4668255 910914 3051774 19108046 37209567 36658999 19297192 8430938 12795032
65394 12795032 15043780 4312298 -4445036 1658291 8733602 -330904 -15459817 -15999764
65386 -15999764 -4552520 626199 -2683454 -2924795 -2073334 -11822197 -24411516 -18064892
65378 -18064892 4116648 11390492 -8001884 -26522715 -19760160 -2229533 1585729
65371 1585729 -854302 14213212 44267468 64092730 64450754 58064847 50456124 34071369
65363 34071369 12855845 4064270 9082888 8316163 -5721378 -14762300 -6307653 4580785
65355 4580785 1122112 -7920489 -5668654 5257593 12864600 18656824 27994558 30076118
$$ packed form
65410B105378J2585731J228675l456233j734483j744422k397482p05379j213530
65402D668255l757341K140860J6056272J8101521n50568j7361807j0866254M364094
65394A2795032K248748j0731482q757334O103327P075311r064506j5128913n39947
65386a5999764J1447244N178719l309653k41341Q51461r748863j2589319O346624
65378a8064892K2181540P273844j9392376j8520831O762555J7530627L815262
65371A585729k440031J5067514L0054256J9825262L58024o385907p608723j6384755
65363C4071369k1215524q791575N018618p66725j4037541r040922Q454647J0888438
65355D580785l458673r042601K251835J0926247P607007N792224R337734K081560
$$ plain form
65347 30076118 13086373 -8252812 -6743073 18018125 38853631 39155982 27817723
65340 27817723 14945529 -1041201 -15456829 -12275982 9509851 24474993 11575591
65333 11575591 -17615417 -35690449 -32781742 -19916952 -9659671 -7513092 -14868610
65326 -14868610 -26898626 -31772822 -21858406 -1502993 22310394 48023109 69833645
65319 69833645 71165611 42252082 -1059964 -29417709 -29680360 -14401454 -4699793 -10177171
65311 -10177171 -21386865 -17369228 12122711 47868943 56680415 32624210 7536183
65304 7536183 9027791 25396933 30153051 24221057 27390688 39051137 39114227 25889088
65296 25889088 21699473 35425650 47235757 40257552 23512130 11669234 3458822
$$ packed form
65347C0076118j6989745k1339185J509739K4761198K0835506L02351j1338259
65340B7817723j2872194j5986730j4415628L180847K1785833J4965142j2899402
65333A1575591k9191008j8075032K908707J2864790J0257281K146579p355518
65326a4868610j2030016m874196R914416K0355413K3813387K5712715K1810536
65319F9833645J331966k8913529m3312046k8357745k62651J5278906R701661n477378
65311a0177171j1209694M017637K9491939L5746232Q811472k4056205k5088027
65304G536183J491608J6369142M756118n931994L169631J1660449O3090j3225139
65296B5889088m189615J3726177J1810107o978205j6745422j1842896q210412
$$ plain form
65289 3458822 -5760647 -8445332 1926476 15771780 20687509 19110913 19420878 19387145
65281 19387145 11940196 29983 -5945091 -278312 15379234 33372037 39204869 22434601
65273 22434601 -4274767 -12635383 4077255 18400998 7880101 -11211727 -10384241
65266 -10384241 6511614 12990906 5629944 9180957 34960953 61907990 66941224 52788648
65258 52788648 36165169 24938964 16518086 6533290 -7981379 -23885759 -27702007
65251 -27702007 -9236586 18469492 29605241 20666495 15910947 28723080 37845224
65244 37845224 18601396 -18181921 -39892332 -36018217 -26181006 -26435512 -28499276 -17620605
65236 -17620605 4297228 22145484 26112005 19579333 12261193 10252702 12339272 14919493
$$ packed form
65289C458822r219469k684685J0371808J3845304M915729j576596L09965l3733
65281A9387145p446949j1910213n975074N666779J5657546J7992803N832832j6770268
65273B2434601k6709368q360616J6712638J4323743j0520897j9091828Q27486
65266a0384241J6895855O479292p360962L551013K5779996K6947037N033234j4152576
65258E2788648j6623479j1226205q420878r984796j4514669j5904380l816248
65251b7702007J8465421K7706078J1135749q938746m755548J2812133R122144
65244C7845224j9243828l6783317k1710411L874115R837211k54506k063764J0878671
65236a7620605K1917833J7848256L966521o532672p318140k008491K086570K580221
$$ plain form
65228 14919493 19335133 29898795 42897031 45040381 29933284 10053865 2171612
65221 2171612 4741456 2339678 -8544489 -13138150 -1974711 13484317 18247723 15766684
65213 15766684 19498308 29098392 30372465 18594424 7502394 9909788 19831107 21659286
65205 21659286 10788469 -3039773 -9657969 -7878271 -1645916 6222744 14339456 20806584
65197 20806584 23530316 21652645 16780100 13456377 15938628 21862390 22047919 11181175
65189 11181175 -3707324 -11393616 -11168362 -11329586 -13280490 -7758077 8639669 22655800
65181 22655800 18409638 -3024984 -25634895 -35936265 -31261939 -15608969 2429354
65174 2429354 9905272 22021 -15005447 -12308510 14331447 43033279 47066676 24779457
$$ packed form
65228A4919493M415640J0563662J2998236K143350j5107097j9879419p882253
65221B171612K569844k401778j0884167m593661J1163439J5459028M763406k481039
65213A5766684L731624R600084J274073j1778041j1092030K407394R921319J828179
65205B1659286j0870817j3828242o618196J779698O232355P868660Q116712O467128
65197B0806584K723732j877671m872545l323723K482251N923762J85529j0866744
65189A1181175j4888499p686292K25254j61224j950904N522413J6397746J4016131
65181B2655800m246162k1434622k2609911j0301370M674326J5652970J8038323
65174B429354P475918r883251j5027468K696937K6639957K8701832M033397k2287219
$$ plain form
65166 24779457 -1655819 -14401776 -16579648 -18813014 -19930879 -11265901 3662899 7414073
65158 7414073 -7362329 -21525485 -8856041 29936843 63728949 64426563 35992726
65151 35992726 6509522 -2022362 8119941 16673343 5834680 -21191872 -40616336
65144 -40616336 -33736096 -12355476 -6339807 -21914701 -28821946 -1265080 42970241
65137 42970241 63651651 49883724 28681661 24489449 33719391 43824205 54787052
65130 54787052 68950418 75746970 63410820 38893796 22099609 22277738 29980744 31850251
65122 31850251 25499443 17980473 14265862 11255485 4388867 -1986437 3062877 21348342
65114 21348342 38726156 40625989 28896630 15322475 5159982 -1683588 -317666
$$ packed form
65166B4779457k6435276j2745957k177872k233366j117865Q664978J4928800L751174
65158G414073j4776402j4163156J2669444L8792884L3792106O97614k8433837
65151C5992726k9483204q531884J0142303Q553402j0838663k7026552j9424464
65144d0616336O880240K1380620O015669j5574894o907245K7556866M4235321
65137D2970241K0681410j3767927k1202063m192212R229942J0104814J0962847
65130E4787052J4163366O796552j2336150k4517024j6794187J78129P703006J869507
65122C1850251o350808p518970l714611l010377o866618o375304N049314J8285465
65114B1348342J7377814J899833j1729359j3574155j0162493o843570J365922
$$ plain form
65107 -317666 11843274 21402786 11865277 -9712503 -18823408 -8805940 1242733 -476064
65099 -476064 -543458 13107767 27982193 26354716 10724515 -6634056 -23836679 -40794608
65091 -40794608 -44828642 -26309402 945590 14925801 12867338 4997855 -8112508
65084 -8112508 -28439870 -39500863 -21277402 14504377 31331951 14978732 -9785114
65077 -9785114 -15868593 -5089507 6308540 12773536 16785612 16486447 10424288 4945753
65069 4945753 4752462 3162468 -7787615 -22396268 -25522339 -10596928 10757892 16601628
65061 16601628 -6135269 -45625143 -71261459 -63395688 -34059491 -9665804 1025911
65054 1025911 8431432 18027696 25027600 32293128 50434511 74336629 81623993 64666780
$$ packed form
65107c17666J2160940R559512r537509k1577780r110905J0017468J0048673j718797
65099d76064o7394J3651225J4874426j627477j5630201j7358571j7202623j6957929
65091d0794608m034034J8519240K7254992J3980211k058463p869483j3110363
65084h112508k0327362j1060993J8223461L5781779J6827574j6353219k4763846
65077i785114o083479J0779086J1398047O464996M012076k99165o062159n478535
65069D945753j93291j589994j0950083j4608653l126071J4925411K1354820N843736
65061A6601628k2736897l9489874k5636316P865771K9336197K4393687J0691715
65054A025911P405521R596264O999904P265528J8141383K3902118P287364j6957213
$$ plain form
65046 64666780 43930311 35922581 26468565 -5591729 -51217762 -78107186 -69102403
65039 -69102403 -37521003 -7896098 5287421 2916592 -2638489 1894892 16027199
65032 16027199 24462071 16395395 -34368 -7944570 1971081 30405804 71591439 106857464
65024 106857464 110755466 79715847 44184602 35136722 46967903 51104850 37150975
65017 37150975 18144182 1008831 -20598800 -40988304 -36792994 269267 42441951
65010 42441951 52905155 25672537 -11270649 -26602444 -12721071 11758227 20315679
65003 20315679 3191621 -22748960 -31986211 -17758779 4848675 22039394 36648546
64996 36648546 56283657 75048549 75070140 45078845 -5073606 -48615007 -63528149
$$ packed form
65046F4666780k0736469q007730r454016l2060294m5626033k6889424R004783
65039f9102403L1581400K9624905J3183519k370829n555081M533381J4132307
65032A6027199Q434872q066676j6429763p910202R915651K8434723M1185635L5266025
65024A06857464L898002l1039619l5531245r047880J1831181M136947j3953875
65017C7150975j9006793j7135351k1607631k0389504M195310L7062261M2172684
65010D2441951J0463204k7232618l6943186j5331795J3881373K4479298Q557452
65003B0315679j7124058k5940581r237251J4227432K2607454J7190719J4609152
64996C6648546J9635111J8764892K1591k9991295n0152451m3541401j4913142
$$ plain form
64989 -63528149 -52771887 -38376445 -32416157 -23625432 -1210694 20838314 21183008 5120640
64981 5120640 -1604081 8191595 13837426 518169 -20686531 -34559798 -41574562 -44120411
64973 -44120411 -33624721 -7898327 15239188 19704743 13202491 9666964 3187182 -18254109
64965 -18254109 -42601128 -43185439 -16663895 11936703 24507273 28647644 34990703 35772983
64957 35772983 18912868 -8907438 -27758149 -29332442 -25809573 -32851989 -49397459
64950 -49397459 -58267115 -47327867 -26108526 -14824263 -18113234 -21318755 -16718984 -18145644
64942 -18145644 -37062016 -57306130 -53126939 -25667848 -772372 6792254 5407938
64935 5407938 2941803 -4986212 -16950873 -18879604 -6884280 2125735 -3615548 -10840230
$$ packed form
64989f3528149J0756262J4395442N960288Q790725K2414738K2049008L44694j6062368
64981E120640o724721R795676N645831j3319257k1204700j3873267p014764k545849
64973d4120411J0495690K5726394K3137515M465555o502252l535527o479782k1441291
64965a8254109k4347019n84311K6521544K8600598J2570570M140371O343059P82280
64957C5772983j6860115k7820306j8850711j574293L522869p042416j6545470
64950d9397459q869656J0939248K1219341J1284263l288971l205521M599771j426660
64942a8145644j8916372k0244114M179191K7459091K4895476P564626j384316
64935E407938k466135p928015j1964661j928731J1995324R010015n741283p224682
$$ plain form
64927 -10840230 -3191541 11202820 12617596 75250 -10337441 -11177221 -8988844 -6877623
64919 -6877623 1029094 17480423 37562993 55171807 62729536 49282966 14101444
64912 14101444 -21567418 -34159474 -27657509 -24555714 -27905932 -17316139 11310891
$$ packed form
64927a0840230P648689J4394361J414776j2542346j0412691q39780K188377K111221
64919f877623P906717J6451329K0082570J7608814P557729j3446570l5181522
64912A4101444l5668862j2592056O501965L101795l350218J0589793K8627030
$$ [...]
##END NTUPLES=NMR SPECTRUM
##END=
