##TITLE=31Pdec_2PBDP2910
 CDCl3, 24 sc
 30.10.2020
##JCAMPDX= 6.0         $$ Bruker NMR JCAMP-DX V2.0
##DATA TYPE= NMR SPECTRUM
##DATA CLASS= NTUPLES
##ORIGIN= UXNMR, Bruker Analytische Messtechnik GmbH
##OWNER= root
$$ XWIN-NMR		Version 3.5
$$ Fri Oct 30 10:44:16 2020 Russian Standard Time (UT+4h)  she@DPX200
##.OBSERVE FREQUENCY= 81.013821
##.OBSERVE NUCLEUS= ^31P
##.ACQUISITION MODE= SIMULTANEOUS
##.ACQUISITION SCHEME= undefined
##.AVERAGES= 24
##.DIGITISER RES= 17
##SPECTROMETER/DATA SYSTEM= spect
##.PULSE SEQUENCE= zgpg30
##.SOLVENT NAME= CDCl3
##.SHIFT REFERENCE= (INTERNAL, CDCl3, 0, 182.463)
##AUDIT TRAIL= $$ (NUMBER, WHEN, WHO, WHERE, WHAT)
$$ ##TITLE= Audit trail, XWIN-NMR		Version 3.5
$$ ##JCAMPDX= 5.01
$$ ##ORIGIN= Bruker BioSpin GmbH
$$ ##OWNER= she
$$ F:/spectra/data/she/nmr/P31/1/pdata/1/auditp.txt
$$ ##AUDIT TRAIL=  $$ (NUMBER, WHEN, WHO, WHERE, WHAT)
(   1,<2020-10-30 10:42:55.70 +0400>,<she>,<DPX200>,
      <created by zg, POWCHK disabled, PULCHK disabled
       configuration hash MD5:
       00 E9 B6 7A A2 85 ED C7 34 08 36 98 17 FE 4E 26
       data hash MD5: 32K
       21 6F E1 0C 51 8F BB 92 8C 66 12 A0 08 60 04 3E>)
(   2,<2020-10-30 10:43:23.84 +0400>,<she>,<DPX200>,
      <Start of raw data processing
       efp BC_mod = 2 LB = 1 FT_mod = 6 PKNL = 1 PHC0 = -2432.834 PHC1 = 144.8008 SI = 64K 
       data hash MD5: 64K
       78 B7 26 CE 66 32 17 56 70 DD 91 7C 2A 45 D9 84>)
(   3,<2020-10-30 10:43:38.40 +0400>,<she>,<DPX200>,
      <pk PHC0 = 19.10221 PHC1 = 0 
       data hash MD5: 64K
       0C 96 FB D1 5C 49 8E CC ED 9F C8 8A 5B F9 51 19>)
$$ ##END=
$$ 
$$ hash MD5
$$ 63 64 5C FC B5 78 E3 0B D3 B0 D1 1A AE 94 DC DC
##$RELAX= 
##$RELAX= 
##$RELAX= 
##$RELAX= 
##$RELAX= 
##$RELAX= 
##$RELAX= 
##$RELAX= 
$$ Bruker specific parameters
$$ --------------------------
##$DU= <F:/spectra>
##$EXPNO= 1
##$NAME= <P31>
##$PROCNO= 1
##$TYPE= <nmr>
##$USER= <she>
##$AMP= (0..31)
100 100 100 100 100 100 100 100 100 100 100 100 100 100 100 100 100 100 
100 100 100 100 100 100 100 100 100 100 100 100 100 100 
##$AQSEQ= 0
##$AQ_mod= 1
##$AUNM= <au_zg>
##$AUTOPOS= <>
##$BF1= 81.014009
##$BF2= 200.13
##$BF3= 200.13
##$BF4= 200.13
##$BF5= 200.13
##$BF6= 200.13
##$BF7= 200.13
##$BF8= 200.13
##$BYTORDA= 1
##$CFDGTYP= 0
##$CFRGTYP= 5
##$CHEMSTR= <none>
##$CNST= (0..31)
1 1 145 1 1 1 1 1 1 1 1 1 1 1 1 1 1 1 1 1 1 1 1 1 1 1 1 1 1 1 1 1 
##$CPDPRG= <waltz16>
##$CPDPRG1= <>
##$CPDPRG2= <waltz16>
##$CPDPRG3= <>
##$CPDPRG4= <mlev>
##$CPDPRG5= <mlev>
##$CPDPRG6= <mlev>
##$CPDPRG7= <mlev>
##$CPDPRG8= <mlev>
##$CPDPRGB= <>
##$CPDPRGT= <>
##$D= (0..31)
0 1 0 0 0 0 0 0 0 0 0 0.03 2e-05 3e-06 0 0 0 0 0 0 0 0 0 0 0 0 0 0 0 0 
0 0 
##$DATE= 1604040175
##$DBL= (0..7)
120 120 120 11 120 120 24 19 
##$DBP= (0..7)
150 150 150 150 150 150 150 150 
##$DBP07= 0
##$DBPNAM0= <>
##$DBPNAM1= <>
##$DBPNAM2= <>
##$DBPNAM3= <>
##$DBPNAM4= <>
##$DBPNAM5= <>
##$DBPNAM6= <>
##$DBPNAM7= <>
##$DBPOAL= (0..7)
0.5 0.5 0.5 0.5 0.5 0.5 0.5 0.5 
##$DBPOFFS= (0..7)
0 0 0 0 0 0 0 0 
$$ [...]
##$SUBNAM2= <"">
##$SUBNAM3= <"">
##$SUBNAM4= <"">
##$SUBNAM5= <"">
##$SUBNAM6= <"">
##$SUBNAM7= <"">
##$SUBNAM8= <"">
##$SUBNAM9= <"">
##$SW= 369.568048894756
##$SWIBOX= (0..15)
0 1 3 0 0 0 0 0 0 0 0 0 0 0 0 0 
##$SW_h= 29940.119760479
##$TD= 32768
##$TD0= 1
##$TE= 0
##$TE2= 300
##$TE3= 300
##$TEG= 300
##$TL= (0..7)
0 120 53 12 22 120 120 120 
##$TP= (0..7)
150 150 150 150 150 150 150 150 
##$TP07= 0
##$TPNAME0= <>
##$TPNAME1= <>
##$TPNAME2= <>
##$TPNAME3= <>
##$TPNAME4= <>
##$TPNAME5= <>
##$TPNAME6= <>
##$TPNAME7= <>
##$TPOAL= (0..7)
0.5 0.5 0.5 0.5 0.5 0.5 0.5 0.5 
##$TPOFFS= (0..7)
0 0 0 0 0 0 0 0 
##$TUNHIN= 0
##$TUNHOUT= 0
##$TUNXOUT= 0
##$USERA1= <user>
##$USERA2= <user>
##$USERA3= <user>
##$USERA4= <user>
##$USERA5= <user>
##$V9= 5
##$VALIST= <valist>
##$VCLIST= <CCCCCCCCCCCCCCC>
##$VD= 0
##$VDLIST= <DDDDDDDDDDDDDDD>
##$VPLIST= <PPPPPPPPPPPPPPP>
##$VTLIST= <TTTTTTTTTTTTTTT>
##$WBST= 1024
##$WBSW= 4
##$XGAIN= (0..3)
0 0 0 0 
##$XL= 0
##$YL= 0
##$YMAX_a= 82326
##$YMIN_a= -75105
##$ZGOPTNS= <>
##$ZL1= 120
##$ZL2= 120
##$ZL3= 120
##$ZL4= 120
##$ABSF1= 0
##$ABSF2= 0
##$ABSG= 0
##$ABSL= 0
##$ALPHA= 0
##$AQORDER= 0
##$ASSFAC= 0
##$ASSFACI= 0
##$ASSFACX= 0
##$ASSWID= 0
##$AUNMP= <proc_1d>
##$AZFE= 0.1
##$AZFW= 0.5
##$BCFW= 0
##$BC_mod= 2
##$BYTORDP= 0
##$COROFFS= 0
##$CY= -3
##$DATMOD= 1
##$DC= 0
##$DFILT= <>
##$DTYPP= 0
##$F1P= 0
##$F2P= 0
##$FCOR= 1
##$FTSIZE= 65536
##$FT_mod= 6
##$GAMMA= 0
##$GB= 0
##$INTBC= 1
##$INTSCL= 5.30512e-09
##$ISEN= 30
##$LB= 1
##$LEV0= 0
##$LPBIN= 0
##$MAXI= 10000
##$MC2= 0
##$MEAN= 0
##$ME_mod= 0
##$MI= 50
##$NCOEF= 0
##$NC_proc= -4
##$NLEV= 6
##$NOISF1= 182.463
##$NOISF2= 159.3651
##$NSP= 0
##$NTH_PI= 0
##$NZP= 0
##$OFFSET= 182.463
##$PC= 4
##$PHC0= -2413.732
##$PHC1= 144.8008
##$PH_mod= 1
##$PKNL= yes
##$PPARMOD= 0
##$PSCAL= 0
##$PSIGN= 0
##$REVERSE= no
##$SF= 81.014009
##$SI= 65536
##$SIGF1= 159.3651
##$SIGF2= -187.1042
##$SINO= 113.3802
##$SIOLD= 16384
##$SREGLST= <1H.CDCl3>
##$SSB= 0
##$STSI= 65536
##$STSR= 0
##$SW_p= 29940.119760479
##$SYMM= 0
##$S_DEV= 0
##$TDeff= 32768
##$TDoff= 0
##$TI= <>
##$TILT= no
##$TM1= 0
##$TM2= 0
##$TOPLEV= 0
##$USERP1= <user>
##$USERP2= <user>
##$USERP3= <user>
##$USERP4= <user>
##$USERP5= <user>
##$WDW= 1
##$XDIM= 65536
##$YMAX_p= 292427577
##$YMIN_p= -2134992
$$ End of Bruker specific parameters
$$ ---------------------------------
##NTUPLES= NMR SPECTRUM
##VAR_NAME=  FREQUENCY,     SPECTRUM/REAL,   SPECTRUM/IMAG
##SYMBOL=    X,             R,               I
##VAR_TYPE=  INDEPENDENT,   DEPENDENT,       DEPENDENT
##VAR_FORM=  AFFN,          ASDF,            ASDF
##VAR_DIM=   65536,         65536,           65536
##UNITS=     HZ,            ARBITRARY UNITS, ARBITRARY UNITS
##FACTOR=    0.456856943014862, 1,           1
##FIRST=     14782.0589164895, 0,            0
##LAST=      -15158.0608439895, 0,           0
##MIN=       -15158.0608439895, -2134992,    0
##MAX=       14782.0589164895, 292427577,    0
$$ Real data points
##PAGE= N=1
##DATA TABLE= (X++(R..R)), XYDATA
$$ [...]
42818E89292K8200k74920k15850J36054K28934m5064k04325J0950K53746J45594
42808F52611j85687l36366j41822J81785K91924Q9475j20040L0211M02849M30839
42798A295779o4000n10764l83268K8190J08185j55018l04656k19931j43061p8321
42788d26865J55306L73439K30264p8014m7131K09825Q1896m15118n23084L670
42778d35812M23710K07786j29003K8662L63236K53537j44914k42429l8862r723
42768B76188k04872k08927R1210L38267K84721L5948k43267m29913l42788L0892
42758c72541L21059K09202o6270q5426N0006p5226m08266m63319j26401J69052
42748h48130J51595N7907J34084K66516K79591K07742J17574p900j06392p4198
$$ plain form
42818 589292 617492 342572 126722 262776 491710 446646 242321 253271 507017 652611
42808 652611 466924 130558 -11264 170521 462445 551920 431880 462091 864940 1295779
42798 1295779 1231779 721015 337747 365937 474122 319104 14448 -205483 -348544 -426865
42788 -426865 -271559 101880 332144 254130 206999 416824 498720 83602 -439482 -435812
42778 -435812 -12102 195684 66681 95343 458579 712116 567202 324773 285911 276188
42768 276188 71316 -137611 -46401 291866 576587 612535 369268 -60645 -403433 -372541
42758 -372541 -51482 157720 91450 6024 56030 -19196 -427462 -890781 -1017182 -848130
42748 -848130 -696535 -638628 -504544 -238028 41563 249305 366879 358979 252587 178389
42738A78389j0719q6363j71817r480K51568J88742j72590l18731o2674J68982
42728d4693P9760m3918N9948J27286r6745l08833j54437R9881k3676l92215m38967
42717a136609l3077L71075M20096K24731K3282j01307j11498K6499J91791J84944
42707E9927J6075r8439m7366O6302J19265P6068o7002k48278k95990j21819R5402
42696d45855J25173L829q8427j53321k81734l37588j07394K62610L76796J81711
42686d64200N1220J74587K54883J3970l42182m22148j67234J76113M04475M46890
42676A26374K84331J8046j21286n0870R453j32384l05464k21030O9151K41083
42666h2596J58970m241o9508j3410J43485L32844L36165m51m16175m46927r2202
$$ plain form
42738 178389 167670 81307 -90510 -99990 151578 340320 167730 -151001 -213675 -44693
42728 -44693 35067 -8851 51097 178383 81638 -227195 -381632 -281751 -305427 -697642 -1136609
42717 -1136609 -1169686 -798611 -378515 -153784 -130502 -231809 -343307 -316808 -125017 59927
42707 59927 76002 -22437 -69803 -3501 115764 191832 124830 -123448 -419438 -541257 -445855
42696 -445855 -320682 -316853 -405280 -558601 -840335 -1177923 -1285317 -1022707 -645911 -464200
42686 -464200 -412980 -238393 16490 30460 -311722 -733870 -901104 -724991 -320516 126374
42676 126374 410705 428751 307465 256595 266048 133664 -171800 -392830 -323679 -82596
42666 -82596 76374 72133 2625 -10785 132700 465544 801709 801258 385083 -61844 -154046
42655a54046J00372j72098m59358k05206L74333N51037J20524l44373l45863p7161
42645f11839L0484l9318l1299P2513Q8561K4703M7536J22718N5432j24353j76697
42634e41559q0410q2505k37644k66398j9170K72444M01613M86012N99564M70518
42624A002465o1677n77272n49072j18609J05671n3884j82112k5570J49949J20034
42614a90077J05421L18260N04838L08122j67565m90866m36928j26775J97335L04079
42604C25844P5010k82611l34830P839K69100Q5117j77886L9388N42115N82271
42594A131357j9447n83324n49218j74795J0725m5293q6173p8940j51549k31570
42584g78227j38476J01830L29064M78967M96575K58840j13400j55995K98844O46871
$$ plain form
42655 -154046 -53674 -225772 -685130 -890336 -516003 35034 155558 -188815 -534678 -611839
42645 -611839 -581355 -620673 -651972 -579459 -490898 -466195 -418659 -295941 -240509 -364862 -541559
42634 -541559 -621969 -704474 -942118 -1208516 -1227686 -955242 -553629 -67617 531947 1002465
42624 1002465 940788 363516 -185556 -304165 -198494 -252378 -434490 -460060 -310111 -190077
42614 -190077 -84656 233604 738442 1046564 878999 388133 -48795 -175570 21765 325844
42604 325844 400854 118243 -216587 -208748 60352 145469 -32417 6971 549086 1131357
42594 1131357 1111910 528586 -20632 -195427 -184702 -229995 -316168 -395108 -546657 -778227
42584 -778227 -916703 -814873 -485809 -6842 489733 748573 635173 479178 778022 1424893
42574A424893K36211n96283q75388l58505J62901R5525j54003K821L52746L05456
42564E96374j16893l70699k66131j33842j75748j98292m0408J80311L27299L84666
42554A86637K89869m461k47863p2679M15552O10617J74374m72332o58492k40133
42544a8911L30828N30869J99213l71240o48663l59575J39857K40650r7573k76340
42534c30885K2098L14540Q9570l28679k62288K38349M69321J70399j36953m1020
42524B04452J58342M1912k40113k88648j20015n2947j28038q9825J18083K49065
42514a47732J81826J05953J63529J82260m7653m04742n52803l52146K5386L59024
42504d87098N66877O05899L97356K95k87906k28223J7584Q2983o6429p9346K07021
$$ plain form
42574 1424893 1661104 1064821 189433 -169072 -6171 89354 -64649 -61828 290918 596374
42564 596374 479481 108782 -157349 -291191 -466939 -665231 -705639 -525328 -198029 186637
42554 186637 476506 472045 224182 151503 567055 1177672 1352046 879714 221222 -18911
42544 -18911 311917 842786 1041999 670759 22096 -337479 -197622 43028 -54545 -330885
42534 -330885 -308787 5753 95323 -233356 -495644 -257295 212026 382425 245472 204452
42524 204452 362794 404706 164593 -124055 -244070 -297017 -425055 -514880 -396797 -147732
42514 -147732 34094 140047 303576 485836 438183 33441 -519362 -871508 -846122 -487098
42504 -487098 79779 685678 1083034 1083329 795423 567200 584784 667767 601338 521992 729013
42493G29013M48291K71772j67723m05966k84018l4387J31599J85895J00740j38881
42483H36335l46339k99659j12318r4364k25877j63054J62923L85774K86914J00763
42473E31098K9959q7903l24752l29218J05578N09237L11359k83762n65563l29544
42463d33511m5579m2477r8924M9842K98781M45696M75744L93918J31632j94011
42453I81111k66607l0495J39047m1043l41676l78900j47105Q6542K12728K86619
42443E00221K52068J0816k79415l08326o5749P3779j65319n65636o50606k43721
42433a441888L23706N73114L78181M4065r0926j2247Q8701J53777K73085M10037
42423F99605L77063J52349j6385M2386J60543O9465k34970n15462n72579l80138
$$ plain form
42493 729013 1177304 1449076 1281353 875387 591369 556982 688581 874476 975216 836335
42483 836335 489996 190337 78019 -16345 -242222 -405276 -242353 143421 430335 531098
42473 531098 561057 473154 148402 -180816 -75238 433999 745358 461596 -103967 -433511
42463 -433511 -479090 -521567 -620491 -570649 -271868 173828 649572 1043490 1175122 981111
42453 981111 714504 684009 823056 782013 440337 61437 -85668 874 213602 500221
42443 500221 752289 763105 483690 175364 109615 183394 18075 -547561 -1198167 -1441888
42433 -1441888 -1118182 -545068 -166887 -122822 -213748 -225995 -137294 16483 289568 699605
42423 699605 1076668 1229017 1212632 1255018 1415561 1485026 1250056 734594 162015 -218123
42413b18123o1876J49628O8452j94320k74667K945L73204M81209L24484J40104
42403G91040J2082j38939k79991k74689j32313R472J19655K40183K64507N4691
42393F65698k20922k06292J05948K84800O3858k54771k24845J28807L81658K77559
42383A001498k6821k47469k85859k24310j58738j12529o8957l8695p0404j73289
42373d05573k56636k07997k3093J98773L57861L80153K08750r2310k77615j51785
42363b69472J48483L00289K19325J04672M5441j07339l64000m17525p6133L75151
42353d1108N24432L59277J56570J3935j66503l29452k81887n6015Q7949O7832
42343C35030O8664J55153J27027r7563k65015j70125q399p8365l02822l37616
$$ plain form
42413 -218123 -279999 -130371 -61919 -256239 -530906 -527961 -154757 326452 650936 791040
42403 791040 803122 664183 384192 109503 -22810 -13338 106317 346500 611007 665698
42393 665698 444776 238484 344432 629232 693090 438319 213474 342281 723939 1001498
42383 1001498 974677 727208 441349 217039 58301 -54228 -123185 -161880 -232284 -405573
42373 -405573 -662209 -870206 -893299 -694526 -336665 43488 252238 159928 -117687 -269472
42363 -269472 -120989 179300 398625 503297 548738 441399 77399 -340126 -416259 -41108
42353 -41108 483324 842601 999171 1013106 846603 517151 235264 179249 267198 335030
42343 335030 403694 558847 685874 588311 323296 153171 144772 66407 -236415 -574031
42333e74031p9225K04728K44569N4631j64452k33912q7265J88951L70521K86207
42323B10722L1663j17642k9212J63030K68280K34649J10801k9654p0609O8683
42313H40711K46076J68548k00243m79863l37757K6782J48013l7383j37345N4713
42303B92252K44838J26083j49073k45306j46801p6594r3422j04899j55946l30508
42293f39376m31630j74521K78237M04244O3867k59560j66407J12482J84533J51663
42283d76468L52368O71545O31862J49443k77730k57578j1423N592k58531m34613
42273I4467k51954J16967K60399J5526l12945l09432l970J41975r0965l07784
42263f47716q5842L24626L54041L8067q053L82889N59680L5505o79813p37162
$$ plain form
42333 -574031 -653256 -448528 -203959 -149328 -313780 -547692 -634957 -446006 -75485 210722
42323 210722 242385 124743 95531 258561 526841 761490 872291 842637 772028 840711
42313 840711 1086787 1255335 1055092 575229 237472 264254 412267 374884 237539 292252
42303 292252 537090 663173 514100 268794 121993 45399 -48023 -152922 -308868 -639376
42293 -639376 -1071006 -1245527 -967290 -563046 -499179 -758739 -925146 -812664 -628131 -476468
42283 -476468 -124100 547445 1179307 1328750 1051020 793442 782019 787611 529080 94467
42273 94467 -157487 -40520 219879 235405 -77540 -386972 -390942 -248967 -339932 -647716
42263 -647716 -733558 -408932 -54891 -16824 -24877 358012 917692 953197 273384 -463778
42253d63778j21409L88155L01653o2818j64403J00343M38286N29996K27405l57922
42243H15508q28491p76536k35875K85710L44139J8476k48069j50311K17027M97486
42233f0936L95826n3558m78187m95725r0684L92469O15876N02499J63513k26092
42223F65001m36134k88888R6841L25946J64133j47802j91755Q9124L45728K99094
42213I21288O3243o4347J5525J32830Q2164j63064m36983n18665l12688M1094
42203b39603K52057J46546j34878k72811j26454J21833K32370K16387K42655L04991
42193G43093K06346q2837k83182j75818O3906J11910m6234j48346q1146M859J6720
42182C29271P8580K76138M60899M33791J73439j98138n16873n88994l20520O7870
$$ plain form
42253 -463778 -585187 -197032 104621 41803 -122600 -22257 416029 946025 1173430 815508
42243 815508 -12983 -789519 -1025394 -739684 -395545 -377069 -625138 -775449 -558422 -60936
42233 -60936 334890 281332 -196855 -692580 -783264 -390795 225081 727580 891093 665001
42223 665001 228867 -60021 36820 362766 526899 379097 187342 276466 622194 921288
42213 921288 984531 920184 935709 1068539 1150703 987639 550656 31991 -280697 -239603
42203 -239603 12454 159000 24122 -248689 -375143 -253310 -20940 195447 438102 743093
42193 743093 949439 866602 583420 407602 471508 583418 537184 388838 307692 312551 329271
42182 329271 407851 683989 1144888 1578679 1752118 1553980 1037107 448113 127593 195463
42172A95463J93084J1449r6145P5210J89043p6386m09192k89715J42481K48147
42162A83439q6481k37651J30195M56822J53925m06159l97233K17956O32375L54256
42152A001444k22334n44861n98949n67293l13599K82875P88305O09868j23005
42143C12451o04539l82750R7847J84718j22191l17398j63631O7929Q8623j1698
42133h50639L5731K80428M94685M45315J34422k16704l83001l22827j49134M2941
42123d88783K29510L42032K55511q783k02523j28314R2172J98081J53419J18492
42113E60814J18845J8198j62447j94873j5940J22610M1030p7333n206J27112M0272
42102E73082k16042l17159j51025O4045J62415K11100K23701K4369l96465o51112
$$ plain form
42172 195463 388547 399996 303851 379061 568104 491718 82526 -207189 -64708 183439
42162 183439 96958 -140693 -10498 446324 600249 194090 -203143 14813 647188 1001444
42152 1001444 779110 234249 -364700 -931993 -1245592 -962717 -174412 435456 312451
42143 312451 -292088 -674838 -576991 -392273 -514464 -831862 -995493 -927564 -838941 -850639
42133 -850639 -814908 -534480 -39795 405520 539942 323238 -59763 -382590 -531724 -488783
42123 -488783 -259273 82759 338270 329487 126964 -1350 90822 288903 442322 560814
42113 560814 679659 697857 535410 340537 324597 447207 488237 410904 405698 532810 573082
42102 573082 357040 39881 -111144 -47099 115316 326416 550117 574486 178021 -473091
42092d73091l84414J90758N00396L25641J2197q0954k2883k7303j5441K01371
42082B26277M45632L08440j85039m59376j63572K83198K83736m8083r0056K75231
42072H76388M31908k1583o21722o95620k87058L0459K8302o139J06517J65298
42062F750L0479j02206n7625K7186p881l6696J10615K90962K22220q4411l31935
42051F7458l48723k60398k27711k12518r3832J05574K23978J64695J6316n5353
42041f20514K279J00526J65712K26132K80811J96402j01328l89978l30886O8382
42031d02462L84933K91274l3940j64518K2356K39745J92222q2603k96543k37174
42021h6710K5478K30901K12141N3573p6714j69264k98776l71833k10440P9441
$$ plain form
42092 -473091 -857505 -666747 -166351 159290 171487 90533 67650 40347 24906 226277
42082 226277 671909 980349 795310 335934 172362 455560 739296 691213 601157 876388
42072 876388 1308296 1286713 664991 -30629 -317687 -287228 -258926 -265065 -158548 6750
42062 6750 37229 -64977 -122602 -95416 -103297 -139993 -29378 261584 483804 399393 67458
42051 67458 -281265 -541663 -769374 -981892 -1075724 -970150 -746172 -581477 -565161 -620514
42041 -620514 -618235 -517709 -351997 -125865 154946 351348 250020 -139958 -470844 -402462
42031 -402462 -17529 273745 239805 75287 97643 337388 529610 447007 150464 -86710
42021 -86710 -61232 169669 381810 435383 358669 189405 -109371 -481204 -691644 -612203
42011f12203J32976j33967l16628r8264K42915K45165l8126j76237o4160J874
42001h16655o7029Q577L07359M73184K92909P6456J30369K21374r481l65385l32484
41990h0806J05412L91690J83186k11910l22348j12093R9728R7692l7411p8771
41980C4369J10046L98925M41751O6443l98150m46465q7315J26035j00591l50395
41970b05347j49479K71224L35422L0923j13238P9486J79070n5382k22279K2999
41960A73399L11844J30496k89720k86327J61628L52802n2280m97317l73421J08396
41950b60500L13488J05845j15104j07973j5066N4105J79733K98725J51202k60792
41940C43663n18456l33999K6588J47114N4207O2789J87674J34146j31136k32236
$$ plain form
42011 -612203 -479227 -613194 -929822 -1028086 -785171 -540006 -578132 -754369 -818529 -816655
42001 -816655 -883684 -875107 -567748 -94564 198345 274801 405170 626544 617063 251678 -80806
41990 -80806 24606 416296 599482 387572 65224 -46869 52859 150551 113140 34369
41980 34369 144415 543340 985091 1051534 653384 206919 119604 245639 145048 -205347
41970 -205347 -354826 -83602 251820 282743 169505 248991 428061 372679 150400 173399
41960 173399 485243 615739 326019 39692 201320 554122 501842 4525 -368896 -260500
41950 -260500 52988 158833 43729 -64244 -79310 -25205 154528 453253 604455 343663
41940 343663 -174793 -508792 -482204 -335090 -280883 -218094 -30420 103726 -27410 -259646
41930b59646L1606L05964J71278k13451l13158J2535L06976J66630k07592l12290
41920c11148j7022L13252L26061Q3135j05941r2561p445k3553j17693j15180N8069
41909a0026K36557J94412m9126k15262j23869M3118j3400k54846l02118N8212
41899d36348N42596O75322L27595j75210m32440l40542j09057M95o2687j12115
41889a22391K0825K32505K66850R8985l30J08763J72521n5978l41791k57272J22128
41878B44815K44126j08325m55381l08592J36425L45043K16261P4944M6077n5924
41868C79469k13898j14489K54756L89851j9290n27659n12034o7943J63867l9752
41858c07122k33990p9716J54300R9252j18778j35086P7801K54890K86939K71331
$$ plain form
41930 -259646 -228040 77924 249202 35751 -277407 -264872 42104 208734 1142 -311148
41920 -311148 -328170 -14918 311143 394278 288337 195776 188331 164778 47085 -68095 -10026
41909 -10026 226531 420943 371817 156555 32686 75804 62404 -192442 -494560 -436348
41899 -436348 106248 781570 1109165 933955 501515 160973 51916 52411 -10276 -122391
41889 -122391 -101566 130939 397789 496774 496444 605207 777728 721750 379959 122687 244815
41878 244815 488941 380616 -74765 -383357 -246932 98111 314372 389316 435393 379469
41868 379469 165571 51082 305838 695689 676399 148740 -363294 -431237 -267370 -307122
41858 -307122 -541112 -620828 -466528 -367276 -486054 -621140 -543339 -288449 -1510 269821
41848B69821K24920R0004l6166j3987L3142j23784l61214k91816J11338L70272
41838B72530J52263k75737m64217l60543k14758j51375j21415j01554o7380Q5154
41828a247032L41291M46023K44409j3997m447J85127K24603P7152r048K6370q687
41817B61764j50592j95523p8992J2920j3463l6485j5262o8058j57880n5568K38361
41806b58778L79051J72197j26528k06866j03453J2339J41944L07263L58259K13861
41796H89289O8243Q5299J09639l7898k06591j78574p7196j52623l21003k96096
41786a17511p2897R1648J12361J35028K02444J96026R3187j2234j10041k14833
41776C03178j87619O5127L01468K14575q1338k29323k16347l12534m60799k87962
$$ plain form
41848 269821 494741 584745 548579 534592 567734 443950 82736 -209080 -97742 272530
41838 272530 424793 149056 -315161 -675704 -890462 -1041837 -1163252 -1264806 -1332186 -1247032
41828 -1247032 -905741 -459718 -215309 -229306 -233753 -48626 175977 253129 244081 270451 261764
41817 261764 111172 -84351 -163343 -150423 -163886 -200371 -215633 -283691 -441571 -497139 -258778
41806 -258778 120273 292470 165942 -40924 -144377 -132038 9906 317169 675428 889289
41796 889289 957532 1042831 1152470 1114572 907981 729407 652211 499588 178585 -117511
41786 -117511 -190408 -98760 13601 148629 351073 547099 640286 628052 518011 303178
41776 303178 115559 180686 482154 696729 615391 386068 169721 -142813 -603612 -891574
41766h91574J85320M19386J53961j90665j93949k9023k1304o3010Q1042K41891
41756c07925J33851o9129K5527L43071M15935J20518j41362p4921J03913N8958
41746F08436j73679k91319j59650M3547Q1952m4139r8216P9594L19649L21032
41736F87207Q6011p2365j5050J7616j58580l33676k58527o2557J5760P2749L01183
41725B79771M92136K68815k45406m95132k71912M1118J08696P6943J73088K67490
41715F95607J23412j72602l10157j53685J38899K95345J41398k26325m40600k29788
41705a38496J90432L38489J08118j29165j32096j07811k41060l06401o5272K63309
41695b19953L05519R6700k8397L5675J05850Q8203P2594Q8393O1639k454m0219
$$ plain form
41766 -891574 -706254 -286868 -132907 -323572 -517521 -546544 -567848 -630858 -549816 -307925
41756 -307925 -174074 -243203 -217676 125395 541330 661848 520486 445565 549478 608436
41746 608436 434757 143438 -16212 27335 109287 65148 -33068 46526 366175 687207
41736 687207 773218 700853 685803 703419 544839 211163 -47364 -109921 -94161 -21412 279771
41725 279771 771907 1040722 795316 300184 28272 69390 178086 255029 428117 695607
41715 695607 819019 646417 336260 182575 321474 616819 758217 531892 91292 -138496
41705 -138496 51936 390425 498543 369378 237282 129471 -111589 -417990 -483262 -219953
41695 -219953 85566 182266 153869 189544 295394 383597 456191 544584 606223 603769 563550
41684E63550r0995k02517k41915o4393J82523K03696j6664k02920j93362r1195
41674a54192q919O7084J25234R0954j1204n9141j0238J04764L02659N21051M72055
41663A440107k3218o04536p02536l21782k7722o6302m1640K96308N15166J97906
41653F61751k79718k65916J45313K65290r6873l48645m7411M38448M87186N7038
41643A016463l77526m94978l93180k74374j64077M240K02233L08426K53454J04393
41633A85074r168l5911l5179o2839q1576k8797P3342J36567J10711K7322l4562
41622B44984j1227O0208K0694k30073n08230m70766n5398L79285M89491L42412
41612B61380J93889O9228j43328l20529k04241J33847K95100J12676j11261p6279
$$ plain form
41684 563550 472555 270038 28123 -36270 146253 349949 333285 130365 -62997 -154192
41674 -154192 -163111 -96027 29207 120161 108957 49816 39578 144342 447001 968052 1440107
41663 1440107 1416889 812353 109817 -211965 -239687 -305989 -347629 -51321 463845 661751
41653 661751 382033 116117 261430 526720 429847 81202 33791 472239 959425 1016463
41643 1016463 638937 143959 -249221 -523595 -687672 -683432 -481199 -172773 80681 185074
41633 185074 175906 139995 104816 41977 -39599 -68396 4946 141513 252224 279546 244984
41622 244984 233757 293965 314659 84586 -423644 -894410 -949808 -570523 -81032 261380
41612 261380 455269 524497 381169 60640 -143601 -9754 285346 398022 286761 210482
41602B10482Q4414N9212j45674k17602J6688L49942M22421J17587k81918l51769
41592B63783N710M02896L98009K5373k95146l32995k56538k40613j91666j5157
41582b36344J33499J03078M0693J64736L80744L89915J11512k32344m13128l83340
41572E9021k06958J0547J38395J23280O5410P2663Q2828l6438k52021l68848k57446
41561e69567J3774K42635K37812r232k38463j50308J94117L88328K20619l5659
41551B94056p1091j6515j54345l73706l26306m719K69592L76275M55971M49485
41541H98697R6158m86942p30725l71444J29326K22380j5782j44368m3618N8646
41531c87672O7202J18583K47840K93631J70632Q115k9979O6491J51416M5453k69393
$$ plain form
41602 210482 294896 354108 208434 -9168 7520 357462 779883 897470 615552 263783
41592 263783 269493 672389 1070398 1095771 800625 467630 211092 -29521 -221187 -236344
41582 -236344 -102845 233 40926 205662 586406 976321 1087833 855489 442361 59021
41572 59021 -147937 -137390 1005 124285 189695 262358 345186 308748 56727 -312121 -569567
41561 -569567 -555793 -313158 -75346 -84578 -323041 -473349 -279232 109096 329715 294056
41551 294056 222965 206450 52105 -321601 -647907 -652626 -383034 -6759 449212 898697
41541 898697 994855 507913 -222812 -594256 -464930 -242550 -258332 -402700 -446318 -387672
41531 -387672 -320470 -201887 45953 339584 510216 518331 488352 554843 706259 751712 482319
41520D82319n30754m17685K5068L68210L23514Q0654l6732j1794m883j6310K3762
41509B85369J3326j44710k69858j55029L2967j6589k17153j92091J08090L34071
41499b21607L15064K61466K88873J81436j79645n32272o03999m46507j97139J46674
41489i87656M65890M02049j32051o11225m91984M3091L64233K76513J48741K10731
41479c11668K36364M1076j54231r2621J06688J74728J10591R9358J56412J30567
41469D97264J008q2367n7807l0119m5699L967J46440J75804p0098l75288l36975
41458a73870Q3343M37219L41198m5891k91679k73602k12105k11109j28871M8126
41448d27241P6739j18631k13764N1418M18562M44784J27113j54330k14073k06466
$$ plain form
41520 482319 -48435 -466120 -441052 -72842 250672 331326 294594 282800 277917 261607 285369
41509 285369 298695 153985 -115873 -270902 -237935 -254524 -471677 -663768 -555678 -221607
41499 -221607 93457 354923 643796 825232 645587 113315 -490684 -937191 -1134330 -987656
41489 -987656 -521766 -119717 -251768 -862993 -1354977 -1311886 -947653 -671140 -522399 -311668
41479 -311668 -75304 -34228 -188459 -281080 -174392 336 110927 210285 366697 497264
41469 497264 498272 415905 358098 327979 282280 286247 432687 608491 538393 163105 -173870
41458 -173870 -90527 346692 687890 641999 350320 76718 -135387 -346496 -475367 -427241
41448 -427241 -350502 -469133 -682897 -631479 -212917 231867 358980 204650 -9423 -215889
41438b15889k20120j18328J35143L24324K87130J14901o0613k20029k92023j33589
41428c99093J64494K52772K7688j25546J11362M47009L74518o4226l47827k48280
41418A92871p9938j18607k05687j13320M8007M9011o9551j01435j5510O8049J39063
41407b07047K71712L84796K95264M1376r0915L1553J57109j2212l68633n02743
41397B60k48861R0007J55561q270r7586l1175j6468j36756j88360o0165K6455
41386e15358r2696j56710J24933M83452L85210j03993k84940J76679P09147O15145
41376A340869J0788m26967l84991j27855N9997J63036J80474K3078k35606l30915
41366B71908j50090J23187K69422K28758K6334k42868l37511o8811L67188N41557
$$ plain form
41438 -215889 -436009 -554337 -419194 -94870 192260 307161 246548 26519 -265504 -399093
41428 -399093 -234599 18173 45861 -79685 31677 478686 853204 788978 441151 192871
41418 192871 112933 -5674 -211361 -324681 -276674 -227663 -297214 -398649 -414159 -346110 -207047
41407 -207047 64665 449461 744725 786101 695186 726739 883848 871636 503003 260
41397 260 -248601 -158594 -3033 -11303 -108889 -140064 -156532 -293288 -481648 -541813 -515358
41386 -515358 -608054 -764764 -639831 -156379 228831 124838 -160102 16577 725724 1340869
41376 1340869 1351657 924690 539699 411844 471841 634877 815351 838429 602823 271908
41366 271908 121818 245005 514427 743185 769519 526651 189140 120329 487517 1029074
41356A029074L42232P6435l5614j08516k15961j80551K5729O3523k50491n25786
41346B20074l14695J86801L96766J59203j44334k19269j57621j14304q2840m6342
41336a16561k1799P8428L12702M40566J64729l21791m56771r8548K33228J15221
41326C29404j83763j66411J63366M00615L47266J52905j6382j15476j10451k1416
41316G79657m272j30986j83372M8068L50887L16184n3972l23838k46953n5992
41306D95411k1052n6664L3976J89967K12065P5572j03053k75951m20799m10991
41296b81519j79110O7457O3810j05802j04708J21421K23126J385k22270p3045
41286d89255K51178K20969j99922m09800j2675N56368N74878r18m98364m15464
$$ plain form
41356 1029074 1371306 1447741 1412127 1303611 1087650 907099 932828 996351 745860 220074
41346 220074 -94621 92180 488946 648149 503815 284546 126925 12621 -70219 -116561
41336 -116561 -138360 -59932 252770 693336 858065 536274 79503 -19045 214183 329404
41326 329404 145641 -20770 142596 543211 890477 1043382 1027000 911524 801073 779657
41316 779657 775385 644399 461027 509095 859982 1176166 1122194 798356 551403 495411
41306 495411 474359 417695 451671 641638 853703 929275 826222 550271 129472 -281519
41296 -281519 -460629 -393172 -329362 -435164 -539872 -418451 -195325 -193940 -416210 -489255
41286 -489255 -238077 -17108 -217030 -626830 -639505 -83137 491741 490823 -7541 -423005
41276d23005K1264K73632J59542q3255k01278j67744r1328m9202j1635J19253
41266d53756L53215N02263L64538L8480j41867n9596K4139j02888k63844j99531
41256F1153J2838J37862J84102K74872K77367n26l22190k37553J73927L06453
41246H68305n8240l61948j01992M06637N29631K28658j8329P288Q7115O5857L4734
41235A687716J7888q7084k15270j72227j1865L106j33670j50683j4261j6793k10573
41224F96284k35315M7616K30032K3811j92476K0667L69530K43436k77479m90042
41214D36064j25559K89328K64430j3997j30135q2221j36073l20420m15161l09090
41204e42834j07325N2611J19790J11255P1136R172j12117k28997j12570K99448
$$ plain form
41276 -423005 -401741 -128109 31433 -51822 -253100 -420844 -512172 -561374 -573009 -453756
41266 -453756 -100541 401722 766260 804740 662873 603277 627416 524528 260684 61153
41256 61153 73991 211853 395955 670827 948194 947668 625478 387925 561852 868305
41246 868305 810065 448117 346125 752762 1282393 1511051 1492722 1500010 1587125 1652982 1687716
41235 1687716 1705604 1618520 1403250 1231023 1219158 1222264 1088594 937911 923650 906857 696284
41224 696284 460969 508585 738617 762428 569952 590619 960149 1203585 926106 436064
41214 436064 310505 599833 864263 850266 720131 637910 501837 181417 -233744 -542834
41204 -542834 -650159 -597548 -477758 -366503 -295367 -286195 -398312 -627309 -739879 -440431
41194d40431N91498K86816l97292o81119k70894K15065J65260j56708j17845K89164
41184e16486N26169L66448R2418o5207j37963r8491J41252L74248K42166j78128
41174G46426l95287k15692K1539M8620K9316J18091J28985p0722k39889j57778
41164A3609M760L3561O3365K55480L75033J16213l45961n48637l67183p5819J15095
41153c60484K16584K28247J08047m9373j13279j56686k92217l32034J7228O08568
41143a25399Q80634N38454q5872m71668m62354k62355j04075o4724p2776Q671
41133b21464K10333L52695K58666N9726O9536L09542M09289J09697l37875m63726
41123G56419j58619K22893L05047Q8674j29501j49639q0012j16721k07844j18405
$$ plain form
41194 -440431 151067 437883 40591 -640528 -911422 -696357 -531097 -687805 -805650 -516486
41184 -516486 9683 376131 468549 403342 265379 166888 308140 682388 924554 746426
41174 746426 351139 135447 156986 205606 234922 353013 481998 411276 171387 13609
41164 13609 18369 51930 115295 370775 745808 862021 516060 -32577 -399760 -475579 -360484
41153 -360484 -143900 84347 192394 143021 29742 -126944 -419161 -751195 -733967 -125399
41143 -125399 755235 1293689 1207817 736149 273795 11440 -92635 -157359 -230135 -221464
41133 -221464 -11131 341564 600230 659956 729492 1039034 1448323 1558020 1220145 756419
41123 756419 597800 820693 1125740 1214414 1084913 935274 855262 738541 530697 412292
41113D12292J56417K88555P7580k09949k11229o959K7478j87239l46150k47052
41103b46256k0175J69454L20814M14092L31357P9247j56191k69734l15534k81686
41093B5388r0777J10041L2463k41573k39201J79317M89992K51298j92552k31131
41083I3265O8270J24578j67965k67919Q8752L99374J59890l23973l62877R7982
41073i0623L99355J20091l49648m05180p0826J20297m8243k09401m9538K00930
41063c82786J82995O362L6405K55634K89182K8668k20421k65908k58317k73039
41053f01225j20919K04735L29276O2875k09772q3457K41217L08220J17627J5709
41043B64286P1356O9481Q782Q2441K01004O0096k72893l48384l2801K48102J47019
$$ plain form
41113 412292 568709 857264 934844 724895 513666 506707 534185 346946 796 -246256
41103 -246256 -266431 -96977 223837 637929 969286 1048533 892342 622608 307074 25388
41093 25388 -65389 44652 77115 -164458 -403659 -224342 265650 516948 324396 93265
41083 93265 161535 286113 118148 -149771 -61019 338355 498245 174272 -188605 -90623
41073 -90623 308732 428823 79175 -326005 -396831 -276534 -324777 -534178 -583716 -382786
41063 -382786 -199791 -193429 -157024 98610 387792 416460 196039 -69869 -328186 -601225
41053 -601225 -722144 -517409 -188133 -125258 -335030 -418487 -177270 130950 248577 264286
41043 264286 335642 405123 413905 496346 697350 757446 484553 136169 103368 351470 498489
41032D98489j31742k15965p3399R6314J80254J40430m5435k25269j34821J66237
41022B55093K27140j51888n17406l64636J10651L01668P9166r4669P7836L31752
41012B54707L17658R3451o6609q4594p2745q2646p0133j7958O8141K13148L80668
41001I33088L95730J26390k69705m38958k26316J24825K39862K4704k64626l40851
40991C04143j92051m4325p4759k18571k56352n7864K70297M73701L95970J36437
40981G36626o6413j04254p8351q3580l6963J46930K96997J30562l02862n52395
40971H6297l10601J17459J41824l22308o50790k55723O12474J064984O13165k24023
40961H72758n43813j58085K46519Q9951l22212k96733K01372M76617J09300m36668
$$ plain form
41032 498489 366747 150782 77383 173697 353951 494381 448946 223677 88856 255093
41022 255093 482233 330345 -187061 -551697 -441046 -139378 -60212 -154881 -77045 254707
41012 254707 572365 665816 599207 514613 441868 359222 289089 271131 339272 552420 933088
41001 933088 1328818 1455208 1185503 746545 520229 645054 884916 909620 644994 304143
40991 304143 112092 67767 -6992 -225563 -481915 -539779 -269482 204219 600189 736626
40981 736626 670213 565959 487608 404028 367065 513995 810992 941554 638692 86297
40971 86297 -224304 -106845 34979 -287329 -938119 -1193842 -581368 483616 1096781 872758
40961 872758 328945 170860 417379 507330 185118 -111615 89757 566374 675674 239006
40951B39006m79162m9007K53172J57252l653N4749J26183l6821k03450M224M32219
40940D94712M91266l5789o55226p77939l91480P9019L46549M28387L86296K25003
40930E90798L5531l7090j7134o6159j77109j32791J31722L46800K50649m7161
40920H78056k24653j62952k8410o031j11492k41957k91874k29181j25756p5911
40910f20161n1343O8830K79648M00716L23693J53969P576j42050k74148k10025
40900f3295P3886K40613K4669k92293k27281J72055L80166J80155p1568q0917
40890C36190m4275j86725k84609m2076L22910L22885o7821l57003k40754J7212
40880b24066N6983m3273K7343K55818L02373N8838j27544K9277K68942J37764
$$ plain form
40951 239006 -240156 -289163 -35991 121261 117608 172357 298540 261719 58269 62493 494712
40940 494712 985978 950189 294963 -482976 -874456 -795437 -448888 -20501 365795 590798
40930 590798 626329 589239 572105 505946 328837 196046 327768 674568 925217 878056
40920 878056 653403 490451 462041 456010 344518 102561 -189313 -418494 -544250 -620161
40910 -620161 -671504 -602674 -323026 77690 401383 555352 562928 420878 146730 -63295
40900 -63295 10591 251204 275873 -16420 -243701 -71646 308520 488675 417107 336190
40890 336190 291915 105190 -179419 -221495 101415 424300 356479 -524 -241278 -224066
40880 -224066 -167083 -210356 -183013 72805 375178 434016 306472 335749 604691 742455
40870G42455k95970m89070k22797Q1312M3110r4531P4381M08100M54199K07671
40860I08860Q9252K13615K23377o1936l24815k59965q852J21951O0999q8965k33042
40849F40479k63189j25932K07r2004k14425Q680M27602M15667j47929n41991k34064
40838a26899L20835M30553J96626J34268J84183q8033n35436n34099k6977L36898
40828B91919K16486j0950m9775j61767m89253n63465k1620O44904O57889K9297
40818E43665m75702l60350R7178L77826L51104K23208J31273K1285j40938k26706
40808E41843j00977J39454K28839Q7641l2529R6811L09394K53708r1429l75549
40798A057206l52340j34787O5750J91694K42586J71891J3322p9627m5860j0602
$$ plain form
40870 742455 446485 -42585 -265382 -184070 -140960 -235491 -161110 246990 701189 908860
40860 908860 998112 1211727 1435104 1373168 1048353 788388 779536 901487 962486 873521 640479
40849 640479 377290 251358 251565 159561 -54864 -46184 381418 797085 649156 107165 -126899
40838 -126899 193936 624489 821115 955383 1139566 1051533 516097 -18002 -44979 291919
40828 291919 508405 497455 447680 285913 -203340 -766805 -788425 -143521 514368 543665
40818 543665 67963 -292387 -195209 182617 533721 756929 888202 909487 768549 541843
40808 541843 440866 580320 809159 896800 864271 961082 1270476 1524184 1432755 1057206
40798 1057206 704866 570079 635829 827523 1070109 1242000 1255322 1175695 1129835 1119233
40788A119233o9070j39179j24980o4726k4149j640j4963j00531j54128K842K87382
40777G16091L35461Q72l49062k75467J52814M71871M10752J22890j13133j91168
40767A281921j70522j46425j62961j71988r6325J8596J3464j35137k02740j0917
40757B16966K68851L03446M4734k09604k01609J8250K30811K85026J36966j82401
40747I11436n12752n86364k80992J55777K98359L3681k66267j92740J75263L96296
40737A31697K75866P4234M2405O6469k5745r4407N2566K37794J46325j35195k27538
40726E44471o1116N9749O73m5209o631o5096j96674p3527L34982N26875J74115
40715A192612l26102m03825j06101R5920M8652pO5945N3359j78181m78627n58784
$$ plain form
40788 1119233 1050163 910984 786004 721278 697129 695489 680526 579995 425867 428709 716091
40777 716091 1051552 1052424 703362 427895 580709 1052580 1463332 1586222 1473089 1281921
40767 1281921 1111399 964974 802013 630025 533700 552296 565760 430623 227883 216966
40757 216966 485817 789263 833997 624393 422784 441034 671845 956871 1093837 911436
40747 911436 398684 -187680 -468672 -312895 -14536 19145 -247122 -439862 -264599 131697
40737 131697 407563 481797 524202 590671 564926 470519 523085 760879 907204 772009 544471
40726 544471 483355 543104 543777 498568 491937 426841 230167 156640 491622 1018497 1192612
40715 1192612 866510 462685 356584 452504 501156 501149 567094 620453 442272 -36355 -595139
40704e95139k40709L47484P36475N16019q5449l54480m4783K44901l663l95454
40694A25202k70217K10355L42929K2643j75946R096K23761K38251K51608L18222
40684A295904J76746j40005k00013O3754J47381j50378l21308k9394K57729O3375
40674A163791k56543j31410K20844J53745l27196n83520l14683J47477M47210
40665E19715N07240K76717k10814n21103j81658N34673P68720K03688m83346n44721
40655H69111q3936K51669J40810j91578l94055l20997o5412J36075J18296m494
40645D55489R553J43301J38007m2680r9417R2048K01736m7321l72599k88768J87950
40634C77299N45719M36478M1888k19074j37470J36018K54288K5553l13535l12466
$$ plain form
40704 -595139 -835848 -488364 248111 764130 678681 324201 279418 524319 520656 125202
40694 125202 -145015 65340 408269 430912 254966 264062 487823 726074 977682 1295904
40684 1295904 1472650 1332645 1132632 1196386 1343767 1193389 872081 842687 1100416 1163791
40674 1163791 907248 775838 996682 1150427 823231 239711 -74972 72505 519715
40665 519715 1026955 1303672 1092858 571755 390097 924770 1693490 1897178 1413832 869111
40655 869111 785175 1036844 1177654 986076 592021 271024 205612 341687 459983 455489
40645 455489 465042 608343 746350 703670 604253 696301 898037 850716 478117 189349 377299
40634 377299 923018 1359496 1401384 1182310 1044840 1180858 1435146 1460699 1147164 834698
40624H34698Q8514L88830J88429k14037k39695J15351K97125L5997l09231l59898
40614H26083k26230j81250j91431q1290R0031J52040J62769K92452M46776L31952
40604A621902q5232m49049m31977j07449J80144K04525L5886j10948j35046j31577
40594E91179k04823k54323p9637K79287M81267K80798j48752m28638l94284j57607
40584c5533J09277K57102J59289j19366k49775j9012K84196J94200k45438n03701
40574a68761l25399n1454n582J3329K95871O11591M90916k7124l85288k59069
40564A89030O7305J83076R7474J04158K83785L85609J99663j17362k02200M4742
40554A235280K83213J53455k11211l30435n4162K09107R8663j62885j38214J42887
$$ plain form
40624 834698 923212 1312042 1500471 1286434 1046739 1162090 1459215 1495212 1185981 826083
40614 826083 599853 418603 227172 145882 235913 387953 550722 843174 1289950 1621902
40604 1621902 1536670 1087621 655644 548195 728339 932864 968750 857802 722756 591179
40594 591179 386356 132033 52396 331683 812950 1093748 944996 516358 122074 -35533
40584 -35533 73744 330846 490135 370769 120994 101982 386178 580378 334940 -168761
40574 -168761 -494160 -545614 -551196 -537867 -241996 369595 860511 833387 448099 189030
40564 189030 256335 439411 536885 641043 924828 1310437 1510100 1392738 1190538 1235280
40554 1235280 1518493 1671948 1460737 1130302 1076140 1285247 1383910 1221025 1082811 1225698
40544A225698K65891R2864q9617r9535j12264k59643l58759k57718j40850k11080
40534E4987l00097j20400K25260L28740O4466k01676q6416L20585N76105M10984
40524A272538J8840j93308p8417J06833O5185j33590j70280K1640J16463j19895
40514I06009m30765l99765n1315J88404J11129k1798N5061K02985J53941l9146
40504F74740j23650p6980p1295p1020J27193L92989K56236l52743p71877m41512
40494d57919K25315L61603j06536l85419n0010L36245J59986k74926k50904K71043
40484a71522O58878N28429R8693k96813n30627n08489j73063K28903L11986J00873
40474B47248K3543K35783L65516J30419j79703j42058J56368K60503j164l06348
$$ plain form
40544 1225698 1491589 1584453 1494836 1395301 1283037 1023394 664635 406917 266067 54987
40534 54987 -245110 -365510 -140250 188490 252956 51280 -35136 285449 861554 1272538
40524 1272538 1291378 1098070 1019653 1126486 1191671 1058081 887801 909441 1025904 906009
40514 906009 475244 75479 24164 212568 323697 301899 356960 559945 713886 674740
40504 674740 551090 474110 402815 331795 458988 851977 1108213 755470 -16407 -457919
40494 -457919 -232604 128999 22463 -362956 -412966 -76721 83265 -191661 -442565 -171522
40484 -171522 487356 1015785 1114478 817665 287038 -221451 -394514 -165611 146375 247248
40474 247248 270791 506574 872090 1002509 822806 680748 837116 1097619 1096455 790107
40464G90107k72296P5145L11168Q5274m04582n46145q0812M47566L49970k37130
40454E18265n23178j85633K55083L07174J40333O5772j9751k36581k89776K4613
40444E6321L04988J41324j22334R2105N61145N17444j19229n40259k12978M06954
40434A085481N75498J71744l55712n76168l75245M7352L04439J71263j21922j83885
40424G42845r293J12848J63188L62785N64837K82981m79150j003830p85393j94260
40414b42442J43919J82624K38821L28461K27273l5706k10239k13692j23752O4005
40404C59272L34818M75163L25876O2274p1216j11672j76305j76339p7745j35368
40394H08758m24204m66869Q9578P04167N71228j33841m49084o4959L02106J61677
$$ plain form
40464 790107 517811 592956 904124 989398 584816 38671 -42141 405425 755395 518265
40454 518265 -4913 -190546 64537 371711 512044 577816 558065 321484 31708 56321
40444 56321 361309 502633 380299 472404 1033549 1550993 1431764 891505 678527 1085481
40434 1085481 1660979 1832723 1477011 900843 525598 572950 877389 1048652 926730 742845
40424 742845 733552 846400 1009588 1372373 1937210 2220191 1741041 737211 -48182 -242442
40414 -242442 -98523 84101 322922 651383 878656 842950 632711 419019 295267 359272
40404 359272 694090 1169253 1495129 1557403 1486187 1374515 1198210 1021871 944126 808758
40394 808758 384554 -82315 7263 711430 1282658 1148817 699733 634774 936880 1098557
40384A098557j5326K51129N46126K62538l41677n18263j44884K18827K25822O9601
40374A652450k3102p4312j05844o7111n6867k22708m01995k48671K11119N13847
40364A176806L67057J6033j35001j5651J42350J39703k0364j78577j67603K27
40354A324980J13266M3679l8188Q0007K90872L24271J71536L1195r1585l33401
40344A916632n44006l79609Q6272L15915N6930k85531k55488O5820L30768M04466
40334A712169K92606l1306m02724m33394n7554K45911J55374L2840K76404N53540
40324B343866L10119k52707m28542q5789K15727J48098k8306o7509n6081m3409
40314B055467O5487J70510Q1852m021K77354P55624Q91204O40191M20009K39638
$$ plain form
40384 1098557 1083231 1334360 1880486 2143024 1801347 1283084 1138200 1357027 1582849 1652450
40374 1652450 1629348 1555036 1449192 1382081 1325214 1102506 700511 451840 662959 1176806
40364 1176806 1543863 1559896 1424895 1409244 1551594 1691297 1670933 1492356 1324753 1324980
40354 1324980 1438246 1481925 1443737 1523744 1814616 2138887 2310423 2341618 2250033 1916632
40344 1916632 1372626 993017 1079289 1395204 1452134 1166603 911115 976935 1307703 1712169
40334 1712169 2004775 1973469 1570745 1137351 1079797 1325708 1481082 1513922 1790326 2343866
40324 2343866 2653985 2401278 1972736 1886947 2102674 2250772 2222466 2154957 2098876 2055467
40314 2055467 2120954 2291464 2373316 2369295 2646649 3402273 4293477 4933668 5353677 5593315
40304E593315k23018o38794k47480P18545J117384Q57307J299793K831122L547492
40295A4855666J811323j065722k454742j878751q94492j14807J260789K867998
40287A4387262K644329j25442l149199l866355k520185j185818q36134q42171
40279D506287o57481m59876l48257j52546k2498k55769n85929m80714q8928o9702
40269A384587m79825o30697j70967L91841M66394J35162r5718N9987M37623O07161
40259B105548K78127k89366m28906J11063P28803P21145K03880j95473k95371
40250B939450l97802n44762m36253p1863J84457K35313L30317M41951J99165l92072
40240B487901p66676n83649j74201M4855J26322K78984M22729L75591J84770K5541
$$ plain form
40304 5593315 5370297 4731503 4484023 5202568 6319952 7177259 8477052 11308174 14855666
40295 14855666 16666989 15601267 13146525 11267774 10373282 10258475 11519264 14387262
40287 14387262 17031591 16906149 13756950 9890595 7370410 6184592 5348458 4506287
40279 4506287 3848806 3388930 3040673 2888127 2865629 2609860 2023931 1543217 1454289 1384587
40269 1384587 904762 274065 103098 494939 961333 1096495 1000777 1060764 1498387 2105548
40259 2105548 2383675 2094309 1665403 1776466 2505269 3226414 3430294 3234821 2939450
40250 2939450 2541648 1996886 1560633 1488770 1673227 1908540 2238857 2680808 2879973 2487901
40240 2487901 1721225 1137576 963375 1008230 1134552 1413536 1836265 2211856 2396626 2422167
40230B422167L483J65496M15002L89836j56148q04778q30664k27593K06819K4281
40220A607901k68768j04563K74434L42233J59840J13201J71048M3037j79084j56843
40210B002436P4263J81284J20618J19707J54505k3004l48788m43584k04340M1158
40200A674255O4784L8577J75931L87517M54352L38302J90047J53852K16023K13420
40190C907060O7135K3019M09451J025543J128321L62447o09544q79394m79120
40181D954918k22855m52519o03724j78266M40638N29358N0891k75512J25064R69969
40171E337962J379327Q03085l66471j199627j233981q58310o26681n46544l34219
40162B354541m7102J3356j35157j77559k6493J12881J55662J83902J34081j02476
$$ plain form
40230 2422167 2425650 2591146 3006148 3395984 3239836 2435058 1604394 1376801 1583620 1607901
40220 1607901 1339133 1234570 1509004 1851237 2011077 2124278 2295326 2338363 2159279 2002436
40210 2002436 2076699 2257983 2378601 2498308 2652813 2629809 2281021 1837437 1633097 1674255
40200 1674255 1739039 1777616 1953547 2341064 2795416 3133718 3323765 3477617 3693640 3907060
40190 3907060 3974195 3997214 4406665 5432208 6560529 6922976 6313432 5434038 4954918
40181 4954918 4732063 4279544 3675820 3497554 3938192 4467550 4518441 4242929 4367993 5337962
40171 5337962 6717289 7520374 7153903 5954276 4720295 3861985 3235304 2688760 2354541
40162 2354541 2307439 2320795 2185638 2008079 1981586 2094467 2250129 2434031 2568112 2465636
40152B465636l10886j83259J05354R9204j49403j11098L02265N08060J68244k85471
40142B608646l56397j56746k0936M3013J20774O9575j58501k76612j34427j9296
40132A719093j04628o2291L11934N59583K27482l22414m23385j26383k9166k82686
40122A467139m59137l24507r9399L8283J44816K05610J48143J31684L24567M55521
40112B032720J38477l99116n17519j14524K46237K35821J49427K28791K29375
40103B229689m6206l20880k92285q6160M8985J18343J63140M5137k34994l45498
40093A279271q6818K37013K36946j3831j60873q1435Q3840K28391L20773K92120
40083B335397J36882R216J5037L2962q1676k50738k93036j58275Q3701L32406
$$ plain form
40152 2465636 2154750 1971491 2076845 2176049 2026646 1915548 2217813 2725873 2894117 2608646
40142 2608646 2252249 2095503 2074567 2117580 2238354 2307929 2149428 1872816 1738389 1719093
40132 1719093 1614465 1552174 1864108 2423691 2651173 2328759 1905374 1778991 1749825 1467139
40122 1467139 1008002 683495 584096 622379 767195 972805 1120948 1252632 1577199 2032720
40112 2032720 2171197 1772081 1254562 1140038 1386275 1622096 1771523 2000314 2229689
40103 2229689 2183483 1862603 1570318 1484158 1533143 1651486 1814626 1859763 1624769 1279271
40093 1279271 1192453 1429466 1666412 1652581 1491708 1410273 1494113 1722504 2043277 2335397
40083 2335397 2472279 2481495 2496532 2529494 2447818 2197080 1904044 1745769 1829470 2161876
40073B161876M34297K65711n1252k20647j58440p6201r8883r4237r7J5387j03807
40062B073707j38945O558Q6464n7120j79226n0936J25007O1532j31443j77579
40052A618019r5622n5164j392J81430L31890K42495O1301O3143J76357J47483
40042B669940L2349Q1978K40359K05571n4938k68569l03359k49951j02890K05896
40032B456386M59209K95728k18987n62257m13961j6795K23931J96201M2041n2650
40022B408846O4350L83578O07109M10673q6514l68603j39798L24952N39836L30371
40012D474800q2765l60337l41078j70758j27102k24100j22019L69004Q56412P68529
40002E040586J23066m65253n48580k68041L3201K53355M37902N33742M63596L11815
$$ plain form
40073 2161876 2596173 2861884 2810632 2589985 2431545 2355344 2256461 2162224 2162127 2177514 2073707
40062 2073707 1934762 1941320 2027784 1970664 1791438 1740502 1865509 1927041 1795598 1618019
40052 1618019 1522397 1467233 1465841 1647271 1979161 2221656 2282957 2346100 2522457 2669940
40042 2669940 2702289 2784267 3024626 3230197 3175259 2906690 2603331 2353380 2250490 2456386
40032 2456386 2915595 3211323 2992336 2430079 2016118 1999323 2223254 2419455 2461496 2408846
40022 2408846 2473196 2856774 3463883 3874556 3788042 3419439 3279641 3604593 4144429 4474800
40012 4474800 4392035 4031698 3690620 3519862 3392760 3168660 3046641 3415645 4272057 5040586
40002 5040586 5163652 4698399 4149819 3881778 3914979 4168334 4606236 5139978 5603574 5915389
39992E915389K59991L61940M54692L18107l7034k79354j25103J99750J53920l56450
39982F865848p63706o14474j89251m613n3597r064J01991k909k34708j84853J93376
39971E104040M42636K16940l05417o70936n81823j26645K47534J55280j97350
39962D284259k19032J74888L85698J27705o2790J95566L76316l825l90160r0421
39952D778204M42276L35342j77024j75224L34679N09890J73802m4166L7653R457
39942F224889j01444R5621L44892Q6838l16554o2793N41287N10785J1285R3097
39932G427903P15207Q81032O84004J124827J801537J132361p33240j682927r70134
39923A0380570k83832o44039q14407L9541O74859J79574l36275N9137N31011M86100
$$ plain form
39992 5915389 6175380 6537320 6992012 7310119 7273085 6993731 6868628 7068378 7222298 6865848
39982 6865848 6102142 5487668 5298417 5293804 5240207 5231143 5333134 5330225 5095517 4910664 5104040
39971 5104040 5546676 5763616 5458199 4787263 4205440 4078795 4326329 4481609 4284259
39962 4284259 4065227 4240115 4625813 4753518 4690728 4886294 5262610 5258785 4868625 4778204
39952 4778204 5220480 5555822 5378798 5203574 5538253 6048143 6221945 6177779 6215432 6224889
39942 6224889 6123445 6219066 6563958 6650796 6334242 6271449 6812736 7323521 7334806 7427903
39932 7427903 8143110 9024142 9708146 10832973 12634510 13766871 13033631 11350704 10380570
39923 10380570 10096738 9452699 8638292 8677833 9352692 9532266 9195991 9255128 9786139 10272239
39913A0272239P40855J327599Q38145o03674p38219Q80316J737676R34817R57574
39904A6347328K706877L330192J834487J720786M366706N486829K876317J403828
39896D0073350M342135O708934M910004N161628J2048015J7491947J5791130K0775317
39888A27302460M5635296O9071314N0418507j3017195p0355871p5894345m2602639
39881I0557527j6148788j3500725j4961276o821898L27181k426983o072049k514797
39873B8438192J196131j875931n418566k714641R34105p08700k963602j03226
39865A6783762L207205J069405k169960l84293K706848J346144o33224K498059
39857B4423946O302516M051105j3977J645777N257675L273140O17515O669915
$$ plain form
39913 10272239 11013094 12340693 13178838 12575164 11836945 12717261 14454937 15389754 16347328
39904 16347328 19054205 22384397 24218884 25939670 30306376 35793205 38669522 40073350
39896 40073350 44415485 51124419 56034423 61196051 73244066 90736013 106527143 127302460
39888 127302460 172937756 242009070 292427577 279410382 209054511 133160166 90557527
39881 90557527 74408739 60908014 45946738 39124840 39452021 37025038 30952989 28438192
39873 28438192 29634323 27758392 22339826 19625185 20559290 19850590 16886988 16783762
39865 16783762 19990967 21060372 18890412 18506119 21212967 22559111 21925887 24423946
39857 24423946 30726462 34777567 34763590 36409367 41667042 44940182 45557697 52227612
39849E2227612J5820080J6046099J4580936L0376568N6337984N5536467J0116761
39842B51042507m6604862o7359818m7010511k0081670j1220980j2466779q700977
39835C7596910j573527K52003k212920k840785j951131l296703n453889m546039
39827A5973919j689121q57347k007380k064972p44150l37689j079565j101414
39819F092281j68147K23544j13004k7126M36365J87434o10732p54819j70321J92944
39809E288419K34526N58478Q72731L87007n24323p81890m14784k97537m21442
39800D901185p4812N19499M06409l71126p88719n40717k77487j96157J48108O02068
39790D328251M45536j91288l32347J97237M66403Q1864j72947K19772O39890M57533
$$ plain form
39849 52227612 68047692 84093791 98674727 129051295 185389279 240925746 251042507
39842 251042507 204437645 137077827 90067316 69985646 58764666 46297887 37596910
39835 37596910 36023383 36275386 34062466 31221681 29270550 25973847 20519958 15973919
39827 15973919 14284798 13427451 11420071 9355099 8610949 8273260 7193695 6092281
39819 6092281 5924134 6147678 6034674 6007548 6443913 6631347 6020615 5265796 5095475 5288419
39809 5288419 5522945 6081423 6954154 7341161 6816838 6034948 5620164 5322627 4901185
39800 4901185 4826373 5345872 5752281 5381155 4592436 4051719 3774232 3578075 3726183 4328251
39790 4328251 4773787 4582499 4250152 4447389 4913792 4995656 4822709 5042481 5682371 6139904
39780F139904r55j92935j75774j41356N8525M02907M49146O4795k60788k23312
39770F120157j17102j08413R4384M56496L93873j52074l16975L70205J137185
39761G877736J162819P64806N53236K94191k75362l10262R90459K515836K168749
39752A5742208k24971k387762k416232r38682J61710J43547l32550o12848o80411
39743H454009o09291k80692K33183N57194M69414J49205j45184l77602n75811
39734G874425o04063l33757L9637J11955k14382n25177l83632R9596M28137L87516
39724F880255K40167K28064K37561J10977l6925n4570l9253j12631j36603L8513
39714G355555K21011J10252k17861l68544j28656L37549P60011J036872J260439
$$ plain form
39780 6139904 6138949 5946014 5770240 5628884 5687409 6090316 6539462 6604257 6343469 6120157
39770 6120157 6003055 5894642 5989026 6445522 6839395 6687321 6370346 6740551 7877736
39761 7877736 9040555 9805361 10358597 10652788 10377426 10067164 11057623 13573459 15742208
39752 15742208 15517237 13129475 10713243 9774561 9936271 10079818 9747268 9134420 8454009
39743 8454009 7844718 7564026 7797209 8354403 8823817 8973022 8827838 8450236 7874425
39734 7874425 7270362 6936605 6976242 7088197 6873815 6348638 5965006 6064602 6492739 6880255
39724 6880255 7120422 7348486 7586047 7697024 7660099 7605529 7566276 7453645 7317042 7355555
39714 7355555 7576566 7686818 7468957 7100413 6971757 7309306 8069317 9106189 10366628
39705A0366628J554329J783912J455854K49146j273049j982511j507880p37929
39697I908500n85678p89114n73905j4194J66167j01599j23799L48684P74755Q83255
39687I893072J144571J765687K027031J249005j12782r63121q34500j43578N40225
39678A4565610R40945R20674L97998m54572j170898j295243p63104o304M35947
39669A3571053N25460P19758J136467J144637L57163l82354M2630J269661J908466
39660B0292941J865426K663736M687532N652507L373116q75768l598206l358894
39652C0702390j992316j428236j251728k60603J175809J778614J491724J409798
39644C1625452J884489K120310J742210J479007J830885K110766J549371N92961
$$ plain form
39705 10366628 11920957 13704869 15160723 15409869 14136820 12154309 10646429 9908500
39697 9908500 9322822 8533708 7959803 7945609 8111776 8010177 7886378 8235062 9009817 9893072
39687 9893072 11037643 12803330 14830361 16079366 15966584 15003463 14168963 14025385 14565610
39678 14565610 15506555 16427229 16825227 16370655 15199757 13904514 13141410 13135106 13571053
39669 13571053 14096513 14816271 15952738 17097375 17454538 17072184 17114814 18384475 20292941
39660 20292941 22158367 24822103 29509635 35162142 38535258 37659490 34061284 30702390
39652 30702390 28710074 27281838 26030110 25769507 26945316 28723930 30215654 31625452
39644 31625452 33509941 35630251 37372461 38851468 40682353 42793119 44342490 44935451
39636D4935451J83479K09484k77977j416167k167914j867967j194921j061695
39628C7341773j284698j103510n08034j61772k34434k09375J18716K70230o5991
39619C4162905m58266l46315K24839P90951J049894J009508Q24535O66994N48217
39610C8473262K22907m70730j231339j629597j726625j845934j829867j247365
39602B8714712m01684k81565j181548k132757k174119j543859j089976j075707
39594A8833497j157930j095066q92853n80714l13107l59807o23838n91417j11100
39585A3107665L02911L15303K62292L31505K9525q42822j457063j100935l92622
39576A0555759l24939o67704m93156J33019K84197k00323n20147l44393k01615
$$ plain form
39636 44935451 45118930 45328414 45050437 43634270 41466356 39598389 38403468 37341773
39628 37341773 36057075 34953565 34445531 34283759 34049325 33839950 33958666 34228896 34162905
39619 34162905 33704639 33358324 33583163 34374114 35424008 36433516 37258051 37925045 38473262
39610 38473262 38696169 38225439 36994100 35364503 33637878 31791944 29962077 28714712
39602 28714712 28313028 28031463 26849915 24717158 22543039 20999180 19909204 18833497
39594 18833497 17675567 16580501 15687648 15106934 14793827 14434020 13810182 13218765 13107665
39585 13107665 13410576 13725879 13988171 14319676 14349201 13506379 12049316 10948381 10555759
39576 10555759 10230820 9563116 9069960 9202979 9487176 9286853 8766706 8422313 8220698
39567H220698l12764k17913J81313L11504J623j46772J44944L22849M2783j70528
39557H377737J51008O05188O11244K88179R8093J32824K29400L38809L94236K56959
39547A1483677R0724K91974P82424R40711N39261J51858K78682O57053Q34801
39538A6051165Q62681R82330J116648J076701Q49741M00607l05422q57069o44559
39529A9532823J22496L87096l02432j046030q81928j39444J89085j52480o60676
39520A7048510r86241j119014j002963o62357m46995n62342o44620l41917L5219
39511A1317280J3254k61214l41873k33441j98738j57338P7367K87721K40022K49592
39501A0992632O44632R88420O45884r9642l50415Q0333M71314L27702n3461k37464
$$ plain form
39567 8220698 7907934 7690021 7871334 8182838 8184461 8037689 8182633 8505482 8548265 8377737
39557 8377737 8528745 9133933 9745177 10033356 10131449 10264273 10493673 10832482 11226718 11483677
39547 11483677 11574401 11866375 12648799 13589510 14128771 14280629 14559311 15216364 16051165
39538 16051165 16913846 17896176 19012824 20089525 20939266 21339873 21034451 20177382 19532823
39529 19532823 19655319 20042415 19739983 18693953 17812025 17672581 17861666 17709186 17048510
39520 17048510 16062269 14943255 13940292 13277935 12830940 12268598 11623978 11282061 11317280
39511 11317280 11330534 11069320 10727447 10494006 10295268 10137930 10215297 10503018 10743040 10992632
39501 10992632 11637264 12625684 13271568 13171926 12821511 12901844 13373158 13700860 13647399 13409935
39491A3409935j85030R255L24588N94952N50956K18044q0295j56572r2153p776
39481A4585904k0627k82813p15236r12741o93926m61162n67135o83653l85911
39472I862700p22j25428n60535n57369j6221L91467K88605m386j84881l44576
39462H748654n15513m96003k61163j1846K10577M44102M48889L9971l73736k78989
39452G954943R4560K08863K58714P62545J272624P51167o48456j478544j040282
39443H136134k92065j98499l88636j85634J49153J35899J27267O09996J134570
39434I228185R48955J95149m35353p72815j013154r53772l45068L33741M02427
39425G588295M4403n5369J00181l6828l67976j52169P05085J321643J053931K63416
$$ plain form
39491 13409935 13224905 13234160 13558748 14153700 14704656 14922700 14842405 14685833 14593680 14585904
39481 14585904 14565277 14282464 13567228 12654487 11960561 11499399 10932264 10248611 9862700
39472 9862700 9861978 9736550 9176015 8618646 8602425 8993892 9282497 9278111 9093230 8748654
39462 8748654 8233141 7737138 7475975 7464129 7674706 8118808 8567697 8607668 8233932 7954943
39452 7954943 8049503 8258366 8517080 9279625 10552249 11303416 10654960 9176416 8136134
39443 8136134 7844069 7645570 7256934 7071300 7220453 7356352 7483619 8093615 9228185
39434 9228185 10177140 10372289 9936936 9164121 8150967 7197195 6852127 7185868 7588295
39425 7588295 7632698 7577329 7677510 7640682 7272706 7120537 7825622 9147265 10201196 10464612
39415A0464612m01983p87068r69129q49956m14527N9701L97202P27014R91840
39406I217706P06043l52177j523753j858187j215001l47810Q7294J79171K92505
39397E185791L62118O1899m64053n61281L6225O71608N52346j63218o01049m05278
39387D675108j06947j63822l08031j72940L9708J2505n3011J55703L78661J57704
39377D614638l26857m53155r4772K60706L05575K23400J63961J225k38745k47825
39367D208151L2401J93355m8815l91063l63331L8800M11161M63807K65105P6585
39357D886156J09101L59214N82338N09843J46743k48013m89980o18421o87018
39348D549963o10039l32407l135J68066J57200J12486J26881J27204J7343j33375
$$ plain form
39415 10464612 10062629 9275561 8306432 7456476 7041949 7101650 7498852 8225866 9217706
39406 9217706 9923749 9571572 8047819 6189632 4974631 4626821 4714115 4893286 5185791
39397 5185791 5547909 5609808 5145755 4584474 4620699 5292307 5844653 5681435 5080386 4675108
39387 4675108 4568161 4404339 4096308 3923368 3963076 3975581 3922570 4078273 4456934 4614638
39377 4614638 4287781 3834626 3739854 4000560 4306135 4529535 4693496 4694721 4455976 4208151
39367 4208151 4240552 4433907 4385092 3994029 3630698 3669498 4080659 4544466 4809571 4886156
39357 4886156 4995257 5354471 5936809 6446652 6593395 6345382 5855402 5236981 4549963
39348 4549963 3939924 3607517 3604382 3772448 3929648 4042134 4169015 4296219 4313562 4180187
39338D180187j44719m61N6727j44794l76830k69534J20911L30332J51442p7315
39328C825946k3884J62375K09680K20298M19707O53125N63539J43048k65077m07509
39318E501248k54586J30010N12197N04772P6690j93568J26347N56413L23794m29145
39308F854172q09717n02350j12668q5033j27550J5060M8864j68459j60168L64084
39298E316235Q49948O82177J35877j09821l715J3607j27417q9080K22807N76544
39288G467162Q52033J053281J058713Q30207O41046O56364O48375O10562J093805
39279A4911548K245680L239869L687019M735136P041760Q268914N179379j297048
39271D8012257n752597m645381q99104O469k936943n812780n644474l713200k588960
$$ plain form
39338 4180187 4035468 4035007 4091734 3946940 3570110 3300576 3421487 3751819 3903261 3825946
39328 3825946 3802062 3964437 4174117 4394415 4814122 5467247 6030786 6173834 5908757 5501248
39318 5501248 5246662 5376672 5888869 6393641 6470331 6276763 6403110 6959523 7283317 6854172
39308 6854172 6044455 5542105 5429437 5344404 5216854 5231914 5280778 5112319 4952151 5316235
39298 5316235 6166183 6848360 6984237 6874416 6870701 6884308 6756891 6667811 6890618 7467162
39288 7467162 8319195 9372476 10431189 11261396 11902442 12558806 13207181 13817743 14911548
39279 14911548 17157228 20397097 24084116 28819252 35861012 44129926 49309305 48012257
39271 48012257 42259660 37614279 36715175 36721644 33784701 27971921 22327447 18614247 16025287
39262A6025287k528123k225573j375100p67961o96267o94153n22576l91916l97075
39253F426543m33867m76427m52436j56168L09056M32445N9006k53574j09540N7566
39243E402604k35086o37095n58928j65477j5365j01320l6327J26288O8861m5338
39233C802817J72118N00027L47740k43939o09410m47379j05740J03297K03129
39224C722660J80759l4865k15476n1933K92523M14005L61048M86010P19636O65421
39214F539788L38190J32827J26790Q6641R4172N00143J334738K339169L305755
39205A4798213L730992K662616m9237k759456l571887k665616j768349j554079
39197H823197j175573l43231K4724l48477m07807L58412R91021Q33730O40583
$$ plain form
39262 16025287 13497164 11271591 9896491 9128530 8432263 7738110 7215534 6823618 6426543
39253 6426543 5992676 5516249 5063813 4907645 5216701 5649146 5708152 5454578 5345038 5402604
39243 5402604 5167518 4530423 3971495 3806018 3790653 3689333 3653006 3779294 3848155 3802817
39233 3802817 3974935 4474962 4822702 4578763 3969353 3521974 3416234 3519531 3722660
39224 3722660 3903419 3868554 3653078 3601145 3893668 4307673 4668721 5154731 5874367 6539788
39214 6539788 6877978 7010805 7137595 7224236 7318408 7818551 9153289 11492458 14798213
39205 14798213 18529205 21191821 21142584 18383128 14811241 12145625 10377276 8823197
39197 8823197 7647624 7304393 7329117 6980640 6572833 6931245 7922266 8755996 9396579
39188I396579R27561P77829m77945j762967j798284r92095m50750k02037J94777
39179E612668L18313k85551q16812l47937M84935M79966j02943j30597L49623
39170E561665L44448j58771j76794N17522J142918J294562J192903P27576l33030
39161A0112999j323358j289904n36402k15319n03076n55413j48442Q1075j4601
39152E607559P0990L15594J86629j84139j84034K1326k08870o00102l55330K63499
39142D933122L36327L8951K69939P81345O10664J38380N36536J341520J070121
39133A0056905K36463Q80595K767300L269106J871051J316661K698326K911626
39125B6008033m89770m873461o060191m053185k003185j180584m27570M67291
$$ plain form
39188 9396579 10324140 11101969 10624024 8861057 7062773 6070678 5619928 5417891 5612668
39179 5612668 5930981 5645430 4828618 4480681 4965616 5445582 5342639 5212042 5561665
39170 5561665 5906113 5747342 5570548 6088070 7230988 8525550 9718453 10446029 10112999
39161 10112999 8789641 7499737 6963335 6748016 6244940 5689527 5541085 5622160 5607559
39152 5607559 5678549 5994143 6180772 5996633 5812599 5833925 5625055 5024953 4669623 4933122
39142 4933122 5269449 5308400 5578339 6359684 6970348 7108728 7645264 8986784 10056905
39133 10056905 10293368 11173963 13941263 17210369 19081420 20398081 23096407 26008033
39125 26008033 25518263 20644802 14584611 10531426 8528241 7347657 6920087 7387378
39117G387378L53235o14223r04261k68773L2703l04166k40472M58893Q06380M36372
39107G143066J2812j76569l12726j0400J038608J905832J868707K211154M089412
39098A7769896N403223L045007j923926m890276l904381j720778q40627l46813
39090A2591325Q48556J571543J580107L377049P414140Q748734L026021o121330
39082C3036145j0508165p625324k861608j324754k045398j758971l57093J85156
39074F739988l08910m26783K7718n147o40274q62782l55758J12082J10103M5508
39064D435745J70349J81977m0512j89233j72091k60175m50126l51773J15982N01977
39054C942120M78971K23841r279k13043l65929l18259j23614m8440q8566N1689
$$ plain form
39117 7387378 7740613 7126390 6222129 5953356 5986059 5681893 5441421 5900314 6706694 7143066
39107 7143066 7155878 6979309 6666583 6656183 7694791 9600623 11469330 13680484 17769896
39098 17769896 23173119 26218126 24294200 19403924 15499543 13778765 12938138 12591325
39090 12591325 13439881 15011424 16591531 19968580 27382720 36131454 39157475 33036145
39082 33036145 22527980 14902656 12041048 10716294 8670896 6911925 6554832 6739988
39074 6739988 6431078 6004295 6032013 6026866 5386592 4523810 4168052 4280134 4390237 4435745
39064 4435745 4606094 4788071 4747559 4558326 4386235 4126060 3675934 3324161 3440143 3942120
39054 3942120 4421091 4644932 4635653 4422610 4056681 3738422 3614808 3566368 3477802 3529491
39044C529491L27184K73989j39511k14326M20242J019996P02668k01126o00545
39035E118062k17014J94367J54813M8340J97071K47631p3184l14410K754N54124
39025E912554O75564L05130r6235k94261l94330l85434j29646K41202M04130L53899
39015F592573M28460P36972R00720N42026j66476o51280o07375l44233l38846
39006G092541n55242n18366j12195J55571j5820j31436K80452P13635L95159l50042
38996F954257n06643m5625L2475n11244o63731M9247O11490J68008n55606n15457
38986E017171j5720O6219j36008K5363L13055R8976k45355R5366P73535P30774
38976F723376Q2414j0225O37446R83847Q21555J359724K953819L762729J983729
$$ plain form
39044 3529491 3856675 4130664 3991153 3776827 4197069 5217065 5919733 5718607 5118062
39035 5118062 4901048 5095415 5250228 5298568 5495639 5743270 5670086 5355676 5358430 5912554
39025 5912554 6588118 6893248 6797013 6502752 6108422 5722988 5593342 5834544 6238674 6592573
39015 6592573 7021033 7758005 8658725 9200751 9034275 8382995 7775620 7431387 7092541
39006 7092541 6537299 6018933 5906738 6062309 6046489 5915053 6195505 6909140 7304299 6954257
38996 6954257 6447614 6401989 6434464 5923220 5259489 5308736 5920226 6088234 5532628 5017171
38986 5017171 5001451 5067670 4931662 4957025 5270080 5369056 5123701 5219067 5992602 6723376
38976 6723376 6805790 6795565 7433011 8416858 9238413 10598137 13551956 17314685 19298414
38967A9298414j432605l655632l267362j562544n54311o71423q72655m26211K02116
38958G057787K75886m7845j5245N29581R22174O70832J6603o25562j099421j200817
38948F483973p16939m1176R8755j69508N2211P83148Q55564j06944p96746k53984
38938F188354O12062P04881N06776P60238Q66931K74371m0975O18906J007614
38929A1499158L03608K69480K186532L733552K891717K992597Q186805J4451536
38921D6514985J2070846q47179j3639415j5748373r127269l313807k340465k601649
38913A0967674j292412j54556o58176j125718k67258M48422k58905j175042r33791
38904E550238k97266m72831j005785q67459k41105J00246J23815J66473J29261
$$ plain form
38967 19298414 17865809 14210177 10942815 9380271 8825960 8154537 7281882 6855671 7057787
38958 7057787 7333673 7285828 7270583 7800164 8722338 9393170 9409773 8784211 7684790 6483973
38948 6483973 5767034 5725858 5824613 5655105 5707316 6490464 7346028 7239084 6442338 6188354
38938 6188354 6800416 7505297 8012073 8772311 9639242 9913613 9872638 10491544 11499158
38929 11499158 11802766 12072246 14258778 17992330 20884047 23876644 32063449 46514985
38921 46514985 58585831 57738652 44099237 28350864 19223595 15909788 13569323 10967674
38913 10967674 9675262 9520706 8862530 7736812 7469554 7917976 7659071 6484029 5550238
38904 5550238 5252972 4780141 3774356 2906897 2665792 2766038 2889853 3056326 3185587
38895C185587o9103j7765M47138P17375K96455l68399n17511q9655L57246L90716
38885D332084M7692l11581l33690l9200J86211J43240Q8748J85576J34002k07622
38875D225460l54328N3771N36009M96884J80293J51855L11684K36943N5699J25304
38865F019574K49843O5247j95713j48116l2237k22133m28950k37305O2020J9345
38855E151575j42201q0130p1870l21225k82123L41598P46614K82158l06787r0804
38845E226805M81490N35261L46822N37079O49521J15065k98350L08822J210969
38836I113484J236417P80524Q91997J376208J573045J758019J941999J018053
38828A9689746p27730n79910K258057M226771L497418N064878J3062221K0217828
$$ plain form
38895 3185587 3116484 3098719 3545857 4263232 4559687 4191288 3673777 3584122 3941368 4332084
38885 4332084 4379776 4068195 3734505 3695305 3881516 4024756 4113504 4299080 4433082 4225460
38875 4225460 3871132 3924903 4460912 4957796 5138089 5289944 5601628 5838571 5894270 6019574
38865 6019574 6269417 6334664 6138951 5990835 5958598 5736465 5307515 5070210 5132230 5151575
38855 5151575 5009374 4929244 4857374 4536149 4254026 4595624 5342238 5624396 5317609 5226805
38845 5226805 5708295 6243556 6590378 7127457 7776978 7892043 7593693 7902515 9113484
38836 9113484 10349901 11130425 12022422 13398630 14971675 16729694 18671693 19689746
38828 19689746 18962016 18382106 20640163 24866934 28364352 33429230 46491451 66709279
38820F6709279J4143732m678472k0245913k0256099j0266070l404225l043013
38813A8959219l182731r50555M59104l61158n98769P28703Q47227j287748k837866
38804A1775426j990690o58365o64899j005151n59428k60802q40460j168720m60622
38795D166289K01316n5655m07157j23754J58985L4077K08973P99131P49110j5182
38785E716133O9004J498091K359483J129289r62464j881412j546791j102173q23766
38776D455394l80735q1052k97455m91358j44096J55392k12925n93522j22744O66820
38766B953719O62313j2563l28762m5181K21416L04669O04142J015756R15759K92925
38756F584193q0364K01345O59321Q53227J171110K187942L469806L560313J509005
$$ plain form
38820 66709279 80853011 76174539 55928626 35672527 25406457 22002232 18959219
38813 18959219 15776488 14825933 15285037 14923879 14325110 15053813 15901040 14613292 11775426
38804 11775426 9784736 9126371 8461472 7456321 6896893 6636091 5795631 4626911 4166289
38795 4166289 4367605 4311950 3904793 3781039 3940024 3974101 4183074 4982205 5731315 5716133
38785 5716133 5785137 7283228 9642711 10772000 9809536 7928124 6381333 5279160 4455394
38776 4455394 4074659 3993607 3696152 3204794 3060698 3216090 3003165 2409643 2286899 2953719
38766 2953719 3616032 3603469 3274707 3229526 3450942 3755611 4359753 5375509 6291268 6584193
38756 6584193 6503829 6705174 7364495 8217722 9388832 11576774 15046580 18606893 20115898
38747B0115898j679813l667150l213575j538965o54342q17382o54651M30897J323617
38738I644534R61315j77247r78019j158815j125084j068339r28516p83964p02024
38729C683841n52134l28249k50408l13211k42602o1529o3114j01704K71032P89144
38719B831066N93674k89820p00732j20510M34204P4335n04600k68251L89938L80247
38709B819551k37317m50920K9240N38480P18953Q51624R47709N76808k41145q39719
38699D713264q14626m64358j82492j3382N1864j10302m55507o81575n79967k25372
38689A237547J72488L71010J82907k55864m94042l41671j69863k68342k61758
38680A72412K78945R34934Q62192L1414o56489n79174j06325Q6292q9231k17206
$$ plain form
38747 20115898 18436085 14768935 11555360 10016395 9362053 8544671 7890020 8320917 9644534
38738 9644534 10605849 10428602 9450583 8291768 7166684 6098345 5169829 4385865 3683841
38729 3683841 3131707 2803458 2553050 2239839 1997237 1935708 1872594 1770890 2041922 2831066
38719 2831066 3424740 3134920 2434188 2313678 2747882 2822217 2317617 2049366 2439304 2819551
38709 2819551 2582234 2131314 2160554 2699034 3417987 4269611 5217320 5794128 5552983 4713264
38699 4713264 3898638 3434280 3251788 3238406 3290270 3179968 2724461 2042886 1462919 1237547
38689 1237547 1410035 1781045 1963952 1708088 1214046 872375 702512 434170 172412
38680 172412 451357 1386291 2248483 2279897 1623408 1044234 937909 1024201 934970 717764
38670G17764l9888K61239L40408Q8845k30982k68109j9345J58219N4008r3706
38660I68453J6311K77427L54056J78114j3027m7784J8864P7686J12356J78490
38650B120946L06183L81697J78478l13863o75769n03109l4263R7456k24754m42254
38640H90748j99484J70142K68518J92329J51952O0169j17148r9084J93330L28807
38630A840279L7856k55369p6060L41394M65417K60720L7022j29389k78555k33379
38620B009936N4804J88691p3489k98162r0207J20707k11551o61778m03019L85876
38610A021808P16861L38468M4463L14235O42221N27503K45421J87249J51746j86021
38600D003954o25931p58316n61286k89071p5350K7048q8852l62423m57240j64178
$$ plain form
38670 717764 677876 939115 1279523 1368368 1137386 869277 849932 1008151 1062159 968453
38660 968453 984764 1262191 1616247 1794361 1781334 1733550 1752414 1830100 1942456 2120946
38650 2120946 2427129 2808826 2987304 2673441 1997672 1494563 1460300 1557756 1333002 890748
38640 890748 691264 861406 1129924 1322253 1474205 1534374 1417226 1318142 1511472 1840279
38630 1840279 1878135 1622766 1546706 1888100 2353517 2614237 2651259 2521870 2243315 2009936
38620 2009936 2064740 2253431 2179942 1881780 1791573 1912280 1700729 1038951 635932 1021808
38610 1021808 1738669 2077137 2121600 2435835 3078056 3605559 3850980 4038229 4189975 4003954
38600 4003954 3378023 2619707 2058421 1769350 1694000 1721048 1632196 1269773 812533 648355
38590F48355K73471M57692K88748l4596k73145k69039j7151K46622K21817p0334
38580A472440k69731j57510N2883M7195j44721k16015j3995K46356K27954j02066
38570A142790l66703k22336J36324J86530j49726l35490n3307K24267n5742o03089
38560i6482o81806k28591J17236O1564J2762K51294M21451J73290k17463k68379
38550d55124L4652L47882M76582M33873K22777j02563l14229k54377r6428j03152
38540A89893k23639j95303K2692K00452K15216J92890J96799N4597l03639n48380
38530a98422l21003J72148L38579N8587q5650K71492N80053J45378o99543r38550
38520f76931l33882K68981K66565J00212L23237O19683M00328j61129m12821k14096
$$ plain form
38590 648355 921826 1379518 1668266 1633670 1360525 1091486 1074335 1320957 1542774 1472440
38580 1472440 1202709 1045199 1098082 1145277 1000556 784541 770546 1016902 1244856 1142790
38570 1142790 776087 553751 690075 876605 726879 391389 338082 562349 506607 -96482
38560 -96482 -778288 -1006879 -889643 -828079 -815317 -564023 -142572 30718 -186745 -455124
38550 -455124 -420472 -72590 403992 837865 1060642 958079 643850 389473 293045 189893
38540 189893 -33746 -229049 -206357 -5905 209311 402201 599000 653597 349958 -198422
38530 -198422 -519425 -347277 -8698 49889 -35761 235731 815784 961162 261619 -676931
38520 -676931 -1010813 -741832 -475267 -375055 -51818 567865 968193 807064 394243 180147
38510A80147L7171J34565J79736J35889j15508l62217k65359P6767K52741J46469
38500D00401k9399j80055l29425l14531J789L24653K61000l6481r1721J22471
38490A28702J98995K5137q3903J8812J28574J30289J29970J34556N5469q836N7110
38479I14875N1813k01948l62114l9080M06450K94935k19740k78790L26107P84468
38469A676976M87265j58427m60343l28375q1530Q1238Q7048q7001k56379j95049
38459G65423n6310j55756l26311j14777L40662L79609q9423l61568m9644L62769
38449F94674M04946K74736K24700P1724k14914j93807K33707M03519r7266o50523
38439A151496n22839J5702K17238J8005q1161O6980J83774J55127O4940j29042
$$ plain form
38510 180147 217318 351883 531619 667508 552000 189783 -75576 1191 253932 400401
38500 400401 371002 190947 -138478 -453009 -451220 -126567 134433 97952 6231 128702
38490 128702 327697 352834 268931 287743 416317 546606 676576 811132 866601 857765 914875
38479 914875 966688 764740 402626 363546 769996 1064931 845191 566401 892508 1676976
38469 1676976 2164241 2005814 1545471 1217096 1135566 1216804 1303852 1216851 960472 765423
38459 765423 709113 553357 227046 112269 452931 832540 743117 381549 331905 694674
38449 694674 1099620 1374356 1599056 1670780 1455866 1262059 1495766 1899285 1802019 1151496
38439 1151496 628657 644359 861597 879602 798441 865421 1049195 1204322 1269262 1140220
38429A140220m03839m24079j5408M07760M10995K05691J94278K23530n0809l81313
38419A307026k58908J82334L44426J37708L9194K15823L12135J71219Q3509J58661
38409B693127O0570l76221p50072o20586j19477K34778J47764k09836m57092l84869
38399B18086j29843J9111l510K1837K26464M17716L61641J04087j70433l99654
38389F65502n50672m65534o8967L89007N36151K68495j85887m87455m04962Q80
38379c03442L47526L02407K4494l6580K10208M15993L77145K36294M0200l38644
38369A275601o94848n39493Q6300M94417L72046K26045L84923L35576k94998q23202
38359H22367m55129L73217N79810N1418l16924q0834K21780R6897j89158j89447
$$ plain form
38429 1140220 736381 312302 296894 704654 1115649 1321340 1515618 1739148 1688339 1307026
38419 1307026 1048118 1230452 1574878 1712586 1751780 1967603 2279738 2450957 2534466 2693127
38409 2693127 2753697 2377476 1627404 1006818 887341 1122119 1269883 1060047 602955 218086
38399 218086 88243 107354 103844 125681 352145 769861 1131502 1235589 1065156 665502
38389 665502 114830 -350704 -419671 -30664 505487 773982 588095 100640 -304322 -303442
38379 -303442 44084 346491 370985 334405 544613 960606 1337751 1574045 1614245 1275601
38369 1275601 580753 41260 127560 621977 994023 1220068 1604991 1940567 1645569 822367
38359 822367 367238 740455 1320265 1371683 1054759 973925 1195705 1292602 1103444 913997
38349I13997M7451J96865J55623O7722Q9867K63758M64140M57612J47446k99382
38339B505099o62861q45160p57447l28267K21355M55863K83927Q3925Q0935M1547
38329A078916j74612k81076j09832M3879j041M9566L24197L95310M9750j74890
38319A200167J48961N33993L50576j20272j77327J89631M39172L63747J38180
38310C066828j47848l55387j10772O02073J115267R60477N51504L80536K02108
38301F264786k82390o63554n25755j46862K41641R35324J740086J811516J532605
38292A0907397K760768N459516O012049J678844m570283p037594m607322j586268
38284I017107j165380j789116j063548L02974N18097k4482J21231Q22808J011679
$$ plain form
38349 913997 961448 1158313 1313936 1381658 1471525 1735283 2199423 2657035 2804481 2505099
38339 2505099 1842238 997078 239631 -88636 132719 588582 872509 956434 1037369 1078916
38329 1078916 904304 623228 513396 557275 556234 605800 929997 1325307 1375057 1200167
38319 1200167 1349128 1883121 2233697 2113425 1936098 2125729 2564901 2928648 3066828
38310 3066828 2918980 2563593 2452821 3054894 4170161 5130638 5682142 6062678 6264786
38301 6264786 5982396 5318842 4793087 4646225 4887866 5823190 7563276 9374792 10907397
38292 10907397 13668165 19127681 25139730 26818574 22248291 15210697 10603375 9017107
38284 9017107 7851727 6062611 4999063 5302037 5820134 5795652 5916883 6739691 7751370
38275G751370O63185L30154j70252j010915j376421p07599J12156J68706K4557
38266E784941N03101J150871J277785J279533J502137J225081M51076J073443
38258A4247968L926014O012561L639698k169588o310795n806933k757609n93282
38250A0188034L0952M08854R27896Q36035p5884j033739j310186r28306m70204
38241H573452n10850j036050j369668r99811l35289j27344l23030j82738N26582
38232D215254J154216J033527J84238q52724j444989j247712n53909o8264k6745
38223B392892M1239L52916L73744j66839n57627j99800L37934K97261N0940L93510
38213C316170J141922J520196J354860Q80194P2735p74030p23627L51275J065152
$$ plain form
38275 7751370 8414555 8744709 8574457 7563542 6187121 5479522 5591678 5760384 5784941
38266 5784941 6288042 7438913 8716698 9996231 11498368 12723449 13174525 14247968
38258 14247968 18173982 24186543 27826241 25656653 19345858 13538925 10781316 10188034
38250 10188034 10218986 10627840 11555736 12391771 12315887 11282148 9971962 9043656 8573452
38241 8573452 8062602 7026552 5656884 4657073 4321784 4194440 3871410 3688672 4215254
38232 4215254 5369470 6402997 6587235 5734511 4289522 3041810 2487901 2419637 2392892
38223 2392892 2434131 2787047 3160791 2993952 2436325 2236525 2574459 2871720 2922660 3316170
38213 3316170 4458092 5978288 7333148 8213342 8286077 7512047 6788420 7139695 8204847
38204H204847O46078M18278J429245K319446K090263L103570P389977J1047195
38196C6648899P466853l016193j1618317j1519640n727784j651024j481441j948851
38188G152502j041589j60844l08994m01262J33435K47343m82508r57653o19921
38179C560509l48634o16330n98164J26317O21325J95867m11692l30892P8636M9332
38169B326274k74892j99711M01804J006651J111303N81896k96726q86626p28368
38160C041605j52942Q9509j40044k81052p0440O2099k01369n20745m73566j58992
38150A194063R2796K09780L05685M36355O06240P33838N51042j06589q67482j091363
38140B064365o51737p5961J46281O768k88107n75706o50111l58041R1865K86609
$$ plain form
38204 8204847 8850925 9269203 10698448 13017894 15108157 18211727 25601704 36648899
38196 36648899 44115752 41099559 29481242 17961602 12233818 10582794 9101353 7152502
38188 7152502 6110913 5950069 5641075 5239813 5373248 5620591 5138083 4180430 3560509
38179 3560509 3211875 2595545 1997381 2123698 2745023 2940890 2529198 2198306 2276942 2326274
38169 2326274 2051382 1851671 2253475 3260126 4371429 4953325 4656599 3769973 3041605
38160 3041605 2888663 2978172 2838128 2557076 2486636 2548735 2347366 1826621 1353055 1194063
38150 1194063 1286859 1496639 1802324 2238679 2844919 3578757 4129799 4023210 3155728 2064365
38140 2064365 1412628 1336667 1482948 1489716 1201609 625903 -24208 -382249 -290384 -3775
38130c775J60996L5706P5084J22544J18505K17179L82383L26611P666k37943k21521
38119I83435j44672j33987K6059M18602O39351K91892l85521p42287m84272K6317
38109D94917K21182o4663m40419l90338J25530N79925M95652N0362j27737K84433
38099A228844R40928J190612O78762l20512j052568r35466k24905J99129r9975
38090A604849n79619n38073p7107K27239K61763L42493M57263K61490k02666m44849
38080A312783k34638J91307O16834R37922Q17030m406r80412j159161n16503q2439
38070H98317m18888q05636m45261K97694N60418K89111Q7557J42330J00989j53472
38060E53159l20677k41961q1259M0103J31426R9067j44278l81826l18768o8857
$$ plain form
38130 -3775 157221 192927 268011 390555 509060 726239 1108622 1435233 1442899 1204956 983435
38119 983435 838763 704776 730835 1149437 1788788 2080680 1695159 952872 468600 494917
38109 494917 716099 651436 211017 -179321 -53791 526134 1021786 1072148 944411 1228844
38099 1228844 2169772 3360384 4039146 3718634 2666066 1730600 1505695 1704824 1604849
38090 1604849 1025230 487157 410050 637289 899052 1241545 1698808 1960298 1757632 1312783
38080 1312783 1078145 1269452 1886286 2824208 3641238 3636832 2656420 1497259 980756 898317
38070 898317 479429 -326207 -771468 -473774 86644 375755 463312 605642 706631 553159
38060 553159 232482 -9479 -90738 -50635 80791 179858 35580 -346246 -665014 -733871
38050g33871j0632j80545k17026O5325M19003N37729L73836M3881k85634l89655
38040c77589j62719J48960J78624n3216j55320M6780K52247J46320j53516l00319
38030d29748j73007O1960K19221K52663K09602J57144J35309J26453R6505O3938
38020G20040N5624J2796j37293l12484l25816j43197N5272J29774J42462J74638
38010C71816J45550k8338k12308j94153J589J39901J11270L9207J7484l9392j76343
37999A76283k36877j02136P7183J14910J10193K35913L15718K4445m72891n62145
37989c19404n8651M05736K34153k61086l28436J07607L87667J39893k23431j95610
37979a11562J11199K29721J1727k61565k93597p2778J75119K17974N1814q4831
$$ plain form
38050 -733871 -744503 -925048 -1142074 -1076749 -657746 -120017 253819 297700 12066 -377589
38040 -377589 -540308 -391348 -212724 -265940 -421260 -374480 -122233 24087 -129429 -429748
38030 -429748 -602755 -540795 -321574 -68911 140691 297835 433144 559597 656102 720040
38020 720040 775664 788460 651167 338683 12867 -130330 -75058 54716 197178 371816
38010 371816 517366 489028 276720 82567 84156 224057 335327 374534 392018 352626 176283
37999 176283 -60594 -162730 -85547 29363 139556 375469 691187 715632 242741 -319404
37989 -319404 -378055 27681 261834 748 -327688 -220081 167586 307479 84048 -111562
37979 -111562 -363 229358 241085 -20480 -314077 -386855 -211736 6238 58052 -26779
37969b6779k5366P1256k2581j94722j58608L6334P5613l1567O1098L39956K91508
37958D16142k38784n92212j82427N80615Q23769L89494j16705k80616k47806j86338
37948C65132j7947K05409K05366m4672j82754p661K12566J93556M6629m059p867
37937I63698j16212k67401l17175k95973k84938k06831O694J88674J39129n6634
37927b46969j52612q2378N5293K25267L94968L62081m937l97410l35753J24876
37917e7574L55563L181m78356m46275M8628L92158K91593R2598J67095L83078
37907G51689L85191J26789j48025k96336l61568l24302o4366L61256O34055N10908
37897A575291J18165k16221l25153k67558j25345P2759K30545J78890j15979m43204
$$ plain form
37969 -26779 -52145 19111 -3470 -198192 -356800 -320466 -244853 -276420 -215322 124634 416142
37958 416142 177358 -414854 -597281 -16666 807103 1196597 1079892 799276 551470 365132
37948 365132 347185 552594 757960 713288 530534 522873 735439 928995 975624 971565 963698
37937 963698 847486 580085 262910 -33063 -318001 -524832 -518138 -329464 -190335 -246969
37927 -246969 -399581 -481959 -426666 -201399 193569 555650 550713 153303 -182450 -57574
37917 -57574 297989 301170 -177186 -623461 -574833 -182675 108918 201516 368611 751689
37907 751689 1136880 1263669 1115644 819308 457740 133438 69072 430328 1064383 1575291
37897 1575291 1693456 1477235 1152082 884524 759179 831938 1062483 1241373 1125394 682190
37887F82190n44684l73562r2458J22862J92692J06063q1573k19213j57072P3189
37877b91566K65949K86979K21140J99064J78634L8412j70216k44420j18886L3858
37867C98948N5537P449K2434P8197O8747K9840J13422L22072M17701J82856k85136
37856A412067o24127n64697k03845J12544J72849R6411J02313J77416J23907r8230
37846G06608k83015k87133k24307k31839k30449j01902L9594o869j79110j91963
37836i90385O3967L63420M29224K28525m7883j85451j03093R4678K15316J85343
37826B53661J06779N2998m4060j71197j03781K35752M68180J98753l16220m15464
37816B65401J7591L61031J83187j48869j20954J25729J33095n7777k9254K09395
$$ plain form
37887 682190 137506 -236056 -328514 -205652 -12960 93103 11530 -207683 -364755 -291566
37877 -291566 -25617 261362 482502 681566 860200 898612 728396 483976 365090 398948
37867 398948 454485 461934 484368 562565 631312 661152 774574 1096646 1514347 1697203 1412067
37856 1412067 787940 223243 19398 131942 304791 401202 503515 680931 804838 706608
37846 706608 423593 136460 -87847 -319686 -550135 -652037 -612443 -619312 -798422 -990385
37836 -990385 -926418 -562998 -133774 94751 46868 -138583 -241676 -146998 68318 253661
37826 253661 360440 413438 369378 198181 94400 330152 798332 997085 680865 265401
37816 265401 282992 644023 827210 678341 557387 683116 816211 758434 729180 938575
37806I38575J71313k83161o32020m33694M5183K51351Q8030j03741j07688k1048
37796h6900L1737M7777J7009p4312q9136J35948M45740M35059J4697l60914k79969
37785B36736L2851N6638k20930k82412J00877M88095M18145N5590j40100j01807
37775F43683j03338k00889j80501q576J03467J06055J61917K28647M5514l13221
37765D82758l52837Q2547M08649R9745m50666m35110J73092N66959K87585j66479
37755F96243j71942J01167O1446l35978n54474l36094n7622r1560k54401j72453
37745a115668J22595L30076M04667N10101N40327J93679l91339n85540j25837
37736a16939M00571L24109j72475l70664o8484K32428J48133j23726k61335k62592
$$ plain form
37806 938575 1109888 826727 194707 -238987 -193804 57547 145577 41836 -65852 -86900
37796 -86900 -55163 -7386 9623 -64689 -153825 -17877 427863 862922 877619 516705 236736
37785 236736 269587 326225 105295 -177117 -76240 411855 830000 885590 745490 643683
37775 643683 540345 339456 158955 150379 253846 359901 521818 750465 795979 482758
37765 482758 129921 212468 621117 720862 270196 -164914 8178 575137 862722 696243
37755 696243 524301 625468 686914 350936 -203538 -539632 -597254 -688814 -943215 -1115668
37745 -1115668 -993073 -662997 -258330 251771 792098 985777 594438 8898 -116939
37736 -116939 283632 607741 435266 64602 -3882 228546 376679 252953 -8382 -270974
37726b70974k38134j48431J2795O6398q2485k39294j81325N7339L05779M66558
37716b51774M85705L26866R1361n2695j36693l13304m56910k36626K64296M58005
37706A78231O4232m15275m07234n8322J34556J23582J81666K51461P2481j77247
37696e1869m6299L73078M49912k0919m51731l08622J69317M05263K44863n0394
37686G12599k62322l27706k08919L4318K02254K43360M07070Q19290J080574O78767
37676C379285k41278r20959q93070m95823k93843l03974j54887J60282J93580
37667D29313k01114m97155k19806K93005L45472o9444k70133L8730L25185J19645
37657B93698k31501j60462K01344K75893k7206k31080q1185J34280J13808n6170
$$ plain form
37726 -270974 -509108 -657539 -644744 -578346 -660831 -900125 -1081450 -1024111 -718332 -251774
37716 -251774 233931 560797 652158 599463 462770 149466 -307444 -544070 -279774 178231
37706 178231 242463 -172812 -580046 -638368 -503812 -380230 -198564 52897 125378 -51869
37696 -51869 -98168 274910 724822 703903 252172 -56450 112867 518130 762993 712599
37686 712599 450277 122571 -86348 -52030 150224 393584 800654 1619944 2700518 3379285
37676 3379285 3138007 2217048 1323978 828155 534312 230338 75451 235733 429313
37667 429313 228199 -268956 -488762 -195757 149715 80271 -189862 -151132 174053 293698
37657 293698 62197 -98265 103079 378972 351766 120686 39501 173781 287589 231419
37647B31419j49311j12474j8523M8733J1494r6566q0017J33860K72705R3196j59545
37636A74971q2536K06567K45123M5126J10406N09867N93087k7569p57542p65804
37626B51696r9140M42943L64425k3813r8198L71100R80135J023396K01429r08192
37616B505781j336842q24924j20851K5951k20172k34874P3790K82317K54682K86900
37606F91758M38265L29383j87298o47766n94462k32567q9909k34994k62251j967
37596g91808J98202M7481j89466p8054L03019M57603K15422l8730M798J30308
37586B58775M0791j10300l6520R5375r4161m92095n66739j57071L13735M81895
37576b66315M13786K36428p8537l78505l04943J14627L32955P4016k06380m7796
$$ plain form
37647 231419 82108 -30366 -48889 -156 11338 -85228 -165245 -31385 241320 334516 174971
37636 174971 92435 299002 544125 589251 699657 1209524 1802611 1775042 1017500 251696
37626 251696 152556 595499 959924 936111 837913 1209013 2189148 3212544 3413973 2505781
37616 2505781 1168939 344015 223164 249115 28943 -205931 -132141 150176 404858 691758
37606 691758 1130023 1459406 1272108 624342 29880 -202687 -292596 -527590 -789841 -791808
37596 -791808 -593606 -546125 -735591 -813645 -510626 -53023 162399 123669 128467 258775
37586 258775 299566 189266 152746 248121 153960 -338135 -904874 -1061945 -748210 -266315
37576 -266315 147471 383899 305362 -73143 -378086 -263459 69496 143512 -62868 -110664
37566a10664K74894K36839q6520k30136j31185r9655j61504n7293J49050O5671
37556a50503l45026n98770l54745J55923N11169N67685M19545J93164K7220K0586
37546D46248Q5081L2776j38176k27482j22778O9052J69022N4370k65193n22611
37536d19691l37548K35268N46288J62736l98632l40020J79391K44227l48323p00523
37526a176827k10479M77447M90148J7792j54225P0876J32817j11558k09446K347
37516f71108J20934n6114j67173M4062K71474K05731P0457J76869L18904J16157
37506D30193k66257k88244J11448L43871J952n25842n54375q034M88666M09751
37496A43129m6632k69853l2897K62829J83627j31684j98723R3947L37303K30358
$$ plain form
37566 -110664 164230 401069 314549 84413 -46772 -146427 -307931 -365224 -216174 -150503
37556 -150503 -495529 -1094299 -1449044 -1293121 -781952 -214267 205278 398442 425662 446248
37546 446248 531329 564105 425929 198447 75669 144721 313743 368113 102920 -419691
37536 -419691 -757239 -521971 24317 187053 -211579 -551599 -372208 -127981 -476304 -1176827
37526 -1176827 -1387306 -909859 -419711 -401919 -556144 -485268 -352451 -464009 -673455 -671108
37516 -671108 -550174 -606288 -773461 -729399 -457925 -252194 -181737 -4868 314036 430193
37506 430193 163936 -124308 -12860 331011 332963 -192879 -747254 -755288 -266622 143129
37496 143129 96497 -173356 -206253 56576 240203 108519 -90204 3743 341046 571404
37486E71404k217l5864K9068p5556k34207j26781J35740R6744k59127l60979P2966
37475a88809N25030M22024k5889k08199k6232J26189J01324J23440K31039J72561
37465A252478q1402k43983k38512l22203n32571n09383j05825K76286K60144J6014
37455b28957j01964q2840q0576l6420J35170K49099J29160l5652O863J27604P2188
37444A53675m2169O6979K98626L10139J28447J28792L97110N67066L59534r7539
37434B270660n40422p95141o98751k04688L42573M43469R8837j45309K7309K71321
37424A069858J58813j79732l32025k43407j83061k30941k07162p4972l4555j45398
37414d02582j73845K9075K41081J80657m8554r9229Q3569J83486N6439K7626L78044
$$ plain form
37486 571404 569187 533323 562391 486835 252628 125847 261587 358331 99204 -261775 -188809
37475 -188809 336221 758245 732356 524157 497925 624114 725438 848878 1079917 1252478
37465 1252478 1171076 927093 688581 366378 -166193 -675576 -781401 -505115 -244971 -228957
37455 -228957 -330921 -413761 -494337 -530757 -395587 -146488 -17328 -52980 -46117 81487 153675
37444 153675 111506 178485 477111 787250 915697 1044489 1441599 2008665 2368199 2270660
37434 2270660 1730238 935097 236346 31658 374231 817700 916537 771228 798537 1069858
37424 1069858 1228671 1048939 716914 473507 290446 59505 -147657 -222629 -257184 -402582
37414 -402582 -576427 -547352 -306271 -125614 -174168 -273397 -189828 -6342 50097 77723 455767
37403D55767P70880O04827j19550p26256p35142l86346j23454J9850K01534K97897
37393B60007R3049k48675l44814j69316q3596k85595n38338m97225r7533M03528
37383a508508O33269M10649k3869k03697R329K56534K26064Q6112J16866K15942
37373B18691J45338N900J9017N3291j32796l45831k01153J88768L29627J08067
37363C88919j12907j45385j52436j52649M6972L28704K77637j11345l05018l1557
37353C0935L09351K84867K730k15719k99539k93525j51527P0884J56598P1000
37343c3945L4890J08368Q8456m3554j7147K18135L36883J72595n2002j79427k80836
37332C52416k31712K22264P54537N71958l67352j010131o23044J67035M05373
$$ plain form
37403 455767 1226647 1831474 1711924 985668 250526 -135820 -259274 -239424 -37890 260007
37393 260007 353056 104381 -240433 -409749 -493345 -778940 -1317278 -1814503 -1912036 -1508508
37383 -1508508 -875239 -464590 -488459 -692156 -682827 -426293 -200229 -114117 2749 218691
37373 218691 364029 369929 388946 442237 309441 -36390 -237543 -48775 280852 388919
37363 388919 276012 130627 -21809 -174458 -127486 201218 478855 367510 62492 30935
37353 30935 340286 625153 627883 412164 112625 -180900 -332427 -261543 -104945 -33945
37343 -33945 945 109313 197769 154215 137068 355203 692086 864681 812679 633252 352416
37332 352416 120704 342968 1097505 1669463 1302111 291980 -331064 -164029 241344
37323B41344J86117J61187K65439l2876n39904m84688J77473N87548K62570k63687
37313E60523l34981l5152J79358K05134K65518M40115N42966L91241N4366j59484
37303B109604j2397L24239M02822Q9018j89142L8891P10412J361747J687463J877342
37293H399999K552028M198353O164697O406402L267208k131406o286691o808290
37285A5762300m742849k736660j867314j409203q63096n77686n85205l63041P6440
37276B693686J00575l24150m57490r0178O5446l51103o99031m21342J06744L14157
37266I37314K56532K10253J06700j60938m16498n41087o12331n02522J2612N74485
37256a35480M77668j55563l33990K80748P52406L24707m13432n36569j57313L2460
$$ plain form
37323 241344 427461 588648 854087 821211 281307 -203381 -25908 561640 824210 560523
37313 560523 225542 190390 369748 574882 840400 1280515 1823481 2214722 2269088 2109604
37303 2109604 2097207 2421446 2824268 2913286 2724144 2763035 3473447 4835194 6522657 8399999
37293 8399999 10952027 15150380 21315077 27721479 30988687 28857281 22570590 15762300
37285 15762300 11019451 8282791 6415477 5006274 4143178 3565492 2980287 2617246 2693686
37276 2693686 2794261 2470111 2012621 1922443 1987889 1636786 937755 516413 623157 937314
37266 937314 1193846 1404099 1510799 1349861 933363 392276 -220055 -722577 -709965 -135480
37256 -135480 342188 186625 -147365 133383 885789 1210496 797064 260495 103182 135642
37246A35642n8828o5905J6886l426N3010L75660N96357L21013j25261k05793p0130
37235I69225j98847m83867m51163j39321K9425M8277K28512M76472M27033J63244
37225A068990O3752O1055j93162n31028m35135K8729K38256J2895j78716r1547
37215D4089k8244j43104j51964L8831P8795j78956l58044j66197J87286M27021
37205b50487N67930N95761K99612k74510o49026n15450j43848P9552J50871K03556
37195F3961J46219r3569k53090m7829L61463N38236L20173m0440k27686j70514
37185E96924k0709O6543J04052K01508L20971K58822j6370k17946j50532l9838
37175A103425j47199k91556j71040M9716m785k21464j51860J90303L21238J05021
$$ plain form
37246 135642 76814 10909 27795 24369 77379 453039 1049396 1370409 1245148 1039355 969225
37235 969225 770378 286511 -164652 -303973 -274548 -226271 2241 478713 905746 1068990
37225 1068990 1132742 1193797 1000635 469607 34472 63201 301457 314352 135636 44089
37215 44089 15845 -127259 -279223 -240392 -161597 -340553 -698597 -864794 -677508 -250487
37205 -250487 317443 913204 1212816 938306 289280 -226170 -370018 -290466 -139595 63961
37195 63961 210180 116611 -136479 -184308 177155 715391 1035564 995124 767438 596924
37185 596924 576215 642758 746810 948318 1269289 1528111 1511741 1293795 1143263 1103425
37175 1103425 956226 664670 493630 543346 538561 317097 165237 355540 676778 781799
37165G81799p3759m7961r8382k78984k20055J25634K48223m1358j98484J17996
37155C14669L81841Q7934l16738j57841K96035K68142k23635m33842j59366p084
37145E0115k75925m35186m4505N00318N85829K48333m1739j12566j37613j61137
37135A75924l6377K11259L20314J39295j84941l92969l31600q146L94810N64110
37125H51679L17690j27534l33794j70062K6316n5435k50562k05467M7082J50235
37115B50148J1559q0051j289k4557k88329m48736k03592J73051K40919O7636J6775
37104b86466Q4036l446j72295j04159J03616M3042j98257n7688M90140O86658
37094E85181J36711m63436k95905L80632O28741J14983o06299r12759o81354j37029
$$ plain form
37165 781799 708040 660079 561697 282713 62658 188292 436515 395157 196673 314669
37155 314669 696510 784444 467706 309865 605900 874042 650407 216565 57199 50115
37145 50115 -225810 -660996 -705501 -205183 380646 628979 587240 474674 337061 175924
37135 175924 139547 350806 671120 810415 625474 232505 -99095 -107241 287569 851679
37125 851679 1169369 1041835 708041 537979 564295 508860 258298 52831 99913 250148
37115 250148 261707 181656 180367 155810 -132519 -581255 -784847 -611796 -370877 -303241 -286466
37104 -286466 -202430 -205876 -378171 -482330 -378714 -335672 -533929 -591617 -101477 585181
37094 585181 721892 258456 -37449 343183 971924 1086907 480608 -432151 -1113505 -1250534
37084a250534L89182N79071L76957J02828O2516J65336J77805J35444J55207O8742
37074I62554l00696o47838m84148J07844N06132L81212N5795o6297k5850q2028
37064D06680k63164l64325k47478j338J44974N3333j27464q8184K20136M50147
37054A83317L10314k9798k11781j69979n8347R6154K97797L13774m5861m59093
37044B26497l75363K07300O66204N23885n0948n56176o47985l06095J63933K93317
37034A44569n7942m14644k58289K03795L19026j4933k25049k343K54989J46719
37024I5898j43027k48247j29615J02027M15604O29825M17509j40706m59256k43795
37014B96217P4640O4448n6473M1377J26613j19428l85384j92438K34806L10123
$$ plain form
37084 -1250534 -861352 -282281 94676 197504 260020 425356 603161 738605 893812 962554
37074 962554 661858 14020 -470128 -362284 143848 525060 580855 514558 488708 406680
37064 406680 143516 -220809 -468287 -469625 -324651 -271318 -398782 -486966 -266830 183317
37054 183317 493631 463833 252052 82073 23726 119880 417677 731451 685590 226497
37044 226497 -148866 58434 724638 1248523 1197575 641399 -6586 -312681 -148748 144569
37034 144569 86627 -328017 -586306 -382511 -63485 -78418 -303467 -305810 -50821 95898
37024 95898 -47129 -295376 -424991 -322964 92640 722465 1139974 999268 540012 296217
37014 296217 370857 435305 378832 420209 546822 427394 42010 -150428 84378 394501
37004C94501Q9520J32603M42652L88577k05009o77650n15637n4013J59382J51618
36994C06544K47910M21203L90387J38746o8262p1479O0500K02922K48216J05010
36984A981697j80457l74070k84476R3K04537J50373r7344k98813k50869j5350
$$ plain form
37004 394501 484021 616624 1059276 1447853 1242844 565194 49557 -4456 154926 306544
36994 306544 554454 975657 1366044 1504790 1436528 1365049 1425549 1628471 1876687 1981697
36984 1981697 1801240 1427170 1142694 1142787 1347324 1497697 1400353 1101540 850671 835321
$$ [...]
##END NTUPLES=NMR SPECTRUM
##END=
