##TITLE=31Pdec_2PBDP2310
 CDcl3, 24 sc
 26.10.2020
##JCAMPDX= 6.0         $$ Bruker NMR JCAMP-DX V2.0
##DATA TYPE= NMR SPECTRUM
##DATA CLASS= NTUPLES
##ORIGIN= UXNMR, Bruker Analytische Messtechnik GmbH
##OWNER= root
$$ XWIN-NMR		Version 3.5
$$ Mon Oct 26 11:27:49 2020 Russian Standard Time (UT+4h)  she@DPX200
##.OBSERVE FREQUENCY= 81.013821
##.OBSERVE NUCLEUS= ^31P
##.ACQUISITION MODE= SIMULTANEOUS
##.ACQUISITION SCHEME= undefined
##.AVERAGES= 24
##.DIGITISER RES= 17
##SPECTROMETER/DATA SYSTEM= spect
##.PULSE SEQUENCE= zgpg30
##.SOLVENT NAME= CDCl3
##.SHIFT REFERENCE= (INTERNAL, CDCl3, 0, 182.463)
##AUDIT TRAIL= $$ (NUMBER, WHEN, WHO, WHERE, WHAT)
$$ ##TITLE= Audit trail, XWIN-NMR		Version 3.5
$$ ##JCAMPDX= 5.01
$$ ##ORIGIN= Bruker BioSpin GmbH
$$ ##OWNER= she
$$ F:/spectra/data/she/nmr/P31/1/pdata/1/auditp.txt
$$ ##AUDIT TRAIL=  $$ (NUMBER, WHEN, WHO, WHERE, WHAT)
(   1,<2020-10-26 11:26:12.68 +0400>,<she>,<DPX200>,
      <created by zg, POWCHK disabled, PULCHK disabled
       configuration hash MD5:
       00 E9 B6 7A A2 85 ED C7 34 08 36 98 17 FE 4E 26
       data hash MD5: 32K
       A2 94 49 6A F8 E6 F6 37 36 AF 7D AC AF FB EA FF>)
(   2,<2020-10-26 11:26:16.17 +0400>,<she>,<DPX200>,
      <Start of raw data processing
       efp BC_mod = 2 LB = 1 FT_mod = 6 PKNL = 1 PHC0 = -2403.659 PHC1 = 73.00069 SI = 64K 
       data hash MD5: 64K
       34 42 F7 EB 1F 89 EA 4E AB 25 20 B5 DA 23 BF 50>)
(   3,<2020-10-26 11:26:40.53 +0400>,<she>,<DPX200>,
      <pk PHC0 = 16.51534 PHC1 = 0 
       data hash MD5: 64K
       C8 89 7E 70 58 DD 4A 45 A4 40 55 D0 02 21 96 AD>)
(   4,<2020-10-26 11:26:47.51 +0400>,<she>,<DPX200>,
      <abs ABSG = 5 
       data hash MD5: 64K
       95 30 F8 E7 BC 7E 0C 31 A0 23 ED 28 4F 59 97 FC>)
$$ ##END=
$$ 
$$ hash MD5
$$ 50 A8 58 99 A5 A2 CB 61 07 93 A1 8B D0 BF 37 E1
##$RELAX= 
##$RELAX= 
##$RELAX= 
##$RELAX= 
##$RELAX= 
##$RELAX= 
##$RELAX= 
##$RELAX= 
$$ Bruker specific parameters
$$ --------------------------
##$DU= <F:/spectra>
##$EXPNO= 1
##$NAME= <P31>
##$PROCNO= 1
##$TYPE= <nmr>
##$USER= <she>
##$AMP= (0..31)
100 100 100 100 100 100 100 100 100 100 100 100 100 100 100 100 100 100 
100 100 100 100 100 100 100 100 100 100 100 100 100 100 
##$AQSEQ= 0
##$AQ_mod= 1
##$AUNM= <au_zg>
##$AUTOPOS= <>
##$BF1= 81.014009
##$BF2= 200.13
##$BF3= 200.13
##$BF4= 200.13
##$BF5= 200.13
##$BF6= 200.13
##$BF7= 200.13
##$BF8= 200.13
##$BYTORDA= 1
##$CFDGTYP= 0
##$CFRGTYP= 5
##$CHEMSTR= <none>
##$CNST= (0..31)
1 1 145 1 1 1 1 1 1 1 1 1 1 1 1 1 1 1 1 1 1 1 1 1 1 1 1 1 1 1 1 1 
##$CPDPRG= <waltz16>
##$CPDPRG1= <>
##$CPDPRG2= <waltz16>
##$CPDPRG3= <>
##$CPDPRG4= <mlev>
##$CPDPRG5= <mlev>
##$CPDPRG6= <mlev>
##$CPDPRG7= <mlev>
##$CPDPRG8= <mlev>
##$CPDPRGB= <>
##$CPDPRGT= <>
##$D= (0..31)
0 1 0 0 0 0 0 0 0 0 0 0.03 2e-05 3e-06 0 0 0 0 0 0 0 0 0 0 0 0 0 0 0 0 
0 0 
##$DATE= 1603697172
##$DBL= (0..7)
120 120 120 11 120 120 24 19 
##$DBP= (0..7)
150 150 150 150 150 150 150 150 
##$DBP07= 0
##$DBPNAM0= <>
##$DBPNAM1= <>
##$DBPNAM2= <>
$$ [...]
##$SUBNAM3= <"">
##$SUBNAM4= <"">
##$SUBNAM5= <"">
##$SUBNAM6= <"">
##$SUBNAM7= <"">
##$SUBNAM8= <"">
##$SUBNAM9= <"">
##$SW= 369.568048894756
##$SWIBOX= (0..15)
0 1 3 0 0 0 0 0 0 0 0 0 0 0 0 0 
##$SW_h= 29940.119760479
##$TD= 32768
##$TD0= 1
##$TE= 0
##$TE2= 300
##$TE3= 300
##$TEG= 300
##$TL= (0..7)
0 120 53 12 22 120 120 120 
##$TP= (0..7)
150 150 150 150 150 150 150 150 
##$TP07= 0
##$TPNAME0= <>
##$TPNAME1= <>
##$TPNAME2= <>
##$TPNAME3= <>
##$TPNAME4= <>
##$TPNAME5= <>
##$TPNAME6= <>
##$TPNAME7= <>
##$TPOAL= (0..7)
0.5 0.5 0.5 0.5 0.5 0.5 0.5 0.5 
##$TPOFFS= (0..7)
0 0 0 0 0 0 0 0 
##$TUNHIN= 0
##$TUNHOUT= 0
##$TUNXOUT= 0
##$USERA1= <user>
##$USERA2= <user>
##$USERA3= <user>
##$USERA4= <user>
##$USERA5= <user>
##$V9= 5
##$VALIST= <valist>
##$VCLIST= <CCCCCCCCCCCCCCC>
##$VD= 0
##$VDLIST= <DDDDDDDDDDDDDDD>
##$VPLIST= <PPPPPPPPPPPPPPP>
##$VTLIST= <TTTTTTTTTTTTTTT>
##$WBST= 1024
##$WBSW= 4
##$XGAIN= (0..3)
0 0 0 0 
##$XL= 0
##$YL= 0
##$YMAX_a= 104384
##$YMIN_a= -96270
##$ZGOPTNS= <>
##$ZL1= 120
##$ZL2= 120
##$ZL3= 120
##$ZL4= 120
##$ABSF1= 182.463
##$ABSF2= -187.1042
##$ABSG= 5
##$ABSL= 3
##$ALPHA= 0
##$AQORDER= 0
##$ASSFAC= 0
##$ASSFACI= 0
##$ASSFACX= 0
##$ASSWID= 0
##$AUNMP= <proc_1d>
##$AZFE= 0.1
##$AZFW= 0.5
##$BCFW= 0
##$BC_mod= 2
##$BYTORDP= 0
##$COROFFS= 0
##$CY= -3
##$DATMOD= 1
##$DC= 0
##$DFILT= <>
##$DTYPP= 0
##$F1P= 0
##$F2P= 0
##$FCOR= 1
##$FTSIZE= 65536
##$FT_mod= 6
##$GAMMA= 0
##$GB= 0
##$INTBC= 1
##$INTSCL= 5.30512e-09
##$ISEN= 30
##$LB= 1
##$LEV0= 0
##$LPBIN= 0
##$MAXI= 10000
##$MC2= 0
##$MEAN= 0
##$ME_mod= 0
##$MI= 50
##$NCOEF= 0
##$NC_proc= -5
##$NLEV= 6
##$NOISF1= 182.463
##$NOISF2= 159.3651
##$NSP= 0
##$NTH_PI= 0
##$NZP= 0
##$OFFSET= 182.463
##$PC= 4
##$PHC0= -2387.144
##$PHC1= 73.00069
##$PH_mod= 1
##$PKNL= yes
##$PPARMOD= 0
##$PSCAL= 0
##$PSIGN= 0
##$REVERSE= no
##$SF= 81.014009
##$SI= 65536
##$SIGF1= 159.3651
##$SIGF2= -187.1042
##$SINO= 113.3802
##$SIOLD= 16384
##$SREGLST= <1H.CDCl3>
##$SSB= 0
##$STSI= 65536
##$STSR= 0
##$SW_p= 29940.119760479
##$SYMM= 0
##$S_DEV= 0
##$TDeff= 32768
##$TDoff= 0
##$TI= <>
##$TILT= no
##$TM1= 0
##$TM2= 0
##$TOPLEV= 0
##$USERP1= <user>
##$USERP2= <user>
##$USERP3= <user>
##$USERP4= <user>
##$USERP5= <user>
##$WDW= 1
##$XDIM= 65536
##$YMAX_p= 356078392
##$YMIN_p= -4015910
$$ End of Bruker specific parameters
$$ ---------------------------------
##NTUPLES= NMR SPECTRUM
##VAR_NAME=  FREQUENCY,     SPECTRUM/REAL,   SPECTRUM/IMAG
##SYMBOL=    X,             R,               I
##VAR_TYPE=  INDEPENDENT,   DEPENDENT,       DEPENDENT
##VAR_FORM=  AFFN,          ASDF,            ASDF
##VAR_DIM=   65536,         65536,           65536
##UNITS=     HZ,            ARBITRARY UNITS, ARBITRARY UNITS
##FACTOR=    0.456856943014862, 1,           1
##FIRST=     14782.0589164895, 0,            0
##LAST=      -15158.0608439895, 0,           0
##MIN=       -15158.0608439895, -4015910,    0
##MAX=       14782.0589164895, 356078392,    0
$$ Real data points
##PAGE= N=1
##DATA TABLE= (X++(R..R)), XYDATA
$$ [...]
42292a58242O50048M91378k21245o57758m06831L947M5285j665L43322Q31969
42282I20208Q01361J80565m01666m70812k16301j04895k92458m87294k66328M16748
42272G9128R70201O52869m84837j439051j351976n17823J05177J41861K5402J15103
42262a703946K37027J86971R8922R0956L1086q5185L1548M47004P29434N58167
42252F21984K38385J91145K71801J09452j53748r8747J24722r3872p68581j048305
42242f05764l51808P18422J062850M35955l29437l76806K51855Q02785O79554
42233B287606q244o68795q38973n05326O0452N42612O24740J21623o76006j032339
42223i2650n10578M30210R27014O94506J58380k43930m24642l99558k26972j87774
$$ y = [-158242, 491806, 983184, 761939, 104181, -302650, -298703, -253418, -255083, 88239, 920208, 1721569, 1902134, 1500468, 1029656, 813355, 708460, 416002, -71292, -337620, 79128, 1049329, 1702198, 1217361, -221690, -1573666, -2091489, -1986312, -1844451, -1819049, -1703946, -1466919, -1279948, -1181026, -1090070, -1058984, -1144169, -1112621, -665617, 63817, 621984, 860369, 1051514, 1323315, 1432767, 1279019, 1180272, 1304994, 1211122, 442541, -605764, -957572, -239150, 823700, 1259655, 930218, 553412, 805267, 1608052, 2287606, 2279362, 1610567, 771594, 266268, 326720, 869332, 1494072, 1615695, 939689, -92650, -603228, -173018, 753996, 1448502, 1606882, 1362952, 938310, 538752, 311780, 124006]
42213A24006m73794o88034k76177N00244P45597K28085k92712k78921q7716n1252
42203e50674J65593O77389P84227J06273n19294k76989K30293q364o34917n32056
42193e58519K04250M26132o5120k49118K41694N28333J62180p1474L46632O98732
42183A663722L55671j12494p1356n915n12011j005518o23585K56423O01947L32523
42173H79407J47724J29657k24112p53267o92676l8938L13097K6671j59952K47841
42163a24548O47364L85343j23667o5925M63652N91141m9594p97140q29739j57139
42153f0252M57254M10467j02163m01361j40949L76555O69504N75003J82369l84040
42143A582387q56882q24195k47929K24894m3693p48433q97999q3416R37887J120453
$$ y = [124006, -349788, -1037822, -1313999, -813755, -68158, 159927, -132785, -411706, -499422, -550674, -385081, 292308, 1076535, 1182808, 663514, 386525, 616818, 608454, -26463, -558519, -354269, 71863, 6743, -242375, -681, 527652, 689832, 618358, 964990, 1663722, 2019393, 1906899, 1835543, 1829628, 1317617, 312099, -311486, -55063, 546884, 879407, 1027131, 1156788, 932676, 179409, -513267, -552205, -239108, -212437, -372389, -124548, 522816, 908159, 784492, 718567, 1182219, 1773360, 1723766, 926626, 96887, -60252, 397002, 807469, 705306, 303945, 162996, 539551, 1209055, 1784058, 1966427, 1582387, 725505, -98690, -346619, -121725, -165418, -913851, -1811850, -1895266, -957379, 163074]
42133A63074L12789o50534q84413k92325M82586P80467M85911q7280o05614p93579
42123a088918l68547N96190J320351R80239j25676p40007k74906M14482L48594
42114A061802j97350l38495l324J89856Q7640N9198R4068j78440n81251m27196
42104b33492L82223J065992R65786K33358n62003r14141m99731M58940R67765
42095A864697K40257j024971j273924k04915P42792M05751n64191q11139j43138
42086g68781M87228L84159k15464o19682l71519L33649P21647K88471l84438k98405
42076d43135M31112O56737O5351k20889M60412J042098M11940o75890p64480m3331
42066I19925N5047p29039j104285l44011O90593R94288O57892K11025k17284n52070
$$ y = [163074, 475863, -174671, -1059084, -1351409, -868823, -88356, 397555, 310275, -295339, -1088918, -1457465, -861275, 459076, 1439315, 1313639, 573632, 298726, 713208, 1061802, 864452, 525957, 522633, 712489, 800129, 859327, 953395, 774955, 193704, -233492, 148731, 1214723, 2180509, 2413867, 1851864, 937723, 437992, 896932, 1864697, 2104954, 1079983, -193941, -398856, 343936, 749687, 185496, -625643, -768781, -281553, 102606, -112858, -732540, -1104059, -770410, -48763, 239708, -144730, -443135, -12023, 644714, 710065, 489176, 949588, 1991686, 2403626, 1727736, 963256, 919925, 974972, 245933, -858352, -1202363, -511770, 482518, 1140410, 1351435, 1134151, 582081]
42056E82081m79927o0500J03927j99756m00595j52475J9302l19630o21042j98951
42046a727566N70980P52461K32924k23397j65130P9361J43114J41966K80685M53054
42036E38452M74956L84523L02760K11786L0467k26038m55857n39301l72164L7479
42026C87063M59675N54589J97826l32310n76075l58742o704K2898k45442k74544
42016a71766K44080Q65701R46440N24325J52239m2353m53824j046679j092227
42007g4064k90793N33845N32723Q2696Q5575M06892J26890o87499p25386N44253
41997E35132J669934J017066q46866j732517o77018R08439J237359L29208m76040
41988A964697m98921k37468j31493J07144O24893P84874R0802p94364q11525n5670
$$ y = [582081, 102154, 41654, 145581, -54175, -454770, -607245, -587943, -907573, -1528615, -1727566, -1156586, -404125, -171201, -394598, -559728, -480367, -337253, -195287, 85398, 538452, 1013408, 1397931, 1700691, 1912477, 1942944, 1716906, 1261049, 721748, 349584, 387063, 846738, 1401327, 1599153, 1266843, 690768, 332026, 325322, 348220, 102778, -171766, 72314, 938015, 1884455, 2408780, 2561019, 2518666, 2064842, 1018163, -74064, -364857, 168988, 701711, 784407, 869982, 1276874, 1403764, 716265, -9121, 535132, 2205066, 3222132, 2375266, 642749, -34269, 874170, 2111529, 2440737, 1964697, 1465776, 1228308, 1096815, 1203959, 1828852, 2613726, 2704528, 1910164, 1098639, 1042969]
41978A042969L48583n8307m70213k28593J34012n7312l58605q069N73757L48956
41968A267178m81353o01706K35520O20293k53743j113417n50919O46649O92964
41959D61466l11632n59142M51601J039089J00932j011646o00254P15881J036084
41950A322379J06377n40876j42131L48848J43093j42334J60188M69525L4498o28880
41940A130687n60670k363N0442l86543l28128L60397N85715j07673o05364P317
41930A43817Q36852N54670l69509l35073P30215J056753k35526j629006j364308
41921f11115O1222Q13231L87194r3619O6502K83479L2533l13876m13848n54489
41911c42786p49596l27092Q03508J440445O46925p25895j174544o21952j46787
$$ y = [1042969, 1391552, 1333245, 863032, 634439, 768451, 711139, 352534, 344465, 918222, 1267178, 785825, 184119, 419639, 1039932, 786189, -327228, -878147, -231498, 461466, 149834, -409308, 42293, 1081382, 1182314, 170668, -429586, 286295, 1322379, 1428756, 887880, 745749, 1094597, 1237690, 1095356, 1255544, 1725069, 1759567, 1130687, 570017, 567654, 618096, 231553, -96575, 263822, 849537, 741864, 136500, 143817, 980669, 1535339, 1165830, 830757, 1560972, 2617725, 2382199, 753193, -611115, -549893, 263338, 650532, 556913, 623415, 906894, 939427, 625551, 211703, -342786, -1092382, -1419474, -615966, 824479, 1471404, 745509, -429035, -1050987, -1197774]
41902a197774o3549K99908R75406R92798L4926p99097n40031K85464N56377J04685
41892F49113l83385m85549l25271p0331J89254K48609P818k26945o6443M27159
41882c5971Q11660P57392K92059k62981m86544k46423M6598n9741k90594M9452
41872E74907Q79769J185902M18195o53954r99603o07472j17469K16594M59120
41863A355989L98904j17354n70014l23274L69383O56284K56315l31688o42446
41854A052099o08973k66021K35238M36126M9011m92248n85636l74004m07111o06841
41844a568360m05266J88541N32327L74001J15805J8903o4116j19557P4313L69801
41834d83608L84726K10357J99736J63012k70612o20921r0895Q52614Q15769l53482
$$ y = [-1197774, -1261323, -961415, 13991, 1006789, 1041715, 242618, -297413, -11949, 544428, 649113, 265728, -219821, -545092, -615423, -426169, -177560, -169742, -396687, -463130, -35971, 775689, 1533081, 1825140, 1562159, 1075615, 829192, 875790, 816049, 525455, 574907, 1454676, 2640578, 3058773, 2404819, 1405216, 797744, 680275, 896869, 1355989, 1754893, 1637539, 1067525, 744251, 1113634, 1769918, 2026233, 1694545, 1052099, 443126, 177105, 412343, 848469, 897480, 405232, -180404, -554408, -961519, -1568360, -1973626, -1785085, -1252758, -878757, -762952, -744049, -808165, -927722, -853409, -483608, -98882, 111475, 311211, 474223, 203611, -417310, -508205, 344409, 1160178, 806696]
41824H06696j181407q15524j65519j12890j10019M32854Q01500L12470k36521
41815b68360Q4790N87320J66838o27875n25708J30483l4642q37293o36446Q40747
41805a120146J808522J113839j51245n26487j57957O2448N1665J35858R8480k46122
41795A068855l03418L58572R35954M21851p02832j003484j55037O71875N67848
41786A860184k2819k94050k71193m27536o92880n68811m7441K31551j27062o56058
41776a016115n91763J43500Q52492R26548M84267N7320o5658K9164J76169K63035
41766A258959J71231j55173o05124r95023j162484r06778j35278P57055J054832
41757g17783O02223J05815J21367K20563j78133o31504k95635N31804O55888j69959
$$ y = [806696, -374711, -1190235, -1355754, -1468644, -1578663, -1145809, -344309, -31839, -268360, -183570, 403750, 570588, -57287, -582995, -452512, -487154, -1324447, -1960893, -1120146, 688376, 1802215, 1650970, 1124483, 966526, 1028974, 1080639, 1216497, 1314977, 1068855, 765437, 1124009, 2059963, 2481814, 1778982, 775498, 620461, 1292336, 1860184, 1837365, 1543315, 1272122, 844586, 151706, -417105, -464546, -232995, -360057, -1016115, -1607878, -1464378, -611886, 314662, 798929, 856249, 790591, 819755, 995924, 1258959, 1430190, 1275017, 669893, -325130, -1487614, -2394392, -2529670, -1772615, -717783, -115560, -9745, 111622, 332185, 154052, -477452, -773087, -241283, 414605, 244646]
41747B44646q22341n47181L0137J82777K58500P27793R94320K85918q50905j150424
41737f46760m71457R5954m5113k42656J71196P83578P44843j5596p12890o36132
41727i75033J35663Q45780P89283L6141o14865n63542j20647K9886j06452J29795
41717d13991R14540J450738R56129k60869j151813j166989p07037l54525j02337
41708h36154L78679R53499R92752K69766n19636n56972j4024K02386j86656m06862
41698B76778J44670Q99901R21573K54522k49097k28922j52310l37023m09256k6387
41688A094449M39729L82158j85361o52904n76567j29953J79894O9938k70917m25297
41678g4831j99334K13187N00048N16617K65650j72994n56108n88193l38296k62301
$$ y = [244646, -577695, -1124876, -1094739, -911962, -653462, 74331, 1068651, 1354569, 503664, -646760, -1118217, -1022263, -1067376, -1310032, -1138836, -355258, 389585, 373989, -338901, -975033, -839370, 6410, 795693, 831834, 216969, -346573, -467220, -437334, -543786, -413991, 500549, 1951287, 2907416, 2646547, 1494734, 327745, -379292, -733817, -836154, -457475, 496024, 1488776, 1758542, 1238906, 681934, 667910, 870296, 683640, 276778, 421448, 1321349, 2242922, 2497444, 2248347, 2019425, 1867115, 1530092, 1120836, 1094449, 1534178, 1916336, 1730975, 1078071, 501504, 371551, 551445, 621383, 350466, -74831, -274165, -60978, 439070, 955687, 1221337, 1048343, 492235, -95958, -434254, -696555]
41668f96555n23813o26239j41032N26828O74236L49217J75348K79580J98609j37733
41658G8446j96197J81306M20078J90781k0644K06502M71885K57274k04806l97343
41648I87282l51512l60912l31662j30694j45718o71339j085086n81843M60793
41639b210691Q65755L87599o06K57536M68890n399n74151l44722M17729O77259
41629f0801J69462l17500j70341K95860M80535L00816L8200k14529n41181q00493
41619h19972o52196p8243L99593K74370k55828m41243R3101Q40837J047135O35367
41609A042921J79819P5960J44232Q6829o4938j36438j45603k06973k50697o1452
41599F63660M03497Q20403O90567j32423j060096j196344l89474M41204M19011
$$ y = [-696555, -1220368, -1846607, -1987639, -1460811, -786575, -437358, -262010, 17570, 216179, 78446, -117751, 63555, 483633, 674414, 653770, 860272, 1332157, 1589431, 1384625, 987282, 635770, 274858, -56804, -187498, -333216, -1004555, -2089641, -2671484, -2210691, -1344936, -957337, -957943, -700407, -231517, -236916, -811067, -1155789, -738060, -60801, 108661, -208839, -379180, -83320, 397215, 698031, 736231, 521702, -19479, -819972, -1472168, -1550411, -1150818, -876448, -1132276, -1573519, -1480418, -639581, 407554, 1042921, 1222740, 1298700, 1442932, 1529761, 1464823, 1328385, 1182782, 975809, 725112, 663660, 1067157, 1887560, 2578127, 2445704, 1385608, 189264, -200210, 240994, 660005]
41590F60005j74308m80505m33231o27025r23560l80788J069603K029096J456722
41581B196009J61345m31297k21532q3913k19858j40304P5921j22441m90668j80946
41571E42316O45620P43748k79220j204956r96966k29089O2991l5705J36050M64523
41561a50688L65432m4027j60495N579k7764j53053J82968P76747O97534k04356
41551A287877q05459k76112O18273N40672n15406j189917o04319M96398Q01173
41542C53180J61436l44712k967N60112L65111m48604q26694l21077L51214M09837
41532B56836Q0k25444J5428M95821P77693M28223n34175j237922p40273N08296
41522b55437R24725L0015o88725m3829Q87787M73500p34367q32189L17936R03011
$$ y = [660005, 485697, 5192, -428039, -1055064, -1978624, -2359412, -1289809, 739287, 2196009, 2357354, 1926057, 1704525, 1620612, 1400754, 1260450, 1336371, 1213930, 723262, 542316, 1187936, 1931684, 1652464, 447508, -549458, -778547, -715556, -751261, -615211, -150688, 214744, 170717, 10222, 15801, -11963, -165016, 17952, 794699, 1492233, 1287877, 482418, 206306, 824579, 1365251, 849845, -340072, -944391, -447993, 353180, 514616, 169904, 166937, 727049, 1092160, 643556, -183138, -504215, -153001, 256836, 256916, 31472, 46900, 542721, 1320414, 1748637, 1214462, -23460, -763733, -255437, 669288, 699303, 10578, -33251, 854536, 1328036, 593669, -238520, 79416, 982427]
41512I82427J89468l75674K54309R65998M33249o98926r49941k41004L83099M87313
41502A430318L71766N6240n41809q10112j10218R47266J075422J01695q64120
41493A656448j027484o64802k59684Q5153K03325j91087p87860p40018J57399
41484a568610J028100J064249N22596J28546N821k37711o51136p42479j59949
41475f10573P60987J273197R84593K67310j89232j85105j16214k43461k94373
41466A647129m6400J69945J4187k30841j61511l7184l42570q23437p86788k47654
41456h45124R6754M1052J02867M37648M73074k2292l77653m0393N65666P75121
41446A206720O47050N55353L49265l10910j091225j230444n93326J30897L37349
$$ y = [982427, 1171895, 796221, 1050530, 2016528, 2449777, 1750851, 800910, 559906, 943005, 1430318, 1802084, 1858324, 1316515, 506403, 396185, 1343451, 2418873, 2520568, 1656448, 628964, -35838, -295522, -210369, -7044, -198131, -985991, -1726009, -1568610, -540510, 523739, 1046335, 1174881, 1180702, 942991, 291855, -450624, -610573, 150414, 1423611, 2408204, 2675514, 2486282, 2301177, 2184963, 1941502, 1647129, 1600729, 1770674, 1784861, 1554020, 1392509, 1355325, 1012755, 189318, -597470, -845124, -748370, -707318, -604451, -166803, 306271, 283979, -93674, -134067, 431599, 1206720, 1853770, 2409123, 2758388, 2447478, 1356253, 125809, -467517, -336620, 729]
41437G29J56290Q6125K97241M74193K58225k45278m97195j79728L08828L25132
41427I84562j20615l92471k11090n8935l52509p27656n83488J7467M76877M94311
41417d73547L26991K86141L45555K94500N5162k30756l69763l32782k33453o8795
41407d00747K94133P10560O83316Q3352m09089j70435L83358M54644K04608L79281
41397B212981P40317K29674j065552j580361n62131O62323O63901n6372k14248
41388A030532J24722L4584l80153k09475M73744O04184j11275p59559o67661j46368
41378f725L21554O06635N64798J16410k67244r2847K08357j10718o97703n33122
41368A09395K71862N33848J733k28224K98509N50528j46996q73372o49043L4524
$$ y = [729, 157019, 243144, 540385, 1014578, 1272803, 1027525, 530330, 350602, 659430, 984562, 863947, 471476, 260386, 201451, -151058, -878714, -1462202, -1444735, -967858, -473547, -146556, 139585, 485140, 779640, 834802, 604046, 234283, -98499, -331952, -400747, -106614, 603946, 1287262, 1370614, 961525, 791090, 1174448, 1629092, 1833700, 2212981, 2953298, 3182972, 2117420, 537059, -25072, 637251, 1301152, 1244780, 1030532, 1155254, 1189838, 809685, 600210, 1073954, 1678138, 1566863, 807304, 139643, -6725, 314829, 921464, 1486262, 1602672, 1335428, 1242581, 1450938, 1340220, 642517, 109395, 381257, 915105, 916838, 688614, 987123, 1537651, 1390655, 517283, -131760, -97236]
41358i7236K61366J77847L02118K83039m13087j252766j261699m37676M50906
41349a987188R93364J146992O83338l64553j172127j024376l31439J16067L23719
41340a616203N77392M82446k47720o99260P3425J251418J229384J13811m73036
41331F91657j6442L03387j16398l24061K62304O87245J66439m91929k87493L34206
41321A208915M16210R1233L9461J25503j86755o26886n28002n7783P2931j49940
41311D04887j45083J25433J36605j76394l24125j66234k8478Q3277N01690J039317
41301A450895R81260J79050n93068o90341l88021k75563l78643k95801J10151
41292I9919N24523N69509K14329j47554q1273L06016L80373j45384o59918m60470
$$ y = [-97236, 164130, 341977, 644095, 927134, 514047, -738719, -2000418, -2438094, -1987188, -993824, 153168, 836506, 471953, -700174, -1724550, -2055989, -1939922, -1616203, -1038811, -556365, -804085, -1503345, -1429920, -178502, 1050882, 1164693, 691657, 675215, 978602, 862204, 538143, 800447, 1487692, 1654131, 1162202, 874709, 1208915, 1625125, 1716358, 1755819, 1881322, 1694567, 1067681, 539679, 481896, 554827, 404887, 259804, 385237, 521842, 345448, 21323, -144911, -173389, -90112, 411578, 1450895, 2432155, 2611205, 2018137, 1327796, 939775, 664212, 285569, -10232, 99919, 624442, 1193951, 1408280, 1260726, 1179453, 1485469, 1865842, 1720458, 1060540, 600070]
41282F00070J72328L89652Q2221q6703M8044j38252p78766r66554j47976P70344
41272e5592O16752k99415o70232j43880L09382N4166k58640J41662Q47604Q72018
41262A413825J16235n22572m16281Q4799L34057K34779Q4672n1492l37794o40251
41252B99977m92157K38067R57335R21434R9638p71991r89257n54273m3181L4678
41242b99730l20878o97869p22308m04888m2952J77862L50575N66001O56798M32324
41232c05065O7955k4780K44684M75246L10224k7342K5979N96718J054043O70397
41222C088059m23042j207854r07644M5767N42026K11048k14245q7021K31802J08662
41212A387558k38483j20662L69211L88411k94608q46706o27727j39385j39172
$$ y = [600070, 772398, 1162050, 1244271, 1157568, 1205612, 1067360, 288594, -677960, -825936, -55592, 561160, 261745, -408487, -552367, -242985, -188819, -447459, -305797, 541807, 1413825, 1530060, 1007488, 591207, 676006, 1010063, 1244842, 1329514, 1278022, 940228, 299977, -192180, 45887, 1003222, 1924656, 2024294, 1252303, 263046, -291227, -334408, -299730, -620608, -1318477, -2040785, -2445673, -2488625, -2310763, -1960188, -1394187, -737389, -305065, -237110, -261890, -17206, 458040, 768264, 740922, 766901, 1363619, 2417662, 3088059, 2665017, 1457163, 549519, 595286, 1137312, 1348360, 1134115, 1047094, 1278896, 1387558, 1149075, 1028413, 1397624, 1786035, 1491427, 644721, 16994, -122391, -261563]
41203b61563l93571r8381P41110J190925P03766j50072n27599l46611p1578J49242
41193I35668N54963J048568R92099L0747j198671j615240r04467J74833P31009
41184G49509O25246K86675K9703j37502k80363m45201o33174o28039j28770O45250
41174H3334Q80785K12029n47569m23760K73959M39333o2293k51242K10278L82755
41164A197609k93009q84860m20472M80669N54978j52125n02391r5741L46810L58197
41154E89665L03353M07866K65348k94743o84949l95308K44411N83974M74792J84701
41144A679110j08833l42965l75896j40123J64321K81225J97677R3863J02131J84053
41134A734563J60543r1728l75227l03288Q4874J56095m36865j013180o63845L56033
$$ y = [-261563, -655134, -753515, -12405, 1178520, 1882286, 1732214, 1204615, 858004, 786426, 935668, 1490631, 2539199, 3531298, 3562045, 2363374, 748134, -156333, 18500, 749509, 1374755, 1661430, 1691133, 1553631, 1273268, 828067, 194893, -433146, -561916, 83334, 964119, 1176148, 628579, 204819, 478778, 918111, 855818, 604576, 814854, 1197609, 904600, 19740, -400732, 79937, 634915, 482790, -19601, -115342, 231468, 589665, 893018, 1300884, 1566232, 1271489, 586540, 191232, 435643, 1019617, 1494409, 1679110, 1570277, 1227312, 851416, 711293, 875614, 1156839, 1354516, 1448379, 1550510, 1734563, 1895106, 1803378, 1428151, 1124863, 1209737, 1365832, 928967, -84213, -748058, -392025]
41124c92025Q29342K49146n02094m27163L18063Q48063P15044J93474k49706l54866
41114A227278j48187R4101J00527o7757j35676m0682O3040J45278K33919J40881
41104A612722k01918l10290J98241O73421J80775p97332o89071P51281J708597
41095C126426Q04757q66592j349153n45214L2107l38329q59915p35520j44730
41086h76163M04885P16376P11432L41929j57763m47899m85231l39133Q8473O31292
41076E88198O34955o6267m75330K32757J152371P34120p73535j454578m62064
41067A10627Q29122Q99753L4716n34102m01964m9954J44035J19416j74830o07221
41057C69598o97732j58461O24063R89426O71091p9188p21568p61694k74936p198
$$ y = [-392025, 437317, 686463, 184369, -242794, 75269, 923332, 1638376, 1831850, 1582144, 1227278, 1079091, 1173192, 1273719, 1205962, 1070286, 1029604, 1092644, 1237922, 1471841, 1612722, 1410804, 1100514, 1298755, 1972176, 2152951, 1355619, 666548, 1417829, 3126426, 3931183, 3064591, 1715438, 1170224, 1202331, 864002, 4087, -731433, -876163, -471278, 245098, 956530, 1298459, 1140696, 692797, 207566, -131567, -43094, 588198, 1223153, 1156886, 681556, 914313, 2066684, 2800804, 2027269, 572691, 110627, 939749, 1839502, 1874218, 1340116, 938152, 888198, 1032233, 1151649, 976819, 369598, -328134, -486595, 137468, 1126894, 1797985, 1718797, 997229, 235535, -39401, -46599]
41047d6599l89402o79165M4077J229776J418592M83722j30535K49371N12342j96224
41037B495955r73285p89130k31519k58420m04234J74947Q31209M01801n95230
41028F52094o46076K09135M46122l36439p89531j26852O91878O94971K83171J18820
41018A197293k8626m26240m99238J66493P93625M19475o41474j254357r59060
41009a232109k21398M35903P96159P08573J81760m00878o45314n68204l18303
41000a263811J76884Q50867J164980P12290q7856m61381k84286q7406j72450k60589
40990B87242l4910M05404P15929O49087J97822l80213o88217n20379n5003L60219
40980I36981M98967K83792k20107o89688p00051k24501K46375K92084K0503k62133
$$ y = [-46599, -436001, -1115166, -1071089, 158687, 1577279, 2061001, 1930466, 2179837, 2692179, 2495955, 1522670, 733540, 502021, 243601, -160633, 14314, 845523, 1247324, 652094, 6018, 215153, 661275, 324836, -464695, -591547, 100331, 795302, 1078473, 1197293, 1168667, 742427, 243189, 409682, 1203307, 1622782, 981308, -273049, -1232109, -1453507, -1017604, -221445, 487128, 668888, 268010, -377304, -945508, -1263811, -1086927, -236060, 928920, 1641210, 1553354, 1091973, 807687, 720281, 547831, 287242, 252332, 657736, 1373665, 2022752, 2220574, 1840361, 1152144, 631765, 576762, 936981, 1435948, 1719740, 1499633, 809945, 109894, -114607, 131768, 423852, 444355, 182222]
40970A82222n06597p26735o62641q6931O99509J083960Q09253J57108m22054o11438
40960h4344l37512J08126K07946j86642n28132j91267O69699J233030R52471J04487
40950A947862n77806n90762n3685L80239J32020n90621r00877l00835O36875J005964
40940A088374O87768K61191N6052q9230k52263k69840j75563j97689k73423j49608
40930F85769R634j84881m49933J3029J101185J444438J92452j489062j681993
40921c59362j92185J221910J123942l122p36610n34038K588K43431K16700K09879
40911A193133K33447J16729j29162l07198l10882k00953k9936K02296L81777L07935
40901A457186K5789j07174P0497J82416j27277m79839k07923M75275N11338m52368
$$ y = [182222, -324375, -1051110, -1713751, -1800682, -1101173, -17213, 792040, 949148, 527094, -84344, -421856, -313730, -105784, -292426, -820558, -1011825, -342126, 890904, 1843375, 1947862, 1370056, 779294, 725609, 1105848, 1237868, 647247, -253630, -554465, 82410, 1088374, 1776142, 2037333, 2093385, 2004155, 1751892, 1482052, 1306489, 1108800, 835377, 685769, 695403, 510522, 60589, 73618, 1174803, 2619241, 2811693, 1322631, -359362, -551547, 670363, 1794305, 1791183, 1054573, 520535, 523123, 766554, 983254, 1193133, 1426580, 1543309, 1414147, 1106949, 796067, 595114, 565178, 767474, 1149251, 1457186, 1482975, 1375801, 1446298, 1628714, 1501437, 1021598, 813675, 1288950, 1800288, 1347920]
40891A347920j283396q33419L51948P55992Q5721l98115Q7711O66724L04264m78429
40881F06921m49483L27050N77730j65400q58641n91675J15149L11853J08693K77288
40871B59485Q44100J071362P03484K84053J04087k84545j101073j588994q99658
40862f07699O07424J594122J250537J24315o24191m72816J01239L38326Q1195
40853B392452j38507J19225N36803M26980k71328p99018n47778J42025M62756
40844B323610J55925l17651m63992k47513K5864P699m35032r76402r66618j55171
40834a049281Q31015J141277P59968M27977N07219N10528k5574p35758q95735
40825A471636l66988L27395O64152N08688J7410m85457o28209l17792R5009K32417
$$ y = [1347920, 64524, -768895, -416947, 339045, 424766, 26651, 114362, 781086, 1085350, 606921, 157438, 484488, 1062218, 896818, 38177, -553498, -438349, -126496, -17803, 259485, 1103585, 2174947, 2878431, 3162484, 3266571, 2982026, 1880953, 291959, -607699, -275, 1593847, 2844384, 2968699, 2344508, 1871692, 1972931, 2311257, 2392452, 2253945, 2373170, 2909973, 3336953, 3065625, 2266607, 1718829, 1860854, 2323610, 2479535, 2161884, 1697892, 1450379, 1476243, 1483942, 1048910, 72508, -894110, -1049281, -218266, 923011, 1682979, 2110956, 2618175, 3128703, 3103129, 2367371, 1471636, 1104648, 1432043, 2096195, 2604883, 2622293, 2136836, 1508627, 1190835, 1285844, 1518261]
40815A518261J80330K66215M50095L52712p7329l67717j94305J15399O6236k77883
40805B032014m58593l80458m05633o19084n17379K19752J014348R93866K04371
40796B083204l67679j11320M29892M30341m1263k69434m2915J18929j06433l42690
40786A780632j87713J22363J27337r6170o9031K80715L96368j53804r58397j094246
40776A48054k07775R56206J329794P40370J5241j79802j28562l79446p60237o98654
40766H35189k31908P2616R2280J93907K85354j72622r32848q37568M31372J478382
40756A214154J021360k06223n53397J24246N23097J19581j80461J96560N22626
40747B781543J29876m47040m66680j85886k00410l18259m6960L22186J28649m46054
$$ y = [1518261, 1698591, 1964806, 2414901, 2767613, 2690284, 2322567, 2128262, 2243661, 2309897, 2032014, 1573421, 1192963, 787330, 168246, -349133, -129381, 884967, 1878833, 2083204, 1715525, 1604205, 2034097, 2464438, 2423175, 2153741, 2110826, 2229755, 2123322, 1780632, 1592919, 1715282, 1842619, 1746449, 1677418, 1958133, 2354501, 2200697, 1242300, 148054, -59721, 896485, 2226279, 2966649, 2981890, 2802088, 2673526, 2294080, 1533843, 835189, 603281, 675897, 768177, 962084, 1247438, 1074816, 141968, -695600, -264228, 1214154, 2235514, 2029291, 1475894, 1600140, 2123237, 2242818, 2062357, 2258917, 2781543, 2911419, 2464379, 1997699, 1811813, 1611403, 1293144, 1246184, 1568370, 1697019, 1250965]
40737A250965n64819n8137L41322J84973o8946J18643N43282O24862K12959l04522
40727B280582m92105k58213J16770K48896M1762k10844k19483n5374P6639J98186
40717A726816L61004L17650j30916o04585n43626j03647j605l79261n34186o4988
40707D2656M19398K37687k91986l84930j5462J41351j59790m11648k36777N4522
40697f04979L4731j86450k00299R0859L90037L89949O6679k91672k68057K83691
40687b95511R29779R83584L04637m45543n54516p9329L25429K32986k01331n91642
40677F08543o67736l08243L65214Q46385O07372j82949o53783k48896N33314P77091
40667A676312K86844l56810o88062p23664m93012R9894P45501P41765j5868o02175
$$ y = [1250965, 686146, 628009, 969331, 1154304, 1085358, 1204001, 1747283, 2372145, 2585104, 2280582, 1788477, 1530264, 1647034, 1895930, 1937692, 1726848, 1507365, 1451991, 1528630, 1726816, 2087820, 2405470, 2274554, 1669969, 1126343, 1022696, 1021091, 641830, 107644, 42656, 462054, 699741, 407755, 22825, 7363, 148714, -11076, -422724, -659501, -604979, -570248, -756698, -956997, -866138, -476101, -86152, -19473, -311145, -579202, -295511, 634268, 1617852, 1922489, 1476946, 922430, 843101, 1168530, 1401516, 1200185, 608543, -59193, -367436, -2222, 844163, 1451535, 1268586, 614803, 365907, 899221, 1676312, 1963156, 1606346, 918284, 194620, -298392, -198498, 547003, 1288768, 1272900, 670725]
40657F70725k22388N85714O40077j84614p59884l01155N94970Q68478L89383q5393
40647B195913o0874J38290j6373m64166o14076j27431N82581Q24028N10137K12616
40637C180645K47668K02815k72089p15745n48056j23754k11258o14582l87778
40628G57866M93374Q48360J06079p10601n22581K51486N82829M44602M37668M42044
40618C131126q4214q04969q22122k21043l5772n34821p52807r0464P06783P26816
40608A218513J81859j18436M7625K75392K48259k3491l75814n55859l96563j13346
40598C88139o6498j50959O0980N01222O13552L34014K58310N37353M98306j35913
40588B838506n45851o4591O39753N20499k77132p38186m88182p7726J2147j50217
$$ y = [670725, 448337, 1034051, 1674128, 1489514, 729630, 428475, 1023445, 1891923, 2281306, 2195913, 2135039, 2273329, 2256956, 1792790, 1178714, 1051283, 1633864, 2457892, 2968029, 3180645, 3428313, 3631128, 3359039, 2643294, 2095238, 1971484, 1760226, 1145644, 757866, 1251240, 2099600, 2205679, 1495078, 972497, 1223983, 1806812, 2251414, 2689082, 3131126, 3046912, 2241943, 1419821, 1198778, 1163006, 628185, -124622, -215086, 491697, 1218513, 1400372, 1281936, 1329561, 1604953, 1853212, 1829721, 1453907, 898048, 501485, 388139, 321641, 170682, 231662, 732884, 1346436, 1680450, 1938760, 2476113, 2974419, 2838506, 2292655, 2228064, 2867817, 3388316, 3111184, 2372998, 1884816, 1807090, 1819237, 1669020]
40578A669020l12630k49193J77415O34821M18750m57739q59126o1670R19181O68738
40568B547567m52466q61667k27066J87701k46402n68051j0432P05093O66943K05852
40558A947072J04408K79937K18331L5885J58887M31251M07712J77364J29445J97446
40548D087738L1246l30706n80734o85706p45142n82637o8088L92986K87691k45733
40538A560915n97107m67059m5599L72323N47531L54648P1532K31996P59152P64069
40528C552401j80462j122253r31012L4070M75245P7606k77609j33888k9434k26307
40518A238357j10935N83956J007999M25039n50205q01951k73158J87450J96254
40509A902806J57146L13744L43559P8243p0587K09947N00097K01474m83694o87734
$$ y = [1669020, 1356390, 1107197, 1284612, 1919433, 2338183, 1880444, 1021318, 959648, 1878829, 2547567, 2095101, 1233434, 1006368, 1194069, 947667, 379616, 369184, 1074277, 1741220, 1947072, 2051480, 2331417, 2549748, 2585633, 2744520, 3175771, 3583483, 3760847, 3890292, 4087738, 4118984, 3788278, 3207544, 2521838, 1776696, 1194059, 1125971, 1518957, 1806648, 1560915, 963808, 496749, 451150, 823473, 1371004, 1725652, 1797184, 2029180, 2788332, 3552401, 3371939, 2249686, 1318674, 1352744, 1827989, 1905595, 1627986, 1494098, 1464664, 1238357, 1127422, 1711378, 2719377, 3144416, 2594211, 1792260, 1519102, 1706552, 1902806, 2059952, 2373696, 2717255, 2795498, 2724911, 2934858, 3434955, 3636429, 3152735, 2465001]
40499B465001p6797N92546M82584j16390k03209L95600O77556n3366j069595j199012
40489A894918m29516K27817K06541j01445k24212j96652j64716r2340j7446j0745
40479A092204J90042Q31762J370771R05135l67621j060554m67315L76455K49758
40470C120637m30005l75720M84834R11819K66848o28082q41655o07513o73322
40461A227841r80651p33348L43004J403451J385621K93113p26063o79545J14801
40452A648224M97464J5685n11672k03895O12986Q80820K84534l97461m37048n9309
40442B330328N7842k15386l67826n0382M00899M21592L3595j25863K96165P73768
40432C554732N91097r0608m46549k43392j44023n26342p93636m11130P8553r4255
$$ y = [2465001, 2388204, 2980750, 3463334, 3346944, 3143735, 3539335, 4216891, 4163525, 3093930, 1894918, 1465402, 1693219, 1899760, 1798315, 1574103, 1377451, 1212735, 1120395, 1102949, 1092204, 1282246, 2114008, 3484779, 4389914, 4022293, 2961739, 2494424, 2870879, 3120637, 2690632, 2314912, 2799746, 3711565, 3978413, 3350331, 2508676, 1901163, 1227841, 247190, -486158, -143154, 1260297, 2645918, 2939031, 2212968, 1533423, 1648224, 2145688, 2161373, 1649701, 1445806, 2058792, 2939612, 3224146, 2826685, 2389637, 2330328, 2388170, 2172784, 1804958, 1754576, 2155475, 2577067, 2610662, 2484799, 2780964, 3554732, 4145829, 4055221, 3608672, 3365280, 3221257, 2694915, 1901279, 1490149, 1568702, 1474447]
40422A474447n63575l51053M54640O75413j41624r45401o96928J77260N36326
40413F19505J61900j57713O3265L96373K82107j61907l95804j90255K09844N01734
40403A329049N83289M10764m5688n28554n07070J54341P70915O17294R332j06990
40393B686682L16523K45394p17561j430695q36588L50071O87855J56136n4534
40384A403283M05088O54164K96019O8650L87984N50278K7501n39818m09675Q4240
40374B927714K04582n9916k70477l08344k04241J59914N46656K79454o41210j120348
40364A513784m88455L71767M09439J04368N28614J370172J382031M55644k81808
40355E365556l43301l53277n53493l40343L57343O24141L1514o15023o00649l11352
$$ y = [1474447, 910872, 559819, 1014459, 1689872, 1548248, 602847, -94081, 83179, 619505, 781405, 623692, 686957, 1083330, 1365437, 1203530, 807726, 617471, 827315, 1329049, 1912338, 2323102, 2277414, 1748860, 1241790, 1396131, 2167046, 2784340, 2793672, 2686682, 3003205, 3248599, 2531038, 1100343, 263755, 613826, 1301681, 1457817, 1403283, 1808371, 2462535, 2758554, 2827204, 3215188, 3765466, 3792967, 3253149, 2843474, 2927714, 3132296, 3072380, 2801903, 2493559, 2289318, 2449232, 2995888, 3275342, 2634132, 1513784, 1025329, 1397096, 1806535, 1910903, 2439517, 3809689, 5191720, 5647364, 5365556, 5022255, 4668978, 4115485, 3775142, 4132485, 4756626, 4788140, 4173117, 3572468, 3261116]
40345C261116k87317k69749P5538L61107J89581p0783K2717J86068L7965j15636
40335C390607Q8994K58151r1564n50319l97667J97237M40179J32688j91556j87431
40325C089319j6417J29194J66276o6942n30272p11109k56512L52615M21162Q9431
40315B666745L2430L39228N10597M10188L33680K18582k57757p69138n55692K52573
40305C181436N54533q6091o90703l44401M11670M53409k45493o82354l11377L29475
40295B570104M77008N7764l75310l00758K70491Q13920Q08724K64480l68009p47447
40285C470967q34784o02210k0611N62356N57849p4704o28751n79710k81155l06299
40275A262948m94024k34117N06263J045795Q75550K10756m02690o52789n38006
$$ y = [3261116, 2973799, 2704050, 2779588, 3140695, 3330276, 3259493, 3282210, 3468278, 3506243, 3390607, 3479601, 3737752, 3646188, 3095869, 2698202, 2895439, 3335618, 3468306, 3276750, 3089319, 3072902, 3202096, 3368372, 3301430, 2771158, 2060049, 1803537, 2156152, 2577314, 2666745, 2699175, 3038403, 3549000, 3959188, 4292868, 4511450, 4253693, 3484555, 2928863, 3181436, 3735969, 3649878, 2959175, 2614774, 3026444, 3479853, 3234360, 2552006, 2240629, 2570104, 3047112, 3104876, 2729566, 2428808, 2699299, 3513219, 4321943, 4586423, 4218414, 3470967, 2636183, 2033973, 2013362, 2575718, 3133567, 3058863, 2430112, 1850402, 1569247, 1262948, 768924, 534807, 1041070, 2086865, 2962415, 3173171, 2770481, 2117692, 1579686]
40266A579686j95987J73034L65125K90986L1606k08956k16486L6946K77305K04143
40256B337402n1537j9976M02892O76222L52056j94322k34586K51858N26170J59680
40246D205859l62244l75126J7110J68246j08229k88883j1088K83160r934o37483
40236B881388p26161p1624M67763K01687l59864l02463K99427N82780K86409M1368
40226C300710K14073L47489N0945l18358k84070N6624L91888O88577R10739Q06323
40216F164940M23078K68129M65776L73999l58696r86875o91383J31465M95378
40207F285811L15983K94916N93269O75598M08936L10955O05590R14590J062369
40198A1468017J432160K310523L416489M102287L571721J292628j952014l866172
$$ y = [1579686, 1383699, 1556733, 1921858, 2212844, 2244450, 2035494, 1819008, 1855954, 2133259, 2337402, 2285865, 2265889, 2668781, 3345003, 3697059, 3502737, 3268151, 3520009, 4046179, 4205859, 3843615, 3468489, 3485599, 3653845, 3545616, 3256733, 3245645, 3528805, 3518871, 2881388, 2155227, 2083603, 2551366, 2753053, 2393189, 2090726, 2390153, 2972933, 3259342, 3300710, 3514783, 3862272, 3913217, 3594859, 3310789, 3367413, 3759301, 4447878, 5358617, 6164940, 6588018, 6856147, 7321923, 7695922, 7337226, 6350351, 5658968, 5790433, 6285811, 6601794, 6896710, 7489979, 8165577, 8574513, 8885468, 9491058, 10405648, 11468017, 12900177, 15210700, 18627189, 22729476, 26301197, 27593825, 25641811, 21775639]
40190B1775639k819727j10223J432326J177925J252062K821195L810088J748843
40182C1088128k513857n696375n922320m090537j980882o52937m98828j247773
40174H484619j728809r23026N21134R39958k0291r10609o05463K61923N08574
40165F528010J0451n65398q18033p06483k20817L96219O11374L18579P4716J55393
40155E784011L5149n90301r78684l98245N44571O52840j07887o61111m89488j61560
40145C629295j05514M3160M92846O62682J24096n35782n21164k5614J33877j93840
40135C704042l57462l0415K63678Q952m48775l45167M16293J050571Q38351K1794
40125E121862m79612j93468L48880L45227k17217n98655l50137J29616K43635
$$ y = [21775639, 18955912, 18845689, 20278015, 21455940, 22708002, 25529197, 29339285, 31088128, 28574271, 22877896, 16955576, 12865039, 10884157, 10231220, 9732392, 8484619, 6755810, 5832784, 6353918, 7293876, 7273585, 6362976, 5757513, 6019436, 6528010, 6538461, 5973063, 5155030, 4448547, 4227730, 4623949, 5235323, 5553902, 5628618, 5784011, 5819160, 5228859, 4250175, 3851930, 4396501, 5049341, 4941454, 4280343, 3790855, 3629295, 3523781, 3566941, 4059787, 4722469, 4846565, 4310783, 3789619, 3764005, 3897882, 3704042, 3346580, 3316165, 3579843, 3588795, 3140020, 2794853, 3211146, 4261717, 5100068, 5121862, 4642250, 4448782, 4797662, 5142889, 4925672, 4327017, 3976880, 4106496, 4350131]
40116D350131L558j35986J8112K42899L18849K48492J09749p528L6918K46015
40106E431209L01155j12374p68254r86752l71950P04158J415905J207814K83580
40097G104491n15736m77649J90549N78568K67622j07110J20841N77971N28573
40088H268120K16239N02826J303503J556652R16376K61244R5053l11653j424420
40079A1383940k239135j674411l24556L96170K55795R4582J70582r117l88015
40070G665835k50034N20934J257051J675114K060998K165506J207903o45346k021879
40061A3636082k112982j631716j420230j189711m44551L00012K31471m59514r22700
40052E986161q39934m83442l4093L74192L42483k55031p47763m53040K99965O61088
$$ y = [4350131, 4353689, 4217703, 4235815, 4478714, 4797563, 5046055, 5155804, 5148276, 5185194, 5431209, 5732364, 5619990, 4851736, 3864984, 3493034, 4197192, 5613097, 6820911, 7104491, 6588755, 6111106, 6301655, 6880223, 7147845, 7040735, 7161576, 7739547, 8268120, 8484359, 8987185, 10290688, 11847340, 12763716, 13024960, 13120013, 12808360, 11383940, 9144805, 7470394, 7145838, 7542008, 7797803, 7892385, 8062967, 8053850, 7665835, 7415801, 7936735, 9193786, 10868900, 12929898, 15095404, 16303307, 15657961, 13636082, 11523100, 9891384, 8471154, 7281443, 6836892, 7136904, 7368375, 6908861, 5986161, 5146227, 4662785, 4628692, 5002884, 5345367, 5090336, 4342573, 3889533, 4189498, 4850586]
40042D850586M68764J90037n0553m67812p82112l71693O09632J113106N07362
40033F067317n84397j069622n95020K69046P37327N08069n3284l36177j77607
40024D765652r493j60766l00473M9996O74444Q32366K31459n90384q93915m68912
40014D129974K58916O48889M25395n3279k49121j56931j83224l12414o4247N01751
40004D945709N77237r1249n40075L468Q35717Q69994L09625N5917M9736l74809
39994F641270q66502m18267O77930R02810j49528j064456p92720q8821R584j82971
39984D668329R0421N29301L34098m30128j055768j244237j053378l59047O99388
39975B178979J248959O78171k58823l50874L20814O12004J80422m0329N39470
$$ y = [4850586, 5319350, 5509387, 5458834, 4991022, 4208910, 3837217, 4446849, 5559955, 6067317, 5482920, 4413298, 3818278, 4087324, 4824651, 5332720, 5279436, 4943259, 4765652, 4756159, 4595393, 4294920, 4344916, 5019360, 5851726, 6083185, 5492801, 4598886, 4129974, 4388890, 5037779, 5463174, 5409895, 5160774, 5003843, 4820619, 4508205, 4443958, 4945709, 5522946, 5431697, 4891622, 4895090, 5730807, 6600801, 6910426, 6966343, 7016079, 6641270, 5774768, 5356501, 6034431, 6937241, 6787713, 5723257, 4930537, 4841716, 4851300, 4668329, 4758750, 5288051, 5622149, 5192021, 4136253, 2892016, 1838638, 1479591, 2178979, 3427938, 4106109, 3847286, 3496412, 3817226, 4429230, 4609652, 4569323, 5108793]
39966E108793J116303O49915n85671j299025p97151K54965P39101L78130j33885
39957E431475j80652K261j38237m95392m48379P1721L74090R4477j94459R0193
39947D607098N82589N52779M5547k57979j03914R0090J0296j38363q6476R3067
39937E394734J80518J00655r9750l41762m86512l72127K4475M92947O90189M22748
39927F006115p0340k48623Q9699M53446L00300j43264k48463m2582j33601n27966
39917E434721m55537K90077P83870L53121l17433k83176J61724Q5662m66781n82814
39907E003434j6323M61069L06652j16808l01447k49802r2523K95308R08804J275048
39897G473412R07143m6909q39244q23441j35031L62135J7782p31217q44211j07039
$$ y = [5108793, 6225096, 6875011, 6289340, 4990315, 4193164, 4448129, 5187230, 5565360, 5431475, 5250823, 5253084, 5114847, 4619455, 4171076, 4242797, 4616887, 4711364, 4516905, 4607098, 5189687, 5742466, 5788013, 5530034, 5426120, 5516210, 5526506, 5388143, 5301667, 5394734, 5575252, 5675907, 5576157, 5234395, 4747883, 4375756, 4400231, 4893178, 5583367, 6006115, 5935775, 5687152, 5776851, 6230297, 6530597, 6387333, 6138870, 6096288, 5962687, 5434721, 4979184, 5269261, 6053131, 6406252, 6088819, 5805643, 5967367, 6053029, 5586248, 5003434, 4987111, 5448180, 5754832, 5638024, 5336577, 5086775, 4994252, 5289560, 6198364, 7473412, 8380555, 8333646, 7494402, 6670961, 6535930, 6898065, 6915847, 6184630, 5340419, 5233380]
39887E233380N51886M62886J69265L87720P57457N29614m6253j12819L21224M43131
39877H697491Q9059j9805L59560M91804q1016o93304n16190K70448Q19163P34100
39867A0151310L79052K57851M13229M49345J09946k44630o6346M10643K71664
39858A2132064o25829j104534l53101O16213L55215p67627j149170m59814P5650
39849H719067j02281j51386L14299L83612l54597p36278J66596J407386J552494
39840A1198912P45658J47857O7130p2236l76589l34854J49116N44990M60343l4757
39830A2495570o63066j011267o95209M8002L89695L2995k80270L9127M43046K15651
39820A1014274k84723k96525M3359J03044n3742L8586K14058O8797j4665N45399
$$ y = [5233380, 5785266, 6248152, 6417417, 6805137, 7562594, 8092208, 8045955, 7933136, 8254360, 8697491, 8786550, 8766745, 9126305, 9618109, 9537093, 8843789, 8327599, 8598047, 9417210, 10151310, 10530362, 10788213, 11201442, 11650787, 11760733, 11516103, 11449757, 11860400, 12132064, 11506235, 10401701, 10048600, 10664813, 11020028, 10252401, 9103231, 8643417, 8719067, 8616786, 8465400, 8779699, 9163311, 8808714, 8072436, 8239032, 9646418, 11198912, 11944570, 12092427, 12159557, 12087321, 11710732, 11375878, 11524994, 12069984, 12530327, 12495570, 11832504, 10821237, 10126028, 10174030, 10563725, 10596720, 10316450, 10355577, 10798623, 11014274, 10729551, 10433026, 10476385, 10579429, 10525687, 10564273, 10778331, 10847128, 10832463, 11377862]
39810A1377862J247097J125136M38386L32657Q92022J030285M68094K56075Q75450
39801A8043064J282447N77880n87776j114952r64995p27891n46563l47944m15529
39792A5197741q34717r58343l02136N13425N66466l6503m81114n39801o40891
39783A2484127q51231p14558j28872L93111M86008L67586L78335N63647Q22026
39774A3800179J044016J002482M98171k54489p10320n90162j35427L18449P33767
39765A5706666J177018J484015J408433J064764R45535J301918J617555J043528
39757B5749432m87143j902712k118330j303993n42213l66517l06795O6534M31676
39748A9219939M07309K94571N87858J187116J606173J600407J133708J55208j025811
$$ y = [11377862, 12624959, 13750095, 14188481, 14521138, 15413160, 16443445, 16911539, 17167614, 18043064, 19325511, 19903391, 19315615, 18200663, 17235668, 16507777, 15961214, 15613270, 15197741, 14363024, 13404681, 13102545, 13615970, 14182436, 14145933, 13664819, 13125018, 12484127, 11632896, 10918338, 10789466, 11182577, 11668585, 12036171, 12414506, 12978153, 13800179, 14844195, 15846677, 16344848, 16090359, 15380039, 14789877, 14654450, 14972899, 15706666, 16883684, 18367699, 19776132, 20840896, 21786431, 23088349, 24705904, 25749432, 25262289, 23359577, 21241247, 19937254, 19395041, 19028524, 18721729, 18788263, 19219939, 19627248, 19921819, 20509677, 21696793, 23302966, 24903373, 26037081, 26192289, 25166478]
39739B5166478j551978r17459J72272N16761j48855j044195j463969j320161p37416
39730A8671478Q0731N94776L58658j67549o551R17693J497185R33830j18795l84304
39720B2377152M73864J558387J812226J129438M72690Q53897K055358K688306
39712C3421318J944990Q34259Q84271K015369K820305K734190K535512K655589
39704D9845803K594539K412201L122032M837521O106754O057057N699742O108012
39696H6783661P006727Q376335J1452064J6522050K2046341K7974167L6497438
39689B16658783M5273147M3130599K0208277j6748472m6279537n3021061m1932278
39682A67289458k8559668k0676261j5293068r475599n458767m867785n077003
$$ y = [25166478, 23614500, 22697041, 22869313, 23386074, 23237219, 22193024, 20729055, 19408894, 18671478, 18752209, 19346985, 19705643, 19538094, 19531543, 20449236, 21946421, 22880251, 22761456, 22377152, 22851016, 24409403, 26221629, 27351067, 27823757, 28677654, 30733012, 33421318, 35366308, 36200567, 37084838, 39100207, 41920512, 44654702, 47190214, 49845803, 52440342, 54852543, 57974575, 62812096, 68918850, 74975907, 80675649, 86783661, 93790388, 102166723, 113618787, 130140837, 152187178, 180161345, 216658783, 261931930, 305062529, 325270806, 308522334, 262242797, 209221736, 167289458, 138729790, 118053529, 102760461, 93284862, 87826095, 82958310, 77881307]
39675G7881307l786205k372309k223736j723670M63692K479853K531252K240655
39667G5490839L712017N722568O213821O524097R364075J4153994J8630552K3883581
39659A63695544L2112429L8562997L2001468P697685k3336982m3107134m3936247
39652A63689760l3444159k3205894j7288966j3181367r171558o460241n603013
39645E5334562n078391l980042l382070m000122m520081l571175j926256j277013
39637B7599412j727628j944647j298635n21740l87779q15000j276614j306866
39629A8320503o70891L12604Q13229M60310q9302k10114l45826j037868j545538
39620A6007107p89604O70924J127052J68700q32575q52830l72160p3901J86307
$$ y = [77881307, 74095102, 71722793, 69499057, 67775387, 68239079, 70718932, 73250184, 75490839, 79202856, 84925424, 91139245, 97663342, 107027417, 121181411, 139811963, 163695544, 195807973, 234370970, 266372438, 274070123, 250733141, 207626007, 163689760, 130245601, 107039707, 89750741, 76569374, 67397816, 60937575, 55334562, 50256171, 46276129, 42894059, 38893937, 34373856, 30802681, 28876425, 27599412, 25871784, 23927137, 22628502, 22106762, 21718983, 20903983, 19627369, 18320503, 17649612, 17962216, 18775445, 19235755, 19146453, 18936339, 18590513, 17552645, 16007107, 15217503, 15888427, 17015479, 17184179, 16351604, 15498774, 15126614, 15052713, 15239020]
39611A5239020N82637P58694O49300P30880R52397O13939j70173k22891P68817
39602A9902620J428024P25736m01619n75765j3315J97057n8230j06910J34650
39593B1232248K32503K22785M36747P20182P53960P47915R96478J210336J044909
39584B7598063P47648N71902K29079l30001m02175L32928J035980J046217J054073
39575C1883714J751747K242919J269895o44597j821285j765910j430763j424127
39567C0061593j340162p53008K66595J481083K422543K386965J383893N09750
39559C6419252M52112M52519j47553m04443O79923K135764K383090J780417J828795
39550D5579876K534394K734874K521122K982907L814015L601718K508773K269359
$$ y = [15239020, 15821657, 16580351, 17229651, 17960531, 18912928, 19526867, 19356694, 19133803, 19902620, 21330644, 22056380, 21654761, 21078996, 21065681, 21262738, 21204508, 21097598, 21232248, 21464751, 21687536, 22124283, 22844465, 23598425, 24346340, 25342818, 26553154, 27598063, 28345711, 28917613, 29146692, 28816691, 28414516, 28747444, 29783424, 30829641, 31883714, 33635461, 35878380, 37148275, 36503678, 34682393, 32916483, 31485720, 30061593, 28721431, 27968423, 28235018, 29716101, 32138644, 34525609, 35909502, 36419252, 36871364, 37323883, 37176330, 36771887, 37451810, 39587574, 41970664, 43751081, 45579876, 48114270, 50849144, 53370266, 56353173, 60167188, 63768906, 66277679, 68547038]
39542F8547038L289089M053141L763406L313624L209305K770289J980136J910509
39534I2836537K543960K244172K67112k017333l151696l116992k312880q99113
39526H6393767L11724K66144m70877k26173J020072J590055J201730J546116L148767
39517I4781325M388417M548208N066731O629191P769807P614652P320668P636596
39509A45755595P878938Q351825J0586219J4316996J8072397K3303768L2213269
39502B60479007L9797374L5659467J8533278J609266m239684o425149j9585366
39495C25828193m2104103n5836326m9923070l3540345k1370880j6326969j2667952
39488I4058548q350569o117305o361102o399544n486902n122728n219616m280308
$$ y = [68547038, 71836127, 75889268, 79652674, 82966298, 86175603, 88945892, 90926028, 92836537, 95380497, 97624669, 97891781, 95874448, 92722752, 89605760, 87292880, 86393767, 86705491, 86971635, 86500758, 86274585, 87294657, 88884712, 90086442, 91632558, 94781325, 99169742, 103717950, 108784681, 115413872, 123183679, 130798331, 138118999, 145755595, 153634533, 161986358, 172572577, 186889573, 204961970, 228265738, 260479007, 300276381, 335935848, 354469126, 356078392, 351838708, 345413559, 325828193, 283724090, 227887764, 177964694, 144424349, 123053469, 106726500, 94058548, 85707979, 79590674, 73229572, 66830028, 61343126, 56220398, 51000782, 46720474]
39480D6720474k721460k368919l145181l321159k543991j934850j748988j371263
39472B7564663j020244j207763j196451j56839Q93360M62748q46475j289333p61979
39463B2441687m70474n40754k28003R8850m62434j216086o99751N96745P30813
39454B0250593m95927j178774l69037P11759R31763O96918N81824L40992m7702
39445B1422409O7299P54425J140390Q38000M69015L70345J17702k52541N1468
39436B4978512J109392J842866J621896J081227P83796L79801k22170j69281R31078
39427C2337117K035876K083782J462210J098413R54846M93947o5503j10328J71720
39418D0462080J8921o89548j321221j467128j302654j069776q30394o82772p10796
$$ y = [46720474, 43999014, 41630095, 38484914, 35163755, 32619764, 30684914, 28935926, 27564663, 26544419, 25336656, 24140205, 23983366, 24876726, 25339474, 24492999, 23203666, 22441687, 21971213, 21430459, 21202456, 21301306, 20838872, 19622786, 18923035, 19519780, 20250593, 19754666, 18575892, 18206855, 18918614, 19850377, 20547295, 21129119, 21470111, 21422409, 21489708, 22244133, 23384523, 24222523, 24691538, 25061883, 25179585, 24927044, 24978512, 26087904, 27930770, 29552666, 30633893, 31417689, 31797490, 31575320, 31406039, 32337117, 34372993, 36456775, 37918985, 39017398, 39972244, 40466191, 40400688, 40290360, 40462080, 40481001, 39791453, 38470232, 37003104, 35700450, 34630674, 33800280, 33117508, 32406712]
39409C2406712p58034o28700m02056k38780p8995J46368K62541J86882K73429
39400C1169367Q89728J790785K294987K025348J258198O75117R07516K041999
39392D3053045L366550L898516L360155K312588J239769R3699j003388j399416
39384E4921518q86982l85007q14505j750838k075929j600406j064032q01545n06147
39375D5036127j98950k48416l63211K03122J206353J444790O74613J88334P89447
39366D8732209J454617R65395k90242j316761k238379l566614m589544m209920
39358C4940761k927219k255434k391358k196433j419981j068579j342360j119637
39350B0219760p6773M75847k75341j279877j365746q95975o38398l93515N7494
$$ y = [32406712, 31648678, 31019978, 30617922, 30379142, 30300147, 30446515, 30709056, 30895938, 31169367, 32059095, 33849880, 36144867, 38170215, 39428413, 40103530, 41011046, 43053045, 46419595, 50318111, 53678266, 55990854, 57230623, 57324322, 56320934, 54921518, 54034536, 53649529, 52835024, 51084186, 49008257, 47407851, 46343819, 45542274, 45036127, 44837177, 44588761, 44225550, 44428672, 45635025, 47079815, 47754428, 47942762, 48732209, 50186826, 51152221, 50861979, 49545218, 47306839, 43740225, 39150681, 34940761, 32013542, 29758108, 27366750, 25170317, 23750336, 22681757, 21339397, 20219760, 20142987, 20618834, 20343493, 19063616, 17697870, 16801895, 16163497, 15769982, 15827476]
39341A5827476j1136r00768j365351l88225R48939R89730L1761l41516K36933
39332A5027843P83230Q23729P53711P03528N38558O38280J334921K049552K227585
39323B4880937K409973L165825M167929N758405R400562J3944122J3620681M211372
39315H1559806r415767j6803860j3816180o754690l282970l753696m034247k728052
39307B0970344j581784j243332p26416l0792m8745m83287l92308j18103m62707
39298A5882870p65651N5318J389066J905721J747601J804696J924413J859183
39290B5803217K583381M295492M681151K087336j020110j152364R71357K272312
39282D0521772L233842O774330J1082440R485488j87174j0927340j4629404j1337280
$$ y = [15827476, 15816340, 14915572, 13550221, 13161996, 14110935, 15100665, 15132426, 14790910, 15027843, 15811073, 16634802, 17388513, 18092041, 18630599, 19268879, 20603800, 22653352, 24880937, 27290910, 30456735, 34624664, 40383069, 49783631, 63727753, 77348434, 81559806, 72144039, 55340179, 41523999, 34769309, 31486339, 27732643, 23698396, 20970344, 19388560, 18145228, 17418812, 17388020, 17339275, 16855988, 16463680, 16345577, 15882870, 15117219, 15172537, 16561603, 18467324, 20214925, 22019621, 23944034, 25803217, 28386598, 32682090, 37363241, 39450577, 38430467, 37278103, 38249460, 40521772, 43755614, 50529944, 61612384, 71097872, 70910698, 59983358, 45353954, 34016674]
39274C4016674o917017m570741l015871j290317o00497j310887j781947j050202
39266A3479195j48619k7955j91509q8956j23993n02115n11631K09541P98142L89178
39256A3281278n81024j046607p22212j74245J32090K24501K07322o869m15022
39247A0899212o66377l90283J98365L42648l03263j003734p64905K43651P96196
39238I351510L03023l77358k62447L21681L51623l09042p96769n93455j78259
39229G810507j66868m08677k99836L24325R87108J179202Q67664L40291j87297
39220A0446419n87283o52185l22347k2153k43100p03377n57083K93593Q27395
39211H479879L60703l65128l37678J43931Q7767m50703m84393K10430P62237O49993
$$ y = [34016674, 27099657, 22528916, 19513045, 18222728, 17622231, 16311344, 14529397, 13479195, 13330576, 13302621, 13111112, 13022156, 12898163, 12396048, 11884417, 12093958, 12892100, 13281278, 12700254, 11653647, 10931435, 10757190, 10889280, 11113781, 11321103, 11314234, 10899212, 10232835, 9842552, 10040917, 10383565, 10080302, 9076568, 8311663, 8555314, 9351510, 9654533, 9277175, 9014728, 9336409, 9688032, 9378990, 8582221, 7988766, 7810507, 7643639, 7234962, 6935126, 7259451, 8246559, 9425761, 10293425, 10633716, 10446419, 9859136, 9206951, 8884604, 8862451, 8619351, 7915974, 7358891, 7652484, 8479879, 8840582, 8475454, 8137776, 8281707, 8369474, 7918771, 7434378, 7644808, 8407045, 9057038]
39201I057038L22436J57625r5326m80588m48032K05629Q05985O96907N7731n21897
39191I757508p26818n48597j83512j7278j73160j62576L39058O51863K8911q54238
39181H111161p04388K12596L52931m77419o66448M22363J171449L44125p83973
39172G982397n03187N53854N98074l27393n79928K88379R16658L90099n22234
39163H796719p77249m84415l93554p36554j055219q10973M1085R19343J155662
39154F654845P86431M43772L41340M6893m54072m20952K83027N12577m62894j473208
39144F257759r91826M49320R26869l0082q39120k90003Q26979J040141J21030
39135G471067r29773j176061n09683M90797J122857J177381J045919J034251Q43618
$$ y = [9057038, 9379474, 9537099, 9441773, 8961185, 8513153, 8718782, 9524767, 10221674, 10279405, 9757508, 9030690, 8482093, 8298581, 8281303, 8108143, 7945567, 8284625, 8936488, 8965399, 8111161, 7406773, 7619369, 7972300, 7494881, 6828433, 7250796, 8422245, 8766370, 7982397, 7479210, 8033064, 8631138, 8303745, 7723817, 8012196, 8928854, 9318953, 8796719, 8019470, 7535055, 7141501, 6404947, 5349728, 4538755, 4579840, 5499183, 6654845, 7441276, 7885048, 8226388, 8273281, 7819209, 7398257, 7681284, 8193861, 7730967, 6257759, 5265933, 5715253, 6642122, 6612040, 5772920, 5482917, 6309896, 7350037, 7471067, 6541294, 5365233, 4855550, 5346347, 6469204, 7646585, 8692504, 9726755, 10570373]
39126A0570373J79302m62599l37216L83849P76327M76039M6868n6418j07957m13815
39116A1054753o46996l02298N49902J292729J365317P29907n0293k01965M95790
39107A4286846J340441J415609O82409L5231K25419J037041J627441J463360Q21966
39098B2935763M75619R07476J805969K419011K406660K110294J912423J669761
39090C6642976J023865M1749p18799o97475J87822J375941J999299J698606J080124
39081D2634108R40659J062361L87598j452734l419115m202972l602213k443009
39073B9904683j555717j144674q63249k94887M65187Q35716P02737R21243K054880
39064C1025919L000600K113466l56699k328180k564206j855476j210279m87121
$$ y = [10570373, 10749675, 10287076, 9949860, 10333709, 11110036, 11586075, 11632943, 11576525, 11468568, 11054753, 10407757, 10105459, 10655361, 11948090, 13313407, 14043314, 13993021, 13791056, 14286846, 15627287, 17042896, 17725305, 17760536, 17985955, 19022996, 20650437, 22113797, 22935763, 23411382, 24318858, 26124827, 28543838, 30950498, 33060792, 34973215, 36642976, 37666841, 37708590, 36989791, 36292316, 36480138, 37856079, 39855378, 41553984, 42634108, 43574767, 44637128, 45024726, 43571992, 40152877, 35949905, 32347692, 29904683, 28348966, 27204292, 26341043, 26046156, 26511343, 27347059, 28049796, 28971039, 31025919, 34026519, 36139985, 35783286, 33455106, 30890900, 29035424, 27825145, 27338024]
39056B7338024M79375R84403P30611O65067J394749J912416J065539p16698k266642
39047C1586844l237222l713706l325080j998209p10340l06843l96160m08918o68916
39038A6821450j303095j334150k28902Q17292O03658j86345k87276J40885L57503
39029A5401020O23914J245207J353321N06673J36641J357283K748226K565420
39021B5937705J674385J777088K304555J969842J798338L278871N182704O190765
39013E0114253Q841555J5423082K0830273J6286336J633873j2239205j6064963
39006H4825204j2150866q454932p734538p278248n750008m676866m511367l876855
38998C0391524k472435j410731r41958m27528o2400l79383p27085k19338P07742
$$ y = [27338024, 27817399, 28801802, 29532413, 30197480, 31592229, 33504645, 34570184, 33853486, 31586844, 28349622, 24635916, 21310836, 19312627, 18602287, 18295444, 17899284, 17490366, 16821450, 15518355, 14184205, 13955303, 14772595, 15376253, 15189908, 14902632, 15043517, 15401020, 16024934, 17270141, 18623462, 19130135, 19266776, 20624059, 23372285, 25937705, 27612090, 29389178, 31693733, 33663575, 35461913, 38740784, 43923488, 50114253, 58955808, 74378890, 95209163, 111495499, 113129372, 100890167, 84825204, 72674338, 64219406, 56484868, 49206620, 43456612, 38779746, 34268379, 30391524, 27919089, 26508358, 25566400, 25138872, 25076472, 24697089, 23970004, 23750666, 24458408]
38989B4458408J408208K340000L616869M280352M974856Q374720J3653959J3747575
38981G6854947L486266j1186589j8242556j3909560o190098l110095l596119k736314
38973B1369882m11043J24084j264684j712705m68205N06373M35926N56856J220865
38964B0357349J355127Q93923R89719J688012J951301K026750L109513M607618
38956C6979312M819142M631002O789631J0307361R885811L735989j955006q86438
38948G4306804L653317K613455o019854j4177988j4627966r510810n302097l865792
38940B7069069k641834p05880J51314o37847j424715j260026q44271n76577j29106
38931A9000127J37713m09903j061782p09910n702k85216q51617L0962J748659
$$ y = [24458408, 25866616, 28206616, 31823485, 36103837, 41078693, 49453413, 63107372, 76854947, 80341213, 69154624, 50912068, 37002508, 30812410, 27702315, 24106196, 21369882, 20958839, 21082923, 19818239, 18105534, 17637329, 18143702, 18579628, 19136484, 20357349, 21712476, 22606399, 23596118, 25284130, 27235431, 29262181, 32371694, 36979312, 41798454, 46429456, 53219087, 63526448, 73412259, 77148248, 75193242, 74306804, 77960121, 80573576, 74553722, 60375734, 45747768, 36236958, 30934861, 27069069, 24427235, 23721355, 23872669, 23234822, 21810107, 20550081, 19705810, 19129233, 19000127, 19137840, 18727937, 17666155, 16956245, 16950543, 16665327, 15813710, 15844672, 17593331]
38922A7593331J849202J2907j392043j080134l40396k23423n4701M70427M04279
38913A7239449l17485l83951L48352L36574p31294j119226j53267N48262J38072
38904A5905486Q1315J191882J822774P49912n66786m31602N19912R30658R36229
38895B1139780J191596J488954J645009K058759K589751K745557L098501M012121
38887C9970028L464398j07955l379075j748554K822618M457313M499401J0736886
38879F0715060K1854494K3055381N465279j8081662k7246718j9169991q293376
38872C8298467m638652m518466k485538k40981l97885r09748k060L06657q99146
38863B4512648j025813P51180J565196N72257P27780K722957L397812K407745
$$ y = [17593331, 19442533, 19455440, 18063397, 16983263, 16642867, 16419444, 16364743, 16835170, 17239449, 16921964, 16538013, 16886365, 17222939, 16491645, 15372419, 15219152, 15767414, 15905486, 15986801, 17178683, 19001457, 19751369, 19184583, 18752981, 19272893, 20203551, 21139780, 22331376, 23820330, 25465339, 27524098, 30113849, 32859406, 35957907, 39970028, 43434426, 43326471, 39947396, 38198842, 41021460, 45478773, 49978174, 60715060, 82569554, 105624935, 111090214, 93008552, 65761834, 46591843, 38298467, 33659815, 29141349, 26655811, 26414830, 26016945, 25107197, 25105137, 25411794, 24512648, 23486835, 24238015, 25803211, 26375468, 27103248, 29826205, 33224017, 35631762]
38855C5631762L642220P408708Q822783P471953J0031957J7547204J8730684M722117
38847A14009388j5618952k5119476j9539988r868035n450763m781771l384831
38840C0245572j465989p04006k15276P10728M30233j642073l070616k201186p89698
38831B1297689p29005r41652L35196K403592L272501K365627M54457j773800l698821
38822B2985784m380854l428025j689067l95921n3715l73730p07634m96163J59683
38813A1620358N24604K88489R0031L98071O45417K96521p0846K72743R96651J428664
38803A6490703J554577J347174K84408j305139j751630l36606J259875J447725
38795A8991087J276409K477488M155147L806528J018169k014657l255529k307734
$$ y = [35631762, 39273982, 46682690, 55505473, 62977426, 73009383, 90556587, 109287271, 114009388, 98390436, 73270960, 53730972, 43862937, 38412174, 33630403, 30245572, 28779583, 28075577, 27860301, 28571029, 29001262, 27359189, 24288573, 22087387, 21297689, 20568684, 19627032, 19962228, 22365820, 25638321, 28003948, 28458405, 26684605, 22985784, 18604930, 15176905, 13487838, 13091917, 13038202, 12664472, 11956838, 11460675, 11620358, 12144962, 12433451, 12523482, 12921553, 13566970, 13863491, 13792645, 14065388, 15062039, 16490703, 18045280, 19392454, 19676862, 18371723, 16620093, 16283487, 17543362, 18991087, 20267496, 22744984, 26900131, 30706659, 31724828, 29710171, 26454642, 24146908]
38787B4146908J91895K671568K785165k77844l948523m839148k917484j097711
38779A6714826r65565j259786p35404r9904k53776n24936J07155J212779J568545
38770A5763934J068345Q96973J695684K314394J162353j301248k613891j531795
38762A7454749J27792K85106j88691O57554K076712J934639R58307J752530L878959
38753B8937657M370199L259203L491848M815229L828704J419724K975285Q588098
38745F1685947J1267564R413758J1888490K2819434K9743792J8260840o410114
38738A58669711k4222940k3856130j0422546P046653K1912011K4544686P075625
38731A60747070k1307925l7430798l0256571j3696493o159064p763827p218369
$$ y = [24146908, 24338803, 27010371, 29795536, 29517692, 25569169, 20730021, 17812537, 16714826, 15749261, 14489475, 13754071, 13654167, 13400391, 12875455, 12982610, 14195389, 15763934, 16832279, 17729252, 19424936, 21739330, 22901683, 21600435, 18986544, 17454749, 17582541, 17867647, 17678956, 18336510, 20413222, 22347861, 23306168, 25058698, 28937657, 33307856, 36567059, 40058907, 44874136, 48702840, 50122564, 53097849, 61685947, 72953511, 82367269, 94255759, 117075193, 146818985, 165079825, 158669711, 134446771, 110590641, 100168095, 107214748, 129126759, 153671445, 160747070, 139439145, 102008347, 71751776, 58055283, 51896219, 44132392, 36914023]
38724C6914023j984842Q74357j102377k989668k390050k081756k916482k382842
38716B1940363n68594m67696j942937j694061M05999Q95399r07242j830358q37330
38707A4993543n89997j983952k345285n67007P13379j41620j083808l85913M37623
38698I046963j87210j053054o79832M1224k10270q13303o60146j66933k08181
38689E109258n44491o15875n84067n91669k23498N58005J119656J232736J218252
38680F678307R00298j06410j049702p30827L60017M87135n60119j139641n25442
38671D313616Q6458j12344l08551O0384J54513n18222q96012p6430J092862J250506
38661E046780L64408n31399o36179J62914J349194J936162J390261N28968N53383
$$ y = [36914023, 34929181, 35803538, 34701161, 31711493, 29321443, 27239687, 24323205, 21940363, 21371769, 20904073, 18961136, 17267075, 17673074, 18568473, 17661231, 15830873, 14993543, 14403546, 12419594, 10074309, 9507302, 10220681, 10079061, 8995253, 8609340, 9046963, 8859753, 7806699, 7126867, 7168091, 6957821, 6144518, 5484372, 5317439, 5109258, 4564767, 3948892, 3364825, 2773156, 2549658, 3107663, 4227319, 5460055, 6678307, 7578605, 7472195, 6422493, 5691666, 6051683, 6538818, 5978699, 4839058, 4313616, 4400074, 4287730, 3979179, 4039563, 4194076, 3675854, 2779842, 2703412, 3796274, 5046780, 5411188, 4879789, 4243610, 4406524, 5755718, 7691880, 9082141, 9611109, 10164492]
38652A0164492J239724J318736O23894L79040J134733J897283J693853O67796
38644A9119551p17517k201815l101893k592417j128959k85427o35649j030111
38636G425763n10227L12179M61208P9665o0036K82790Q08410J280577J719667
38627A1799996K332601L207512L657592K391684p57337l829716m700599l608763
38619A0492970k387867j707784p76967N85998J560375J947773K224952J923399
38611A3862849N1355k587305l651023k425143p59546k25332l12449j81303j58148
38602C613955m76196m08225K17286L49676l26238m97503M84630J163370L34497
38593D455252p09138n7964J823107K749804J750487j69215j665423k158395j673065
$$ y = [10164492, 11404216, 12722952, 13346846, 13725886, 14860619, 16757902, 18451755, 19119551, 18402034, 16200219, 13098326, 10505909, 9376950, 9091523, 8455874, 7425763, 6915536, 7227715, 7688923, 7768588, 7708552, 7991342, 8799752, 10080329, 11799996, 14132597, 17340109, 20997701, 23389385, 22632048, 18802332, 14101733, 10492970, 8105103, 6397319, 5620352, 6206350, 7766725, 9714498, 11939450, 13862849, 13914204, 11326899, 7675876, 5250733, 4491187, 4265855, 3953406, 3772103, 3613955, 3137759, 2729534, 2946820, 3296496, 2970258, 2472755, 2957385, 4120755, 4455252, 3746114, 3688150, 5511257, 8261061, 10011548, 9842333, 8176910, 6018515, 4345450]
38584D345450o53719K27407O27215N75625q1109j348946k147493j161707R58509
38575A341232J870827P02502p28618p30460P460J56993l3921J79278L13097k21673
38565B856717n76142J21620R11547M38280o80507q17285P2716O73466N20498K10109
38555C731019p2163m99101n75528J20401O68035L4531r36615o80229L78224L98862
38545B567436p57101j270491m45285K19164l05045q98593l36680O61544O98149
38536A33098j60339p44061n10252J52394Q00982J191242J018069K16903o25124
38527A472912p64872j90262L62146K82530k43414n01729j24428M39928N21875
38518A254686J85072J20884N46569Q60881O59329L59118L45338K44362k93901
$$ y = [4345450, 3691731, 3919138, 4546353, 5121978, 5040869, 3691923, 1544430, 382723, 1341232, 3212059, 3914561, 3185943, 2455483, 2462943, 2619936, 2586015, 2765293, 3078390, 2856717, 2280575, 2402195, 3313742, 3752022, 3071515, 2254230, 2326946, 3000412, 3520910, 3731019, 3658856, 3159755, 2584227, 2704628, 3372663, 3407194, 2470579, 1790350, 2168574, 2567436, 1810335, 539844, 94559, 313723, 8678, -889915, -1226595, -565051, 133098, -27241, -771302, -1281554, -1129160, -328178, 863064, 1881133, 2098036, 1472912, 708040, 517778, 879924, 1162454, 919040, 417311, 292883, 732811, 1254686, 1439758, 1560642, 2107211, 2968092, 3627421, 3986539, 4331877, 4576239, 4282338]
38509D282338p87970o88602l28247k60138k55701J03051M23443J51941l02125
38500B337990k34088M0810k14545o58009l57014M75241P09524K03634j4718M23929
38490B712754O96453L56178P235j8091k93927j027769j399926q94291k19142j43764
38480b24290l50726k05838J81099M48776P56926J228098J289064M66857o48919
38471B941047j088854p81008l87153k18280r8710l2947j78081k73120J02887O75221
38461F61002O20463k32708r68062o99000K83988Q87935N47024k10033n18023j69455
38451B03131L36226N45493N18470M96311M34189J53360k00244k28665J26649L76331
38441B761251Q1219m95353o16349K679P42010P77413R5193n50796o86473o08010
$$ y = [4282338, 3494368, 2805766, 2477519, 2217381, 1961680, 2064731, 2488174, 2640115, 2337990, 2103902, 2144712, 1930167, 1272158, 915144, 1390385, 2099909, 2303543, 2288825, 2712754, 3409207, 3765385, 3772620, 3754529, 3460602, 2432833, 1032907, 138616, -80526, -224290, -575016, -780854, -599755, -150979, 605947, 1834045, 3123109, 3589966, 2941047, 1852193, 1071185, 684032, 465752, 367042, 334095, 156014, -117106, -14219, 661002, 1281465, 1048757, 80695, -618305, -334317, 553618, 1100642, 890609, 372586, 203131, 539357, 1084850, 1603320, 2099631, 2533820, 2687180, 2486936, 2258271, 2384920, 2761251, 2842470, 2347117, 1730768, 1733447, 2475457, 3252870, 3348063, 2797267, 2110794, 1502784]
38431A502784o04945l09277N84202J408242J183340K8801r12735r29208l38990
38422A612214L02538P07109N71249k03825r06890o84442N5207Q5468o30999q20670
38412H6959j39174J74333l82810m53559P37148J601370O26630q72449o17807J002603
38402A763244J525686J74827j266467j315977m53756L04701O72639N85627J1743
38393B002267m16977j5856N38212p0087j483284j788212l62770J089392J019708
38384E12393O982n72832m77640k51905o2892J61517K57111K31958M23429P46150
38374I74271O26582R7903m5200L63495M51673j26762m15836K56506J044122R11881
38364D138635K36171n301J33342q6256n91274m88445N49782J682083J744595L96620
$$ y = [1502784, 897839, 588562, 1172764, 2581006, 3764346, 3793147, 2880412, 1951204, 1612214, 1914752, 2621861, 3193110, 2989285, 2082395, 1397953, 1453160, 1538628, 907629, 86959, -52215, 122118, -260692, -714251, 22897, 1624267, 2250897, 1378448, 760641, 1763244, 3288930, 3463757, 2197290, 881313, 427557, 732258, 1404897, 1990524, 2002267, 1585290, 1569434, 2107646, 2037559, 554275, -1233937, -1596707, -507315, 512393, 519375, -53457, -531097, -783002, -845894, -684377, -427266, -195308, 228121, 974271, 1600853, 1698756, 1653556, 2017051, 2468724, 2341962, 1926126, 2182632, 3226754, 4138635, 4374806, 4369505, 4502847, 4416591, 3825317, 3336872, 3886654, 5568737, 7313332, 7709952]
38354G709952j429311k181518j250704J44953L44525n37336q16915K26451J343542
38345C553639J303366N39626M5841j05601j30227M42665J833358K902303K309710
38336A2694680L74850j283611j630047q99251J30324O89579L05469o07123q67386
38327H907484k6048P87770L72974p79637j278993r07408o80893j043743j245306
38318D106200o70002K09918N57440K04458l41973n39583k67708J41850K69457
38309C670057O9043j53511k12592j88014j13656L1469L1177l04026o03546l61455
38299A864946J52328K71024J52184M91809J009690O55138m16672p01769K58853
38290C737531J044898P30963L07809O15407P11502j61308p29562K76884J751525
$$ y = [7709952, 6280641, 4099123, 2848419, 2993372, 3337897, 2800561, 1983646, 2210097, 3553639, 4857005, 5396631, 5442472, 5336871, 5206644, 5649309, 7482667, 10384970, 12694680, 13069530, 11785919, 10155872, 9256621, 9386945, 10076524, 10381993, 9774870, 8907484, 8881436, 9669206, 10042180, 9262543, 7983550, 7076142, 6395249, 5351506, 4106200, 3436198, 3646116, 4203556, 4408014, 4066041, 3526458, 3258750, 3400600, 3670057, 3739100, 3585589, 3372997, 3184983, 3071327, 3102796, 3133973, 2829947, 2226401, 1864946, 2017274, 2288298, 2440482, 2932291, 3941981, 4597119, 4180447, 3478678, 3737531, 4782429, 5513392, 5821201, 6436608, 7148110, 6986802, 6257240, 6534124, 8285649]
38281H285649K003908J602074K099166L158961L630633M386467O761043Q637680
38273D0565581N941725j215709p367700q219657n528824l616419l553613l347588
38265A3657796k137483j194654j241501j353471q37113l28133m33866o35439k73883
38256E222253K92531L31434J541J06619P24250R56577L48542k09963K92269J401156
38246I467209J853929J527119J454610K002396K656115L774024O291105Q713177
38238C7739684P019314j10701p876059j0183324o898870l209142k386200k753452
38230A1341250k048829r75402q92037j063843l81422L41749n2755q04368n91886
38221D872457J24759J02142l73948j54048N26220M19325m79144q47391j71614
$$ y = [8285649, 10289557, 11891631, 13990797, 17149758, 20780391, 25166858, 31927901, 40565581, 46507306, 45291597, 37923897, 29704240, 24175416, 20558997, 17005384, 13657796, 11520313, 10325659, 9084158, 7730687, 6893574, 6565441, 6131575, 5496136, 5222253, 5514784, 5846218, 5847759, 5954378, 6678628, 7635205, 7983747, 7773784, 8066053, 9467209, 11321138, 12848257, 14302867, 16305263, 18961378, 22735402, 29026507, 37739684, 44758998, 44648297, 36772238, 26588914, 19690044, 16480902, 14094702, 11341250, 9292421, 8317019, 7424982, 6361139, 5979717, 6321466, 6268711, 5464343, 4872457, 4997216, 5099358, 4725410, 4571362, 5097582, 5516907, 5037763, 4190372, 4018758]
38212D018758N42065L55334m46177r81438p41192J62985J102155J318244O86162
38203F016896p4395l08458j89609k03189l57110l57232q1014N19957J419625K084074
38193H469545J804806Q87475N98026J338004J836566R17569q49907k105209k394042
38184A0502833k020953j164391j93056M4664n81394q26260J97378J520129J883318
38175I362268J827657K507608L221515K208264l85083k397600k596548j844252
38167A1903829j129120l47948M58678N10995k10041m02722O24253J724778J629569
38158A4762271P59426K16122n6240q00957j805289k112379j623874j232413j311436
38149F795231j178304l75350M12501K90405n40174j041656o66958J62221Q30337
$$ y = [4018758, 4560823, 4916157, 4469980, 3488542, 2747350, 2910335, 4012490, 5330734, 6016896, 5942501, 5634043, 5444434, 5241245, 4884135, 4526903, 4445889, 4965846, 6385471, 8469545, 10274351, 11161826, 11759852, 13097856, 14934422, 15851991, 15002084, 12896875, 10502833, 8481880, 7317489, 7124433, 7169097, 6587703, 5761443, 5958821, 7478950, 9362268, 11189925, 13697533, 16919048, 19127312, 18742229, 16344629, 13748081, 11903829, 10774709, 10426761, 10885439, 11396434, 11186393, 10783671, 11407924, 13132702, 14762271, 15521697, 15737819, 15681579, 14880622, 13075333, 10962954, 9339080, 8106667, 6795231, 5616927, 5241577, 5654078, 5944483, 5404309, 4362653, 3695695, 3857916, 4688253]
38140D688253J153653J090407M94169l93103p67195k68538K58277j38464r92638
38131E124821j061418k95672J58508k6126Q7351P14420O33547o36695j576942
38122C121794r10934K92088L53236l62775l55493L77744O19341K29013J12117
38113C476131K47028j99020r18398o66246N06380J158388P79255L50182L94610
38104E128310L54466J56679M55413R86959O86065j77484j03190R39154J222975
38095I649347L10243j32289N43424P41663k08490n07319P79333J748387J198976
38086A4123275J153034L102575M888170M976203O618465J2377824J6660198J0692268
38078G4592012m560128j7055356j7700668j0344666m551369l340927k923290j153820
$$ y = [4688253, 5841906, 6932313, 7426482, 7033379, 6266184, 5997646, 6255923, 6117459, 5124821, 4063403, 3767731, 3926239, 3900113, 3987464, 4701884, 5335431, 4698736, 3121794, 2210860, 2502948, 2856184, 2493409, 2137916, 2515660, 3135001, 3364014, 3476131, 3723159, 3524139, 2605741, 1939495, 2445875, 3604263, 4383518, 4733700, 5128310, 5482776, 5639455, 6094868, 7081827, 7767892, 7590408, 7487218, 8426372, 9649347, 9959590, 9827301, 10370725, 11112388, 10903898, 10396579, 11175912, 12924299, 14123275, 15276309, 18378884, 23267054, 28243257, 34861722, 47239546, 63899744, 74592012, 70031884, 52976528, 35275860, 24931194, 20379825, 17038898, 14115608, 12961788]
38070A2961788j57855j229587k366083j921628j067330j218762j651674j146666
38062B202203j15885L11256L0245l51287n72770n32195R2356J154104J689604
38053C907631J097966J00344k53156l4818p1069m83605n41967L1692M63858q54
38043D216022r53080j265684n32333M45448P37566M17948K28702M04215M65879
38034D164683J73347n9125K3963m18m25498p16413l43132J86247L0531n41090
38024B493095m38759N31080J248239Q14640l53724j312847j702409j624678j083870
38015a429233j59824O45184Q02550L77972n3007j4906M37197P25350K60204p34057
38005H57430j118027j65702J182213J279506M238j030569p50766N5537K39796
$$ y = [12961788, 12803933, 11574346, 9208263, 7286635, 6219305, 5000543, 3348869, 2202203, 2086318, 2397574, 2427819, 2076532, 1503762, 971567, 1063923, 2218027, 3907631, 5005597, 5105941, 4852785, 4817967, 4746898, 4263293, 3721326, 3753018, 4216876, 4216022, 3262942, 1997258, 1464925, 1910373, 2647939, 3065887, 3294589, 3698804, 4164683, 4338030, 4278905, 4302868, 4302450, 3876952, 3160539, 2817407, 3003654, 3034185, 2493095, 2054336, 2585416, 3833655, 4648295, 4294571, 2981724, 1279315, -345363, -1429233, -1589057, -943873, -141323, 236649, 183642, 168736, 605933, 1331283, 1591487, 857430, -260597, -426299, 755914, 2035420, 2039658, 1009089, 258323, 313860, 553656]
37996E53656l8250j9220K57266L37462L98138P91256J113700Q16495K46666L4021
37986D491190k3346l51813m94729P5455O20611J60461o29434l18709P58756R02657
37976E191099k4752k84582O93445J251048M21771k84071N37678J671285J153179
37967A0326100o97201j976637j965797j434456r25134m36006k68846o04701o85316
37958A332006J16353R21157N52578m26323n76707l5311j99272j138120j323095
37949g76734j50745J101341J259976N83163l10072j244735j732051j004141N07956
37940a766042J180260M29564m01523j44752N74214P04391M31911L89542L47203
37931A744768j20881n69347m27672n6281j5595k0733L49760O40366K84831k93251
$$ y = [553656, 515406, 496186, 753452, 1090914, 1489052, 2280308, 3394008, 4210503, 4457169, 4491190, 4467844, 4116031, 3621302, 3696757, 4317368, 4477829, 3848395, 3529686, 4288442, 5191099, 5166347, 4881765, 5575210, 6826258, 7248029, 6963958, 7501636, 9172921, 10326100, 9628899, 7652262, 5686465, 4252009, 3326875, 2890869, 2622023, 2017322, 1332006, 1448359, 2369516, 2922094, 2495771, 1919064, 1883753, 1684481, 546361, -776734, -927479, 173862, 1433838, 2017001, 1706929, 462194, -1269857, -2273998, -1766042, -585782, -156218, -557741, -702493, -128279, 576112, 1008023, 1397565, 1744768, 1623887, 1054540, 626868, 570587, 554992, 534259, 884019, 1524385, 1809216, 1515965]
37921A515965m18017l27302m87515m41111L78350J272794J159053M36499M64578
37912C553294J312942J549835M37850j021619j609970j330645q76894n85331m22754
37903A006708l44197k39009J1473K03672o765n00918p58220n49589q1083M70810
37893g87118R77106J036923L81833m34097n36325K8590L41170j5739m63584m82808
37883D5951k98993k00792J4933M65537P28397M77468O3084k2295J35018R4868
37873A503176k88683p43313q54319l41314N91690J145232O79990l21564o63568
37864G07327J224O88694M90394k10066m40730k1523L96634L72595J38004O2849
37854B185402Q7838j67755q01497j228081o99038N41858J112448J82674j101322
$$ y = [1515965, 1097948, 770646, 283131, -157980, 220370, 1493164, 2652217, 3088716, 3553294, 4866236, 6416071, 6853921, 5832302, 4222332, 2891687, 2014793, 1429462, 1006708, 662511, 423502, 434975, 638647, 631882, 130964, -627256, -1176845, -1257928, -787118, 189988, 1226911, 1608744, 1174647, 638322, 666912, 1008082, 992343, 528759, 45951, -253042, -453834, -438901, 26636, 755033, 1232501, 1295585, 1273290, 1408308, 1503176, 1214493, 471180, -383139, -724453, -132763, 1012469, 1692459, 1370895, 707327, 708551, 1397245, 1887639, 1677573, 1236843, 1215320, 1611954, 1984549, 2122553, 2185402, 2273240, 2105485, 1303988, 75907, -623131, -81273, 1031175, 1213849, 112527]
37845A12527r62446M04698R86316l9015j032974m75996O78596O35752l48058m96573
37835e37173N56572J246175N93462m25419n84133j55923j26114n54760o60014
37826f47327r7484O31783R18902O58302J41752l16010n88227o97667o21302k50442
37816h67720L27158O91903N36358J11049j19792j24168j76603k39800m9569K29456
37806C18272J01408m01287o29872l19899j7186j53694l38732p5681L63236M05211
37796g48224J12212l0750K9122r635o5274J78987M28914k0836j011538j322047
37786b459069k86590J078063J315055M43338k63134k02707r1251m74109o61517
37777a601921J06011J148300J071654j92638j147035p49074K48993N11582n0927
$$ y = [112527, -849919, -445221, 541095, 502080, -530894, -1006890, -328294, 307458, -40600, -537173, 19399, 1265574, 1859036, 1433617, 849484, 693561, 567447, 12687, -647327, -744811, -113028, 805874, 1464176, 1605928, 1289918, 701691, 4024, -617278, -867720, -540562, 151341, 687699, 798748, 678956, 554788, 378185, 138385, 88816, 318272, 419680, 18393, -611479, -931378, -948564, -1102258, -1440990, -1516671, -1153435, -748224, -636012, -666762, -637640, -647275, -712549, -533562, -104648, -125484, -1137022, -2459069, -2745659, -1667596, -352541, 90797, -172337, -375044, -466295, -940404, -1601921, -1495910, -347610, 724044, 531406, -615629, -1364703, -1115710, -604128, -655055]
37768f55055m57148k54302q456j93962m46188k54487K20084N09041O15428Q46596
37758g8449J050206O69121l10566j023210p32481J49575N65778K11032j82210
37749C18796o3644J23908j69333m98648o8508P88961Q50871j21058q27081l17988
37739A6276N22824L29264o01290p59534K06775R03510K55640r48995j215494l04289
37729a595313O93842Q44650K58127l60117n09111k19882J02820J12944j00120
37720g72160j37384J65533M99573M70288N2504m05054m82472m1794N10692M69061
37710C28787k96820r07968m94512N08897Q86746M33582J83656O05790P65862m4888
37700A969132r66998q72753j09661K53368J87196L26907M09951k70703j114010
$$ y = [-655055, -1112203, -1366505, -1374961, -1568923, -2015111, -2269598, -2049514, -1540473, -925045, -78449, 971757, 1640878, 1330312, 307102, -425379, -275804, 289974, 501006, 318796, 255152, 379060, 209727, -288921, -357429, 431532, 1282403, 1161345, 334264, 16276, 539100, 868364, 267074, -492460, -285685, 617825, 873465, -75530, -1291024, -1595313, -901471, -56821, 201306, -158811, -667922, -887804, -784984, -672040, -772160, -909544, -744011, -244438, 225850, 278354, -126700, -609172, -650966, -140274, 328787, 31967, -876001, -1370513, -861616, 25130, 458712, 642368, 1248158, 2014020, 1969132, 1002134, 129381, 19720, 273088, 460284, 787191, 1197142, 926439, -187571]
37691a87571p28209O44902J064864j75468j304495p30444O08269Q83839J27377
37682B03064k77773k1110j8551m91415o09209j21585J70204j00801k33823J82592
37672a318407M48502j2514n61054l55458K40402K37059l82578o30570k0084P51079
37662a603623Q14875J93716m53311o80497m90625n4848L69107M29496P5915j02870
37652a502665M85011J339925J118783n19001j947231j381516O40621J748513Q33080
37643H15520n85007o58978K80905N98251j05696p17151n56079j66065l5946J82430
37633i47816P29077J049224O90589J26382N112J48615M012l07362j57754M98300
37623A838379Q95760M85778k36185k42605P50407J756211J498765o6868j548915
$$ y = [-187571, -915780, -270878, 793986, 618518, -685977, -1416421, -808152, 75687, 203064, -74709, -95819, -114370, -605785, -1214994, -1336579, -1166375, -1267176, -1500999, -1318407, -869905, -882419, -1443473, -1798931, -1558529, -1321470, -1704048, -2334618, -2354702, -1603623, -788748, -595032, -1048343, -1728840, -2219465, -2274313, -1905206, -1475710, -1399795, -1502665, -1017654, 322271, 1441054, 922053, -1025178, -2406694, -1766073, -17560, 815520, 230513, -428465, -147560, 450691, 344995, -372156, -928235, -1094300, -1130246, -947816, -218739, 830485, 1521074, 1647456, 1652568, 1801183, 1805195, 1497833, 1340079, 1838379, 2734139, 3219917, 2983732, 2741127, 3491534, 5247745, 6746510, 6679642, 5130727]
37614E130727j677157p34498j1411j49574o67492r53632r41188p42768l72395
37605a119388k5555J2418q9093J06772M54983L32811k27800m04841Q0347M39134
37595d40212J36868k13177J6161L38134P2343l65087j66817M10418M30014j97580
37585B1065o55829n35123k14032n628J54920J98977k7613k00932J62821P98238
37575c03136R15401L88326r0294j30687r4975k50535k87572J3768L30974L75513
37565H66783L63867N57076P62140O09425L4479o92793j165538j037636l46862
37556d9059L56156N14957J59570k64008m54291l41982L1620L13019j9551p70232
37546e23801q79772Q3541R70463O23294k87792l69032J51388o7499r33589r40085
$$ y = [5130727, 3453570, 2719072, 2707661, 2558087, 1890595, 936963, -4225, -746993, -1119388, -1144943, -1132525, -1221618, -1114846, -659863, -327052, -554852, -959693, -879346, -440212, -303344, -516521, -500360, -162226, -89883, -454970, -621787, -211369, 218645, 21065, -634764, -1169887, -1383919, -1389547, -1234627, -1035650, -1063263, -1264195, -1101374, -303136, 612265, 1000591, 910297, 779610, 684635, 434100, 146528, 160296, 491270, 866783, 1230650, 1787726, 2549866, 3159291, 3193770, 2500977, 1335439, 297803, -49059, 307097, 822054, 981624, 717616, 263325, -78657, -47037, 265982, 246431, -523801, -1403573, -1320032, -349569, 273725, -14067, -383099, -231711, -299210, -1232799, -2172884]
37536b172884J21158O05078k17829q78815j61300J020888J376211J154503R63088
37527A810098L16991r91416j563943l72580J116059Q79362n04587q62225M4673
37518a27568M03972m12744r44970l16146M13526L01217L1360L98496Q27053N08719
37508A082915j63062l82405k58105l43264n35224l89023l4162M6544j80530l64382
37498a520698l56679k36268k8030J98087K31112M6523o5358N7246K16675K64464
37488a192926L34138M63402M30449K03695J07896K72244L23647q4453p60360j196276
37478a098544j027727k31133P58294J168613O64948k8376O5996P58862R02003
37469A932936J23991o07345m97273k0668N9275j24399q5288L0655j41556l49877
$$ y = [-2172884, -2051726, -1446648, -1664477, -2543292, -2704592, -1683704, -307493, 847010, 1810098, 2127089, 1135673, -428270, -800850, 315209, 1194571, 689984, -172241, -127568, 276404, -136340, -1081310, -1397456, -983930, -682713, -651353, -252857, 574196, 1082915, 919853, 537448, 279343, -63921, -599145, -988168, -1022330, -975786, -1156316, -1520698, -1877377, -2113645, -2141675, -1943588, -1712476, -1665953, -1731311, -1674065, -1457390, -1192926, -858788, -395386, 35063, 238758, 346654, 618898, 942545, 858092, 97732, -1098544, -2126271, -2357404, -1599110, -430497, 234451, 206075, 272071, 1030933, 1932936, 2056927, 1449582, 952309, 931641, 990916, 866517, 781229, 811884, 670328, 320451]
37459C20451j85199M8134j80092n67265l36457M59088Q85003M79291r7867l8500
37449G86587N08350O60109o6991j092090j316591l91455P12146P57268j91874
37440C65459q42961m29574L61550N95044M07891M19556M96923P6520o48809q67384
37430f5785l68652K42401N18421N49456L72954j51822p43160p59156j23262M59025
37420f9580M70606J85799M3253j936j51241k80432j91202r452J6735j16707k38617
37409c42774k08447P9752N92899R42084O64549r2535n85030m18799o6388j09412
37399D55899l70517k59987K85809P10646N69870m4996p24094j028839o79285J42518
37389i42976P30819N25557j25708k88455L68709J098362R97792R1295p88302r86763
$$ y = [320451, 135252, 183386, 3294, -563971, -900428, -441340, 443663, 922954, 825087, 786587, 1294937, 1955046, 1888055, 795965, -520626, -912081, -199935, 557333, 365459, -477502, -907076, -545526, 49518, 457409, 876965, 1373888, 1450408, 801599, -65785, -434437, -192036, 326385, 875841, 1248795, 1096973, 353813, -405343, -528605, -69580, 401026, 586825, 630078, 628142, 476901, 196469, 5267, -4185, 12550, -104157, -342774, -551221, -471469, 121430, 1063514, 1728063, 1635528, 1050498, 631699, 565311, 455899, 85382, -174605, 111204, 821850, 1391720, 1346724, 622630, -406209, -1085494, -942976, -212157, 313400, 187692, -100763, 267946, 1366308, 2364100, 2455395, 1667093, 680330]
37379F80330n96997j49771k1815j59632k24276J198L09651L17080Q1157J62578
37369C99503P86887J266285P87691l83550j150668j053657p40302p55674p01563
37360a545048j44201L97823K20043l15106k63754M21903Q92458P74559N23394
37351I62071L59545p3507p41717r57598n14632j22501j90776j39594M10840P34600
37341b73269K02181m54222k14949N07962N01040k66773o38616j69644K98737J69408
37331c38145l4343K12540M74284J73071l65130l92284J73678P40640Q54706N57527
37321B056544J07322l04034o26580q96095j023833p29991J7618O34668N13648
37312b50733l6419q8414N37114R09993L21639o64853r78262l66733N31708J037737
$$ y = [680330, 83333, -66438, -88253, -247885, -472161, -470963, -161312, 155768, 236925, 399503, 1186390, 2452675, 3240366, 2856816, 1706148, 652491, -87811, -843485, -1545048, -1689249, -1291426, -1071383, -1386489, -1650243, -1228340, -335882, 438677, 962071, 1321616, 1248109, 506392, -451206, -965838, -1088339, -1279115, -1418709, -1007869, -273269, -71088, -525310, -740259, -232297, 268743, 1970, -636646, -806290, -507553, -338145, -372488, -159948, 314336, 487407, 122277, -270007, -96329, 644311, 1499017, 2056544, 2163866, 1859832, 1233252, 337157, -686676, -1416667, -1399049, -764381, -250733, -287152, -375566, 161548, 1071541, 1393180, 728327, -249935, -616668, -84960, 952777]
37302I52777Q57517N2957q46489j013188k22537O21280M97315l25178o02534J22625
37292I4545Q32115M45671o55760j093316k53572R67334J267056M17676n91348
37283A430401p43811o5782N62768M94554n300k19632N3466K50847j49104p98341
37273H10066q12599L8824R05514R26323L57173P3430J94105M1084m73962m43832
37263A616126N20688J282423O26260q52469j420298n47509N34201O66215R6600
37254B522237l21976l47508k45828j23455P0113K30691K05653J0767k37496l75984
37244A387214j75392L79799Q51591Q40724O02622O11464P08063M57981J68831
37235E832897N12117J175398J134039M31529K89840J019391J337939N49826j18998
$$ y = [952777, 1810294, 1863251, 1016762, 3574, -218963, 402317, 899632, 574454, -28080, 94545, 926660, 1372331, 716571, -376745, -630317, 337017, 1604073, 2021749, 1430401, 686590, 620808, 1183576, 1678130, 1672830, 1453198, 1506664, 1757511, 1608407, 810066, -2533, 36291, 941805, 1868128, 2225301, 2298731, 2492836, 2533920, 2059958, 1616126, 2136814, 3419237, 4045497, 3193028, 1772730, 1225221, 1759422, 2425637, 2522237, 2200261, 1852753, 1606925, 1483470, 1553583, 1784274, 1989927, 2000694, 1763198, 1387214, 1211822, 1591621, 2443212, 3283936, 3886558, 4498022, 5206085, 5664066, 5832897, 6345014, 7520412, 8654451, 9085980, 9375820, 10395211, 11733150, 12282976, 12163978]
37226A2163978M80937J479568J538659J199489J906851L483390M491418M695528
37218C1439818N243892O451859P161766O449880M425835J269942k843471o619716
37210E2979805q202390p458401o215817n646852m939087l282106j569096j006072
37202A4659984j320154j565041j661032j924872j978649j374360n86439k38856
37194D010581m1243M02223N18495k26197j000021p57112r3534l08698j069261
37185A435233q91180J69058L61717q19719j534357l71662J396390J653037L89292
37176A787809o29647m91259K1607N0352j44610R3538P03709R76601M55776n05518
37166B318358j078890q31273j93080J02144o6552k06390m7379J62558K56868L96654
$$ y = [12163978, 12644915, 14124483, 15663142, 16862631, 18769482, 22252872, 26744290, 31439818, 36683710, 43135569, 50297335, 56747215, 61173050, 62442992, 59599521, 52979805, 44777415, 37319014, 31103197, 25456345, 20517258, 17235152, 15666056, 14659984, 13339830, 11774789, 10113757, 8188885, 6210236, 4835876, 4249437, 4010581, 3969338, 4371561, 4890056, 4663859, 3663838, 2906726, 2813192, 2504494, 1435233, 544053, 713111, 1074828, 255109, -1279248, -1650910, -254520, 1398517, 1787809, 1158162, 666903, 688510, 738862, 594252, 687790, 1391499, 2368100, 2823876, 2318358, 1239468, 408195, 215115, 317259, 250707, 44317, -3062, 159496, 416364, 813018]
37156H13018M94633Q8765p82943j222605n88501N08476R56048N07143k23416p41986
37146a91368r40595p03700p6800L51744Q3564l65470o9911P77107R65950J39596
37136b9883n14518k9015Q18595O44920m88336j213372q11258k811L02600J44291
37126a178787L0498P788k16240n68796o11176j89472L38216N86396N45024L95961
37116h60588K11636N3421J55464O50478J148440J002929J72150n45338m61637
37107A526955R1301K53090j52646m91556l85796k13903l20490m11064j93850l2624
37097c30583k99967n21587M750R49096J209342M62770m13132o74078o05209o86755
37087i05353o88902k62122K07288J62092j06176J10221O86302P77692J95697k57192
$$ y = [813018, 1307651, 1396416, 613473, -609132, -1197633, -689157, 266891, 774034, 550618, -191368, -1131963, -1835663, -1912463, -1560719, -1477155, -1842625, -1912536, -1135429, -169479, -29883, -544401, -573416, 245179, 890099, 401763, -811609, -1622867, -1625678, -1323078, -1178787, -1148289, -1140501, -1356741, -1925537, -2536713, -2726185, -2387969, -1801573, -1256549, -860588, -648952, -595531, -440067, 210411, 1358851, 2361780, 2533930, 1988592, 1526955, 1618256, 1871346, 1718700, 1227144, 841348, 627445, 306955, -104109, -297959, -330583, -630550, -1152137, -1147387, -198291, 1011051, 1473821, 1060689, 386611, -218598, -905353, -1594255, -1856377, -1649089, -1486997, -1593173, -1482952, -796650, -18958, 176739, -80453]
37077h0453o8898K19327j9167m92527n74788l39515k70298l03531J3220N42195
37067a374435N80812j7127n00452l05195J41754J35650k69657m70227k53920L3971
37057b298826J46756K26589M04712N44858N10223L78532K60499J25747q2936l18598
37047a02444m64882l86477j4418M25851M19792k30189q83333o58488L61029J069841
37037d63718P31675j02918m54240j95962O6484J9441j35488k85887n23424o73628
37027b017665l84680K07261N05586L13795J03633K09911L24959J08236k26287
37018h55251l32612k85719k62619r0938L48226O22664K96874k46069k33235L13200
37008g25479N38363J0734o58254p19548k37760K35979M55956M60054J35982n52407
$$ y = [-80453, -149351, 69976, 50809, -441718, -1016506, -1356021, -1626319, -1929850, -1916630, -1374435, -793623, -810750, -1311202, -1616397, -1474643, -1338993, -1608650, -2078877, -2332797, -2298826, -2152070, -1925481, -1520769, -975911, -465688, -87156, 173343, 299090, 216154, -102444, -567326, -953803, -968221, -542370, -122578, -352767, -1236100, -1894588, -1533559, -463718, 267957, 165039, -289201, -485163, -418679, -399238, -534726, -820613, -1344037, -2017665, -2402345, -2195084, -1689498, -1375703, -1272070, -1062159, -737200, -628964, -855251, -1187863, -1473582, -1736201, -1827139, -1478913, -856249, -559375, -805444, -1038679, -725479, -187116, -176382, -834636, -1554184, -1791944, -1555965, -1100009, -639955, -503973, -1056380]
36998a056380j055760o57840M45703J084188N08232n62864q13020l4283O78545
36989a463479M87969j11273j70054K99676M71951N0466l15953q4762L93926M86516
36979D4983J63619j50100k38370j48086J20050M74403N11536p323n79220m56804
36969b65312K72051P05184L66963j50534q6935M19752N97653J02242o06332q44034
36959E10698l66453M60774R23830N17864m95807j192483r29821j18715K70541
36950d19572o6268m53011k61099K06795K46177j38640k45188J99604N39402J45207
36940b46593n90994p64514k31666K56510J90455p5164n1546J19936N4674j49831
36930a488733r7200K32506M80784M58521K77246N1356j25415l7237L74754P02327
$$ y = [-1056380, -2112140, -2769980, -2324277, -1240089, -731857, -1294721, -2107741, -2142024, -1463479, -975510, -1086783, -1256837, -957161, -485210, -434744, -750697, -835459, -441533, 44983, 208602, 58502, -179868, -327954, -207904, 266499, 778035, 770712, 191492, -265312, 6739, 711923, 1078886, 928352, 841417, 1261169, 1858822, 1961064, 1354732, 510698, 144245, 605019, 1528849, 2046713, 1550906, 358423, -571398, -690113, -419572, -485840, -938851, -1199950, -993155, -746978, -885618, -1130806, -931202, -391800, -246593, -837587, -1602101, -1833767, -1577257, -1386802, -1461966, -1513512, -1393576, -1338902, -1488733, -1585933, -1353427, -872643, -414122, -136876, -85520, -210935, -248172, 126582, 828909]
36920H28909N22250O2325j27787q7238l40760q42924q35629o7572O13007M30893
36910A55474j70308k64731J10636J00550n30467r78320n92215K17627O38486N28590
36900g84678L50185L10390J37269k63698m38032Q056O84491P60941N9635o23353
36890B01206n16649J58573N87048M44420O8569k78929o41165q12586l26544O51961
36880d64096J093056L56581p75425j015505k64028L56575J08662m71780n02462
36871a578422M8367N08666M82709K13127O1327J8465j46263m41228n56685k52527
36861a642464K77499N86906N06287K90552J79309O7545j93940m01399k28027K36165
36851c21567N03918K86965j63167l67701j15426L77018O71818M91142J960l40241
$$ y = [828909, 1351159, 1413484, 1285697, 1198459, 857699, 14775, -820854, -888426, -275419, 155474, -14834, -279565, -168929, -68379, -598846, -1577166, -2169381, -1951754, -1313268, -784678, -434493, -124103, 13166, -250532, -688564, -680508, 3983, 764924, 824559, 201206, -315443, -156870, 430178, 874598, 943167, 664238, 23073, -789513, -1116057, -464096, 628960, 985541, 210116, -805389, -1069417, -712842, -604180, -1075960, -1578422, -1530055, -1021389, -538680, -325553, -264226, -245761, -392024, -833252, -1389937, -1642464, -1364965, -778059, -271772, 18780, 198089, 265634, 71694, -329705, -557732, -321567, 182351, 469316, 306149, -61552, -176978, 200040, 871858, 1363000, 1364960, 1024719]
36841A024719l26312k08060k17173j40698K58257O23703L79005l15654o16950
36832D60837j86853K97297J88467j50193n217M57130M02757l34376r19002o95227
36822d84380m7096K56913P4115j76505k12565n7406K31283N29547N20733P7529
36812G12168l54216k55658J55233J68495l48358p19312m44393J40315M19233K30859
36802b95634j83074m89376l31413L58410R10424M90034n68158q71767L9856Q05866
36792a34832K39846p51204n55466N66985R33952J24897n63033l98493j81811n16602
$$ y = [1024719, 698407, 490347, 273174, 132476, 390733, 1014436, 1393441, 1077787, 460837, 273984, 571281, 759748, 609555, 604338, 1061468, 1464225, 1129849, 210847, -484380, -531476, -274563, -200448, -376953, -589518, -646924, -415641, 113906, 634639, 712168, 357952, 102294, 257527, 426022, 77664, -641648, -1086041, -945726, -526493, -295634, -478708, -968084, -1299497, -941087, -30663, 459371, -108787, -980554, -940698, -134832, 105014, -646190, -1201656, -634671, 299281, 424178, -138855, -537348, -719159, -1235761]
$$ [...]
##END NTUPLES=NMR SPECTRUM
##END=
