##TITLE=31Pdec_2PBDP2307
 CDcl3, 24 sc
 24.7.2019
##JCAMPDX= 6.0         $$ Bruker NMR JCAMP-DX V2.0
##DATA TYPE= NMR SPECTRUM
##DATA CLASS= NTUPLES
##ORIGIN= UXNMR, Bruker Analytische Messtechnik GmbH
##OWNER= root
$$ XWIN-NMR		Version 3.5
$$ Wed Jul 24 16:32:38 2019 Russian Standard Time (UT+4h)  she@DPX200
##.OBSERVE FREQUENCY= 81.013821
##.OBSERVE NUCLEUS= ^31P
##.ACQUISITION MODE= SIMULTANEOUS
##.ACQUISITION SCHEME= undefined
##.AVERAGES= 100
##.DIGITISER RES= 17
##SPECTROMETER/DATA SYSTEM= spect
##.PULSE SEQUENCE= zgpg30
##.SOLVENT NAME= CDCl3
##.SHIFT REFERENCE= (INTERNAL, CDCl3, 0, 182.463)
##AUDIT TRAIL= $$ (NUMBER, WHEN, WHO, WHERE, WHAT)
$$ ##TITLE= Audit trail, XWIN-NMR		Version 3.5
$$ ##JCAMPDX= 5.01
$$ ##ORIGIN= Bruker BioSpin GmbH
$$ ##OWNER= she
$$ F:/spectra/data/she/nmr/P31/1/pdata/1/auditp.txt
$$ ##AUDIT TRAIL=  $$ (NUMBER, WHEN, WHO, WHERE, WHAT)
(   1,<2019-07-24 16:30:27.42 +0400>,<she>,<DPX200>,
      <created by zg, POWCHK disabled, PULCHK disabled
       configuration hash MD5:
       00 E9 B6 7A A2 85 ED C7 34 08 36 98 17 FE 4E 26
       data hash MD5: 32K
       4D 92 57 9E 49 AB 76 41 71 7A FA 8C E4 06 E0 9E>)
(   2,<2019-07-24 16:30:33.82 +0400>,<she>,<DPX200>,
      <Start of raw data processing
       efp BC_mod = 2 LB = 1 FT_mod = 6 PKNL = 1 PHC0 = -572.6845 PHC1 = 494.8 SI = 64K 
       data hash MD5: 64K
       C8 DB AF 1B FD 43 4F 24 E1 BD 10 CE FF 37 91 3B>)
(   3,<2019-07-24 16:30:49.03 +0400>,<she>,<DPX200>,
      <pk PHC0 = 29.19246 PHC1 = 0 
       data hash MD5: 64K
       1C 7E 4F 87 7A E8 29 EB BD EE 5C 34 89 82 5F 8F>)
(   4,<2019-07-24 16:30:52.81 +0400>,<she>,<DPX200>,
      <abs ABSG = 5 
       data hash MD5: 64K
       4B E5 C5 AF 16 53 EC 96 6C 9B 7F 01 98 A7 4E FA>)
$$ ##END=
$$ 
$$ hash MD5
$$ 2E 47 2E 46 63 A4 55 AA 2A 26 56 77 A2 48 0B 1B
##$RELAX= 
##$RELAX= 
##$RELAX= 
##$RELAX= 
##$RELAX= 
##$RELAX= 
##$RELAX= 
##$RELAX= 
$$ Bruker specific parameters
$$ --------------------------
##$DU= <F:/spectra>
##$EXPNO= 1
##$NAME= <P31>
##$PROCNO= 1
##$TYPE= <nmr>
##$USER= <she>
##$AMP= (0..31)
100 100 100 100 100 100 100 100 100 100 100 100 100 100 100 100 100 100 
100 100 100 100 100 100 100 100 100 100 100 100 100 100 
##$AQSEQ= 0
##$AQ_mod= 1
##$AUNM= <au_zg>
##$AUTOPOS= <>
##$BF1= 81.014009
##$BF2= 200.13
##$BF3= 200.13
##$BF4= 200.13
##$BF5= 200.13
##$BF6= 200.13
##$BF7= 200.13
##$BF8= 200.13
##$BYTORDA= 1
##$CFDGTYP= 0
##$CFRGTYP= 5
##$CHEMSTR= <none>
##$CNST= (0..31)
1 1 145 1 1 1 1 1 1 1 1 1 1 1 1 1 1 1 1 1 1 1 1 1 1 1 1 1 1 1 1 1 
##$CPDPRG= <waltz16>
##$CPDPRG1= <>
##$CPDPRG2= <waltz16>
##$CPDPRG3= <>
##$CPDPRG4= <mlev>
##$CPDPRG5= <mlev>
##$CPDPRG6= <mlev>
##$CPDPRG7= <mlev>
##$CPDPRG8= <mlev>
##$CPDPRGB= <>
##$CPDPRGT= <>
##$D= (0..31)
0 1 0 0 0 0 0 0 0 0 0 0.03 2e-05 3e-06 0 0 0 0 0 0 0 0 0 0 0 0 0 0 0 0 
0 0 
##$DATE= 1563971426
##$DBL= (0..7)
120 120 120 11 120 120 24 19 
##$DBP= (0..7)
150 150 150 150 150 150 150 150 
##$DBP07= 0
##$DBPNAM0= <>
##$DBPNAM1= <>
##$DBPNAM2= <>
$$ [...]
##$SUBNAM3= <"">
##$SUBNAM4= <"">
##$SUBNAM5= <"">
##$SUBNAM6= <"">
##$SUBNAM7= <"">
##$SUBNAM8= <"">
##$SUBNAM9= <"">
##$SW= 369.568048894756
##$SWIBOX= (0..15)
0 1 3 0 0 0 0 0 0 0 0 0 0 0 0 0 
##$SW_h= 29940.119760479
##$TD= 32768
##$TD0= 1
##$TE= 0
##$TE2= 300
##$TE3= 300
##$TEG= 300
##$TL= (0..7)
0 120 53 12 22 120 120 120 
##$TP= (0..7)
150 150 150 150 150 150 150 150 
##$TP07= 0
##$TPNAME0= <>
##$TPNAME1= <>
##$TPNAME2= <>
##$TPNAME3= <>
##$TPNAME4= <>
##$TPNAME5= <>
##$TPNAME6= <>
##$TPNAME7= <>
##$TPOAL= (0..7)
0.5 0.5 0.5 0.5 0.5 0.5 0.5 0.5 
##$TPOFFS= (0..7)
0 0 0 0 0 0 0 0 
##$TUNHIN= 0
##$TUNHOUT= 0
##$TUNXOUT= 0
##$USERA1= <user>
##$USERA2= <user>
##$USERA3= <user>
##$USERA4= <user>
##$USERA5= <user>
##$V9= 5
##$VALIST= <valist>
##$VCLIST= <CCCCCCCCCCCCCCC>
##$VD= 0
##$VDLIST= <DDDDDDDDDDDDDDD>
##$VPLIST= <PPPPPPPPPPPPPPP>
##$VTLIST= <TTTTTTTTTTTTTTT>
##$WBST= 1024
##$WBSW= 4
##$XGAIN= (0..3)
0 0 0 0 
##$XL= 0
##$YL= 0
##$YMAX_a= 50194
##$YMIN_a= -56497
##$ZGOPTNS= <>
##$ZL1= 120
##$ZL2= 120
##$ZL3= 120
##$ZL4= 120
##$ABSF1= 182.463
##$ABSF2= -187.1042
##$ABSG= 5
##$ABSL= 3
##$ALPHA= 0
##$AQORDER= 0
##$ASSFAC= 0
##$ASSFACI= 0
##$ASSFACX= 0
##$ASSWID= 0
##$AUNMP= <proc_1d>
##$AZFE= 0.1
##$AZFW= 0.5
##$BCFW= 0
##$BC_mod= 2
##$BYTORDP= 0
##$COROFFS= 0
##$CY= -3
##$DATMOD= 1
##$DC= 0
##$DFILT= <>
##$DTYPP= 0
##$F1P= 0
##$F2P= 0
##$FCOR= 1
##$FTSIZE= 65536
##$FT_mod= 6
##$GAMMA= 0
##$GB= 0
##$INTBC= 1
##$INTSCL= 5.30512e-09
##$ISEN= 30
##$LB= 1
##$LEV0= 0
##$LPBIN= 0
##$MAXI= 10000
##$MC2= 0
##$MEAN= 0
##$ME_mod= 0
##$MI= 50
##$NCOEF= 0
##$NC_proc= -4
##$NLEV= 6
##$NOISF1= 182.463
##$NOISF2= 159.3651
##$NSP= 0
##$NTH_PI= 0
##$NZP= 0
##$OFFSET= 182.463
##$PC= 4
##$PHC0= -543.4921
##$PHC1= 494.8
##$PH_mod= 1
##$PKNL= yes
##$PPARMOD= 0
##$PSCAL= 0
##$PSIGN= 0
##$REVERSE= no
##$SF= 81.0140089999434
##$SI= 65536
##$SIGF1= 159.3651
##$SIGF2= -187.1042
##$SINO= 113.3802
##$SIOLD= 16384
##$SREGLST= <1H.CDCl3>
##$SSB= 0
##$STSI= 65536
##$STSR= 0
##$SW_p= 29940.119760479
##$SYMM= 0
##$S_DEV= 0
##$TDeff= 32768
##$TDoff= 0
##$TI= <>
##$TILT= no
##$TM1= 0
##$TM2= 0
##$TOPLEV= 0
##$USERP1= <user>
##$USERP2= <user>
##$USERP3= <user>
##$USERP4= <user>
##$USERP5= <user>
##$WDW= 1
##$XDIM= 65536
##$YMAX_p= 299500987
##$YMIN_p= -105882833
$$ End of Bruker specific parameters
$$ ---------------------------------
##NTUPLES= NMR SPECTRUM
##VAR_NAME=  FREQUENCY,     SPECTRUM/REAL,   SPECTRUM/IMAG
##SYMBOL=    X,             R,               I
##VAR_TYPE=  INDEPENDENT,   DEPENDENT,       DEPENDENT
##VAR_FORM=  AFFN,          ASDF,            ASDF
##VAR_DIM=   65536,         65536,           65536
##UNITS=     HZ,            ARBITRARY UNITS, ARBITRARY UNITS
##FACTOR=    0.456856943014862, 1,           1
##FIRST=     14782.0589164792, 0,            0
##LAST=      -15158.0608439998, 0,           0
##MIN=       -15158.0608439998, -105882833,  0
##MAX=       14782.0589164792, 299500987,    0
$$ Real data points
##PAGE= N=1
##DATA TABLE= (X++(R..R)), XYDATA
$$ [...]
42396a60416O72542R45470Q06144L43513k36324n42388l30460Q1542J10806l26533
42386A363896o85966n17821q704L43346L20718N4413k71570n16941n15810j99710
42376f34149K12656L61322J33314k01067k58031R4091N81006P14781K98475k12445
42366A089953j31764N11623Q21821K05841o56679o34233K37770P29798J08091
42357B282221r11445j229662p20578l0206M33729O66206N69821K3838o25940p72027
42347c14043l35741J02149Q3338j89899k69014j09957l7870j75930j96859K25414
42337a218412Q51645J035995N25073j80786m77726l73368k02666L0365M36389
42328D26509O25978J35029n83435n26482L33933Q57975M05162l01264m89942m83564
$$ plain form
42396 -160416 512126 1457596 2263740 2607253 2370929 1828541 1498081 1579623 1690429 1363896
42386 1363896 677930 160109 151405 494751 815469 869882 598312 81371 -434439 -634149
42376 -634149 -421493 -60171 73143 -127924 -385955 -291864 289142 1003923 1302398 1089953
42366 1089953 958189 1469812 2291633 2497474 1840795 1206562 1444332 2174130 2282221
42357 2282221 1370776 141114 -579464 -609670 -175941 490265 1060086 1083924 457984 -314043
42347 -314043 -649784 -547635 -464297 -654196 -923210 -1033167 -1071037 -1246967 -1443826 -1218412
42337 -1218412 -366767 669228 1194301 1013515 535789 162421 -40245 -9880 426509
42328 426509 1052487 1187516 604081 77599 411532 1269507 1674669 1373405 883463 399899
42318C99899p46368p58219R0636J179638J381985O54823j44926o02548q32696
42309F22224o66059K7284N07159l7097j003365j023472o3345N14842J28190k38648
42299a232287J71777O85548M76820q7829k19237K2823O0840j66392k15358J51935
42289c51360P11744R60140M35536o83184j345473p06798N92767J105516N16972
42280A235860j56758l38653n06094p66425l63232P20565J153474K41845p75095
42271D45487n84201J89737J60053n74790q12702k22006M74140Q38071R62029P50977
42261A626795J54162k51673n1023N9249o83600j542175j142367L41841J282255
42252b06536Q35319k15916q78213r55321n64964J41343O32962M67120J57430M66575
$$ plain form
42318 399899 -346469 -1104688 -1014052 165586 1547571 2202394 2057468 1454920 622224
42309 622224 -43835 -16551 490608 453511 -549854 -1573326 -1636671 -1121829 -993639 -1232287
42299 -1232287 -1060510 -374962 101858 14029 -205208 -182385 -121545 -287937 -503295 -351360
42289 -351360 360384 1320524 1756060 1072876 -272597 -979395 -386628 718888 1235860
42280 1235860 1079102 740449 234355 -532070 -895302 -174737 978737 1220582 445487
42271 445487 -138714 51023 211076 -363714 -1176416 -1398422 -924282 -86211 875818 1626795
42261 1626795 1780957 1529284 1478261 1537510 853910 -688265 -1830632 -1488791 -206536
42252 -206536 628783 412867 -465346 -1420667 -1985631 -1844288 -1211326 -744206 -586776 -120201
42242a20201R01586K93266j036616j281258J96081J710654J545988J49721q65753
42233A493468q84928m63727j28801P978o9035k01464n1663L01347K95921j25448
42223A73648j94014M20824Q33766K65422n83512n31177K28291M59988j39294n41930
42213C92012j14517L73332j0138q82162j039073j06184R86509J212963O13520
42204A426262l2559l38920n73155q44718p29689n5120N47869M88579J49599K02863
42194B41011L80717o1990q49766q50672J30411R22301P28158J54590n1007j71612
42184E72141o31006r16350m00919M64989P94120N44144K11137k05128q71540j217909
42174a656321n56523O20487J126392P80886M97582O66278O41151P4312l93784
$$ plain form
42242 -120201 781385 1074651 38035 -1243223 -1047142 663512 2209500 2359221 1493468
42233 1493468 608540 144813 16012 23990 -45045 -246509 -298172 3175 299096 173648
42223 173648 -20366 400458 1234224 1499646 916134 384957 613248 1073236 933942 392012
42213 392012 277495 650827 640689 -241473 -1280546 -1386730 -400221 812742 1426262
42204 1426262 1393703 1054783 481628 -363090 -1092779 -1147899 -600030 -111451 38148 241011
42194 241011 621728 559738 -290028 -1140700 -1010289 -87988 640170 794760 743753 572141
42184 572141 -58865 -975215 -1376134 -911145 -117025 427119 638256 433128 -438412 -1656321
42174 -1656321 -2212844 -1592357 -465965 314921 812503 1478781 2119932 2194244 1800460
42165A800460k58843K354j73520m82731l87273q1992p1848k19272j3110M40530
42155E54755M96017L3404k91588q2293J33875k75862r58949r22737P8284J092626
42145a42468J153292M61814l5065L5901J50215j73070o86969q36604m24740L29920
42135a67774J025236J210193O95932p6650l89118j47810K7642k07247m60035m39351
42125A071018n35477j009065j270343p27077J74676O06167O21936Q24875J097104
42116H53814P55682j22925o27958l70879O5602J96291J95284J80370p6221m08735
42106F40325k29823L35623L12416n60890j177065p41662p1396j65616m36861K18428
42096a876521J250558J085382k38573q54473J50194J382435J345488N52339K89608
$$ plain form
42165 1800460 1541617 1543971 1370451 887720 500447 418455 346607 127335 114225 554755
42155 554755 1050772 1084176 792588 710295 844170 568308 -390641 -1313378 -1235094 -142468
42145 -142468 1010824 1472638 1437573 1473474 1623689 1450619 763650 -72954 -497694 -167774
42135 -167774 857462 2067655 2763587 2686937 2297819 2150009 2177651 1970404 1510369 1071018
42125 1071018 535541 -473524 -1743867 -2470944 -2296268 -1690101 -1068165 -243290 853814
42116 853814 1609496 1486571 858613 487734 553336 749627 944911 1125281 1049060 640325
42106 640325 410502 746125 1058541 497651 -679414 -1421076 -1492472 -1658088 -2094949 -1876521
42096 -1876521 -625963 459419 220846 -633627 -483433 899002 2244490 2796829 3086437
42087C086437M09592j28542j146011j335723m01073M22247L02093p9329M6009
42078A175700J88966l64706j061377q01038K85040R36224N41824j91141m24586
42069B84906j59844J68338L07295J51684k59131m98985j42853M29634L37808m64739
42059A54113r74431o16855n5112L2568O4449O04836J097180O48878m20657r73648
42049d38679p15305l21534p4842L94309R47943P98537r6601o26429j09264O28831
42039C86966M74204l75869q13705l63025M10611P70339M95368j25352n34825l34212
42029i500J78252J87964n30016j070629n34610N90565R12068m7960j203281j251305
42019b778452j49546J011895J247683N21434l89792o10790R6814J081331J356559
$$ plain form
42087 3086437 3496029 3367487 2221476 885753 484680 906927 1209020 1129691 1175700
42078 1175700 1364666 999960 -61417 -862455 -577415 358809 900633 709492 284906
42069 284906 125062 293400 600695 752379 493248 -5737 -148590 281044 618852 154113
42059 154113 -820318 -1437173 -1492285 -1459717 -1395268 -790432 306748 955626 534969 -438679
42049 -438679 -1153984 -1475518 -1550360 -1156051 -208108 590429 493828 -132601 -241865 386966
42039 386966 861170 485301 -328404 -691429 -280818 489521 984889 859537 324712 -9500
42029 -9500 168752 356716 -173300 -1243929 -1778539 -1187974 -275906 -323866 -1527147 -2778452
42019 -2778452 -2927998 -1916103 -668420 -146986 -536778 -1147568 -1050754 30577 1387136
42010A387136N79797n80765j177173r69025m83697j94521k103L49853P03058O84803
42000B97363L08634l6051j59790k23655k81903j44253J53337K22244o8477l14224
41990b46775k43335j84881m22447n73606k29148K18320J54915j56123M9460P01889
41980i31731Q94073K75038m58961o42693l64310J01355P02356J140756Q83579
41971A599462Q0607l69280j56141p7841o11345r30448k64087O17831M83381l66109
41961F030n46313J95117O31262P6095n65234k84019N27955P86748K45103m25881
41951F46863o73252n17304k04607J9347q8671n01806p19757l06188L67136M28538
41941a549701k64788p17741o8546J068725J225787N2277j083217q35086M15258
$$ plain form
42010 1387136 1966933 1386168 208995 -760030 -1243727 -1438248 -1440351 -1090498 -387440 297363
42000 297363 605997 569946 410156 186501 -95402 -239655 -86318 135926 67449 -246775
41990 -246775 -490110 -674991 -1097438 -1671044 -1900192 -1681872 -1526957 -1683080 -1633620 -931731
41980 -931731 -37658 237380 -221581 -864274 -1228584 -1127229 -424873 715883 1599462
41971 1599462 1680069 1310789 1154648 1076807 465462 -464986 -729073 -111242 372139 6030
41961 6030 -540283 -345166 286096 362191 -203043 -487062 40893 827641 1072744 646863
41951 646863 -26389 -543693 -748300 -728953 -817624 -1319430 -2039187 -2345375 -1978239 -1549701
41941 -1549701 -1814489 -2532230 -2600776 -1532051 -306264 -253987 -1337204 -2172290 -1757032
41932a757032J240594J079194N87459L12112O0409k79532l16381L2472J78753
41923A138048j53946l68379l0796K94615J7186l84372j95561J86302j14585q25521
41913d37009q04400R1281O64786J75219o20649o89486r4698M30659N93160N65190
41903a25947L57128j69461q20089j092506p19468R165M77875L19549j35912j28060
41893b027726N82860J251487J044177J93666l06626m4702M19393M82884J48572
41884A743985k95306n61383k85895N72408J181658N90116p59028j279527m19544
41875D87484M94518K73245l64225j04227P43363P57591k59484r47305m74032L47125
41865I54053M48240l2384l10218k22034j79751k84269k48863r4949k45668p51854
$$ plain form
41932 -1757032 -516438 562756 1150215 1462327 1522736 1243204 926823 959295 1138048
41923 1138048 984102 615723 584927 879542 896728 512356 316795 503097 388512 -437009
41913 -437009 -1241409 -1150128 -485342 -310123 -930772 -1620258 -1714956 -1284297 -691137 -125947
41903 -125947 231181 61720 -758369 -1850875 -2570343 -2561178 -2083303 -1763754 -1899666 -2027726
41893 -2027726 -1444866 -193379 850798 1044464 737838 693136 1112529 1595413 1743985
41884 1743985 1448679 887296 601401 1173809 2355467 2945583 2186555 907028 487484
41875 487484 982002 1255247 891022 786795 1530158 2287749 2028265 1080960 606928 954053
41865 954053 1402293 1369909 1059691 837657 657906 373637 124774 29825 -215843 -967697
41855i67697r28019j79289J013501J452314O75453m23357p68194m50341k92015
41846h67644l96862r2252O57392Q89840J76889m81299j11732O54224M98390n76580
41836C50366j289363r35108j08762M32551O10845N72993L29608J26869L64222
41827D54221Q23831P28283r9641q68444r83464q18407q23421o32045J91934J079058
41817i48095J022307P680q87064p97624Q4238R49783J176491O93312n4257m70873
41807G75898l94560k33929l21515l95733r7922K89633J69360l96684o34846j04725
41797a345023O70099Q40228K19368n62921p63165k74031K93543L15688p8848k07270
41787h92332J50834M22382K21156O2052M61150Q51764L66996n84354p21396P8838
$$ plain form
41855 -967697 -1895716 -2075005 -1061504 390810 1066263 642906 -125288 -575629 -867644
41846 -867644 -1264506 -1356758 -699366 190474 367363 -113936 -225668 428556 926946 350366
41836 350366 -938997 -1874105 -1982867 -1550316 -939471 -366478 -36870 89999 454221
41827 454221 1278052 2006335 1906694 1038250 54786 -763621 -1587042 -2219087 -2027153 -948095
41817 -948095 74212 81892 -805172 -1602796 -1518558 -568775 607716 1301028 1246771 775898
41807 775898 381338 147409 -174106 -569839 -667761 -378128 -208768 -605452 -1240298 -1345023
41797 -1345023 -674924 165304 384672 -178249 -941414 -1215445 -921902 -606214 -685062 -892332
41787 -892332 -741498 -319116 -97960 -35908 425242 1277006 1644002 1059648 338252 417090
41777D17090M53331l08012j065063o11892M21248O38615R0335k1857M93024N05413
41767A012232l97878j002403k71035R84856J178689J22516q28666o54493J31775
41758B75593L73202j67846n92269j52922O55647O95017k06453q56404k81487Q44328
41748E86406J081166K10463n89642n07455k0179J73705J34443J01366j61644p42731
41738B65898j023262n13629L23805Q30254J131031J507091J412264K68058j149705
41729C051805j429416n64429J0508m11075q70496m24366L83995M67632k14239
41720h1q06610p72758k68876L17621O29179M42273k0852j67943K14927O33913
41710B00793O16488L16822L6508l04162p07633o77472L6316O98221M16870n18340
$$ plain form
41777 417090 870421 562409 -502654 -1114546 -693298 -54683 35652 13795 506819 1012232
41767 1012232 614354 -388049 -659084 325772 1504461 1626977 798311 143818 275593
41758 275593 648795 480949 -111320 -264242 391405 1086422 879969 23565 -257922 586406
41748 586406 1667572 1878035 1288393 780938 760759 934464 1068907 1170273 1008629 265898
41738 265898 -757364 -1270993 -947188 -116934 1014097 2521188 3933452 4201510 3051805
41729 3051805 1622389 1057960 1068468 657393 -213103 -637469 -253474 214158 -81
41720 -81 -806691 -1579449 -1848325 -1530704 -901525 -459252 -480104 -648047 -433120 200793
41710 200793 817281 1134103 1170611 866449 158816 -518656 -482340 215881 632751 114411
41700A14411r59648m84126J60626K77381J02133J59658L58742K29922k33810m75562
41690g50273j46511L31487K27284m91244r28687l45756P51287J156389N62388
41681C66364r5950q2788J66968q703l67752l31749o8917r8748k51332j2586L79560
41670d05633K44096k66599l03318K18982M13526q0077m65534j10765M45741M16163
41660A06582o2365l39690k69048j58223j22159p6055o0526p2184J41445O59679
41650b52544J033724Q06157J74507k67906k79833j08138l1903r6372k15516l11439
41640D50737l89877n21764o33896m35164J44134O14357N37182L07250N83990J017152
41630A674101N42634q34402j651050r43753L72384Q26451K70082m02812o77776
$$ plain form
41700 114411 -845237 -1329363 -1168737 -891356 -789223 -629565 -270823 -40901 -274711 -750273
41690 -750273 -896784 -565297 -338013 -829257 -1757944 -2103700 -1352413 -196024 366364
41681 366364 270414 187626 354594 345891 -21861 -353610 -422527 -521275 -772607 -785193 -405633
41670 -405633 -161537 -428136 -731454 -512472 -98946 -179023 -644557 -755322 -309581 106582
41660 106582 44217 -295473 -564521 -722744 -844903 -920958 -981484 -1053668 -912223 -252544
41650 -252544 781180 1587337 1761844 1493938 1214105 1105967 1074064 977692 762176 450737
41640 450737 60860 -460904 -1094800 -1529964 -1385830 -771473 -234291 72959 656949 1674101
41630 1674101 2216735 1382333 -268717 -1212470 -840086 -13635 256447 -146365 -824141
41621h24141o09860j91522M57598P15734K48036k30183N6543O19524M53796k59843
41611D35682m29648J53788N62513K77885k00635m04122m34522l10816J39857N71547
41601C61529L82249j41579p1877N77435P45498Q7547m88801m77371n34936r50695
41591e11001q52172J10237P21960R9615o47269j50419R00261R22777J24349L9601
41581G57939P79441Q26927l03823j183233q02057p9029j49978n43633k12812N70628
41571c39630O14027l28584j167846r17921K01893J183299J304890O99357P0335
41562A319820p2123J27472K22723Q7111r8419k84680n26517o39811m28576j81360
41552d74360l22009n98534l49371L59499O87038L13606p9128J5888J60849p1962
$$ plain form
41621 -824141 -1434001 -1625523 -1167925 -452191 -204155 -434338 -377795 241729 695525 435682
41611 435682 6034 159822 722335 1000220 799585 395463 -39059 -349875 -210018 361529
41601 361529 743778 602199 530322 1107757 1853255 1940802 1452001 974630 439694 -511001
41591 -511001 -1363173 -1252936 -530976 -431361 -1078630 -1229049 -328788 593989 718338 757939
41581 757939 1537380 2364307 2060484 877251 75194 -3835 -153813 -697446 -910258 -339630
41571 -339630 274397 -54187 -1222033 -2139954 -1938061 -754762 550128 1249485 1319820
41562 1319820 1247697 1375169 1597892 1685003 1586584 1301904 775387 135576 -293000 -474360
41552 -474360 -796369 -1394903 -1744274 -1384775 -697737 -384131 -463259 -447371 -286522 -358484
41542c58484k29597J60294N62260K11718n56664p56654k52301J83138K02724K75770
41532e57796O27242P20840J64163n62743p31132k82147K42082L82882J13824k47889
41522a30674k91599J01431N21297M47253l1878k70309L5953M04576K76684j68706
41512H94028k75822J83152P10913O76065p067p97034j029751n51108R8603K23624
41502A25603k55674o99013m87311K66595Q54829P32131M7760n26933m67857O0599
41492c49271L83834J28409k94373k71447R4709J27943l31133n76770j01800N32176
41482f57723M69152j44527l76796P3486M79564K88249n1694P0363L80451K19337
41472G49862k82274l70464O0018K23042l00612q29683n81599J78427N96214M34158
$$ plain form
41542 -358484 -588081 -427787 134473 346191 -210473 -967127 -1219428 -1036290 -833566 -557796
41532 -557796 69446 790286 954449 391706 -339426 -621573 -379491 3391 117215 -130674
41522 -130674 -422273 -320842 200455 647708 615830 345521 381474 786050 1062734 894028
41512 894028 618206 801358 1512271 2188336 2181269 1384235 354484 -196624 -98021 125603
41502 125603 -130071 -829084 -1316395 -1049800 -194971 537160 584920 57987 -409870 -349271
41492 -349271 34563 162972 -131401 -402848 -308139 -180196 -511329 -1088099 -1189899 -657723
41482 -657723 -188571 -333098 -709894 -636408 -156844 131405 79711 150074 530525 749862
41472 749862 467588 97124 157142 380184 79572 -750111 -1331710 -1153283 -557069 -122911
41462a22911J45465K038j23950k16372j03283o870l37464q07860n80868L78141
41452a773934R29310K94742p55129r75606l21074L07367N30466O98492Q60147
41443b05219O14278N2462j66128O2233M555o71134j208416q69033m9370L72272
41433b063500L12612L95957Q67386J256844J054206K54450p00971j191203p91625
41424f05844K47120J042212R50790K58842k95062m34751l89783k92472r2359L9679
41414D28372j84760o02140o31891l3028P39673J072254P98652J89477l76156o17267
41404G83186m56336l7054M31420P67464O76002j49473j420821k086247j397960
41395b889819m577P34659M99497K46998N64056P62870J43997p16010q04566k36066
$$ plain form
41462 -122911 22554 24592 -99358 -315730 -419013 -425883 -763347 -1571207 -2152075 -1773934
41452 -1773934 -844624 -549882 -1305011 -2280617 -2601691 -2294324 -1763858 -1065366 -205219
41443 -205219 409059 461521 295393 357626 362181 -308953 -1517369 -2386402 -2435772 -2063500
41433 -2063500 -1750888 -1354931 -487545 769299 1823505 2077955 1376984 185781 -605844
41424 -605844 -358724 683488 1634278 1893120 1598058 1163307 773524 481052 388693 428372
41414 428372 243612 -358528 -990419 -1023447 -283774 788480 1587132 1776609 1400453 783186
41404 783186 326850 289796 721216 1488680 2164682 2015209 594388 -1491859 -2889819
41395 -2889819 -2894396 -2159737 -1660240 -1413242 -849186 -86316 57681 -658329 -1462895 -1698961
41385a698961R597l60114o50469l98716N9565M09925Q43544J349729J330747N15694
41375A410541l40274l71679J73278L58142k8904k84476N652L67123K80962l3548
41365A536817r3293N5878M696l25355n97086n32740j33204M42883R04275Q86473
41355B149344L36417k89143n52434n90828p31432p74509k94212M30815N76862
41346B60880L7229k64790K75213R91022R21184J45085n60567r19809j169351j196677
41336a480581o36480K37623O59799N09491M04061M79491Q3603q76444j296162
41327a915599l99716Q58836R60187n2821p30661l58441K12814R3083l33496j86791
41317a852605N40712J073847R10326K03255o24354j121024r13982j24796N02730
$$ plain form
41385 -1698961 -1689364 -2049478 -2699947 -3098663 -3039098 -2629173 -1785629 -435900 894847 1410541
41375 1410541 1070267 698588 871866 1230008 1201104 916628 922280 1289403 1570365 1536817
41365 1536817 1443524 1499402 1504098 1178743 581657 48917 -84287 358596 1262871 2149344
41355 2149344 2485761 2196618 1644184 1053356 321924 -452585 -746797 -315982 260880
41346 260880 298109 33319 308532 1299554 2220738 2365823 1805256 885447 -283904 -1480581
41336 -1480581 -2117061 -1879438 -1219639 -710148 -306087 173404 257007 -619437 -1915599
41327 -1915599 -2315315 -1456479 -496292 -549113 -1279774 -1638215 -1425401 -1332318 -1665814 -1852605
41317 -1852605 -1311893 -238046 672280 875535 251181 -869843 -1783825 -1908621 -1405891
41308a405891M33824J19798L17212Q08972O67209j66391n91036n1199M71149l7212
41298E66435r33048q45449J84542P66411K62167m48133n16984k41649j41958n400
41288a353066M23045O64771K76168k41400j54453L68125O41453N30966L07990
41279A463599j04028p99664j181219o20167L90237P80471M50155K03653K65682
41270H48719O4371m63054o16343k29566o664k14506k49836O0321M732n59731o13211
41259a974768L15090J076357O24170k80441l29471K87929M67878P7402j81413
41250H2733k15410l68577k70529N70880J338184P46229p61718j362252n36863
41241g77323K86861J24677k38388M6763M47195K26573k36191l04710j80971j85604
$$ plain form
41308 -1405891 -972067 -852269 -535057 273915 941124 774733 183697 132498 603647 566435
41298 566435 -366613 -1212062 -1027520 -261109 1058 -447075 -964059 -1205708 -1347666 -1353066
41288 -1353066 -930021 -265250 10918 -230482 -384935 -16810 624643 1155609 1463599
41279 1463599 1359571 559907 -621312 -1241479 -851242 -70771 379384 583037 848719
41270 848719 913090 450036 -166307 -395873 -402537 -617043 -866879 -806558 -801826 -1361557 -1974768
41259 -1974768 -1659678 -583321 40849 -239592 -569063 -281134 186744 264146 82733
41250 82733 -132677 -501254 -771783 -200903 1137281 1883510 1121792 -240460 -777323
41241 -777323 -490462 -365785 -604173 -557410 -110215 116358 -119833 -424543 -605514 -791118
41231g91118N2575P11307J039020N32596p1784p1569r4841q23470j351088m75092
41221a343464R91912J082320l30084j274547o43114L81667M47617k5018K4298
41212f88413M78208N30472J80136N8890K07767Q8430l55798n49581k22566J95104
41202g7351K44668J5876j12620N119J83826J89308J8026j08740m3602Q7805J36522
41191E38837K33614N15798O63170K27235n38193p71913j57095N84836O81409K52338
41181B230036j48982l89990n76453m80531J10555P40051P36621K19069p6088M7474
41171B411762J37n53904j117171j124056p30804m52042l89015k20839K25821P00239
41161a249872P68578K50131m84606p28291k14172M20875L67972k13536l57039
$$ plain form
41231 -791118 -738543 -27236 1011784 1544380 1472596 1401027 1306186 482716 -868372 -1343464
41221 -1343464 -351552 730768 400684 -873863 -1516977 -1135310 -687693 -712711 -688413
41212 -688413 -210205 320267 500403 559293 767060 855490 499692 -49889 -272455 -77351
41202 -77351 167317 183193 70573 75692 259518 448826 466852 358112 314510 402315 538837
41191 538837 772451 1288249 1951419 2178654 1640461 868548 711453 1296289 1977698 2230036
41181 2230036 2081054 1691064 1114611 634080 744635 1484686 2221307 2440376 2364288 2411762
41171 2411762 2411899 1857995 740824 -383232 -1114036 -1566078 -1955093 -2175932 -1950111 -1249872
41161 -1249872 -481294 -231163 -715769 -1444060 -1658232 -1237357 -869385 -1082921 -1439960
41152a439960L16187J010265Q71818J09618m64133n45414m30484l05747m6126
41143i23976L67473O88549O64054K15495m99323j008440p92670P8927Q70026J028713
41133F88828P63559M62735O7652m59214o19668j12695L82982J06829m50126k24881
41123F06001N91025P02026k10211r16697n83289Q351j00861n20554l70927K05803
41113e89333M27937J40019k76157p16458j130650j012254j44516O07531L76451
41104b317430k19715P2607J045119J199316P6327j004590q95349l1389O19906
41095a455198Q47599P72476K21454o21148q40054k7584Q19094O35131q8413j24040
41085A39317N13129O78638L5948m38551j10847L30087P7087n31608o62296k67005
$$ plain form
41152 -1439960 -1123773 -113508 758310 867928 403795 -141619 -572103 -877850 -923976
41143 -923976 -556503 132046 796100 1011595 512272 -496168 -1288838 -1209911 -339885 688828
41133 688828 1452387 1915122 1982774 1523560 903892 791197 1174179 1281008 830882 606001
41123 606001 1197026 1899052 1688841 772144 188855 197206 96345 -424209 -795136 -589333
41113 -589333 -161396 -21377 -297534 -1013992 -2144642 -3156896 -3301412 -2693881 -2317430
41104 -2317430 -2537145 -2464538 -1419419 -220103 -143776 -1148366 -2043715 -2075104 -1455198
41095 -1455198 -607599 164877 386331 -234817 -1074871 -1102455 -283361 351770 263357 139317
41085 139317 652446 1331084 1367032 928481 817634 1147721 1224808 693200 30904 -236101
41075b36101N0358O3912N3802P6470j38731n05699m65871J76925Q11450P92674
41065F79189L23639J21681L82633N49887J29251o46561j085962p56027J00646
41056b01624O85828K85338q94011j648499j019744M30057J183730O51855k46318
41047g73388n48688l69211j07432M24765J228463J385239L04377r38124q77513
41038b71512J42676N51266P2341p7379M04575K49600r93437j762392q25215O81273
41028a828204R80683K76180N3033N61327O92046J7609o19431n62271j16480K23732
41018c21776L01551J6283n55454p93063k10828N75434N45471j38833l49802J70463
41008g60554M05110k26751r08663o81260K73105J124286J386367R58536k8790
$$ plain form
41075 -236101 -185743 -121831 -68029 8441 -130290 -635989 -1101860 -924935 -113485 679189
41065 679189 1002828 1124509 1507142 2057029 2186280 1539719 453757 -302270 -201624
41056 -201624 484204 769542 -124469 -1772968 -2792712 -2362655 -1178925 -527070 -773388
41047 -773388 -1322076 -1691287 -1798719 -1373954 -145491 1239748 1544125 606001 -271512
41038 -271512 -128836 422430 494771 417392 821967 1071567 78130 -1684262 -2509477 -1828204
41028 -1828204 -847521 -571341 -518308 43019 735065 752674 133243 -429028 -545508 -321776
41018 -321776 -20225 -3942 -559396 -1352459 -1563287 -987853 -442382 -581215 -931017 -760554
41008 -760554 -355444 -582195 -1490858 -2172118 -1899013 -774727 611640 1570176 1541386
40999A541386r06375p88100K11146P94229J53945q55879r58720k44580J90281
40990h62667j4249j18071L95455J032367J067473N15314n532p8061J11601R7824
40980B141454k73465o45319o06533k56319o9084k12518l46903j97679M3788R0849
40970c31729R639M4858K39223M52498N60645M66994J30978k70939m47023l70962
40960D84182k96690l04594j82772R6725J76471j67817o31285p55153m41507Q2322
40950a940118N23289O10892K91097j6351K14851P98838Q87091J32592p15437q01129
40940a4385k77245Q2980K921j56873j26128k209J01894J96537K23606P8399k02565
40929i3068m85588o39485m60490J80968R06809R82736K69905m11975l46032R2181
$$ plain form
40999 1541386 635011 -153089 58057 852286 1006231 150352 -808368 -1052948 -862667
40990 -862667 -876916 -994987 -599532 432835 1500308 2015622 2010090 1932029 2043630 2141454
40980 2141454 1867989 1222670 616137 359818 290734 78216 -268687 -466366 -422578 -331729
40970 -331729 -322090 -277232 -38009 414489 975134 1442128 1573106 1302167 855144 484182
40960 484182 187492 -117102 -299874 -203149 -26678 -194495 -825780 -1580933 -2022440 -1940118
40950 -1940118 -1416829 -805937 -514840 -531191 -316340 482498 1369589 1502181 786744 -14385
40940 -14385 -291630 -208650 -205729 -362602 -488730 -490939 -389045 -192508 31098 109497 -93068
40929 -93068 -578656 -1218141 -1678631 -1497663 -590854 391882 661787 249812 -96220 -4039
40919d039J09194k46679k94696M0010J15908k50794l95345Q7121N75874L11710
40909D8264m14357o13472n279N59036K84603m21109m87986K89893R33005O95394
40899H67992J06670n965P5093m59132j280610j153308N9274R67136P06876J29237
40889A3263K01240M77152K00752j97677k3517J81974m14544j165697p86488M10125
40879a103417Q52343J86833l04095Q2180N11243K74604j50480l06910o03479j188501
40869a749679j232951k49904Q79406J117779O94577M67514N93692O71323N82557
40860A774314M17134J05421k04356j1712O31469P72096j10904j101830j087814
40851A183818m10065k35763p17602r30648m73232P922J6788l6540L60893R36572
$$ plain form
40919 -4039 105155 -141524 -436220 -396210 -280302 -531096 -926441 -839320 -263446 48264
40909 48264 -366093 -979565 -984844 -425808 -141205 -562314 -1050300 -760407 172598 867992
40899 867992 974662 968697 1043790 584658 -695952 -1849260 -1789986 -822850 -115974 13263
40889 13263 214503 691655 892407 694730 671213 853187 438643 -727054 -1513542 -1103417
40879 -1103417 -251074 -64241 -368336 -286156 225087 499691 349211 42301 -561178 -1749679
40869 -1749679 -2982630 -3232534 -2353128 -1235349 -540772 -73258 520434 1191757 1774314
40860 1774314 2191448 2296869 2092513 2080801 2712270 3484366 3373462 2271632 1183818
40851 1183818 773753 537990 -179612 -1110260 -1583492 -1575570 -1558782 -1595322 -1234429 -297857
40841b97857J006060M24911k01705k44069J83432L59475m6787m30147j46345L40178
40831I47146L3843r24643j239894l90155N52876N94311J86988J07109L5179n96626
40821f93866j197305q05051K58718Q46784P18355N17762L46971k22308q38044
40812a067984n54362M99393R93686L10074n87847o30435K7423O15152P92447O11502
40802A009049J95742j17032K5063L32053J02130o38014r84542m48887L67314P20479
40792E63355N89689K56804j82983m88353k35339M17284O52204J47046m18976m75218
40782H25513l92368o32247q30404m40506L07174P77474P58994L53745l82962j102351
40772g57938j092418k34171N50787N03044Q2766Q6526L48365K25225j67064k10683
$$ plain form
40841 -297857 708203 1133114 931409 687340 870772 1230247 1183460 753313 606968 947146
40831 947146 980989 56346 -1183548 -1573703 -1020827 -426516 -239528 -132419 -97240 -693866
40821 -693866 -1891171 -2696222 -2437504 -1590720 -872365 -354603 -7632 -229940 -1067984
40812 -1067984 -1622346 -1122953 -129267 180807 -407040 -1037475 -1010052 -394900 397547 1009049
40802 1009049 1204791 1087759 1112822 1444875 1547005 908991 -75551 -524438 -157124 563355
40792 563355 1153044 1409848 1226865 738512 503173 920457 1572661 1719707 1300731 825513
40782 825513 433145 -199102 -1029506 -1470012 -1162838 -385364 373630 727375 344413 -757938
40772 -757938 -1850356 -2084527 -1533740 -1030696 -947930 -861404 -513039 -287814 -454878 -665561
40762f65561J03910L00792L36972M47614L82841j98931q29416p58943j87634R0249
40752i78107P7597M24483R84704Q56732J4294m48601q5140J69078l77617r68710
40742c31287o26519L27631Q55850O45287J58357k36937m48968l94998j78527j30831
40732c60942j77271K66765J179418J422192K48216j241139j287278J12414J152096
40723A314471O57724n00532q06796m8282P22272O67152K952m92638m00565j1216
40713A104542J37612l2678r9082J36742K62468p6120n06264m86889k38813l64648
40703a63130o80468l54214O46355J212283O66491j66927j86197L40595K79398
40694A594186n52948j088938n78535M14737Q93256O49255J77909j76158m50342
$$ plain form
40762 -665561 -561651 -260859 76113 523727 906568 707637 -121779 -880722 -1068356 -978107
40752 -978107 -900510 -476027 508677 1365409 1379703 931102 845962 1015040 637423 -331287
40742 -331287 -957806 -630175 225675 870962 1029319 792382 343414 -51584 -230111 -360942
40732 -360942 -538213 -271448 907970 2330162 2578378 1337239 49961 162375 1314471
40723 1314471 1972195 1471663 664867 616585 1338857 2006009 2008961 1516323 1115758 1104542
40713 1104542 1242154 1209476 1110394 1247136 1509604 1433484 927220 440331 201518 -163130
40703 -163130 -843598 -1197812 -551457 660826 1327317 1160390 974193 1314788 1594186
40694 1594186 1041238 -47700 -626235 -211498 681758 1331013 1508922 1332764 882422
40685H82422o32748n13552m6210M57413O55283N55345M22928L77114K47947j26657
40675B279285o11009r03102q56343n22688j0337M37927L66454m08761j202926
40666a431500r69426K90602J236747Q56423j20957k77428M27522P19888N6197
40657G88068o17323m81402m9258n6511j38687L77633J062577R51164J74762j89646
40647A821377J53432L22048k00156p25776n53492p8903k5432k32572k6951N64813
40637A018388Q02360L78259j17645p6706K50225J04691o95847j375533j084097
40628g95905j5799P17288M35881k90915n06030j31886J83681J63387O6317q1277
40618b55258m91422q07680l23346P11358J060369L05095l57885J10928R83111
$$ plain form
40685 882422 249674 -263878 -310088 147325 802608 1357953 1780881 2157995 2405942 2279285
40675 2279285 1668276 765174 -91169 -613857 -624194 -186267 180187 -228574 -1431500
40666 -1431500 -2400926 -2110324 -873577 -17154 -138111 -415539 11983 731871 788068
40657 788068 170745 -310657 -359915 -416426 -555113 -177480 885097 1836261 2011023 1821377
40647 1821377 1974809 2296857 2096701 1370925 817433 738530 713098 480526 453575 1018388
40637 1018388 1820748 2199007 2081362 2004656 2254881 2359572 1663725 288192 -795905
40628 -795905 -811704 -94416 341465 50550 -455480 -587366 -403685 -240298 -173981 -255258
40618 -255258 -746680 -1554360 -1877706 -1166348 -105979 199116 -158769 -47841 935270
40609I35270R43405R0485m65517m42769m70173o41572m18611N4153l7206o21473
40599a074008n74822M11496J065026L83807p82456r28031N7969R70227R47599
40590D76807K10469n52190p94674l29568M35758O57000k333p76490o79658K07865
40580a147014Q89062P49010J43351k73532l02260k08840l06197n62891n04563
40571a523874K67346J275924J353570J11968j205537j088897K51317J128432O04626
40562A174875m52734q05380m42627j47384j26046Q0953N73522Q20614N30335J40631
40552A346759J18612K13047j43126r04014j389073j195335o58160k35085J09671
40543b736704N36245P26370K44570o26396j030294n83238K47973Q79188J144634
$$ plain form
40609 935270 1878675 1969160 1503643 1060874 590701 -50871 -469482 -415329 -452535 -1074008
40599 -1074008 -1648830 -1237334 -172308 211499 -570957 -1498988 -1441019 -470792 476807
40590 476807 687276 135086 -659588 -989156 -553398 103602 101269 -675221 -1354879 -1147014
40580 -1147014 -257952 491058 634409 360877 58617 -150223 -456420 -1019311 -1523874
40571 -1523874 -1256528 19396 1372966 1484934 279397 -809500 -558183 570249 1174875
40562 1174875 722141 -83239 -525866 -673250 -799296 -718343 -144821 675793 1206128 1346759
40552 1346759 1465371 1678418 1535292 631278 -757795 -1953130 -2611290 -2846375 -2736704
40543 -2736704 -2200459 -1474089 -1229519 -1855915 -2886209 -3469447 -3221474 -2342286 -1197652
40534a197652R88673L29172m50531n62203J40970P71958O15095J27987O9578K43368
40524A076415K4033l49007j41569M33587L75255m28726q75702l29397M45960N27339
40514G58188O3684l36253n92347p97070o01896J74104Q46726O73185Q138k12753
40504a6294J09399K40770p3352k48906N0591L27309J05770k73810j91945L09530
40494C39062N76877J86721n52809r14882m97760K74717N00200j24268p40408l04864
40484a257414R38602J605159R60324j22701m42106q5386l4023n33743p98829l46956
40474a17073K83140M73179M19566N38632N74502N6112o88162q32892l36865p9329
40464B90810m95098q48235l52753N72437Q44433K10052m93587n18335m4639K72186
$$ plain form
40534 -1197652 -208979 120193 -330338 -892541 -751571 20387 635482 763469 833047 1076415
40524 1076415 1100448 751441 609872 1043459 1418714 989988 114286 -215111 230849 758188
40514 758188 821872 485619 -106728 -903798 -1505694 -1331590 -484864 188321 196459 -16294
40504 -16294 93105 333875 260523 11617 62208 389517 495287 221477 29532 339062
40494 339062 915939 1102660 549851 -365031 -862791 -588074 -87874 -212142 -952550 -1257414
40484 -1257414 -318812 1286347 2246671 2123970 1681864 1596478 1562455 1028712 229883 -117073
40474 -117073 166067 639246 1058812 1597444 2171946 2228058 1539896 707004 370139 290810
40464 290810 -204288 -1052523 -1405276 -832839 11594 221646 -271941 -790276 -834915 -562729
40454e62729J39964j90311l14044p1804L18449M83389L23960J16942O4215j8839
40444B89192k96783m87986k94039p283q0314k38939K09289J131170J469110P01085
40434B394502l32296n38303N9239N77696M48025j77524q03840r08194k66981N71329
40424A023653N90898l82198j185471q17257R7890K61156l04230l98872L30480
40415g83951Q42920M63813o5792N8926L67110M3709n69901n01691K33976O59343
40405G48462L86525J02536L10699N13001J12322n60090p48952l92671o1265L5849
40395D46416K70310P49347R25091M15088k78249m17054j19962j46857o45333q50668
40385C48129k87251M08848L97306j20195k54355K20050O25002M83926J41576P9908
$$ plain form
40454 -562729 -422765 -613076 -927120 -998924 -680475 -197086 126874 243816 308031 289192
40444 289192 -7591 -495577 -789616 -796899 -877213 -1116152 -906863 224307 1693417 2394502
40434 2394502 2062206 1523903 1583142 2160838 2608863 2431339 1627499 719305 452324 1023653
40424 1023653 1614551 1232353 46882 -770375 -672485 -411329 -715559 -1114431 -783951
40415 -783951 58969 522782 456990 515916 883026 926735 356834 -144857 89119 748462
40405 748462 1134987 1237523 1548222 2061223 2173545 1613455 864503 471832 410567 446416
40395 446416 716726 1466073 2391164 2806252 2528003 2110949 1990987 1844130 1198797 348129
40385 348129 60878 469726 867032 746837 492482 712532 1337534 1821460 1963036 2042944
40375B042944K14854J91152p6358m82929r69766j338589j180053l86145N20568
40366a464322R47758Q96073P00304M07859o0638l65827q9088L69845L5053j158279
40356B18738j824482p63237J257637K206862J263291k50722p16201k23453l1920
40347A136513n36328q22966k98542K87812K9495o58433o14936L20547J050382
40338a06456P58886q9543n75663m90994k21552M5084L87905O40823M18600k84698
40328D82392r33160j014214n19633J92657P47448Q74980M93425r0946k74636K14633
40318A72946Q36181P43951j35498q89057p28981j3356K64353j71071n96644m09802
40308i26978O9014K01584m5104k13610o8431K59000O10981Q53018P68222L32344
$$ plain form
40375 2042944 2257798 2448950 2372592 1889663 919897 -418692 -1598745 -1984890 -1464322
40366 -1464322 -516564 379509 1079813 1487672 1427034 1061207 972119 1341964 1377017 218738
40356 218738 -1605744 -2368981 -1111344 1095518 2358809 2108087 1391886 1168433 1136513
40347 1136513 600185 -222781 -521323 -233511 -204016 -862449 -1477385 -1156838 -106456
40338 -106456 652430 562887 -12776 -503770 -725322 -680238 -292333 348490 767090 482392
40328 482392 -450768 -1464982 -1984615 -1791958 -1044510 -169530 323895 232949 -41687 172946
40318 172946 1009127 1753078 1617580 728523 -458 -13814 250539 79468 -517176 -926978
40308 -926978 -857964 -656380 -701484 -915094 -983525 -724525 -113544 739474 1507696 1840040
40298A840040p0817j23921o0310k19569l98056k58430j25196n35910j083924o98067
40288a734160O94028J714780J237606j82145j140867j086730n87840l18232l85538
40279a789098m70549k11646M08434Q79069O87373J37138Q6562O53420R01050K35888
40269A517641o47707q47919n40433l53150j30300N94542J333282J090097k1242
40260A994811p62161m94871R1415K05089k4922j00086N0026K27476L32566K38609
40250A757952j88842o97375p73444l67542K516J7040j19898k26198l77009m57549
40240a430349j87814K23489K26871l8512K28943J065100J358044N27587m17775
40231A555584l94043J07343L4635l25477P0914R56570R12656l21838j262230q73730
$$ plain form
40298 1840040 1769223 1645302 1584992 1365423 967367 708937 583741 47831 -1036093 -1734160
40288 -1734160 -1040132 674648 1912254 1730109 589242 -497488 -1085328 -1403560 -1789098
40279 -1789098 -2259647 -2471293 -2062859 -1183790 -496417 -359279 -272717 380703 1281753 1517641
40269 1517641 869934 22015 -518418 -871568 -1001868 -407326 925956 2016053 1994811
40260 1994811 1232650 737779 829194 1034283 1009361 909275 959301 1186777 1519343 1757952
40250 1757952 1569110 871735 98291 -269251 -266735 -249695 -369593 -595791 -972800 -1430349
40240 -1430349 -1618163 -1394674 -1167803 -1206315 -977372 87728 1445772 1973359 1555584
40231 1555584 1161541 1268884 1303519 978042 1048956 2005526 2918182 2596344 1334114 460384
40221D60384M500J73983j47614q3926K37821K6110o12382p19680p1070M11837
40211c20037R5498m52374m43852k3928J70875Q2039J41179L93716M46492K41064
40201C30672J99839M70770O05828K40638l64131p39308p68793n46550q1266M75809
40191a76492O80484L49832j9592R7089M25993L04102k61533o20537n19225l99717
40181a39596n49733o34844l27220J68902N01571N98588M78624J44196j02426J77419
40171C15481P47623O72893l98984j482101j402997l02968O50673P51184L08107
40162a41089o2692o8512K25500M59843K09966l97047n71423Q0476P47059M34979
40152I17060m87851p54685j06296L88676R5409k69829J2239M49587K58905l03685
$$ plain form
40221 460384 464884 638867 491253 407327 645148 671258 58876 -660804 -731874 -320037
40211 -320037 -224539 -676913 -1120765 -1144693 -973818 -891779 -750600 -356884 89608 330672
40201 330672 530511 1001281 1607109 1847747 1483616 744308 -24485 -571035 -652301 -176492
40191 -176492 503992 853824 834232 931321 1357314 1661416 1399883 779346 260121 -139596
40181 -139596 -689329 -1324173 -1651393 -1482491 -980920 -382332 96292 240488 138062 315481
40171 315481 1063104 1735997 1337013 -145088 -1548085 -1851053 -1200380 -449196 -141089
40162 -141089 -203781 -272293 -46793 413050 623016 225969 -345454 -264978 482081 917060
40152 917060 429209 -325476 -431772 -43096 52313 -217516 -205277 244310 503215 199530
40142A99530m54823j76693n0714j59479r6210J40292J82452J13874L20280N58756
40132E77265K05269m48268k99373P39211J197735J52531j156157j009544J98258
40123A56927N57653m11301j067589k57017R15867Q28279k75072q59956m28735
40114h40944N3685q9973l01766J12635Q36535J019533M28996l44750o54621m61974
40104b42644k28745k36391j56247M30152J133333R98221n9662q02109l36738M48061
40094I47231J53996r27351j235645l83621L45607J48084j98347N4855L70570J52769
40084e71852n6212L05578N99091J15601n03509l34995J34240j00495o07570j84601
40074a204724Q50872R08240k42322r12076p3981J121438J205619M11306j54126
$$ plain form
40142 199530 -255293 -431986 -482700 -642179 -738389 -598097 -415645 -301771 18509 577265
40132 577265 782534 334266 34893 774104 1971839 2124370 968213 -41331 156927
40123 156927 714580 303279 -764310 -1021327 -105460 722819 447747 -412209 -840944
40114 -840944 -787259 -877232 -1178998 -1066363 -229828 789705 1218701 873951 219330 -242644
40104 -242644 -471389 -707780 -864027 -433875 699458 1697679 1638017 835908 499170 947231
40094 947231 1101227 173876 -1061769 -1445390 -1099783 -951699 -1150046 -1095191 -724621 -571852
40084 -571852 -628064 -322486 276605 392206 -111303 -446298 -312058 -412553 -1020123 -1204724
40074 -1204724 -353852 554388 312066 -600010 -673991 447447 1653066 2064372 1910246
40065A910246k73762m18887n13288r0370O23284P85837Q8852q37232j186833p29319
40055f41472J35213P40180O74925J86361q9164N3549J21578l12299r13139r79937
40045a024205l20466N70388J067877R30315L69290k18871o14978q53641q90946
40036i85237m72400L42436Q37484M29918l58333m51697K68540P96618M67380k25800
40026F48909n27250l36944J02772O47200R48841M97444n00053r98783m82133K20713
40016B20716J45076m31221n94707k17120J10631J70704K58140M53796N40615M87912
40006A144542L62200j5133o54174r25174k88960O86751Q73845J05841o21146n21392
39996A47200R6996M39767J54564m65150p81751l13857O87883J286277Q89918K2416
$$ plain form
40065 1910246 1636484 1217597 704309 613939 1237223 2023060 2111912 1274680 87847 -641472
40055 -641472 -506259 233921 908846 1095207 1006043 1059592 1181170 868871 -44268 -1024205
40045 -1024205 -1344671 -774283 293594 1223909 1593199 1374328 759350 -94291 -985237
40036 -985237 -1457637 -1115201 -277717 152201 -206132 -657829 -389289 407329 874709 648909
40026 648909 121659 -215285 -112513 534687 1483528 1980972 1480919 482136 3 220716
40016 220716 365792 -65429 -660136 -877256 -766625 -595921 -337781 116015 656630 1144542
40006 1144542 1506742 1491609 837435 -87739 -376699 310052 1183897 1289738 668592 147200
39996 147200 244196 683963 838527 373377 -408374 -722231 -34348 1251929 2141847 2164263
39986B164263m24318l92779m56122p00652o55194k23897J76651M20260P60084
39977F68296J040950P12090j48891o65327l71960J18670O2814m14553o94977n34955
39967b27843j32519K80919N37132N15334L05543J42626N8023p6983j28494J94507
39957A468245P10235P96959K75676k58389k65008L8079R6162k49715p21543r60143
39947I30558p22666n9361N68469O94063M21192J92527N2818k50258m93408j54149
39937A179785N32642O75316J85146N5412O32224P67875l42871j506195j076440
39928A102894M62775J031992n8486j197751q84683K87883P79412K56060l50555
39919A429541m07475k16715j85701k05617q7887j5180j33617p3427N51375J292397
$$ plain form
39986 2164263 1739945 1347166 891044 190392 -464802 -688699 -512048 -91788 668296
39977 668296 1709246 2421336 2272445 1607118 1235158 1353828 1416642 1002089 307112 -227843
39967 -227843 -360362 -79443 457689 973023 1278566 1421192 1479215 1402232 1273738 1468245
39957 1468245 2178480 2975439 3251115 2992726 2727718 2765797 2861959 2612244 1890701 930558
39947 930558 207892 148531 717000 1411063 1832255 2024782 2077600 1827342 1333934 1179785
39937 1179785 1712427 2387743 2572889 2628301 3260525 4028400 3685529 2179334 1102894
39928 1102894 1565669 2597661 2539175 1341424 456741 744624 1524036 1780096 1429541
39919 1429541 1022066 805351 619650 414033 326146 310966 177349 103922 655297 1947694
39909A947694J201130K07798n18385j10725O61040M16053q15099j612933j182583
39900A93990k62868K23117L45585M73023L92736q8661m35363j58084K75621J91691
39890A150787j24213M2910N36953N93332J71863l0852J59076J65101j93851l10560
39880B160546J66563P21665P81723M86393K74701K41371K65867L37154M01242
39871E837225K27896k63554p76703r31623o07394N1992P27069J022724P69769
39862F057401K18239l08918p96004j243199j285946o65640J32164L84137J45046
39853B637280L3233J21309p7356n10830m86568J07025M78008K28492O944K99047
39843B836584M80283j49376j107165j376431q19550j21740K88266M61173L70460
$$ plain form
39909 1947694 3148824 3356622 2838237 2727512 3388552 3804605 2989506 1376573 193990
39900 193990 -68878 154239 499824 972847 1365583 1276922 841559 683475 959096 1150787
39890 1150787 1026574 1069484 1606437 2199769 2371632 2340780 2499856 2664957 2471106 2160546
39880 2160546 2327109 3048774 3830497 4316890 4591591 4832962 5098829 5435983 5837225
39871 5837225 6065121 5801567 5024864 4093241 3485847 3537839 4264908 5287632 6057401
39862 6057401 6275640 5966722 5170718 3927519 2641573 1975933 2108097 2492234 2637280
39853 2637280 2670513 2791822 2714466 2203636 1717068 1824093 2302101 2530593 2537537 2836584
39843 2836584 3316867 3167491 2060326 683895 -135655 -257395 30871 492044 862504
39834H62504o4195n39990o32447l88752j20494J80306O32284R15415O15346k6460
39824A433517l76153l17469k33455j75540J96833Q02667J011452N49411n2851
39815B838412j82085J18656L44661J32074m56154r62814q56590j50378L86374
39806A212156P3609p07392r29688k81977M91406O75119L84153J18154R4275K49334
39796A379149M15250L01301k36774p91187p80625l08276k0501m4026J34746N56184
39786F05241N26286j17251m93892q8063L29163O3192k03253L30190Q77172J99461
39776B028246j051823r73565N77996J472563L69110j345863j641451n45010M46034
39767f63763O73572O48138O32026L13268k28277m33967k34114j22060j60284J26465
$$ plain form
39834 862504 798309 258319 -374128 -762880 -883374 -703068 -70784 844631 1459977 1433517
39824 1433517 1057364 739895 506440 330900 527733 1330400 2341852 2891263 2838412
39815 2838412 2656327 2774983 3119644 3251718 2795564 1832750 976160 825782 1212156
39806 1212156 1285765 578373 -351315 -633292 -141886 533233 917386 1035540 1129815 1379149
39796 1379149 1794399 2095700 1858926 1067739 287114 -21162 -41663 -85689 49057 605241
39786 605241 1131527 1014276 520384 432321 761484 824676 621423 951613 1828785 2028246
39776 2028246 976423 2858 580854 2053417 2422527 1076664 -564787 -1109797 -663763
39767 -663763 9809 657947 1289973 1603241 1374964 940997 706883 584823 424539 551004
39757E51004O68820O60930j11176o50971j38279P60899Q12261k188n54707k71711
39747A724882J91811J37419j74211j56461R4781M9282l34030n52629l16473J52292
39737H16663N19416N79201J78689n52144r28527l42834P18066J037864L33585
39728B359979k76934J4762M26145q3816r60436q31115K36599P36719N4112o61650
39718A014365l85486L36353N28698K43990L502k55555o68702o77998R9157Q38342
39708A076666N29755l88777o28844j4448M01828J15639j88078M8157M12418L58926
39698A723242M824k82270m04026l59350j46467J6515m0047L9616O23822J191273
39688B367132Q92968J9707k28957L55893N59751l26607j348777j358827n89544
$$ plain form
39757 551004 1219824 1880754 1769578 1118607 980328 1741227 2553488 2551300 1996593 1724882
39747 1724882 1916693 2054112 1879901 1723440 1818221 1867503 1533473 980844 664371 816663
39737 816663 1336079 1915280 2093969 1541825 613298 270464 988530 2026394 2359979
39728 2359979 2083045 2097807 2523952 2440136 1479700 648585 885184 1621903 1676015 1014365
39718 1014365 628879 965232 1493930 1737920 1741422 1485867 817165 139167 238324 1076666
39708 1076666 1606421 1217644 588800 574352 976180 1091819 903741 951898 1364316 1723242
39698 1723242 1728066 1445796 1041770 682420 535953 552468 512421 552037 1175859 2367132
39688 2367132 3260100 3279807 3050850 3406743 3966494 3639887 2291110 932283 342739
39679C42739N7060L70062N86430N90077K93014J47875L78863L46556l98832j081791
39669A632053p50221K02876O59999M46701K31873J62488j41865m51417r3969P13286
39659B611804R11340J75912o02066o59248k34585J83740N87453J013643J118018
39650E106011O78134O5454j74963K9228K24653j22249j040117j749746j300844
39641A715561J67872J329105J325854Q53130Q37772Q60284R1259q82669p60138
39632E538030K58451O64269M7970m17634j36936L4925m07482o70754k89042q2152
39622D539645n10649n97255L02163J031522L92770p50058p43390K85427Q11423
39613D761598L75424j8327J76060L02293j11249n16026l32171J33711K18109k11650
$$ plain form
39679 342739 399799 769861 1356291 1946368 2239382 2387257 2766120 3112676 2713844 1632053
39669 1632053 881832 1084708 1744707 2191408 2423281 2585769 2443904 1992487 1898518 2611804
39659 2611804 3523144 3699056 3096990 2437742 2203157 2386897 2974350 3987993 5106011
39650 5106011 5784145 5849599 5674636 5703864 5928517 5806268 4766151 3016405 1715561
39641 1715561 1883433 3212538 4538392 5391522 6229294 7089578 7180837 6298168 5538030
39632 5538030 5796481 6460750 6508720 6091086 5954150 5989075 5581593 4910839 4621797 4539645
39622 4539645 4028996 3431741 3733904 4765426 5158196 4408138 3664748 3950175 4761598
39613 4761598 5137022 5118695 5294755 5597048 5485799 4969773 4637602 4771313 4989422 4777772
39603D777772p31486q93843o18468k22164n7155q3526k5979R0735O7142J49838
39593B452866P14002J242071P40893m64050o92836N87134J628972R28064m55960
39584F681156o34212K05617N11988J31271J95400O98289M83304l51589l21665
39575G599559P71990J214893J85033q07004l57987O93688R10220N91246R08974
39566A1710612J726044J923442J379921J124659J666901K412498K830392L233541
39558B8008010M123344N357749O293068O558258O535230O988288Q118757R239823
39550H1222527R807802J0496801J2483719J5741311J8931098K1056770K2247745
39543A91987773K2732281K2152502K0309210J7511604J3711863Q490521K605233
$$ plain form
39603 4777772 4046286 3152443 2533975 2311811 2254656 2171130 2145151 2235886 2303028 2452866
39593 2452866 3166868 4408939 5149832 4685782 3992946 4580080 6209052 7137116 6681156
39584 6681156 6046944 6252561 6764549 6895820 7091220 7789509 8272813 7921224 7599559
39575 7599559 8371549 9586442 9771475 8964471 8606484 9300172 10210392 10801638 11710612
39566 11710612 13436656 15360098 16740019 17864678 19531579 21944077 24774469 28008010
39558 28008010 32131354 37489103 43782171 50340429 56875659 63863947 71982704 81222527
39550 81222527 91030329 101527130 114010849 129752160 148683258 169740028 191987773
39543 191987773 214720054 236872556 257181766 274693370 288405233 296895754 299500987
39536B99500987j729700l269489l525734m920022p871938j0943545j3227321j5153399
39528B38859839j7196744j9118079k0494542k0979837k0112321j7835355j5115523
39521A08007438j3093216j1718339j0168931q449917p449240p401986p448570
39514D2277239o908461n956365m826216l416937k035652j484366j871633k207924
39506A3569685j747564r62671o07614n73435l85477k05897m94762j049628j197921
39497F344716p88278l12740j12800n8615k0087j03153k73461j80124L63463R29496
39487E788417Q12308j32555j160984j354135o49316R9653J96787j06105j92340
39478C301730p9152k45752o48377o58283q8458M24395L61387L9415k6613L8283
$$ plain form
39536 299500987 297771287 294501798 290976064 286056042 278184104 267240559 254013238 238859839
39528 238859839 221663095 202545016 182050474 161070637 140958316 123122961 108007438
39521 108007438 94914222 83195883 73026952 64577035 57127795 49725809 42277239
39514 42277239 35368778 29412413 24586197 21169260 19133608 17649242 15777609 13569685
39506 13569685 11822121 10859450 10251836 9678401 9292924 9087027 8592265 7542637 6344716
39497 6344716 5556438 5243698 5130898 5072283 5052196 4949043 4675582 4495458 4858921 5788417
39487 5788417 6600725 6468170 5307186 3953051 3303735 3403388 3600175 3494070 3301730
39478 3301730 3222578 2976826 2328449 1670166 1581708 2006103 2367490 2406905 2380292 2418575
39468B418575j76358n13130l81040L23058R43823Q34195J02509n31834n13221
39459B506577j3554K99450R7756j49250J71976Q20035Q79953Q0009o66960m68238
39449C557754K70246M02163l53334j058834q36635J14773R73425J257849J024209
39440E351616M81712j47812n37890m54994j06335L587l11421o60024o01727k61087
39430B755625j27676k86447k17119M46835J237350J292835M21658o14512r62880
39421C945669n77899j28359j81553o44777r59939p36589j53994K86012L68118
39412A216689L48918M60793N15273K79970j6116l4541l3150n71466j446803j652917
39402i33350p53229L42854N40377J8676j73296L03672P08092M19320k27749n24394
$$ plain form
39468 2418575 2242217 1729087 1348047 1671105 2614928 3449123 3551632 3019798 2506577
39459 2506577 2493023 2792473 2890229 2740979 2912955 3732990 4612943 4692952 4025992 3557754
39449 3557754 3828000 4230163 3876829 2817995 1981360 2096133 3069558 4327407 5351616
39440 5351616 5833328 5685516 5147626 4692632 4586297 4589884 4278463 3618439 3016712 2755625
39430 2755625 2627949 2341502 2124383 2571218 3808568 5101403 5523061 4908549 3945669
39421 3945669 3367770 3239411 3057858 2413081 1453142 716553 562559 848571 1216689
39412 1216689 1565607 2026400 2541673 2821643 2805527 2770986 2737836 2166370 719567 -933350
39402 -933350 -1686579 -1343725 -803348 -784672 -957968 -654296 53796 473116 245367 -279027
39392b79027k64182K17219M87044L15548j06324j51585N56973J317759Q87455
39383B980880p60133j926798j183361O50322J494678P19327k89492l51620j0687
39374A323116k30586o81981m07027M46535P88202K88745k42672k77900k71688
39365G34744n91789p37555k50753L49867L14294j49602k09917L56414R77406J143913
39355A937022P98361M0139q54317j219668n81601M96192Q79386L17531k90004
39346A523041k78499o0492j82992l47858o0692L53723K43000k25048l12506M0129
39336F91806J48764j64118j92310M44292J043345Q41036J50825k11093j55423
39327B597124j53742j62331K87248R31939P86300l07579j086866n17769O80602
$$ plain form
39392 -279027 -543209 -325990 161054 476602 370278 218693 775666 2093425 2980880
39383 2980880 2220747 293949 -889412 -239090 1255588 1974915 1685423 1333803 1323116
39374 1323116 1092530 410549 3522 450057 1238259 1527004 1284332 1006432 734744
39365 734744 142955 -594600 -845353 -495486 -181192 -330794 -540711 -184297 793109 1937022
39355 1937022 2735383 2775522 1921205 701537 119936 616128 1495514 1813045 1523041
39346 1523041 1244542 1184050 1001058 653200 592508 946231 1189231 964183 651677 691806
39336 691806 840570 676452 484142 928434 1971779 2812815 2963640 2752547 2597124
39327 2597124 2443382 2281051 2568299 3500238 4286538 3978959 2892093 2374324 3054926
39318C054926J036513L40931l62958n14051n62519p24373m72301K73910N80341
39309B650419j03125q76770o81778M5271J50919k73550o0220R73226J516960P19307
39299D060659n30887r67562o86442o11760q23589n12569N01799J214453P46489
39290B390591m22529j056203p07622j13241l9454k86355k00253K00588K77217
39281D2739q5126j56893M67490J075518Q31412K4357m72064n72160q20724j096156
39271g61607o63279L70929Q75580M03638m1743L76688R66862P00346m5858j15154
39261B066402N35708Q23672L07476k18059j04096J83023o0130o33196p46128j28440
39251B026232O41673Q14831K40578m84840n76475J38720J005264J258545Q64869
$$ plain form
39318 3054926 4091439 4432370 4069412 3555361 2992842 2268469 1796168 2070078 2650419
39309 2650419 2547294 1670524 988746 1034017 1184936 911386 851166 1824392 3341352 4060659
39299 4060659 3529772 2562210 1875768 1264008 440419 -72150 429649 1644102 2390591
39290 2390591 1968062 911859 204237 90996 51542 -234813 -435066 -234478 42739
39281 42739 -42387 -199280 268210 1343728 2175140 2199497 1727433 1155273 334549 -761607
39271 -761607 -1424886 -1053957 -178377 225261 183518 560206 1527068 2227414 2181556 2066402
39261 2066402 2602110 3425782 3733258 3515199 3411103 3594126 3533996 2900800 2154672 2026232
39251 2026232 2667905 3482736 3723314 3238474 2661999 2800719 3805983 5064528 5929397
39242E929397M40029M55342Q10164J108578J051072N96440J9524k46396r0444
39233A0073706O2009j85572n93890o54970m03392l23563n17291n89191m31715
39224F436131m63250q39140j037744o38151l4691J02526k52507n77397n71980
39215B123797l49241j9109M05975P09285N34411j36200q64057j191543r80250
39206B33068l64856K86171L85162l88982j409930j419588K416J623705J837958
39197G85124O23920m80723m19854J87237K69664j00825j37452K05552K79767M8425
39187A260835J70905O29730M64431o03633j365980p94542L51748O58041J48128
39178I19663l0517L42301K99695m29964p62425n6424O80440L19650n70666o01193
$$ plain form
39242 5929397 6369426 6824768 7634932 8743510 9794582 10391022 10410546 10164150 10073706
39233 10073706 10135715 9950143 9356253 8701283 8297891 7974328 7457037 6867846 6436131
39224 6436131 5972881 5133741 4095997 3457846 3423155 3525681 3273174 2695777 2123797
39215 2123797 1774556 1755447 2161422 2870707 3405118 3268918 2404861 1213318 233068
39206 233068 -131788 154383 539545 150563 -1259367 -2678955 -2676539 -1052834 785124
39197 785124 1409044 928321 508467 695704 965368 864543 727091 932643 1212410 1260835
39187 1260835 1431740 2061470 2525901 1922268 556288 -238254 113494 771535 919663
39178 919663 889146 1231447 1531142 1101178 338753 282329 962769 1282419 711753 110560
39168A10560K62538O73667n307p89022o20564J19778L50462n8996k30438K98548
39158A11226R19331R10667L98817m5898k85308n06558n44440o5281N84938N21266
39148A998760l84795j051602n74164M63956P71660J24189m49028j95042M34219
39139A138153O04751K38237o5879Q2050M27440M62824Q3969j90376K42370J251210
39129D274749J955894J761049J096630P32378O74772L53925k91982o85990n96670
39120I274755m96142p21392r45711q05856m93051l47891l30268k78602l15896
39111D539946o01436r46100j015091p36210k91597J09935L17992L03100J94275
39102A874814N2541k76872p33511p05064K27566J353267J490807O09648j53085
$$ plain form
39168 110560 373098 1046765 1041458 252436 -368128 -248350 102112 43116 -187322 111226
39158 111226 1030557 1941224 2340041 2294143 2008835 1502277 957837 892556 1477494 1998760
39148 1998760 1613965 562363 -11801 452155 1223815 1348004 898976 703934 1138153
39139 1138153 1742904 1981141 1915262 1997312 2424752 2887576 2971545 2781169 3023539 4274749
39129 4274749 6230643 7991692 9088322 9820700 10495472 10849397 10557415 9871425 9274755
39120 9274755 8778613 8057221 7111510 6305654 5812603 5464712 5134444 4855842 4539946
39111 4539946 3938510 2992410 1977319 1241109 949512 1059447 1377439 1680539 1874814
39102 1874814 1927355 1650483 916972 211908 439474 1792741 3283548 3893196 3740111
39093C740111k19158j95275m40397k89377N61583J097712M85511m27257l41108
39084C972345N05168Q91920O04060M47379O26122N65494K62516M08705J050525
39075I334234J405681J233374J209522J649860J957555J694844J221959R36632
39067B0643661P92496Q24300J184549J440259R11516m6447l20389Q3428j29586
39058B5383787j279567j889249j095609k90627r18784k018062j803937o92733
39050A5395219n76180j568156j794468n77955L64358l46929j629430j689112o28625
39041F948722k7250o29402j607581j842237j091918J0705O02454L22160l25731
39032B359922n34058k08399j013k51707n34802m96924m10985m67717k51948M44113
$$ plain form
39093 3740111 3520953 3325678 2885281 2595904 3157487 4255199 4740710 4313453 3972345
39084 3972345 4477513 5369433 5973493 6420872 7046994 7612488 7875004 8283709 9334234
39075 9334234 10739915 11973289 13182811 14832671 16790226 18485070 19707029 20643661
39067 20643661 21436157 22260457 23445006 24885265 25796781 25750334 25429945 25513373 25383787
39058 25383787 24104220 22214971 21119362 20828735 19909951 17891889 16087952 15395219
39050 15395219 14819039 13250883 11456415 10878460 11242818 10895889 9266459 7577347 6948722
39041 6948722 6921472 6292070 4684489 2842252 1750334 1761039 2363493 2685653 2359922
39032 2359922 1825864 1617465 1616452 1364745 829943 333019 -77966 -545683 -797631 -353518
39022c53518R22917M94665l45954m93708K51382J006094J012380L49747m57034
39013B386971r10713p02792L365N16392L70911j2311K6448L38642K97657n9089
39003B255481j32417R8664P8905j23632K28678J091373J323732M13893n51711
38994D682966m27229M09607R05774R11660Q55061N89875j47837o48775j1849J211770
38984H331023J584124R71038P00535J313048J669036Q80519k74806p75284r92808
38975A3406425j718981k441854k015668o46366J79680k33858r62447r54310l95489
38966D217132j21863l39159n04665j97501L44618N41752J44844m50320o18310
38957C016528k59665O6316q3695m12244l47954J00290L84079J93133k22332m52931
$$ plain form
39022 -353518 569399 1064064 718110 224402 475784 1481878 2494258 2844005 2386971
39013 2386971 1476258 773466 776831 1293223 1664134 1651823 1678271 2016913 2314570 2255481
39003 2255481 2123064 2221728 2300633 2177001 2405679 3497052 4820784 5234677 4682966
38994 4682966 4255737 4665344 5571118 6482778 7337839 7927714 7779877 7131102 7119253 8331023
38984 8331023 9915147 10886185 11586720 12899768 14568804 15449323 15174517 14399233 13406425
38975 13406425 11687444 9245590 7229922 6583556 6763236 6529378 5566931 4612621 4217132
38966 4217132 4095269 3756110 3251445 3053944 3398562 3940314 4085158 3634838 3016528
38957 3016528 2756863 2823179 2739484 2327240 1979286 2079576 2463655 2656788 2434456 1981525
38947A981525k98650J80463O26953N24567k12034r04922q32534j74876K72714
38938A163206K17495O6890M5030j24005m85185n67335j83480J46836L1755j14880
38928A96327K21992P52137Q06103L38895j23125l14092l80049l41327n7892K69712
38918A368681J81881l24129o71118m92842j29772q8580l21768l28648J78427R05190
38908B77322J220862P54471j37444n86724j50491N69932O47547R4477k09645L4712
38898B515019p036q85543j679382j206020M5057M59673k60354o10103L19781J352165
38888D3257J106885K06937J70670Q71567Q44785j56944p94727n23232m27363j013122
38878C28713j034729K70224J424276Q64909m14002l80983P26898Q89198k52169
$$ plain form
38947 1981525 1682875 1863338 2490291 3014858 2802824 1897902 1065368 890492 1163206
38938 1163206 1380701 1447591 1492621 1368616 883431 316096 132616 279452 311207 196327
38928 196327 418319 1170456 1976559 2315454 2192329 1878237 1498188 1156861 1098969 1368681
38918 1368681 1550562 1226433 555315 62473 -67299 -155879 -477647 -806295 -627868 277322
38908 277322 1498184 2252655 2115211 1528487 1377996 1947928 2595475 2689952 2480307 2515019
38898 2515019 2507983 1622440 -56942 -1262962 -1217905 -758232 -1018586 -1628689 -1308908 43257
38888 43257 1150142 1357079 1527749 2399316 3244101 3087157 2292430 1769198 1341835 328713
38878 328713 -706016 -435792 988484 1853393 1439391 1058408 1785306 2674504 2422335
38869B422335q55973m8866P17257K73445m16214k35352P3673n43364j329797r54112
38859h96968J39908N16124K18204M74189J209860R22730o90259j856323j217862
38850a180397K69196Q78490M39371L4545J39386K57468J08388P8039L62182M74101
38840A860769j1018o76977p10351j0091O02464M63270k1724j3260M20878L62961
38830B266921m12374q40870j12003R36256R01852j54659q50760m91655J62757
38821A405465K36151j88125n95408p16707l35300O77829J676129J481460j7679
38812C623815j275002r21096L75599Q10035j28431j111674q51130L62211J293407
38803B177734J327209R12133O66921N31535L9032p39948j006956l09544N64917
$$ plain form
38869 2422335 1566362 1517496 2234753 2508198 2091984 1856632 1930305 1386941 57144 -896968
38859 -896968 -757060 -240936 -22732 451457 1661317 2584047 1893788 37465 -1180397
38850 -1180397 -911201 -32711 406660 441205 580591 838059 946447 1024486 1386668 1860769
38840 1860769 1849751 1172774 462423 452332 1054796 1518066 1496342 1483082 1903960 2266921
38830 2266921 1854547 1013677 901674 1837930 2739782 2585123 1734363 1242708 1405465
38821 1405465 1641616 1453491 858083 141376 -193924 483905 2160034 3641494 3623815
38812 3623815 2348813 1427717 1803316 2613351 2484920 1373246 522116 884327 2177734
38803 2177734 3504943 4417076 5083997 5615532 5654564 4914616 3907660 3598116 4163033
38794D163033M36123o20264j281944q15154k7350Q9466j66456R7588P80267R11540
38784C566849J76206o30571p52556l38985O893k8013l51064o40127n06559J14734
38774F16807O62016M63925l46722q85449o28086j8994K61101K01800K52368M79413
38764A058179M30355j15329o15462k86571Q49918J726532J330397m0423j044629
38755C292967r18896l18018k08037m69510k80025M37342Q36720M65375p4274r2655
38745B670989K25591L00780J13062R8586L37404M25974J57124j38253j01546R0147
38735D179858m3426n39956p83180k67392N80243P78086J04365m61118j5420R53381
38725D485441J184019L79904m60530n16320j26045M2855N9033L39923P09237O22075
$$ plain form
38794 4163033 4599156 3978892 2696948 1881794 1854444 1943910 1777454 1875042 2655309 3566849
38784 3566849 3743055 3112484 2359928 2020943 2027836 1999823 1648759 1008632 502073 616807
38774 616807 1278823 1742748 1396026 510577 -117509 -136503 124598 326398 578766 1058179
38764 1058179 1488534 1373205 757743 471172 1321090 3047622 4378019 4337596 3292967
38755 3292967 2374071 2056053 1848016 1378506 1098481 1535823 2372543 2837918 2763644 2670989
38745 2670989 2896580 3197360 3310422 3409008 3746412 4172386 4329510 4191257 4089711 4179858
38735 4179858 4136432 3596476 2813296 2545904 3126147 3904233 4008598 3547480 3532060 4485441
38725 4485441 5669460 6049364 5588834 5072514 4946469 4989324 5048357 5388280 6097517 6719592
38715F719592J50567K91M60553R39727P90555J66289k71699k23655M3270K32987
38705I008477L56972M69808M40682K35527J58434M32641O91488L85825k91638
38696A1888216m74111J65219Q46789P46917J06917k82874k47883j51388j0055
38687A2587747M12958P86633M65345l59317p03790k30083K33926m2139p05862
38678A2445418j013635p81943k15868N17089J092319J084781O54330M64449N31294
38669A4778234O7543j002348j482262p14062J71371k574m92510N7545J157232
38660A2538169J181681J35768l05931M28340R68825L78041m54582n27791k42324
38651A4100196k88800m11622k90985m21891j024410j195783l30668O09930N01963
$$ plain form
38715 6719592 6870159 6870450 7331003 8270730 9061285 9227574 8955875 8732220 8775490 9008477
38705 9008477 9365449 9835257 10275939 10511466 10669900 11102541 11794029 12179854 11888216
38696 11888216 11414105 11579324 12426113 13173030 13279947 12997073 12749190 12597802 12587747
38687 12587747 13000705 13787338 14252683 13893366 13189576 12959493 13193419 13151280 12445418
38678 12445418 11431783 10649840 10433972 10951061 12043380 13128161 13782491 14246940 14778234
38669 14778234 14845777 13843429 12361167 11647105 11818476 11815902 11323392 11380937 12538169
38660 12538169 13719850 13855618 13549687 13978027 14946852 15324893 14870311 14342520 14100196
38651 14100196 13811396 13399774 13108789 12686898 11662488 10466705 10136037 10745967 11247930
38642A1247930j78847l44692j92746n61961j079956p25524J29880J14308p48923
38633G659469r26724L7295O72377J2817p96963l99639O08462P13500k11849r70835
38623F397910q98022m49200j80482j50552k53474l62449k30164J35290K13711
38614D222568k79034p04463l29248M56904O59517K12717m9517R4134m6166o30464
38604C606948p73741m5999N95068K10994o28744p48202j22815L33192L01037K39784
38594B967522K62730O150l88506l09577J47111J49343m33131o86212j97263K06535
38584A724702o2522k74472K61878P97443L40185n64431p03649k65284l87219r34275
38574f7644n66808Q18086J563577P75524l00130l40507R0884j39324o62416l40254
$$ plain form
38642 11247930 11069083 10724391 10531645 9969684 8889728 8164204 8294084 8408392 7659469
38633 7659469 6732745 6770040 7442417 7455234 6658271 6258632 6867094 7580594 7368745 6397910
38623 6397910 5499888 5050688 4870206 4719654 4466180 4103731 3873567 4008857 4222568
38614 4222568 3943534 3239071 2909823 3366727 4026244 4238961 4189444 4283578 4237412 3606948
38604 3606948 2833207 2787208 3382276 3593270 2964526 2216324 2093509 2426701 2727738 2967522
38594 2967522 3230252 3236402 2847896 2538319 2685430 2834773 2401642 1715430 1518167 1724702
38584 1724702 1662180 1387708 1649586 2447029 2787214 2222783 1519134 1253850 866631 -67644
38574 -67644 -634452 183634 1747211 2522735 2222605 1882098 1972982 1833658 1171242 830988
38564H30988O89936J203219P45198j0596n29217q19676p19943O780Q18799P49932
38554B965420j97186r39231p77676j45748K66700L24599J91849P844R098L13893
38544B019562N06745J46832l25034q9033N94937N34256m92613j140054m20386
38535A335212P90054J011530J63688o09117n88487n6543M50615O25475K83936
38526C406363m97406j157738j101671l87189L73025P09124O19881L65602K06415
38517B536406K04011J25001k44796o40811n70121r0457K05185J24332J34597M46498
38507B229845O01304L65069K14463L75899K25040n97288j262481q99447j4891
38498A237513K80950n8862k49202j37742j99700l37993k887N51690M37258l29012
$$ plain form
38564 830988 1520924 2724143 3469341 3458745 2929528 2109852 1389909 1396689 2215488 2965420
38554 2965420 2768234 1829003 1051327 905579 1172279 1496878 1688727 1696571 1705669 2019562
38544 2019562 2526307 2673139 2348105 2259072 2854009 3388265 2895652 1755598 1335212
38535 1335212 2125266 3136796 3300484 2691367 2102880 2046337 2496952 3122427 3406363
38526 3406363 2908957 1751219 649548 262359 635384 1344508 1964389 2329991 2536406
38517 2536406 2740417 2865418 2620622 1979811 1409690 1319233 1524418 1648750 1783347 2229845
38507 2229845 2831149 3196218 3410681 3786580 4011620 3414332 2151851 1252404 1237513
38498 1237513 1518463 1459601 1210399 1072657 872957 534964 532077 1083767 1521025 1192013
38488A192013p08144l06140O8921j03427k16642K28111O43999L91931r0980o0014
38478A039628L03782L01969j10332l96476l68733k74382j39876K43986P02728
38469A302294O56555j26245j096095j393227o67325N40538J215464Q37759m4660
38460A225058m55366j82628O5396k39958p12617o82502j16550M72046P32395P06997
38450H12271N37636K91387L4008j30703j06289J15057L41500K81857k7732r1246
38440B057746L81847Q75301O56268j63481p76263q14620o33787m81415k12028
38431H89568O1875p9052n08287n31291m7715J71798j96900l89306J65678Q28512
38421C64880P74775K47539m0305m8276r0098l3014K69466L56888o4784l26241
$$ plain form
38488 1192013 483869 177729 246650 143223 -73419 154692 798691 1190622 1099642 1039628
38478 1039628 1343410 1645379 1535047 1138571 769838 495456 355580 599566 1302294
38469 1302294 1958849 1832604 736509 -656718 -1324043 -783505 431959 1269718 1225058
38460 1225058 769692 587064 652460 412502 -300115 -982617 -1099167 -627121 105274 812271
38450 812271 1349907 1641294 1675302 1544599 1438310 1553367 1894867 2176724 2148992 2057746
38440 2057746 2439593 3314894 3971162 3807681 3031418 2216798 1583011 1101596 889568
38431 889568 951443 872391 364104 -167187 -214902 -43104 -240004 -629310 -463632 364880
38421 364880 1139655 1387194 1346889 1298613 1208515 1175501 1444967 1801855 1737071 1410830
38411A410830J75238P23529K83071o91373q09519R4488P43740L90755k97954n29050
38401A493755l65913j10392K47180N71534M48480j37564p02955j012009j179569
38392g47453j007065j68821Q50512J077989N16211J70590L57138K42756m82968
38383H08889q49206k82935K52671j46014p08369k59515P52768R54380K60095q3252
38373F99512M75567J055968P73547j63062j012615j319291r61914j12643O23101
38364E8170O17854p662m67925k76394K71807O07208M77734M3157k59316l9027
38354A025606M97248N53403k09975r48365o58176L02712O12270j29106q82997
38345A62620p59079j77994J3664j81710j57609K64060O57519O13301J26448m41346
$$ plain form
38411 1410830 1586068 2309597 2592668 1901295 1091776 1186264 1930004 2320759 2022805 1493755
38401 1493755 1127842 1017450 1264630 1836164 2284644 2147080 1444125 432116 -747453
38392 -747453 -1754518 -1923339 -1072827 5162 521373 691963 1049101 1291857 808889
38383 808889 -40317 -323252 -70581 -216595 -924964 -1184479 -431711 522669 782764 699512
38373 699512 1175079 2231047 3004594 2841532 1828917 509626 -452288 -564931 58170
38364 58170 676024 668362 200437 -75957 195850 803058 1280792 1323949 1064633 1025606
38354 1025606 1522854 2076257 1866282 917917 259741 562453 1174723 1045617 162620
38345 162620 -596459 -774453 -760789 -942499 -1100108 -836048 -178529 434772 561220 119874
38335A19874n61162L454P56081Q82613K93556k44539k50901j65608m24694n83535
38325a74861n5361P93466J105875P60270L09465m8239n28037r26396p35308j59341
38315C41533j9505m10923m58183J89400O40510J99252m21591k57238K90348J53529
38305B47132n52793p06224r1825K09278l74128r32682n20564L96276P35662L66787
38295a223081J8921M3969J32966R0855J16736K91071L84866K71797J02659K0354
38285B51113L7562J63611L17650K10975k81591p13246m88973L02643R17664Q47443
38275A564851K79271l27349o58617n09019J31688P81548P55243K6096n92583m18952
38265A032177K64748O38673L35535k87485o70263n82871k58877j52206m32482
$$ plain form
38335 119874 -441288 -437834 318247 1200860 1494416 1249877 998976 833368 408674 -174861
38325 -174861 -230222 563244 1669119 2429389 2738854 2690615 2162578 1236182 500874 341533
38315 341533 322028 -88895 -547078 -357678 282832 482084 60493 -196745 93603 247132
38305 247132 -305661 -1011885 -1103710 -894432 -1268560 -2201242 -2721806 -2325530 -1589868 -1223081
38295 -1223081 -1204160 -1160191 -1027225 -936370 -819634 -528563 -143697 128100 230759 251113
38285 251113 288675 452286 769936 980911 699320 -13926 -502899 -200256 717408 1564851
38275 1564851 1844122 1516773 858156 349137 480825 1262373 2017616 2043712 1451129 1032177
38265 1032177 1296925 1935598 2271133 1983648 1313385 730514 471637 319431 -113051
38256a13051o77281l15971N61369J175511R73100K29312m21565o74734n55285
38247A81405j51178L01138L97888L2562l55460l43182r2607j2576j30154k14302
38237c86466k61993l59406k64630K78612Q86404Q19776K1684o80168o11677m6885
38227f04749K91433J59480r6522j16336J15978L92125N03636L67160R0231r3435
38217A009001n5776P3701O2536j36184l18932k65462N02K16135J60955q1800j95248
38206D69428J6384L83900N28852K63328j82831l62975q6934L30577M10364R9542
38196A869635j84745j76440j17126k54296l20985L0190N02495M54385j45562o73563
38186I83988p69406o43758m07337J14013O57802M93258l92035q86377k33748P82016
$$ plain form
38256 -113051 -790332 -1106303 -544934 630577 1603677 1832989 1411424 736690 181405
38247 181405 30227 331365 729253 761815 406355 63173 -29434 -42010 -172164 -386466
38237 -386466 -648459 -1007865 -1272495 -993883 -107479 712297 733981 53813 -557864 -604749
38227 -604749 -313316 -153836 -250358 -366694 -250716 141409 645045 1012205 1102436 1009001
38217 1009001 953225 1026926 1089462 953278 634346 368884 369386 585521 746476 664676 469428
38206 469428 485812 869712 1398564 1661892 1479061 1116086 1029152 1359729 1770093 1869635
38196 1869635 1684890 1508450 1391324 1137028 816043 846233 1348728 1803113 1657551 983988
38186 983988 214582 -429176 -836513 -722500 -64698 428560 36525 -849852 -1083600 -301584
38176c01584R73111M51301J72504K55300k781o08579p12893j47388J43579l21681
38166i9111o78246j13727P82171R67500N47210L76770M97853J39104p63955j184209
38156D71360n10185M32830M89600k35957o06955m3716P95358R74038L80501l33819
38146A813055n47401j70018L81060M99657p0635q37999j001854m82179p8447k77128
38136g71889m73079r754N72183L41666l06654o5994J089406J569423N46119o92914
38126A798513o67948J71032M19822p7712l70359j67212l4051q7725J36363N47253
38116A667976M77509r4750m08704j52754J72662K46526K81526K62032j33502o64068
38106A654453o30304q5402J20528k18057l07515J79706M77901J18697k32022m9433
$$ plain form
38176 -301584 671527 1122828 1295332 1550632 1547851 939272 226379 78991 222570 -99111
38166 -99111 -777357 -891084 -108913 858587 1405797 1782567 2280420 2419524 1655569 471360
38156 471360 -38825 394005 883605 647648 40693 -3023 792335 1766373 2146874 1813055
38146 1813055 1265654 1095636 1476696 1976353 1905718 1067719 65865 -416314 -494761 -771889
38136 -771889 -1244968 -1254722 -682539 -340873 -647527 -713521 375885 1945308 2491427 1798513
38126 1798513 1130565 1301597 1721419 1643707 1273348 1106136 1072085 984360 1120723 1667976
38116 1667976 2145485 2050735 1642031 1489277 1661939 1908465 2189991 2452023 2318521 1654453
38106 1654453 1024149 938747 1059275 841218 533703 713409 1191310 1310007 1077985 1028552
38096A028552Q0354l21782n04072K61259J132260P50197o18137j306151n12844
38087a0364P60585J144989M38831m77729p03121j21544N63560N89045J648m94004
38077A691896n69130n63570o05754k87608L56738M66756l35890j082422p83755
38068a712739J00975N04913L89886M03996M63774q948p36978p94474q9498N43804
38058i35289P06771P54679P74701M38333l6705J9243M61179L37562n12458j026295
38048I81721n47068J94639L19607N0256J9248J52681M3832j59714m3377K61123
38038A272948K22551l18150r77800j280532j024783m13486O5097J64336K40563
38029b049256O44291R33741M76422k54689q2659R50501J284972Q8018j326989
$$ plain form
38096 1028552 1108906 787124 283052 544311 1676571 2426768 1808631 502480 -10364
38087 -10364 750221 1895210 2334041 1856312 1153191 1031647 1595207 2184252 2185900 1691896
38077 1691896 1122766 559196 -46558 -334166 22572 489328 153438 -928984 -1712739
38068 -1712739 -1611764 -1106851 -716965 -312969 150805 141857 -595121 -1389595 -1479093 -935289
38058 -935289 -228518 526161 1300862 1739195 1702490 1721733 2182912 2520474 2008016 981721
38048 981721 434653 629292 948899 999155 1018403 1171084 1214916 1055202 1011825 1272948
38038 1272948 1495499 1177349 199549 -1080983 -2105766 -2519252 -2454155 -2289819 -2049256
38029 -2049256 -1404965 -471224 5198 -249491 -332150 618351 1903323 1991341 664352
38020F64352j277540m1244P27552L57307k57060k18179L14536P11037O96088L91950
38010B068799N3308j10076j35588k69378n14845n03022j04613K36909J97274J32800
38000A051568M04087O18857K69336k68382k21802L26289N49284J34540m26115
37991B437662p70263j011524j079542o10351K50188P21703M22576j07061k42781
37982A0607m2315J61053L43993N49474N47485J93304k36166m41329m97792n41482
37972D6832m51495j96248p3675j89982j27623L53116O92719K85000m24117l77224
37962d62697N93169J453460J305343L94806m47383q02004p62278n10797k25556
37953E36063j16569j80738j35283J15255K25255m4635l45224k54860J4314M242
$$ plain form
38020 664352 -613188 -654432 73120 430427 173367 -44812 269724 980761 1676849 2068799
38010 2068799 2122107 2012031 1876443 1607065 1092220 589198 484585 721494 918768 1051568
38000 1051568 1455655 2074512 2343848 2075466 1853664 2179953 2729237 2863777 2437662
37991 2437662 1667399 655875 -423667 -1034018 -783830 -62127 360449 253388 10607
37982 10607 -31708 129345 473338 1022812 1570297 1763601 1527435 1086106 588314 46832
37972 46832 -404663 -600911 -674586 -864568 -992191 -639075 53644 338644 -85473 -462697
37962 -462697 130472 1583932 2889275 3284081 2836698 2034694 1272416 761619 536063
37953 536063 419494 238756 103473 218728 443983 399348 54124 -200736 -186422 -182180
37943a82180j24323J44068O25135N30108j93371n36257O4671P32018M30710m08295
37933A082284n50479J22959M91120j9700o22702m70204J35848L65077N2013l11619
37923B74597l66576j46374J83171M17649L51380N6400p6436J47637M02708L05165
37913A549321m0502k43194j50859R2713K99217L02870J4772l65708m72848l22323
37903F63459l68370p31036q17082j76083O48766P29628R655o44456n75118p9M53526
37892h07190M48027J23808j15786j7053J62856q5110p01333q94888k09588O65833
37882a430424P56973J45853k61817q1088K51604M21214N92868P36422M55557k18948
37872A368214n83167j92501M78273O37502N4453q38968j330936q87428K48010
$$ plain form
37943 -182180 -306503 -162435 462700 992808 799437 263180 327851 1059869 1490579 1082284
37933 1082284 531805 654764 1145884 1126184 503482 33278 169126 534203 586216 274597
37923 274597 -91979 -238353 -55182 362467 713847 770247 693811 841448 1244156 1549321
37913 1549321 1508819 1265625 1114766 1207479 1506696 1809566 1824338 1458630 985782 663459
37903 663459 295089 -435947 -1253029 -1429112 -780346 -50718 -41063 -685519 -1260637 -1260716 -807190
37892 -807190 -359163 -235355 -351141 -368194 -205338 -290448 -991781 -1886669 -2096257 -1430424
37882 -1430424 -673451 -527598 -789415 -870503 -618899 -197685 395183 1131605 1587162 1368214
37872 1368214 785047 592546 1070819 1708321 1762774 923806 -407130 -1294558 -1046548
37863a046548R44203L74200o98444p44487L21672R29989K50276n31257j89807
37854c90203N48126L34081m38860l13091O55007Q60792k02661j034244m44147
37845d25200P12900J023940N55116K96339M21039L31106n2498k64293l47337p62695
37835A488417j244139r08563K07702Q22405K09027o02056l01223O87245Q07815
37826A166630k56980j066041n33884N38071P38191O1752l26236L4309L52091j0803
37816F97100n69028n79486j42863J68199K71489M42297N14670M5840p17730q53380
37806g22892n1628P61752O10505j81180m93842n0200K50066k28461q43427o34461
37796a583768J95665N38312K3221m08221J17033J092261J309190N31363k23547
$$ plain form
37863 -1046548 -102345 271855 -426589 -1171076 -849404 80585 330861 -200396 -390203
37854 -390203 157923 492004 53144 -259947 395060 1255852 1053191 18947 -425200
37845 -425200 287700 1311640 1866756 2163095 2584134 2915240 2862742 2598449 2251112 1488417
37835 1488417 244278 -664285 -456583 365822 574849 -27207 -328430 358815 1166630
37826 1166630 909650 -156391 -690275 -152204 585987 647739 321503 355812 707903 697100
37816 697100 128072 -451414 -594277 -426078 -154589 287708 802378 848218 130488 -722892
37806 -722892 -774520 -12768 597737 416557 -77285 -127485 122581 -105880 -949307 -1583768
37796 -1583768 -1388103 -849791 -826570 -1234791 -1117758 -25497 1283693 1815056 1591509
37787A591509j10148M56406M47566m13762j329874j371996m75493N27995P60970
37778H3173J75573m21863k92648L56192O43204J65775m61430m19218K57637P82540
37768H68935O36386R0362l11802m20510m25872l74798q2528M33983O99731K34958
37758A348845p27721j255286o81880N51374J319474J065612L01354k10758l50219
37749A360795m25567m47615j61393L02140L97977m2760m65623l51642K1688R052
37739A97052m10829o10005l11668n6973l48946p49620m00192O70922J376951R08985
37729B65677k26914q64873n62338R3443L85549K09191p8412j45545Q1425M06702
37719d36095N11790L05345R8557J95166M00667K93341r1138l13749k73255l38740
$$ plain form
37787 1591509 1481361 1937767 2385333 1971571 641697 -730299 -1205792 -677797 83173
37778 83173 258746 -163117 -455765 -99573 543631 709406 247976 -171242 86395 868935
37768 868935 1505321 1595683 1283881 863371 437499 62701 -19827 414156 1113887 1348845
37758 1348845 621124 -634162 -1316042 -764668 554806 1620418 1921772 1711014 1360795
37749 1360795 935228 487613 326220 628360 1026337 983577 517954 166312 188000 197052
37739 197052 -213777 -823782 -1135450 -1192423 -1541369 -2290989 -2691181 -2020259 -643308 265677
37729 265677 38763 -826110 -1388448 -1295005 -909456 -700265 -778677 -924222 -842797 -436095
37719 -436095 75695 381040 479597 674763 1075430 1368771 1277633 963884 690629 351889
37709C51889o17181o86009l24650O4925J40899J60805L59235L51995j77270o63360
37699a038722l57158M35706O88225J28263m78912n47541l08346q3437K03014M78214
37689h80694L12709k63982m64608J31616P56449M82509l48127n39595K82153J182061
37679F50491J178276L88648l03179l49166l5977J2180l33114n11369n5023O12979
37669A254746O28584p0343o03500m66021k17685l79308m73521N897M11757r2150
37659a544q72671n55003P32455J367511O86736j27359j33959l3851n41573q18418
37649b97676N7418J143973Q54875m94747j110616m38504K79163K30555P7707L30621
37639F32769L11526m23274r75957m96681L39281M10234o3616o2924M09320L89583
$$ plain form
37709 351889 -265292 -951301 -1275951 -1211026 -1070127 -909322 -550087 -198092 -375362 -1038722
37699 -1038722 -1395880 -960174 -271949 -143686 -622598 -1170139 -1478485 -1561922 -1358908 -880694
37689 -880694 -567985 -831967 -1296575 -1164959 -408510 73999 -274128 -813723 -531570 650491
37679 650491 1828767 2217415 1914236 1565070 1529093 1541273 1208159 696790 641767 1254746
37669 1254746 1883330 1812987 1209487 743466 525781 146473 -327048 -321151 90606 -1544
37659 -1544 -874215 -1429218 -696763 670748 1357484 1230125 1096166 1062315 520742 -297676
37649 -297676 -240258 903715 1758590 1263843 153227 -285277 -6114 224441 302148 632769
37639 632769 944295 521021 -454936 -951617 -612336 -202102 -265718 -328642 80678 470261
37629D70261l12982p30420k90915L02851J85459m59933q20824n62302j257M98446
37619a721616Q15518Q89404O56831K14132j81104l45407l08388j75896M8061L75582
37609B67117N99429L87539k18851o38968m31514K4627J6007m13239m92938N1979
37599h48812N38273L98373P076n8479P2439L5841K4274L20223N11419O9344o04688
37588D65283o39763q714N32172O64158O94236O13505O5410o38544n97247K43629
37578A394125P51609J98969o75341p74486j09597M39233K97011l77833j012619
37569A31071j014337k78899M87399M90680k5758j41774J94016Q4838n47927m78756
37559a099447P77943J754453J048118n00769j072600n27745k11205n74727p07058
$$ plain form
37629 470261 157279 -573141 -864056 -561205 -375746 -835679 -1656503 -2218805 -2220062 -1721616
37619 -1721616 -906098 -16694 640137 854269 673165 327758 19370 -156526 -108465 267117
37609 267117 866546 1254085 1035234 396266 -35248 -10621 5386 -407853 -900791 -848812
37599 -848812 -310539 87834 94910 36431 108870 144711 168985 489208 1000627 1069971 465283
37588 465283 -174480 -183194 348978 1013136 1707372 2320877 2386287 1747743 1150496 1394125
37578 1394125 2145734 2344703 1669362 894876 785279 1224512 1521523 1143690 131071
37569 131071 -883266 -1162165 -674766 -184086 -209844 -351618 -157602 -72764 -620691 -1099447
37559 -1099447 -321504 1432949 2481067 1980298 907698 379953 168748 -405979 -1113037
37550a113037j83893K41072J00248j4902L52877O86552M50804K3934O4198N54269
37540A162122R62591Q86742K22409q18140j599715j481931n97598K35166N34360
37531d93994N75266O55352N59105N1184n99555r07571o52293M7792P55103Q15229
37521H05618O173q79812p83631J69332P22805K34781m51161l27491L45778N96049
37511D38441J86240k37982j93380R8425J77149p4578l59188l07103P4242L22860
37501A25126J03884k46369j73544J95886K17188j87648l30244J55961P34850P90874
37491A385964L85316j45910o81827j001548o68502K34698Q44865N60988j49830
37482G64214n02832m16363k32676J2581L68287M93945J30947l11720l14171n5906
$$ plain form
37550 -1113037 -1296930 -1055858 -955610 -970512 -617635 68917 519721 543655 607853 1162122
37540 1162122 2124713 3011455 3233864 2415724 816009 -665922 -1263520 -1028354 -493994
37531 -493994 81272 736624 1295729 1346913 747358 -160213 -812506 -764714 -9611 805618
37521 805618 811791 -68021 -851652 -682320 40485 275266 -175895 -503386 -157608 438441
37511 438441 624681 386699 193319 291744 468893 394315 35127 -271976 -197734 125126
37501 125126 229010 -17359 -190903 4983 222171 34523 -295721 -139760 595090 1385964
37491 1385964 1771280 1625370 943543 -58005 -726507 -491809 353056 914044 764214
37482 764214 261382 -154981 -387657 -375076 -6789 487156 618103 306383 -7788 -63694
37472f3694k4794j60266p5520J53994J27415j52923l15306k09181N5387M03478
37462b61410O45600M04860k58988n92384j47148M40276L89942k2501p6742R5819
37452F17324j15332n24631m34385L1446J10103j62923L7583P93945J159539O56034
37442B168703o9687l96241m86442n60788m24522r9951O540q7578R7285M49441
37432E96760K35959n23001q24110l24930K1637l26926m32751M91866J507503J250652
37422A672659P643p99098o54307k63649j92058l09354l79544k74620J74886P72226
37412b45216P89224J4162n58429n3165Q15535P59834o9290m51116j75890k15433
37402F10216q04111r21934p0331Q06856P49847L0669n79252q19117p04134k17487
$$ plain form
37472 -63694 -88488 -248754 -324274 -170280 -42865 -195788 -511094 -720275 -664888 -261410
37462 -261410 384190 789050 530062 -62322 -209470 230806 620748 598247 521505 617324
37452 617324 501992 -22639 -457024 -425578 -315475 -478398 -440815 353130 1512669 2168703
37442 2168703 2099016 1702775 1216333 655545 231023 131072 137612 50034 147319 596760
37432 596760 832719 309718 -514392 -839322 -817685 -1144611 -1577362 -1085496 422007 1672659
37422 1672659 1680302 881204 226897 -36752 -228810 -538164 -917708 -1192328 -1017442 -245216
37412 -245216 544008 558170 -259 -53424 762111 1521945 1452655 1001539 825649 610216
37402 610216 -193895 -1115829 -1186160 -379304 370543 401212 -178040 -997157 -1701291 -1918778
37392a918778K45348M1021n94918n52586M28047J081631M72795m77107l80191
37383a654738N11189Q30913K20543l57256k26691K39573M72922L57678l4117n35356
37373a75340o74534j43134N15665M67710j46917l59807J14717M35858M028n91076
37363e52830m88891K37728Q43646Q99226N26937L7258k41349j11112J55289K365
37353A308267n36667o41458J29713R55928P38694l24352r54466n32210J60452
37344C03901J38547m84073p83637k55128O39412J032237N28677m30655j000061
37335c10780p83341k39469q6971l64174l89576K57426J052714J117662L32288
37326E85779n07513p00792m74876n15644q41527o70661L78251J452632J427639
$$ plain form
37392 -1918778 -1673430 -1632409 -2227327 -2779913 -2351866 -1270235 -797440 -1274547 -1654738
37383 -1654738 -1143549 -312636 -92093 -449349 -676040 -436467 36455 394133 360016 -175340
37373 -175340 -849874 -993008 -477343 -9633 -156550 -516357 -401640 34218 38246 -552830
37363 -552830 -1041721 -803993 39653 938879 1465816 1503074 1261725 1150613 1305902 1308267
37353 1308267 771600 130142 259855 1215783 1954477 1630125 675659 143449 303901
37344 303901 442448 -41625 -825262 -1080390 -440978 591259 1119936 689281 -310780
37335 -310780 -1094121 -1333590 -1420561 -1784735 -2174311 -1916885 -864171 253491 585779
37326 585779 78266 -622526 -1097402 -1613046 -2454573 -3125234 -2746983 -1294351 133288
37317A33288M63088j93195Q58K18158k11686o02347j15227O14551L38914o71398
37307b4996q24233L42166J354244R98751K8699k21283J34177P5809m46233n33323
37297H83778K6202M11230J20910l91862o34874o95290o71280l39178K31719M82919
37287e75726K34428P8615L90443N68438o3599j060497j345453o81409J04058L40756
37277b009946K55460L25849N14989N33788M71354O61530J019478R72443K17027
37268B961972p35730j065467o11925l3042N5310k28048l91603l07375k05050j32400
37258f93358P4446L09764K20121j57908k77134J42797O39685O53956L03141J01932
37248A317442J68152J78324r669j50776l5993K35343M34018L79387j2030n33983
$$ plain form
37317 133288 596376 403181 404039 622197 410511 -191836 -307063 307488 646402 -24996
37307 -24996 -849229 -507063 847181 1845932 1874631 1653348 1787525 1863334 1417101 883778
37297 883778 909980 1321210 1442120 1050258 415384 -279906 -951186 -1290364 -1058645 -575726
37287 -575726 -341298 -262683 127760 696198 632599 -427898 -1773351 -2454760 -2350702 -2009946
37277 -2009946 -1754486 -1428637 -913648 -379860 91494 753024 1772502 2744945 2961972
37268 2961972 2226242 1160775 548850 515808 571118 343070 -48533 -355908 -560958 -693358
37258 -693358 -618912 -309148 -89027 -246935 -524069 -381272 258413 912369 1215510 1317442
37248 1317442 1485594 1663918 1654249 1503473 1467480 1702823 2136841 2516228 2504198 1970215
37238A970215o22520N6333R05084Q33167l35424j408625j273771m11898k42624
37229e30063j071327j572611o55178R29289J568928R36380K15230K49098M71851
37220E41597O3108o71690p94760j25413O30111R06430P32923K85950l10253p37632
37210E20371o94771m17296l82610m59845o5166P04898R18565J66107o74204n91246
37200i75197K18990P96697P44440M30835J85442j7859k17117l77021n55572p18940
37190d85302n86619j12670J69219j34576m89466r4253Q30975J234753P01846j00881
37180I33026n48412p44462q01765l45085O76298J386052R64559j59144q21830
37171E39237n93771n5074K30169K75240J85650j37564n30795m21566L63754J033405
$$ plain form
37238 1970215 1347695 1404028 2309112 3142279 2806855 1398230 124459 -287439 -530063
37229 -530063 -1601390 -3174001 -3829179 -2899890 -1330962 -394582 -179352 69746 541597
37220 541597 604705 -66985 -861745 -987158 -357047 549383 1282306 1568256 1258003 520371
37210 520371 -174400 -591696 -974306 -1434151 -1499317 -794419 124146 290253 -383951 -975197
37200 -975197 -756207 40490 784930 1215765 1401207 1383348 1166231 789210 233638 -485302
37190 -485302 -1071921 -1184591 -1015372 -1149948 -1639414 -1733667 -902692 332061 1033907 933026
37180 933026 384614 -359848 -1161613 -1506698 -830400 555652 1520211 1361067 539237
37171 539237 -54534 -109608 120561 395801 581451 443887 -86908 -508474 -144720 888685
37161H88685O67055m92364j160506n61171N97220R87083K13705q57159j177794
37152h95246n50576L95157R04996O88746O4865l68373l36016j32966j01304n2819
37142c83536L68365Q84276P99652J13858l10187q256L68134J16166m00826m32950
37132A114696j13426j38949m83099m17550K15595O69499L91500k85674p41679
37123B10913p27145k82123L67027O71800J76477p10766r81626l15014M85076N99418
37113e05963J63276j60850l2343M30007Q40852O65224k59583j131133q66117L39488
37103e17142J022676M79412k20340J7160N48907J16002j021464j456943q02397
37094a834129q4834O344l6727L01333O92283O88286M19509J27986k38940n65942
$$ plain form
37161 888685 1555740 1063376 -97130 -658301 -61081 926002 1139707 282548 -895246
37152 -895246 -1445822 -1050665 -145669 543077 607942 239569 -96447 -229413 -330717 -383536
37142 -383536 -15171 869105 1668757 1782615 1472428 1464172 1832306 1948472 1547646 1114696
37132 1114696 1001270 862321 379222 -38328 177267 846766 1238266 952592 210913
37123 210913 -516232 -798355 -431328 240472 416949 -293817 -1275443 -1590457 -1105381 -505963
37113 -505963 -342687 -503537 -535880 -105873 734979 1400203 1140620 9487 -856630 -517142
37103 -517142 505534 984946 764606 781766 1330673 1446675 425211 -1031732 -1834129
37094 -1834129 -1918963 -1912619 -1949346 -1648013 -955730 -267444 152065 280051 41111 -524831
37084e24831m39058P9005K67788j30998l25506L07485J039152P18529m73752j167251
37074f49437o46256L27881P15869M69292K24364K78391L78369K55365r2971n47600
37064G13267r17610q89914l03597M73338Q00116N48926K89727M17526M51467k51499
37054A331747j239979j198455K66999J730942J504895k12955j519198j161309
37046d97313N3466N60698J03018k43149J36840M75745j57866j361215j815650
37037b745426j007694J98824Q27137R17290R85937R79028N03630k05055m06055
37028D7616L6943M23532K61794j28562k91873k59705j79171M5415L22536J77239
37018D55764n10735j084118r49438l73022P5319L50496O12762O40450K97433P5711
$$ plain form
37084 -524831 -963889 -884884 -617096 -748094 -1073600 -766115 273037 991566 517814 -649437
37074 -649437 -1295693 -967812 -251943 217349 441713 720104 1098473 1353838 1260867 713267
37064 713267 -204343 -1094257 -1397854 -924516 -124400 424526 714253 1131779 1583246 1331747
37054 1331747 91768 -1106687 -839688 891254 2396149 2183194 663996 -497313
37046 -497313 -443847 116851 219869 -23280 113560 589305 431439 -929776 -2745426
37037 -2745426 -3753120 -3554296 -2727159 -1809869 -823932 155096 658726 453671 47616
37028 47616 84559 508091 769885 641323 349450 89745 -89426 -44011 278525 455764
37018 455764 -54971 -1139089 -2088527 -2461549 -2386230 -2035734 -1422972 -782522 -485089 -409378
37008d09378L39405N15589k96n98254k92310N13230M79570m82260r52727k23645
36998a111076O33743N07718j84280m45328j96135M6879J67925K47050M4153m37076
36988g26427m61308M57096J543107J614988O15168m97718j047921j047216o31380
36979a81611M2964N18142M46052J73547K48691N27952M68780R1753j29948j74590
36969B031732m31914q41815r14836o05530l42516j71790K63477Q08979P99472
36960E95259K06179j33263J84178M51924J3329o43970o31847J4591M55641K12058
36950G24079l65425o50511l62414K47550N85335K79241l07091m57961j17894N275
36940d19816l99488o45038j32486N69930N23948j02728k98913J82209M71810J5983
$$ plain form
37008 -409378 -69973 445616 445320 -152934 -445244 67986 547556 65296 -887431 -1111076
36998 -1111076 -477333 30385 -153895 -599223 -795358 -748479 -580554 -333504 -289351 -726427
36988 -726427 -1187735 -730639 812468 2427456 3042624 2544906 1496985 449769 -181611
36979 -181611 -138647 379495 825547 999094 1247785 1775737 2244517 2336270 2206322 2031732
36969 2031732 1599818 758003 -156833 -762363 -1104879 -1276669 -1013192 -204213 595259
36960 595259 801438 668175 852353 1304277 1317606 673636 41789 56380 512021 724079
36950 724079 358654 -291857 -654271 -406721 178614 457855 150764 -307197 -425091 -419816
36940 -419816 -819304 -1464342 -1596828 -1026898 -502950 -605678 -904591 -722382 -250572 -234589
36930b34589n72690n59328k23044k42053m46369p6930Q42663J309933P69126l3252
36920E33467j40728K40828K11546l11652m90471j391L90438P6589m31277m27225
36910c49876j87594l48650o25444k28141O64988J004478N17402J35643M43478
36901A026284P43640K64610n63903q14933m42706j54369k81199n25618o15274
36892a363468n54455l42805J9374L33257M30054M60817N93321O35570L53466p9508
36882D85623l60331n05108n75751l03218M30968J027917P85929o0015n89648m17876
36872h1510j8659J23379K6429j35115k60364j64887K19832M95445K64051j06964
36862C61637O5003N75290M90726l21792q13144l17582M17672L87343k57239o78842
$$ plain form
36930 -234589 -807279 -1366607 -1589651 -1831704 -2278073 -2355003 -1512340 -202407 566719 533467
36920 533467 392739 633567 845113 533461 42990 41599 432037 508626 77349 -349876
36910 -349876 -537470 -886120 -1511564 -1739705 -1074717 -70239 447163 582806 1026284
36901 1026284 1769924 2034534 1470631 655698 212992 58623 -222576 -748194 -1363468
36892 -1363468 -1917923 -2260728 -2241354 -1908097 -1478043 -1017226 -423905 211665 565131 485623
36882 485623 125292 -379816 -955567 -1258785 -827817 200100 986029 926014 336366 -81510
36872 -81510 -100169 23210 49639 -85476 -345840 -510727 -290895 204550 468601 361637
36862 361637 426640 1001930 1492656 1170864 357720 40138 457810 845153 587914 -90928
36852i0928o15968l71008j9669M98150P93305M05998l23013n27039J7442O38423
36842D05693P33252L99029J1210k69731l86801k42051P9197K33042j3207n06672
36832D42961r25460j110375j075151q13120k48687N54580J171320J032421J38523
36823h32988o11828l24649O38191R52757R5051r12931r65620l36314M2961R1652
36813b163718L54759P01393M57289k46494m44252J62404P32484O17614J76226
36804C47705j34879m88878r32587q29937J31605J075708R72201Q5787m52058j97969
36794d23302K92089N00853M91803M39090L03341P9513j03868k01748k58097k62505
36784H57169k67621m40699o86084n35595J52379P27416N27598j78142o22209n96075
$$ plain form
36852 -90928 -706896 -1077904 -1097573 -599423 193882 599880 276867 -250172 -232730 405693
36842 405693 1138945 1537974 1549184 1279453 892652 650601 729798 962840 949633 442961
36832 442961 -482499 -1592874 -2668025 -3481145 -3729832 -3175252 -2003932 -971511 -832988
36823 -832988 -1444816 -1769465 -1131274 -178517 -83466 -996397 -1962017 -2298331 -2255370 -2163718
36813 -2163718 -1808959 -1107566 -650277 -896771 -1341023 -1178619 -446135 171479 347705
36804 347705 212826 -276052 -1208639 -2038576 -1906971 -831263 140938 226725 -225333 -423302
36794 -423302 -131213 369640 861443 1300533 1603874 1683387 1579519 1377771 1119674 857169
36784 857169 589548 148849 -537235 -1072830 -920451 -193035 334563 156421 -465788 -1061863
36774a061863l97919o9559M57554P27603K96626k29339J48808J086535J112391
36765B070837j05384j071538p04468L7258k00535r83173r04014J04270P61476
36756i95271M83754K1907r508L5409j93202l03423O6544N06990M41740k4192l42507
36745c11759k57144O9827L84670M94386L16199k798j82842j20643Q6771L85877
36735H62544P13435P58787K29186o15125j133777j052539o08169j9629N86702
36726b78585P84360K01226o02289n18841N09284J192649O76811l14664p79452
36717H70499r02273j259341j423783o49869N76162J032206N74824J61073J67846
36708h52656L1697l60393l01127L68194P64395L42589l02876n18990m31620j84688
$$ plain form
36774 -1061863 -1459782 -1529341 -1071787 -344184 -47558 -276897 -128089 958446 2070837
36765 2070837 1965453 893915 189447 226705 26170 -957003 -1861017 -1756747 -995271
36756 -995271 -511517 -489610 -499118 -463709 -656911 -960334 -893790 -386800 54940 30748 -311759
36745 -311759 -568903 -499076 -114406 379980 696179 693381 510539 389896 476667 862544
36735 862544 1575979 2334766 2563952 1948827 815050 -237489 -845658 -865287 -278585
36726 -278585 505775 707001 104712 -414129 95155 1287804 1964615 1649951 870499
36717 870499 -31774 -1291115 -2714898 -3364767 -2788605 -1756399 -1181575 -1020502 -852656
36708 -852656 -820959 -1181352 -1482479 -1114285 -349890 -7301 -310177 -829167 -1260787 -1445475
36698a445475N26615J460664J491280J94296j197571j430090q94468n49557j61096
$$ plain form
36698 -1445475 -918860 541804 2033084 2227380 1029809 -400281 -1294749 -1844306 -2005402
$$ [...]
##END NTUPLES=NMR SPECTRUM
##END=
