##TITLE=31Pdec_2PBDP2212
 CDCl3, 24 sc
 23.12.2022
##JCAMPDX= 6.0         $$ Bruker NMR JCAMP-DX V2.0
##DATA TYPE= NMR SPECTRUM
##DATA CLASS= NTUPLES
##ORIGIN= UXNMR, Bruker Analytische Messtechnik GmbH
##OWNER= root
$$ XWIN-NMR		Version 3.5
$$ Fri Dec 23 14:10:58 2022 Russian Standard Time (UT+4h)  she@DPX200
##.OBSERVE FREQUENCY= 81.013821
##.OBSERVE NUCLEUS= ^31P
##.ACQUISITION MODE= SIMULTANEOUS
##.ACQUISITION SCHEME= undefined
##.AVERAGES= 24
##.DIGITISER RES= 16
##SPECTROMETER/DATA SYSTEM= spect
##.PULSE SEQUENCE= zgpg30
##.SOLVENT NAME= DMSO
##.SHIFT REFERENCE= (INTERNAL, DMSO, 0, 248.564)
##AUDIT TRAIL= $$ (NUMBER, WHEN, WHO, WHERE, WHAT)
$$ ##TITLE= Audit trail, XWIN-NMR		Version 3.5
$$ ##JCAMPDX= 5.01
$$ ##ORIGIN= Bruker BioSpin GmbH
$$ ##OWNER= she
$$ F:/spectra/data/she/nmr/P31/1/pdata/1/auditp.txt
$$ ##AUDIT TRAIL=  $$ (NUMBER, WHEN, WHO, WHERE, WHAT)
(   1,<2022-12-23 14:09:52.81 +0400>,<she>,<DPX200>,
      <created by zg, POWCHK disabled, PULCHK disabled
       configuration hash MD5:
       00 E9 B6 7A A2 85 ED C7 34 08 36 98 17 FE 4E 26
       data hash MD5: 32K
       A7 89 35 D3 21 66 C3 EB 5D 9D A3 BC 4E 14 AB CC>)
(   2,<2022-12-23 14:10:04.85 +0400>,<she>,<DPX200>,
      <Start of raw data processing
       efp BC_mod = 2 LB = 1 FT_mod = 6 PKNL = 1 PHC0 = -10940.79 PHC1 = 855.0566 SI = 64K 
       data hash MD5: 64K
       75 A8 BF 78 00 20 D5 75 92 1F D7 4D 1E 87 F9 D3>)
(   3,<2022-12-23 14:10:25.64 +0400>,<she>,<DPX200>,
      <pk PHC0 = 89.03777 PHC1 = -194 
       data hash MD5: 64K
       A0 1A 2D A1 D0 09 AB 81 76 8B 4B 4B BE AD FA 83>)
(   4,<2022-12-23 14:10:29.87 +0400>,<she>,<DPX200>,
      <abs ABSG = 5 
       data hash MD5: 64K
       93 E2 6E 16 7A 80 B4 79 54 92 8C 7D 4F 1F B0 40>)
$$ ##END=
$$ 
$$ hash MD5
$$ CF 83 35 44 08 AC 93 37 58 B3 95 D8 4B 8A 05 72
##$RELAX= 
##$RELAX= 
##$RELAX= 
##$RELAX= 
##$RELAX= 
##$RELAX= 
##$RELAX= 
##$RELAX= 
##$RELAX= 
$$ Bruker specific parameters
$$ --------------------------
##$DU= <F:/spectra>
##$EXPNO= 1
##$NAME= <P31>
##$PROCNO= 1
##$TYPE= <nmr>
##$USER= <she>
##$AMP= (0..31)
100 100 100 100 100 100 100 100 100 100 100 100 100 100 100 100 100 100 
100 100 100 100 100 100 100 100 100 100 100 100 100 100 
##$AQSEQ= 0
##$AQ_mod= 1
##$AUNM= <au_zg>
##$AUTOPOS= <>
##$BF1= 81.014009
##$BF2= 200.13
##$BF3= 200.13
##$BF4= 200.13
##$BF5= 200.13
##$BF6= 200.13
##$BF7= 200.13
##$BF8= 200.13
##$BYTORDA= 1
##$CFDGTYP= 0
##$CFRGTYP= 5
##$CHEMSTR= <none>
##$CNST= (0..31)
1 1 145 1 1 1 1 1 1 1 1 1 1 1 1 1 1 1 1 1 1 1 1 1 1 1 1 1 1 1 1 1 
##$CPDPRG= <waltz16>
##$CPDPRG1= <>
##$CPDPRG2= <waltz16>
##$CPDPRG3= <>
##$CPDPRG4= <mlev>
##$CPDPRG5= <mlev>
##$CPDPRG6= <mlev>
##$CPDPRG7= <mlev>
##$CPDPRG8= <mlev>
##$CPDPRGB= <>
##$CPDPRGT= <>
##$D= (0..31)
0 1 0 0 0 0 0 0 0 0 0 0.03 2e-05 3e-06 0 0 0 0 0 0 0 0 0 0 0 0 0 0 0 0 
0 0 
##$DATE= 1671790192
##$DBL= (0..7)
120 120 120 11 120 120 24 19 
##$DBP= (0..7)
150 150 150 150 150 150 150 150 
##$DBP07= 0
##$DBPNAM0= <>
##$DBPNAM1= <>
$$ [...]
##$SUBNAM3= <"">
##$SUBNAM4= <"">
##$SUBNAM5= <"">
##$SUBNAM6= <"">
##$SUBNAM7= <"">
##$SUBNAM8= <"">
##$SUBNAM9= <"">
##$SW= 501.771253377433
##$SWIBOX= (0..15)
0 1 3 0 0 0 0 0 0 0 0 0 0 0 0 0 
##$SW_h= 40650.406504065
##$TD= 32768
##$TD0= 1
##$TE= 0
##$TE2= 300
##$TE3= 300
##$TEG= 300
##$TL= (0..7)
0 120 53 12 22 120 120 120 
##$TP= (0..7)
150 150 150 150 150 150 150 150 
##$TP07= 0
##$TPNAME0= <>
##$TPNAME1= <>
##$TPNAME2= <>
##$TPNAME3= <>
##$TPNAME4= <>
##$TPNAME5= <>
##$TPNAME6= <>
##$TPNAME7= <>
##$TPOAL= (0..7)
0.5 0.5 0.5 0.5 0.5 0.5 0.5 0.5 
##$TPOFFS= (0..7)
0 0 0 0 0 0 0 0 
##$TUNHIN= 0
##$TUNHOUT= 0
##$TUNXOUT= 0
##$USERA1= <user>
##$USERA2= <user>
##$USERA3= <user>
##$USERA4= <user>
##$USERA5= <user>
##$V9= 5
##$VALIST= <valist>
##$VCLIST= <CCCCCCCCCCCCCCC>
##$VD= 0
##$VDLIST= <DDDDDDDDDDDDDDD>
##$VPLIST= <PPPPPPPPPPPPPPP>
##$VTLIST= <TTTTTTTTTTTTTTT>
##$WBST= 1024
##$WBSW= 4
##$XGAIN= (0..3)
0 0 0 0 
##$XL= 0
##$YL= 0
##$YMAX_a= 6235
##$YMIN_a= -9020
##$ZGOPTNS= <>
##$ZL1= 120
##$ZL2= 120
##$ZL3= 120
##$ZL4= 120
##$ABSF1= 248.5645
##$ABSF2= -253.2056
##$ABSG= 5
##$ABSL= 3
##$ALPHA= 0
##$AQORDER= 0
##$ASSFAC= 0
##$ASSFACI= 0
##$ASSFACX= 0
##$ASSWID= 0
##$AUNMP= <proc_1d>
##$AZFE= 0.1
##$AZFW= 0.5
##$BCFW= 0
##$BC_mod= 2
##$BYTORDP= 0
##$COROFFS= 0
##$CY= -3
##$DATMOD= 1
##$DC= 0
##$DFILT= <>
##$DTYPP= 0
##$F1P= 0
##$F2P= 0
##$FCOR= 1
##$FTSIZE= 65536
##$FT_mod= 6
##$GAMMA= 0
##$GB= 0
##$INTBC= 1
##$INTSCL= 6.047779e-11
##$ISEN= 30
##$LB= 1
##$LEV0= 0
##$LPBIN= 0
##$MAXI= 10000
##$MC2= 0
##$MEAN= 0
##$ME_mod= 0
##$MI= 50
##$NCOEF= 0
##$NC_proc= -8
##$NLEV= 6
##$NOISF1= 182.463
##$NOISF2= 159.3651
##$NSP= 0
##$NTH_PI= 0
##$NZP= 0
##$OFFSET= 248.5645
##$PC= 4
##$PHC0= -10851.75
##$PHC1= 661.0566
##$PH_mod= 1
##$PKNL= yes
##$PPARMOD= 0
##$PSCAL= 0
##$PSIGN= 0
##$REVERSE= no
##$SF= 81.0140089999694
##$SI= 65536
##$SIGF1= 159.3651
##$SIGF2= -187.1042
##$SINO= 113.3802
##$SIOLD= 16384
##$SREGLST= <1H.CDCl3>
##$SSB= 0
##$STSI= 65536
##$STSR= 0
##$SW_p= 40650.406504065
##$SYMM= 0
##$S_DEV= 0
##$TDeff= 32768
##$TDoff= 0
##$TI= <>
##$TILT= no
##$TM1= 0
##$TM2= 0
##$TOPLEV= 0
##$USERP1= <user>
##$USERP2= <user>
##$USERP3= <user>
##$USERP4= <user>
##$USERP5= <user>
##$WDW= 1
##$XDIM= 65536
##$YMAX_p= 454972926
##$YMIN_p= -41136348
$$ End of Bruker specific parameters
$$ ---------------------------------
##NTUPLES= NMR SPECTRUM
##VAR_NAME=  FREQUENCY,     SPECTRUM/REAL,   SPECTRUM/IMAG
##SYMBOL=    X,             R,               I
##VAR_TYPE=  INDEPENDENT,   DEPENDENT,       DEPENDENT
##VAR_FORM=  AFFN,          ASDF,            ASDF
##VAR_DIM=   65536,         65536,           65536
##UNITS=     HZ,            ARBITRARY UNITS, ARBITRARY UNITS
##FACTOR=    0.620285442955139, 1,           1
##FIRST=     20137.2065510682, 0,            0
##LAST=      -20513.1999529968, 0,           0
##MIN=       -20513.1999529968, -41136348,   0
##MAX=       20137.2065510682, 454972926,    0
$$ Real data points
##PAGE= N=1
##DATA TABLE= (X++(R..R)), XYDATA
$$ [...]
$$ plain form
40407 -5598788 -5648367 -5119281 -6645014 -9679396 -10783410 -8989636 -6676192 -5171284 -3494004
40398 -3494004 -1272743 776859 2682962 4123623 3112212 -339268 -1828026 993569
40390 993569 2588573 -2838659 -10393239 -10088216 -2526924 1103757 -3931741 -9195129
40382 -9195129 -6987916 -1315961 648156 -238382 562160 2117777 716037 -2744383
40374 -2744383 -4885248 -5845423 -7057539 -6617523 -3183923 -1152284 -5033718 -11185790
40366 -11185790 -12311167 -8508473 -6379413 -7779005 -7324741 -2361683 1879577 303042
40358 303042 -4301862 -5645529 -2715661 18279 -241859 -1028539 1142019 5119040 5829998
40349 5829998 919792 -5321599 -6990890 -4458072 -3421189 -5825414 -6720288 -2604501
$$ packed form
40407e598788m9579N29086j525733l034382j104014J793774K313444J504908J677280
40398c494004K221261K049602J906103J440661j011411l451480j488758K821595
40390I93569J595004n427232p554580L05023P561292L630681n035498n263388
40382i195129K207213N671955J964117q86538Q00542J555617j401740l460420
40374b744383k140865r60175j212116M40016L433600K031639l881434o152072
40366a1185790j125377L802694K129060j399592M54264M963058M241260j576535
40358C03042m604904j343667K929868K733940k60138p86680K170558L977021P10958
40349E829998m910206o241391j669291K532818J036883k404225q94874M115787
$$ plain form
40341 -2604501 2126125 1735157 -1614794 -1166158 3944754 7904575 7430639 5399486 4286800
40332 4286800 1936370 -3526499 -9164782 -11020883 -9476678 -7614785 -6258376 -3855022
40324 -3855022 -359970 1799256 1131869 -434922 262492 3430629 5592642 3811113
40316 3811113 -260580 -2262386 -817242 1006174 374872 -1946593 -4086215 -5740548
40308 -5740548 -6257058 -3390888 2714282 7173968 6102174 2459237 1624349 3085672
40300 3085672 1999220 -2026777 -3901624 -1346036 1602805 1041739 -1838435 -4278694
40292 -4278694 -5892800 -6661463 -5109354 -1394101 1094941 86280 -2306849 -3084357
40284 -3084357 -2445745 -2053154 -1946948 -1687696 -1991747 -2719476 -1833656 995718 2490735
$$ packed form
40341b604501M730626l90968l349951M48636N110912L959821m73936k031153j112686
40332D286800k350430n462869n638283j856101J544205J861893J356409K403354
40324c855022L495052K159226o67387j566791O97414L168137K162013j781529
40316C811113m071693k001806J445144J823416o31302k321465k139622j654333
40308e740548n16510K866170O105170M459686j071794l642937q34888J461323
40300C085672j086452m025997j874847K555588K948841n61066k880174k440259
40292d278694j614106p68663J552109L715253K489042j008661k393129p77508
40284c084357O38612L92591J06206K59252l04051p27729Q85820K829374J495017
$$ plain form
40275 2490735 614760 -1274352 1008289 5569110 6310171 1065308 -5816927 -9021267
40267 -9021267 -7440705 -3667314 -842738 -520432 -2062023 -3796687 -5180390 -6788867
40259 -6788867 -7787442 -5849424 -1156263 2249455 1718199 177353 1858697 6005161
40251 6005161 8636977 8833543 8860445 9075333 7404805 3758260 544946 -1483710 -3744201
40242 -3744201 -5898426 -5906681 -4739593 -6268126 -10798427 -13153869 -9488863 -2205483 4146352
40233 4146352 7974491 9115349 6418039 605285 -3833874 -3857221 -2521527 -4344928
40225 -4344928 -8250096 -9477712 -6647693 -2256212 2240462 6498847 7481549 1965862
40217 1965862 -6369688 -8674710 -2268997 5072402 5586174 1533418 140285 2362361
$$ packed form
40275B490735j875975j889112K282641M560821P41061n244863o882235l204340
40267i021267J580562L773391K824576L22306j541591j734664j383703j608477
40259f788867r98575J938018M693161L405718n31256j540846J681344M146464
40251F005161K631816J96566K6902K14888j670528l646545l213314k028656k260491
40242c744201k154225q255J167088j528533m530301k355442L665006P283380O351835
40233D146352L828139J140858k697310n812754m439159k3347J335694j823401
40225d344928l905168j227616K830019M391481M496674M258385R82702n515687
40217A965862q335550k305022O405713P341399N13772m052756j393133K222076
$$ plain form
40209 2362361 2928894 105897 -1260422 2193519 6579221 6202519 1469938 -2364157
40201 -2364157 -2775338 -2470422 -4123394 -5883125 -4041334 1374968 6010673 6309429 3532888
40192 3532888 1600316 1825117 1531758 -1710939 -6102414 -7578743 -5311759 -3048733
40184 -3048733 -4041472 -6522094 -6333321 -3052711 -575454 -1291317 -2812188 -2241618 -963729
40175 -963729 -2078773 -4754552 -5119383 -2549925 -882394 -2179791 -3220895 -763990
40167 -763990 2768914 2528789 -1393529 -3671721 -787394 4703735 7693954 6193688
40159 6193688 2593405 583360 1499589 3121564 2164186 -1517865 -4117949 -2468674
40151 -2468674 1609314 3425722 1180885 -2504379 -4363130 -3535822 -1138642 789136
$$ packed form
40209B362361N66533k822997j366319L453941M385702l76702m732581l834095
40201b364157m11181L04916j652972j759731J841791N416302M635705K98756k776541
40192C532888j932572K24801k93359l242697m391475j476329K266984K263026
40184c048733r92739k480622J88773L280610K477257p15863j520871N70570J277889
40175i63729j115044k675779l64831K569458J667531j297397j041104K456905
40167g63990L532904k40125l922318k278192K884327N491129K990219j500266
40159F193688l600283k010045R16229J621975r57378l682051k600084J649275
40151b468674M077988J816408k244837l685264j858751Q27308K397180J927778
$$ plain form
40143 789136 -5309 -3718886 -6812369 -5453536 -1041036 936691 -1447264 -3586083
40135 -3586083 -1116455 3511575 4501420 898076 -2154650 35053 6424594 11632699
40127 11632699 11159623 5463403 -160454 -479546 3981585 7303282 5259524 338802
40119 338802 -2097343 -1010915 -371660 -3343529 -8456913 -11804575 -11154339 -7536100 -4036808
40110 -4036808 -3133695 -4273124 -4320258 -1204312 3528134 6676994 6927261 5298654 3230868
40101 3230868 1688225 1051450 324361 -2273520 -6108399 -7127024 -2694578 3773003
40093 3773003 6213189 3429959 -118444 -1044594 -1026966 -3175140 -7534963 -11851174 -14541752
40084 -14541752 -15228440 -13976570 -11602320 -9593324 -8440851 -6927987 -4065260 -915165
$$ packed form
40143G89136p94445l713577l093483J358833M412500J977727k383955k138819
40135c586083K469628M628030R89845l603344l052726K189703O389541N208105
40127A1632699m73076n696220n623857l19092M461131L321697k043758m920722
40119C38802k436145J086428O39255k971869n113384l347662O50236L618239L499292
40110d036808R03113j139429m7134L115946M732446L148860K50267j628607k067786
40101C230868j542643o36775p27089k597881l834879j018625M432446O467581
40093C773003K440186k783230l548403r26150J7628k148174m359823m316211k690578
40084a4541752o86688J251870K374250K008996J152473J512864K862727L150095
$$ plain form
40076 -915165 527843 -67397 -561800 1711732 6966846 11933351 12780087 9525769 6134815
40067 6134815 5425838 6001648 5866085 6292442 8737066 10262384 7054163 1706355 1262119
40058 1262119 6828159 10478947 5339499 -5242051 -12067471 -10988716 -5935341 -2511448
40050 -2511448 -1875233 -1145421 1850924 5041717 3987328 -2002928 -7376693 -6782567 -2668607
40041 -2668607 -2037443 -5919377 -7665094 -3148459 3121669 5144233 3450477 1802520
40033 1802520 407416 -2302849 -4372305 -2552503 1769617 3813955 1651141 -2642283
40025 -2642283 -6625378 -8577156 -6870412 -2404208 250661 -1545932 -3920275 -2264909
40017 -2264909 991950 414706 -2847921 -2750362 1489776 4809481 5784829 8215443 12067262
$$ packed form
40076i15165J443008n95240m94403K273532N255114M966505Q46736l254318l390954
40067F134815p08977N75810j35563M26357K444624J525318l208221n347808m44236
40058A262119N566040L650788n139448j0581550o825420J078755N053375L423893
40050b511448O36215P29812K996345L190793j054389n990256n373765N94126M113960
40041b668607O31164l881934j745717M516635O270128K022564j693756j647957
40033A802520j395104k710265k069456J819802M322120K044338k162814m293424
40025b642283l983095j951778J706744M466204K654869j796593k374343J655366
40017b264909L256859n77244l262627R7559M240138L319705R75348K430614L851819
$$ plain form
40008 12067262 11766981 6345726 2485862 3204491 2105823 -5187941 -11942594 -10384136
40000 -10384136 -4178042 -1918039 -3476549 -2839319 -634420 -2533488 -6829387 -5553146
39992 -5553146 1094952 3168203 -2911484 -7808004 -4398734 792793 -646116 -4399984
39984 -4399984 -1115584 6947515 8970248 3133588 -1020195 1086839 1920625 -4555947
39976 -4555947 -11885341 -10918568 -3862005 -197461 -2490777 -4756850 -3372080 -1293424
39968 -1293424 -798809 340884 2889178 2767850 -2298497 -7556462 -7504582 -4218698 -4200897
39959 -4200897 -8569690 -11600465 -8968070 -2911884 1753767 3074209 1922994 -373177
39951 -373177 -2246904 -1744400 1620707 5773624 8276626 8835291 8601630 8066386 6963540
$$ packed form
40008A2067262l00281n421255l859864P18629j098668p293764o754653J558458
40000a0384136O206094K260003j558510O37230K204899j899068m295899J276241
39992e553146O648098K073251o079687m896520L409270N191527j438909l753868
39984d399984L284400Q063099K022733n836660m153783K107034Q33786o476572
39976d555947p329394R66773P056563L664544k293316k266073J384770K078656
39968a293424M94615J139693K548294j21328n066347n257965N1880L285884J7801
39959d200897m368793l030775K632395O056186M665651J320442j151215k296171
39951c73177j873727N02504L365107M152917K503002N58665k33661n35244j102846
$$ plain form
39942 6963540 5455068 3988444 2403288 458777 -969562 -466826 1975094 4525467
39934 4525467 5423784 4749889 3831115 3229991 2091233 -168799 -2250360 -2280092 -700017
39925 -700017 -101336 -1268336 -1380737 1586541 4177367 824067 -7909653 -14255430 -12215717
39916 -12215717 -4670305 974372 1873906 1216373 2008381 3265281 2741476 422032 -1857557
39907 -1857557 -2413080 -538522 2983888 5394185 3585371 -2576622 -9417352 -12636333
39899 -12636333 -10606612 -4533074 2914484 8389163 9221801 5800219 1780611 515991
39891 515991 1867333 3541511 4392577 4711536 4235297 2200435 -794461 -3201762 -5011125
39882 -5011125 -7607710 -10563316 -10955388 -7349423 -2581711 -559045 -1347885 -1446709 1516092
$$ packed form
39942F963540j508472j466624j585156j944511j428339N02736K441920K550373
39934D525467Q98317o73895r18774o01124j138758k260032k081561k9732J580075
39925g00017N98681j167000j12401K967278K590826l353300q733720o345777K039713
39916a2215717P545412N644677Q99534o57533P92008J256900n23805k319444k279589
39907a857557n55523J874558L522410K410297j808814o161993o840730l218981
39899a2636333K029721O073538P447558N474679Q32638l421582m019608j264620
39891E15991J351342J674178Q51066L18959m76239k034862k994896k407301j809363
39882e011125k596585k955606l92072L605965M767712K022666p88840r8824K962801
$$ plain form
39873 1516092 6087275 8842378 7576245 2847837 -2350895 -4607960 -3012256 -50178
39865 -50178 1255675 568996 -429903 -877835 -994467 -328874 1686034 3572587 2964521
39856 2964521 352988 -1043413 88985 1473448 1299239 844093 1110046 -81706 -4562055
39847 -4562055 -9523953 -10331073 -6762930 -3447788 -4342489 -8918110 -13202170 -12794098 -6207003
39838 -6207003 2446460 5695464 653187 -6715691 -8719540 -5784434 -4656414 -7790475
39830 -7790475 -10368654 -8697570 -5680364 -5320027 -6645654 -6623441 -5392741 -4826208 -4659194
39821 -4659194 -3709270 -2715926 -2477867 -1210406 2562574 6151113 5623761 1579494 -1682579
39812 -1682579 -2088898 -1339236 -1015270 -882524 -1249240 -3452671 -7044965 -9214920 -8059752
$$ packed form
39873A516092M571183K755103j266133m728408n198732k257065J595704K962078
39865e0178J305853o86679r98899m47932j16632O65593K014908J886553o08066
39856B964521k611533j396401J132398J384463j74209m55146K65953j191752m480349
39847d562055m961898q07120L568143L315142q94701m575621m284060M08072O587095
39838f207003Q653463L249004n042277p368878k003849K935106J128020l134061
39830g790475k578179J671084L017206L60337j325627K2213J230700N66533J67014
39821d659194R49924R93344K38059J267461L772980L588539n27352m044267l262073
39812a682579m06319P49662L23966J32746l66716k203431l592294k169955J155168
$$ plain form
39803 -8059752 -4573093 -999698 945536 283116 -2560166 -5202334 -5646330 -5113082 -6108494
39794 -6108494 -7871558 -6894308 -2424133 1865494 2852977 1591464 495386 -127226 -749928
39785 -749928 -586487 486281 78698 -3578613 -7870681 -8218413 -3914850 1046562 3007788
39776 3007788 2153664 551455 -1013991 -2834096 -4334465 -4348015 -3284398 -3334500 -5621152
39767 -5621152 -8311083 -8999129 -8038150 -7167588 -5299738 605452 9244006 13794079 10393706
39758 10393706 4250123 2501840 3791378 1274468 -5491818 -9446633 -7594425 -5636726
39750 -5636726 -7966714 -10423152 -7926523 -3144589 -1471483 -2265093 -1758504 -796953 -2415324
39741 -2415324 -4588468 -3158519 -208858 -1365453 -5343990 -4725262 1791220 6197481
$$ packed form
39803h059752L486659L573395J945234o62420k843282k642168m43996N33248r95412
39794f108494j763064R77250M470175M289627R87483j261513j096078o22612o22702
39785g49928J63441J072768m07583l657311m292068l47732M303563M961412J961226
39776C007788q54124j602209j565446j820105j500369j3550J063617n0102k286652
39767e621152k689931o88046R60979Q70562J867850N905190Q638554M550073l400373
39758A0393706o143583j748283J289538k516910o766286l954815J852208J957699
39750e636726k329988k456438K496629M781934J673106p93610N06589R61551j618371
39741b415324k173144J429949K949661j156595l978537O18728O516482M406261
$$ plain form
39733 6197481 2909799 -3604573 -6518288 -5551631 -3912000 -1953128 936698 2280638
39725 2280638 -325602 -4626204 -6707585 -6420841 -6050923 -5836016 -4560470 -2655972 -1209113
39716 -1209113 356778 2543067 3762301 3048445 2456058 3693123 5036664 4917625 5338913
39707 5338913 7517544 7526101 1784426 -5784548 -8379472 -6311921 -5690681 -8249464 -9860094
39698 -9860094 -9186069 -9855098 -12202991 -10497822 -1999215 7425376 10927904 8915564
39690 8915564 5630722 2376838 -1016633 -2133838 884077 4625901 4247225 644346
39682 644346 -910807 1604934 4949671 5658834 3302143 -877496 -5025587 -6597480
39674 -6597480 -4470060 -1024452 697863 1355381 3654862 6944114 7349328 3646837
$$ packed form
39733F197481l287682o514372k913715R66657J639631J958872K889826J343940
39725B280638k606240m300602k081381K86744L69918K14907J275546J904498J446859
39716a209113J565891K186289J219234p13856n92387J237065J343541j19039M21288
39707E338913K178631Q557n741675p568974k594924K067551O21240k558783j610630
39698i860094O74025o69029k347893J705169Q498607R424591L502528k012340
39690H915564l284842l253884l393471j117205L017915L741824l78676l602879
39682F44346j555153K515741L344737P09163k356691m179639m148091j571893
39674f597480K127420L445608J722315O57518K299481L289252M05214l702491
$$ plain form
39666 3646837 -716534 -2422574 -1807584 -450931 1462232 3585960 4171693 2845933
39658 2845933 2467979 5420138 9320006 9289243 4193640 -1863047 -4640308 -4264909 -3608246
39649 -3608246 -3742362 -2949450 -97334 2893403 3168503 636992 -2008526 -2746982 -1993754
39640 -1993754 -690954 1260768 3482276 3941125 1366726 -2258179 -3803568 -2921918
39632 -2921918 -1612403 -368058 2315298 6028409 7013674 2692007 -3989469 -7127457
39624 -7127457 -4578489 -308685 522332 -2318724 -4140590 -1428715 3344501 4369008
39616 4369008 -341814 -6323880 -8003941 -4880422 -674019 2230694 4788471 8013131
39608 8013131 10519176 10370206 7627822 4054830 1508514 1244815 3351154 5957054
$$ packed form
39666C646837m363371j706040O14990J356653J913163K123728N85733j325760
39658B845933l77954K952159L899868l0763n095603o056687k777261L75399O56663
39649c608246j34116P92912K852116K990737K75100k531511k645518p38456P53228
39640a993754J302800J951722K221508M58849k574399l624905j545389Q81650
39632b921918J309515J244345K683356L713111R85265m321667o681476l137988
39624g127457K548968M269804Q31017k841056j821866K711875M773216J024507
39616D369008m710822n982066j680061L123519M206403K904713K557777L224660
39608H013131K506045j48970k742384l572992k546316k63699K106339K605900
$$ plain form
39600 5957054 6285732 3548152 -112192 -2218928 -2300572 -1029430 1106707 2888749 2119152
39591 2119152 -1255733 -3192138 10200 5741012 7275141 2688612 -2266798 -2277510
39583 -2277510 238689 -298480 -3548123 -4152786 -984844 628469 -2341930 -5178736
39575 -5178736 -2458026 3571251 6446814 4683812 2294032 1636029 1282595 668725 1254286
39566 1254286 2301726 903424 -2206465 -2145795 2412101 6152479 5062925 2596465
39558 2596465 3435788 5326347 2843931 -3386229 -7277483 -5928857 -2248688 552928
39550 552928 2026349 2080680 300612 -1876398 -2390525 -2111596 -3130851 -3907831 -1168934
39541 -1168934 3261965 3492633 -1220815 -4444015 -2393684 266242 -1442270 -4439204
$$ packed form
39600E957054L28678k737580l660344k106736q1644J271142K136137J782042p69597
39591B119152l374885j936405L202338N730812J534129m586529m955410j0712
39583b277510K516199n37169l249643o04663L167942J613313k970399k836806
39575e178736K720710O029277K875563j763002k389780o58003l53434o13870N85561
39566A254286J047440j398302l109889O0670M557896L740378j089554k466460
39558B596465Q39323J890559k482416o230160l891254J348626L680169K801616
39550E52928J473421N4331j780068k177010n14127K78929j019255p76980K738897
39541a168934M430899K30668m713448l223200K050331K659926j708512k996934
$$ plain form
39533 -4439204 -3147588 716663 1019166 -2089057 -1844222 4235012 9895925 9204881 4827616
39524 4827616 3323130 5593222 6772547 4277702 1057978 -7174 -696993 -3628770
39516 -3628770 -6669102 -5441068 -753369 1104414 -3102284 -8742202 -9722796 -6259144
39508 -6259144 -2479881 775198 5458935 10037977 9834084 4361403 -1056498 -2653243
39500 -2653243 -2437032 -3011472 -2991735 -714846 1625541 1489622 584125 1918314 4512637
39491 4512637 4957398 2643458 -146037 -2020999 -2967761 -2261542 664593 4026404 5414137
39482 5414137 5008749 4419650 3500749 1376587 -527435 11059 2163566 3156286 2713478
39473 2713478 2905103 3963322 4026937 3086553 3364318 5347797 7217036 8812573 12025575
$$ packed form
39533d439204J291616L864251L02503l108223K44835O079234N660913o91044m377265
39524D827616j504486K270092J179325k494845l219724j065152o89819k931777
39516c628770l040332J228034M687699J857783m206698n639918r80594L463652
39508f259144L779263L255079M683737M579042k03893n472681n417901j596745
39500b653243K16211n74440J9737K276889K340387j35919r05497J334189K594323
39491D512637M44761k313940k789495j874962r46762P06219K926135L361811J387733
39482E414137m05388n89099r18901k124162j904022N38494K152507R92720m42808
39473B713478J91625J058219O3615r40384K77765J983479J869239J595537L213002
$$ plain form
39464 12025575 15916026 15785048 9781147 2975377 1442760 4549095 6623883 4915605
39456 4915605 2231847 1860566 3235542 3839141 3225994 3249339 4920783 6751067 6809464
39447 6809464 5450389 4708941 5184442 5216641 3860768 2924769 4377982 7007951 7911509
39438 7911509 6711906 5855350 6750758 8145488 8989916 10567935 14315218 18991060 21693904
39429 21693904 21331159 20113060 21498540 26713298 33203470 37061726 37455636 37766555
39421 37766555 41522802 48641322 57471410 69021371 85756801 105931646 122126184
39414 122126184 126849173 118172896 99628386 76944099 55830675 40386577 31192210
39407 31192210 25416522 19960249 14178510 9310309 6371840 5227093 4906473 4500692
$$ packed form
39464A2025575L890451j30978o003901o805770j532617L106335K074788j708278
39456D915605k683758l71281J374976O03599o13147K3345J671444J830284N8397
39447F809464j359075p41448M75501L2199j355873r35999J453213K629969R03558
39438G911509j199603q56556Q95408J394730Q44428J578019L747283M675842K702844
39429B1693904l62745j218099J385480N214758O490172L858256L93910L10919
39421C7766555L756247P118520Q830088J1549961J6735430K0174845J6194538
39414A22126184M722989q676277j8544510k2684287k1113424j5444098r194367
39407C1192210n775688n456273n781739m868201k938469j144747l20620m05781
$$ plain form
39399 4500692 4359914 5922011 9074517 10601409 7701925 2636115 644137 2829771
39391 2829771 4754506 3457803 1874472 3345095 5234212 2655289 -3130486 -5320486
39383 -5320486 -1160199 3645147 2446804 -3522686 -7174187 -5071471 -1248762 -912103
39375 -912103 -3521275 -4609216 -2669047 -578665 -99664 1103321 4936981 8644369
39367 8644369 8500545 5637839 4184944 4778980 4290840 1546906 -1508465 -4774634 -10785090
39358 -10785090 -18675921 -22486302 -18808677 -12118387 -8690961 -8543991 -7621981 -5160416
39350 -5160416 -3845361 -4088261 -3154333 -31321 2707790 2357596 -1240862 -6223869 -9543037
39341 -9543037 -8293873 -3140527 647720 -1030825 -5207384 -5474376 -811159 3495241
$$ packed form
39399D500692j40778J562097L152506J526892k899484n065810j991978K185634
39391B829771J924735j296703j583331J470623J889117k578923n785775k190000
39383e320486M160287M805346j198343n969490l651501K102716L822709L36659
39375i12103k609172j087941J940169K090382M79001J202985L833660L707388
39367H644369j43824k862706j452895N94036m88140k743934l055371l266169o010456
39358a0785090p890831l810381L677625O690290L427426J46970R22010K461565
39350e160416J315055k42900R33928L123012K739111l50194l598458m983007l319168
39341i543037J249164N153346L788247j678545m176559k66992M663217M306400
$$ plain form
39333 3495241 3549618 786249 -2339159 -5689805 -8861271 -9755345 -8158154 -7038424 -7760860
39324 -7760860 -7472924 -4155798 -1075469 -2582778 -7668189 -11292276 -10744921 -7494176
39316 -7494176 -3855616 -1030355 94935 -882161 -2803609 -3987004 -4164079 -4013386 -3659926
39307 -3659926 -3233818 -3650769 -4766782 -4063000 191435 5364359 6947896 4234110 670544
39298 670544 -1271746 -2471946 -3928214 -4274973 -2095180 1292942 3006649 1640435
39290 1640435 -1632114 -4126448 -3587642 -246394 2883919 2964790 526935 -1660408 -2492755
39281 -2492755 -3212746 -4323838 -4484043 -3162699 -1903069 -1792153 -1838319 -1104698 -407234
39272 -407234 -597595 -1227579 -2251044 -4644801 -7547258 -7458811 -3037992 1591610 1798525
$$ packed form
39333C495241N4377k763369l125408l350646l171466q94074J597191J119730p22436
39324g760860K87936L317126L080329j507309n085411l624087N47355L250745
39316g494176L638560K825261J125290r77096j921448j183395j77075J50693L53460
39307c659926M26108m16951j116013P03782M254435N172924J583537k713786l563566
39298F70544j942290j200200j456268l46759K179793L388122J713707j366214
39290A640435l272549k494334N38806L341248L130313Q0871k437855k187343q32347
39281b492755p19991j111092j60205J321344J259630J10916m6166P33621O97464
39272d07234j90361o29984j023465k393757k902457Q8447M420819M629602K06915
$$ plain form
39263 1798525 -921969 -1246682 1930906 4262253 3095810 1353858 2483939 5229544
39255 5229544 6155718 4936041 4195970 5387312 7326349 8201655 7199971 4788198 2886162
39246 2886162 3787299 7170650 9234983 6990546 2587231 726649 2179810 3120185
39238 3120185 1439461 165164 2561552 6765142 8504765 7416368 6888961 8151580
39230 8151580 8516564 6324693 3835213 3081508 2044482 -1779811 -6162128 -6612587 -3383292
39221 -3383292 -1684853 -4108738 -6776351 -5147368 -595738 1829346 419267 -1648209
39213 -1648209 -1224184 1186698 3021362 2760872 765136 -1621280 -3147956 -3550257 -3551988
39204 -3551988 -3526078 -2585055 162701 3918144 6738286 7364076 5658744 2101573 -1766697
$$ packed form
39263A798525k720494l24713L177588K331347j166443j741952J130081K745605
39255E229544R26174j219677p40071J191342J939037Q75306j001684k411773j902036
39246B886162R01137L383351K064333k244437m403315j860582J453161R40375
39238C120185j680724j274297K396388M203590J739623j088397n27407J262619
39230H151580L64984k191871k489480p53705j037026l824293m382317m50459L229295
39221c383292J698439k423885k667613J628983M551630K425084j410079k067476
39213a648209M24025K410882J834664k60490j995736k386416j526676m02301j731
39204c551988K5910R41023K747756L755443K820142O25790j705332l557171l868270
$$ plain form
39195 -1766697 -3221100 -629081 4306194 8177989 9454052 8807156 6620280 2792368
39187 2792368 -974201 -1758083 528270 2142508 232326 -3329153 -4629198 -2721307
39179 -2721307 67901 1737046 2183677 1483256 -1031729 -5091570 -8400948 -8770206 -7082247
39170 -7082247 -6700826 -9159098 -11459562 -9330236 -2968274 2593794 3485231 979741
39162 979741 -1913034 -4976471 -8871005 -10970721 -7745077 -1005367 2713466 140789
39154 140789 -4822514 -6507563 -3804296 303434 2779035 2481021 239374 -1619992
39146 -1619992 -1452143 -431989 -556528 -1017142 135182 1225439 -1304372 -5897347 -6417212
39137 -6417212 -1646132 1753591 -895037 -5252754 -5309612 -2390300 -1242580 -1858520 -1675622
$$ packed form
39195a766697j454403K592019M935275L871795J276063o46896k186876l827912
39187B792368l766569p83882K286353J614238j910182l561479j300045J907891
39179b721307K789208J669145M46631p00421k514985m059841l309378l69258J687959
39170g082247L81421k458272k300464K129326O361962N562068Q91437k505490
39162I79741k892775l063437l894534k099716L225644O739710L718833k572677
39154A40789m963303j685049K703267M107730K475601k98014k241647j859366
39146a619992J67849J020154j24539m60614J152324J090257k529811m592975n19865
39137f417212M771080L399723k648628m357717n6858K919312J147720o15940J82898
$$ plain form
39128 -1675622 -1987911 -4932380 -7120802 -4028076 1426926 2798693 1033473 2448104
39120 2448104 6189965 3849813 -6236476 -14038911 -11778336 -4820955 -2834065 -6341247
39112 -6341247 -8638914 -6740157 -3735290 -2519238 -2786914 -3296280 -3152222 -1816034 -621275
39103 -621275 -2487544 -7424261 -10616290 -8147202 -2533461 706597 42329 -1901289
39095 -1901289 -3359284 -4847548 -6577052 -7850830 -8576295 -8836390 -7776958 -5195197
39087 -5195197 -2975598 -2486093 -1958767 816129 4576501 6347699 5876447 5072739 3964964
39078 3964964 723674 -4498811 -8896607 -10301898 -8632964 -4392645 1382002 5698337
39070 5698337 5260236 487941 -4207949 -4959024 -1877552 2032135 3748803 2081981
$$ packed form
39128a675622l12289k944469k188422L092726N455002J371767j765220J414631
39120B448104L741861k340152j0086289p802435K260575O957381J986890l507182
39112f341247k297667J898757L004867J216052k67676n09366J44058J336188J194759
39103f21275j866269m936717l192029K469088N613741L240058o64268j943618
39095a901289j457995j488264j729504j273778p25465k60095J059432K581761
39087e195197K219599M89505N27326K774896L760372J771198m71252q03708j107775
39078C964964l241290n222485m397796j405291J668934M240319N774647M316335
39070E698337m38101m772295m695890p51075L081472L909687J716668j666822
$$ plain form
39062 2081981 -1636866 -4592783 -5377476 -5250295 -5254165 -3642147 1155481 6097825 5748012
39053 5748012 -724200 -7990554 -10999041 -10211325 -9180812 -9533233 -10365003 -10865810 -11167055
39044 -11167055 -11007989 -9255059 -5183710 94207 3608502 2604601 -2270462 -6193459
39036 -6193459 -4327081 2672978 8697159 8560891 3271127 -1917759 -3509269 -2300563
39028 -2300563 -560180 1080093 2890006 3762082 1977200 -1606113 -3384344 -1511700
39020 -1511700 1000441 -138954 -4712551 -8334466 -8256053 -5962584 -3669972 -1379387
39012 -1379387 1295102 3097054 2758931 729788 -2069733 -5101916 -6704714 -4617910
39004 -4617910 129061 2832758 1106105 -1558216 -1022311 1685891 3315953 4124353
$$ packed form
39062B081981l718847k955917p84693J27181l870J612018M797628M942344l49813
39053E748012o472212p266354l008487P87716J030513l52421q31770n00807l01245
39044a1167055J59066J752930M071349N277917L514295j003901m875063l922997
39036f193459J866378P000059O024181j36268n289764n188886j591510J208706
39028b300563J740383J640273J809913Q72076j784882l583313j778231J872644
39020a511700K512141j139395m573597l621915P8413K293469K292612K290585
39012a379387K674489J801952l38123k029143k799521l032183j602798K086804
39004d617910M746971K703697j726653k664321N35905K708202J630062Q08400
$$ plain form
38996 4124353 5980712 7074914 4148350 -986477 -2919376 -741564 871240 -447712
38988 -447712 -1287898 1100121 3895969 3439445 1149930 979952 3110372 3708943 364629
38979 364629 -4607482 -6488451 -3039901 2846292 5828493 4255015 2335218 4321425
38971 4321425 8359426 9562998 7696553 6875590 7969784 7056610 2583361 -1680732
38963 -1680732 -3042592 -3582230 -4381260 -1866801 5462089 11785652 11335189 7142317 6063444
38954 6063444 8153670 8075129 4995807 3181758 3254177 1070153 -3493584 -4707674 -862128
38945 -862128 1447981 -2557581 -7758949 -7001778 -2090562 -42668 -1641487 -1332526 2622560
38936 2622560 5400012 3871917 1032857 19689 -728735 -3285813 -5785110 -5873380 -5118047
$$ packed form
38996D124353J856359J094202k926564n134827j932899K177812J612804j318952
38988d47712q40186K388019K795848m56524k289515j69978K130420N98571l344314
38979C64629m972111j880969L448550N886193K982201j573478j919797J986207
38971D321425M038001J203572j866445q20963J094194r13174m473249m264093
38963a680732j361860n39638p99030K514459P328890O323563m50463m192872j078873
38954F063444K090226p8541l079322j814049P2419k184024m563737j214090L845546
38945h62128K310109m005562n201368P57171M911216K047894j598819L08961L955086
38936B622560K777452j528095k839060j013168p48424k557078k499297q8270P55333
$$ plain form
38927 -5118047 -5948694 -6858347 -5016441 -1963484 -2125197 -6121553 -9664695 -9420583 -6548932
38918 -6548932 -3965989 -3227544 -4686321 -7617677 -9273602 -6766748 -1154153 2935166
38910 2935166 2990070 1440949 1525819 2982626 3600375 2692357 1009174 -914727 -2470414
38901 -2470414 -2710451 -1910811 -1610585 -1906498 -1142892 335096 -634180 -4729663 -7399156
38892 -7399156 -4894100 -242878 991846 -1213548 -2278133 -875012 -830450 -4858156
38884 -4858156 -10491170 -13186647 -10678129 -3951584 3502257 7405734 6170471 2570424
38876 2570424 45741 -1418910 -3271740 -4393144 -3120633 -1667916 -3650765 -7899977
38868 -7899977 -9721515 -8067633 -6289797 -5689846 -3953815 -810515 553112 -622947
$$ packed form
38927e118047q30647r09653J841906L052957j61713l996356l543142K44112K871651
38918f548932K582943P38445j458777k931356j655925K506854N612595M089319
38910B935166N4904j549121Q4870J456807O17749r08018j683183j923901j555687
38901b470414k40037P99640L00226k95913P63606J477988r69276m095483k669493
38892g399156K505056M651222J234724k205394j064585J403121M4562m027706
38884d858156n633014k695477K508518O726545P453841L903477j235263l600047
38876B570424k524683j464651j852830j121404J272511J452717j982849m249212
38868g899977j821538J653882J777836N99951J736031L143300J363627j176059
$$ plain form
38860 -622947 -935136 848670 1113787 -2177701 -5513126 -5591041 -4335164 -4425872 -4201811
38851 -4201811 -1357462 1858673 1737051 -1165618 -3513576 -4315024 -4957027 -6092854 -7683008
38842 -7683008 -10098768 -12356514 -11689803 -7718417 -4234375 -3788371 -3705482 -1066163 1861394
38833 1861394 1781142 851840 3431213 8258133 9602110 5481367 -353310 -4349427 -6462758
38824 -6462758 -7595247 -7948469 -8130107 -8289496 -6218050 169110 8489686 13300230 11824537
38815 11824537 5624069 -2492973 -9902304 -13460789 -11348253 -5664036 -219451 3715463
38807 3715463 6716944 7878995 6144721 3823458 4388643 7238701 8649330 7239594
38799 7239594 4373247 215001 -5619536 -10145558 -9367032 -4869763 -2671421 -4721356
$$ packed form
38860f22947l12189J783806K65117l291488l335425p7915J255877r0708K24061
38851d201811K844349L216135j21622k902669k347958q01448o42003j135827j590154
38842g683008k415760k257746O66711L971386L484042M46004Q2889K639319K927557
38833A861394q0252r29302K579373M826920J343977m120743n834677l996117k113331
38824f462758j132489l53222j81638j59389K071446O387160Q320576M810544j475693
38815A1824537o200468q117042p409331l558485K112536N684217N444585L934914
38807C715463L001481J162051j734274k321263N65185K850058J410629j409736
38799G239594k866347m158246n834537m526022P78526M497269K198342k049935
$$ plain form
38791 -4721356 -6727316 -5466192 -3089648 -2653190 -4114212 -6371182 -8935911 -10335798
38783 -10335798 -9258855 -8140756 -10652287 -14831621 -14537810 -9052979 -4735913 -4954106
38775 -4954106 -5358049 -2473211 236762 -345735 -550294 2963806 5567541 1617890 -5363153
38766 -5363153 -7443899 -4220050 -1909962 -2368301 -1415609 1979594 2985421 -697475
38758 -697475 -4259246 -2612308 2682850 6187940 5324176 2121568 165499 1188200
38750 1188200 3551812 3947775 1528636 -978879 -1954574 -4200777 -10158819 -16044441
38742 -16044441 -15680106 -9332017 -3666708 -2853337 -4553205 -5149824 -3889762 -745723
38734 -745723 4620903 9593411 8983368 1725331 -6346835 -9323707 -7751831 -5591916
$$ packed form
38791d721356k005960J261124K376544M36458j461022k256970k564729j399887
38783a0335798J076943J118099k511531m179334K93811N484831M317066k18193
38775d954106m03943K884838K709973n82497k04559L514100K603735l949651o981043
38766e363153k080746L223849K310088m58339R52692L395203J005827l682896
38758f97475l561771J646938N295158L505090q63764l202608j956069J022701
38750A188200K363612L95963k419139k507515r75695k246203n958042n885622
38742a6044441L64335O348089N665309Q13371j699868n96619J260062L144039
38734g45723N366626M972508o10043p258037q072166k976872J571876K159915
$$ plain form
38726 -5591916 -3912407 -1312082 1721670 3079043 2809865 3110040 4573177 5175854 3326057
38717 3326057 2040 -2456008 -2349963 624579 5334164 9496469 10684391 7682193
38709 7682193 1507504 -4399091 -5940721 -2088609 3315022 5380783 3809547 2479087
38701 2479087 3357214 4025331 2378284 288995 95025 343771 -1500174 -4020112 -3497099
38692 -3497099 5292 1903281 -1106837 -7226953 -11992922 -12323118 -8067610 -2057232
38684 -2057232 1016692 -1629080 -7434046 -11098470 -11112078 -10748795 -11629640 -10305978 -4322596
38675 -4322596 1627258 625562 -6395947 -10713835 -6919744 573223 4379882 3555349
38667 3555349 2462025 2953178 2670630 673429 -135990 2181397 4994441 4878116 2695687
$$ packed form
38726e591916J679509K600325L033752J357373k69178L00175J463137O02677j849797
38717C326057l324017k458048J06045K974542M709585M162305J187922l002198
38709G682193o174689n906595j541630L852112N403631K065761j571236j330460
38701B479087Q78127O68117j647047k089289j93970K48746j843945k519938N23013
38692c497099L502391J897989l010118o120116m765969l30196M255508O010378
38684b057232L073924k645772n804966l664424j3608L63283q80845J323662N983382
38675d322596N949854j001696p021509m317888L794091P492967L806659q24533
38667C555349j093324M91153k82548j997201q09419K317387K813044j16325k182429
$$ plain form
38658 2695687 2012373 3559135 4126623 1042425 -4341357 -8247876 -8408546 -5905670 -3638860
38649 -3638860 -3172401 -3141001 -1326771 1834700 3384270 2060259 378777 929909 2484920
38640 2484920 2184380 127754 -1254753 -1524820 -2404538 -3720964 -2956216 293869 2984806
38631 2984806 3282887 3212888 4469139 4711379 1201732 -4032500 -6201929 -3820487 376521
38622 376521 3703292 5365237 4466666 76041 -5684876 -7871962 -4142437 1851258
38614 1851258 4343506 1610393 -3219514 -6388318 -6703241 -4999675 -2401530 262248
38606 262248 2375339 3627199 3858927 2645167 -246267 -3525505 -4541162 -2240677
38598 -2240677 397798 -947621 -6001045 -8877814 -5232459 1107284 1938167 -5045777
$$ packed form
38658B695687o83314J546762N67488l084198n383782l906519j60670K502876K266810
38649c638860M66459L1400J814230L161471J549570j324011j681482N51132J555011
38640B484920l00540k056626j382507k70067q79718j316426P64748L250085K690937
38631B984806K98081o9999J256251K42240l509647n234232k169429K381442M197008
38622C76521L326771J661945q98571m390625n760917k187086L729525N993695
38614A851258K492248k733113m829907l168804l14923J703566K598145K663778
38606B62248K113091J251860K31728j213760k891434l279238j015657K300485
38598b240677K638475j345419n053424k876769L645355O339743Q30883o983944
$$ plain form
38590 -5045777 -13240931 -15391810 -11580692 -6995863 -4713435 -3910946 -3419365 -3212332 -2584352
38581 -2584352 -112364 3829904 6698683 6625466 4169033 1055317 -1319625 -2148390 -1656639
38572 -1656639 -1333405 -2090115 -2381874 -158690 3480639 5148633 4063003 3290934 5022156
38563 5022156 7281706 7093509 4589519 1726280 -1168935 -4738961 -7585322 -7031463
38555 -7031463 -3008943 1286276 3187502 3075912 2464887 1520886 -106665 -1305668 -350950
38546 -350950 2316589 3795276 2035032 -1372914 -2727312 -326055 3781965 6053996
38538 6053996 4615106 363861 -3723603 -4272269 -371653 4337867 4361990 -1314000 -7393312
38529 -7393312 -8758100 -6778908 -6171858 -7425681 -6761264 -3023844 436302 1609766
$$ packed form
38590e045777q195154k150879L811118M584829K282428Q02489M91581K07033O27980
38581b584352K471988L942268K868779p3217k456433l113716k374942q28765M91751
38572a656639L23234p56710k91759K223184L639329J667994j085630p72069J731222
38563E022156K259550j88197k503990k863239k895215l570026k846361N53859
38555g031463M022520M295219J901226j11590o11025r44001j627551j199003R54718
38546c50950K667539J478687j760244l407946j354398K401257M108020K272031
38538F053996j438890m251245m087464n48666L900616M709520K4123n675990o079312
38529g393312j364788J979192O07050j253823O64417L737420L460146J173464
$$ plain form
38521 1609766 2606491 4732234 5679030 4595059 5193677 9343242 11548725 5812284 -4243749
38512 -4243749 -8728185 -4692877 368047 -347946 -4052074 -3782420 1403900 5928491
38504 5928491 5682678 2757495 1988080 5001325 8720463 9339283 6941567 5047663 5392618
38495 5392618 5296053 2028899 -2435429 -4469586 -5016320 -7857768 -11786268 -10385267 -1788567
38486 -1788567 6805247 8390787 5635078 5889832 9719469 10692352 5658724 -1129676
38478 -1129676 -5109444 -6893953 -8276938 -7590232 -2889244 3298279 6528810 6148581
38470 6148581 4771176 3204446 -32567 -4173169 -5362889 -1927062 2595635 3855699
38462 3855699 2024439 479879 812311 1758833 2196159 2387771 2254641 911058 -1367798
$$ packed form
38521A609766R96725K125743R46796j083971N98618M149565K205483n736441j0056033
38512d243749m484436M035308N060924p15993l704128K69654N186320M524591
38504E928491k45813k925183p69415L013245L719138O18820k397716j893904L44955
38495E392618r6565l267154m464328k034157n46734k841448l928500J401001Q596700
38486a788567Q593814J585540k755709K54754L829637R72883n033628o788400
38478a129676l979768j784509j382985O86706M700988O187523L230531l80229
38470F148581j377405j566730l237013m140602j189720L435827M522697J260064
38462C855699j831260j544560L32432R46522M37326J91612j33130j343583k278856
$$ plain form
38453 -1367798 -2504021 -798323 3235904 7395397 9139722 6936868 2075103 -1264667
38445 -1264667 -149213 2965494 3007449 -751622 -4102998 -4852376 -5651409 -7691245 -6708924
38436 -6708924 170448 7548071 7758456 1769446 -2153897 -71472 3531336 3880224
38428 3880224 2175578 1720114 2765788 3916282 4831172 4919099 2569752 -1833803 -4971048
38419 -4971048 -4875856 -3467004 -2859774 -2238828 -653694 352996 -185082 85579 3184418
38410 3184418 6816241 7463428 5490540 3887199 3756804 4326223 5597789 7429103 7585495
38401 7585495 4515209 840589 267416 2071293 2669615 1804728 2585353 5398788 6525521
38392 6525521 4036274 1063394 1201132 3470434 3928571 633327 -4446075 -7510351
$$ packed form
38453a367798j136223J705698M034227M159493J744325k202854m861765l339770
38445a264667J115454L114707M1955l759071l351376p49378p99033k039836R82321
38436f708924O879372P377623K10385n989010l923343K082425L602808L48888
38428C880224j704646m55464J045674J150494R14890Q7927k349347m403555l137245
38419d971048R5192J408852O07230O20946J585134J006690n38078K70661L098839
38410C184418L631823O47187j972888j603341j30395N69419J271566J831314J56392
38401G585495l070286l674620n73173J803877N98322q64887P80625K813435J126733
38392F525521k489247k972880J37738K269302M58137l295244n079402l064276
$$ plain form
38384 -7510351 -6407687 -2852882 -793436 -1587766 -2257868 -384518 1496160 -102744
38376 -102744 -3130145 -2574490 1100124 1979911 -1822826 -4666124 -2032592 2537000 3072014
38367 3072014 -334101 -3175044 -3736155 -3844583 -4219458 -3827168 -3180756 -4040157 -5853475
38358 -5853475 -6150845 -4699982 -3913770 -4669762 -4947749 -3447541 -1457756 232575 3389181
38349 3389181 9102320 14544670 15678980 12498311 9212778 9009085 10316971 9066215
38341 9066215 3852531 -2000718 -3616353 517877 7178395 12058346 14138140 15529413
38333 15529413 17412864 18016033 15578644 11732751 9869872 10636484 11285049 9824673
38325 9824673 7558979 6321232 5232750 2395074 -1291716 -2526466 157808 4472463
$$ packed form
38384g510351J102664L554805K059446p94330o70102J873350J880678j598904
38376a02744l027401N55655L674614Q79787l802737k843298K633532M569592N35014
38367C072014l406115k840943n61111j08428l74875L92290O46412q59401j813318
38358e853475k97370J450863P86212p55992k77987J500208J989785J690331L156606
38349C389181N713139N442350J134310l180669l285533k03693J307886j250756
38341I066215n213684n853249j615635M134230O660518M879951K079794J391273
38333A5529413J883451O03169k437389l845893j862879P66612O48565j460376
38325I824673k265694j237747j088482k837676l686790j234750K684274M314655
$$ plain form
38317 4472463 6956282 6055333 2662718 -840314 -2096456 -934258 114301 -837730
38309 -837730 -1790611 395867 4454585 5671424 3053532 1359036 4048825 8205027
38301 8205027 9436262 8324276 8157344 9036797 8715693 7560312 8109625 10451101 12083420
38292 12083420 11938184 10888606 8849637 5266230 2210298 2951101 7021873 10132073
38284 10132073 9443339 6133588 2937760 2044672 4567041 8532548 8596104 2350974 -4070378
38275 -4070378 -2450027 5553695 9421549 4021278 -3762521 -5152078 63870 6684201
38267 6684201 11760818 14446549 13188943 8585001 5557858 7506029 11007575 11002127 8387084
38258 8387084 7434089 8237669 7433015 4928765 4266080 6620372 9227001 9770602 8429359
$$ packed form
38317D472463K483819r00949l392615l503032j256142J162198J048559r52031
38309h37730r52881K186478M058718J216839k617892j694496K689789M156202
38301H205027J231235j111986j66932Q79453l21104j155381N49313K341476J632319
38292A2083420j45236j049578k038969l583407l055932P40803M070772L110200
38284A0132073o88734l309751l195828q93088K522369L965507O3556o245130o421352
38275d070378J620351Q003722L867854n400271p783799j389557N215948O620331
38267F684201N076617K685731j257606m603942l027143J948171L501546n448k615043
38258H387084r52995Q03580q04654k504250o62685K354292K606629N43601j341243
$$ plain form
38249 8429359 5982794 3685127 4244045 8693811 12856111 11478099 5821596 2434372
38241 2434372 3893117 5627920 3394766 -649837 -1878382 278625 2839385 4244553
38233 4244553 5767162 8495292 11101045 11221223 8489152 5569431 5412315 7507670
38225 7507670 8423769 6688647 4936022 5633292 7109419 6487176 4546819 4337895 6287451
38216 6287451 8103552 8601254 8378501 7751638 7393764 9601068 14787530 18077647 14545697
38207 14545697 7253041 4290929 7513697 10485312 9107178 7626271 10698731 15407940
38199 15407940 16236270 13880267 13605113 17096827 20846085 21385033 18161736 12427691
38191 12427691 7020751 6063835 10868016 16773214 17995174 15337047 15030746 19689288
$$ packed form
38249H429359k446565k297667N58918M449766M162300j378012n656503l387224
38241B434372J458745J734803k233154m044603j228545K157007K560760J405168
38233D244553J522609K728130K605753J20178k732071k919721j57116K095355
38225G507670R16099j735122j752625O97270J476127o22243j940357k08924J949556
38216F287451J816101M97702k22753o26863l57874K207304N186462L290117l531950
38207A4545697p292656k962112L222768K971615j378134j480907L072460M709209
38199A5407940Q28330k356003k75154L491714L749258N38948l223297n734045
38191A2427691n406940r56916M804181N905198J221960k658127l06301M658542
$$ plain form
38183 19689288 24842748 25936778 24577504 24859180 26594146 26327259 23794539 22928140
38175 22928140 25729636 28913654 28771661 26583681 26098867 27453515 27628927 26479378
38167 26479378 27590254 31785657 34413888 32320453 29827082 33138469 40947307 45761797
38159 45761797 43933866 39375686 36927208 36794400 36940158 36790170 36446536 35489120 34672947
38150 34672947 36035326 39312225 40931510 38819831 35854784 36100519 39507885 42794854
38142 42794854 44103227 44344048 44814653 45607905 46128324 45961398 45446261 45603186 46634228
38133 46634228 46884974 45151626 43602748 45597607 50582090 54574759 56191436 58145413
38125 58145413 61617195 63730024 62901705 62263898 64765915 69134515 74041185 81510451
$$ packed form
38183A9689288N153460J094030j359274K81676J734966k66887k532720q66399
38175B2928140K801496L184018j41993k187980m84814J354648J75412j149549
38167B6479378J110876M195403K628231k093435k493371L311387P808838M814490
38159D5761797j827931m558180k448478j32808J45758j49988l43634r57416q16173
38150C4672947J362379L276899J619285k111679k965047K45735L407366L286969
38142D2794854J308373K40821M70605P93252N20419j66926n15137J56925J031042
38133D6634228K50746j733348j548878J994859M984483L992669J616677J953977
38125E8145413L471782K112829q28319o37807K502017M368600M906670P469266
$$ plain form
38117 81510451 91595377 98513060 98504995 97780026 104945221 117876809 126739555 129409792
38109 129409792 134476546 147022855 160541825 167564988 170899909 177904591 188624742
38102 188624742 196697601 199417103 200084352 200970067 199976938 195441260 189722238 185880347
38094 185880347 183457019 179563264 172778665 164536726 157420527 153088270 151392674 150594153
38086 150594153 148275665 142599221 133506531 123256943 115338033 111735412 110945581 109332138
38078 109332138 104681644 97963228 91710053 87402415 84307862 80056923 72592583 62588521
38070 62588521 53709467 49315369 49138397 50304914 50845952 50414461 48468718 44601354
38062 44601354 40555489 38872045 39190697 38997567 38306614 39497207 41463378 39083506
$$ packed form
38117H1510451J0084926O917683q065p24969P165195J2931588Q862746K670237
38109A29409792N066754J2546309J3518970P023163L334921P004682J0720151
38102A88624742Q072859K719502O67249Q85715r93129m535678n719022l841891
38094A85880347k423328l893755o784599q241939p116199m332257j695596p98521
38086A50594153k318488n676444r092690j0249588p918910l602621p89831j613443
38078A09332138m650494o718416o253175m307638l094553m250939p464340j0004062
38070F2588521q879054m394098j76972J166517N41038m31491j945743l867364
38062D4601354m045865j683444L18652j93130o90953J190593J966171k379872
$$ plain form
38054 39083506 31485307 25822071 27963476 33427232 33733490 28914437 26230678 27587888
38046 27587888 26757046 20649670 15166130 15852607 19537330 20703856 20745222 24105191 28780084
38037 28780084 28213254 21494290 14805044 12472520 12626457 12663496 13251953 14943604 15837812
38028 15837812 15298819 15936928 19122287 22058419 22117671 20749340 20023176 18559566 14697867
38019 14697867 11097563 11818152 16207224 19633973 19505957 17224027 15064124 14417359
38011 14417359 16235197 19786269 21632956 19187722 14607521 11855991 11054361 9840384
38003 9840384 9141536 12055000 16793732 16826394 10153284 3296711 3068691 8527500 14310633
37994 14310633 18136598 20966777 22441686 20675660 15837036 10810245 8522049 10106463
$$ packed form
38054C9083506p598199n663236K141405N463756L06258m819053k683759J357210
38046B7587888q30842o107376n483540O86477L684723J166526M1366L359969M674893
38037B8780084n66830o718964o689246k332524J53937L7039N88457J691651Q94208
38028A5837812n38993O38109L185359K936132N9252j368331p26164j463610l861699
38019A4697867l600304P20589M389072L426749j28016k281930k159903o46765
38011A4417359J817838L551072J846687k445234m580201k751530q01630j213977
38003I840384o98848K913464M738732L2662o673110o856573k28020N458809N783133
37994A4310633L825965K830179J474909j766026m838624n026791k288196J584414
$$ plain form
37986 10106463 14402695 17801430 16526166 11069882 6650160 7275109 11020505 13097306
37978 13097306 11840092 9640360 9550762 12772747 17847910 20849698 18483582 12485068
37970 12485068 8435814 8778961 10288944 10262420 10896648 14327688 17713747 17815261 16751945
37961 16751945 17931913 19442438 17487737 13929621 13807289 16870780 18402182 17724854
37953 17724854 18770971 21843400 21964070 17163849 12185804 11517525 13841010 15672681
37945 15672681 15953964 14949423 12855702 11426687 12968835 16163661 16949275 14701348
37937 14701348 12973539 13052859 12184586 9854984 9935358 13937005 17826591 18731306 19287144
37928 19287144 21777148 23621572 23075453 23992963 29653265 36405519 38937189 37965157
$$ packed form
37986A0106463M296232L398735j275264n456284m419722O24949L745396K076801
37978A3097306j257214k199732q9598L221985N075163L001788k366116n998514
37970A2485068m049254L43147J509983k6524O34228L431040L386059J01514j063316
37961A6751945J179968J510525j954701l558116j22332L063491J531402o77328
37953A7724854J046117L072429J20670m800221m978045o68279K323485J831671
37945A5672681K81283j004541k093721j429015J542148L194826P85614k247927
37937A4701348j727809P9320q68273k329602Q0374M001647L889586R04715N55838
37928A9287144K490004J844424n46119R17510N660302O752254K531670r72032
$$ plain form
37920 37965157 37408098 37847419 38403404 41185588 47511775 53005020 53182974 51187142 52941414
37911 52941414 56919351 56373899 50542413 45875351 46101813 48286106 49512458 50881235
37903 50881235 53587418 56843599 61042729 67892507 76542896 84532878 92906769 104978924
37895 104978924 119931149 134007983 148718739 170643635 201058677 232766789 260194168
37888 260194168 285831804 312684828 336748398 352390410 360574430 366683319 374239248
37881 374239248 385611708 404370007 429934660 451713515 454972926 433201489 391744170
37874 391744170 341005085 290212973 246176397 212187529 186236553 163193836 140328006
37867 140328006 119600445 104405141 95223461 88631915 80250606 69099482 58655492
$$ packed form
37920C7965157n57059M39321N55985K782184O326187N493245J77954j995832J754272
37911E2941414L977937n45452n831486m667062K26462K184293J226352J368777
37903E0881235K706183L256181M199130O849778Q650389P989982Q373891J2072155
37895A04978924J4952225J4076834J4710756K1924896L0415042L1708112K7427379
37888B60194168K5637636K6853024K4063570J5642012Q184020O108889P555929
37881C74239248J1372460J8758299K5564653K1778855L259411k1771437m1457319
37874C91744170n0739085n0792112m4036576l3988868k5950976k3042717k2865830
37867A40328006k0727561j5195304r181680o591546q381309j1151124j0443990
$$ plain form
37860 58655492 52254957 48441652 43713527 38898218 38018941 40414877 39783671 33331507
37852 33331507 26255104 23725763 23979490 23917080 25886806 32232284 37389990 33545489
37844 33545489 22326791 13234612 11125112 12556989 14477018 18487179 24329824 26316197
37836 26316197 20509913 11010391 5160707 5403880 8935631 12816761 16118549 18364848
37828 18364848 18768157 17218579 14970187 14103868 15809796 18541600 18932349 15871067
37820 15871067 12325290 11361254 12182241 12588812 13136749 15155070 16490487 13862286 8517104
37811 8517104 4874358 4211291 4522183 5835204 9780596 13921274 13225337 8614864 7516647
37802 7516647 13353090 20426719 22382526 20248217 18500921 18347701 18997196 20843058
$$ packed form
37860E8655492o400535l813305m728125m815309q79277K395936o31206o452164
37852C3331507p076403k529341K53727o2410J969726O345478N157706l844501
37844C3545489j1218698r092179k109500J431877J920029M010161N842645J986373
37836B6316197n806284r499522n849684K43173L531751L881130L301788K246299
37828A8364848M03309j549578k248392q66319J705928K731804L90749l061282
37820A5871067l545777r64036Q20987M06571N47937K018321J335417k628201n345182
37811H517104l642746o63067L10892J313021L945392M140678o95937m610473j098217
37802G516647N836443P073629J955807k134309j747296j53220O49495J845862
$$ plain form
37794 20843058 22882336 21210440 14793731 8936161 8265696 10000646 9242500 7204009
37786 7204009 8230718 11781245 14075036 15678396 20439239 27647490 32078358 32302949
37778 32302949 32986568 37933395 46149790 56120172 69106790 86126846 104993577 121632834
37770 121632834 131592146 130409929 116769578 96252662 78007028 66176196 57608969
37763 57608969 48610087 40027701 34245991 30901443 27925543 24504338 21389662 20112395
37755 20112395 22407178 27893866 31996171 29424894 20698712 12142302 8408221 8098994
37747 8098994 7773412 6746940 6217766 6746048 8516468 11609674 14615665 15488688 14647060
37738 14647060 14168668 13299644 8912640 1787377 -2261528 19925 4982969 8131867
$$ packed form
37794B0843058K039278j671896o416709n857570o70465J734950p58146k038491
37786G204009J026709L550527K293791J603360M760843P208251M430868K24591
37778C2302949O83619M946827Q216395R970382J2986618J7020056J8866731J6639257
37770A21632834R959312j182217j3640351k0516916j8245634j1830832q567227
37763E7608969q998882q582386n781710l344548k975900l421205l114676j277267
37755B0112395K294783N486688M102305k571277q726182q556410l734081l09227
37747H098994l25582j026472n29174N28282J770420L093206L005991Q73023q41628
37738A4647060m78392q69024m387004p125263m048905K281453M963044L148898
$$ plain form
37730 8131867 9937662 12058244 12526820 9679345 7009688 8410422 11380882 10759311
37722 10759311 6981502 4631520 4560587 3888428 2725487 3976324 6612929 6322930 3748014
37713 3748014 4744002 10303455 13546875 10482551 7008708 9811189 15761151 17082369
37705 17082369 13469622 11687929 14524818 17332063 16261276 13811782 13900971 15801296
37697 15801296 15808635 12285472 6759424 1912684 189213 2456091 6188131 6781367 2954755
37688 2954755 -491868 1961148 8950650 12996460 9612005 3014314 818860 4742091
37680 4742091 9307093 9353713 5710570 2257805 222544 -1682187 -2900722 -779800
37672 -779800 4575096 8547030 7350032 3149190 1397889 4202032 8692992 11216980
$$ packed form
37730H131867J805795K120582M68576k847475k669657J400734K970460o21571
37722A0759311l777809k349982p0933o72159j162941J250837K636605k89999k574916
37713C748014R95988N559453L243420l064324l473843K802481N949962J321218
37705A7082369l612747j781693K836889K807245j070787k449494Q9189J900325
37697A5801296P339l523163n526048m846740j723471K266878L732040N93236l826612
37688B954755l446623K453016O989502M045810l384455o597691k195454L923231
37680D742091M565002M6620l643143l452765k035261j904731j218535K120922
37672g79800N354896L971934j196998m200842j751301K804143M490960K523988
$$ plain form
37664 11216980 10611338 7675129 4129475 2412435 3938774 6887126 8069011 7556923
37656 7556923 8510070 11345306 11909432 8231948 5460297 9241178 16160354 16729016 8299366
37647 8299366 -641994 -1399195 4267722 7964082 5931133 2027524 748463 1715673
37639 1715673 1952103 717417 255813 2477187 5984309 7001361 3725621 -867967
37631 -867967 -2141888 525541 3571487 5005880 6950445 10868176 13851809 12651400
37623 12651400 8507208 4462469 522017 -4250440 -7158978 -4792992 596627 3225185
37615 3225185 2034974 1255328 2574258 3005891 1850011 3160881 8291777 11959919
37607 11959919 9989495 6069190 5882513 8408118 8429106 4914814 1468418 187512
$$ packed form
37664A1216980o05642k936209l545654j717040J526339K948352J181885n12088
37656G556923R53147K835236N64126l677484k771651L780881O919176N68662q429650
37647H299366q941360p57201N666917L696360k032949l903609j279061R67210
37639A715673K36430j234686m61604K221374L507122J017052l275740m593588
37631h67967j273921K667429L045946J434393J944565L917731K983633j200409
37623A2651400m144192m044739l940452m772457k908538K365986N389619K628558
37615C225185j190211p79646J318930M31633j155880J310870N130896L668142
37607A1959919j970424l920305j86677K525605K0988l514292l446396j280906
$$ plain form
37599 187512 209479 1279268 3926559 6607146 7089326 6514151 8072701 11741772 14202529
37590 14202529 14061970 13336331 13340180 12744963 10535807 7740048 5334800 3204134 1953512
37581 1953512 3109562 6540113 9828343 11059708 10634932 10089404 10616445 12330619 13250848
37572 13250848 10126390 2845431 -3194531 -2554752 3149073 7359117 7197204 5658993
37564 5658993 5399005 5425554 4955827 5501892 7171780 7410880 5682781 5043349 6463449
37555 6463449 6115871 1874714 -1608822 1153133 8547358 14674616 17882541 21458150
37547 21458150 27069693 32647397 36868106 41374798 47678470 55127762 62675728 69724079
37539 69724079 74348311 73395034 65867600 54775407 44694903 38366263 35642906 34266280
$$ packed form
37599A87512K1967J069789K647291K680587M82180n75175J558550L669071K460757
37590A4202529j40559p25639L849n95217k209156k795759k405248k130666j250622
37581A953512J156050L430551L288230J231365m24776n45528N27041J714174R20229
37572A3250848l124458p280959o039962O39779N703825M210044j61913j538211
37564E658993k59988K6549m69727N46065J669888K39100j728099o39432J420100
37555F463449l47578m241157l483536K761955P394225O127258L207925L575609
37547B1458150N611543N577704M220709M506692O303672P449292P547966P048351
37539F9724079M624232r53277p527434j1092193j0080504o328640k723357j376626
$$ plain form
37531 34266280 31416526 25954153 19686847 15562034 14445734 14429012 13147309 9905628
37523 9905628 5723300 2213348 377975 -59421 70632 855805 3027789 5854197 6914404
37514 6914404 5126303 2591144 1960553 3114548 3922517 3178479 1268129 -920256 -2188043
37505 -2188043 -1428545 478406 708078 -1537440 -2831735 -15694 4643937 6192673
37497 6192673 3999482 2322908 4038146 7449042 9686990 9755918 7593588 3827296
37489 3827296 1668141 5218615 13638412 20132831 19526038 14474235 11279227 11575132
37481 11575132 11650107 8914081 5230485 3430962 3584929 4027557 4095150 4229063 4350158
37472 4350158 3705717 2341462 1686053 3039954 5747400 7623891 7573719 7137090 8502450
$$ packed form
37531C4266280k849754n462373o267306m124813j116300j6722j281703l241681
37523I905628m182328l509952j835373m37396J30053P85173K171984K826408J060207
37514F914404j788101k535159o30591J153995Q07969p44038j910350k188385j267787
37505b188043P59498J906951K29672k245518j294295K816041M659631J548736
37497F192673k193191j676574J715238L410896K237948O8928k162330l766292
37489C827296k159155L550474Q419797O494419o06793n051803l195008K95905
37481A1575132P4975k736026l683596j799523J53967M42628O7593J33913J21095
37472D350158o44441j364255o55409J353901K707446J876491n0172m36629J365360
$$ plain form
37463 8502450 11251795 12395398 10048011 5915694 3260944 3159532 3844978 3423303 2063931
37454 2063931 1214557 1514850 2287133 2886104 3612473 4718688 5152576 3530629 511535
37445 511535 -1124219 297557 2860871 3007050 -318841 -4501858 -6152403 -4271648
37437 -4271648 -497064 2972134 5319946 7272979 9579349 11666926 12313124 11359651
37429 11359651 9692482 7559702 4453768 1046924 -662396 -176800 351825 -784877
37421 -784877 -2407263 -2842836 -2892892 -4057807 -5369992 -4726248 -2237545 437952 2881752
37412 2881752 5053798 5050050 1589965 -2124859 -1529931 2366283 3891907 1247555 -851535
37403 -851535 1225042 4734822 5833743 5840514 8182756 12019710 13240102 10335947 5662139
$$ packed form
37463H502450K749345J143603k347387m132317k654750j01412O85446m21675j359372
37454B063931q49374L00293P72283N98971P26369J106215M33888j621947l019094
37445E11535j635754J421776K563314J46179l325891m183017j650545J880755
37437d271648L774584L469198K347812J953033K306370K087577O46198r53473
37429A1359651j667169k132780l105934l406844j709320M85596N28625j136702
37421g84877j622386m35573n0056j164915j312185O43744K488703K675497K443800
37412B881752K172046l748l460085l714824N94928L896214J525624k644352k099090
37403h51535K076577L509780J098921O771K342242L836954J220392k904155m673808
$$ plain form
37394 5662139 1801024 -256916 -134564 1768749 3465138 3160324 1728761 1615066 3611223
37385 3611223 6255197 7964894 8495630 8863374 10676527 14464523 17967960 17861342 14240644
37376 14240644 11270812 11900399 14311651 15638764 16735464 20384042 26567291 32611829
37368 32611829 37078665 41035900 46269246 54082453 64997358 79004466 98456701 130533538
37360 130533538 180428053 237971609 277151022 277135543 242302630 195546028 154518371
37353 154518371 121993875 96626806 80845921 74444524 70105508 62029257 53414036
37346 53414036 49606038 48513837 44128687 36424189 31120865 30528745 30339097 26301032
37338 26301032 20012845 16373333 17327590 19783257 19567701 16673418 15228682 17464783
$$ packed form
37394E662139l861115k057940J22352J903313J696389l04814j431563j13695J996157
37385C611223K643974J709697N30736L67744J813153L787996L503437j06618l620698
37376A4240644k969832O29587K411252J327113J096700L648578O183249O044538
37368C2611829M466836L957235N233346P813207J0914905J4007108J9452235L2076837
37360A30533538M9894515N7543556L9179413j5479l4832913m6756602m1027657
37353A54518371l2524496k5367069j5780885o401397m339016q076251q615221
37346E3414036l807998j092201m385150p704498n303324n92120j89648m038065
37338B6301032o288187l639512R54257K455667k15556k894283j444736K236101
$$ plain form
37330 17464783 19893619 18345499 14802741 14324929 16040280 13688350 6274768 1140334
37322 1140334 3087304 6974895 6098989 2281468 1355189 3110935 3041265 1193616 1624607
37313 1624607 4292573 4795586 2130304 116999 588177 1292475 1449744 3391842 7155836
37304 7155836 9063666 7741391 6458153 7191468 7258118 4647025 2213066 3169419 6001906
37295 6001906 7230034 6255110 4414710 2106482 -61400 -75961 2223532 3352843 1184247
37286 1184247 -872761 1120689 4673662 4049188 -575052 -2687721 1058112 5959870
37278 5959870 6160324 2666767 1295020 4725701 9886164 12601709 12038061 10046386
37270 10046386 8193128 6832705 6208343 6792276 8153647 8547510 6521109 2565621
$$ packed form
37330A7464783K428836j548120l542758m77812J715351k351930p413582n134434
37322A140334J946970L887591q75906l817521r26279J755746o9670j847649M30991
37313A624607K667966N03013k665282k013305M71178P04298J57269J942098L763994
37304G155836J907830j322275j283238P33315O6650k611093k433959R56353K832487
37295F001906J228128r74924j840400k308228k167882j4561K299493J129311k168596
37286A184247k057008J993450L552973o24474m624240k112669L745833M901758
37278E959870K00454l493557j371747L430681N160463K715545n63648j991675
37270A0046386j853258j360423o24362N83933J361371L93863k026401l955488
$$ plain form
37262 2565621 -1442236 -3885945 -3678158 176961 7335804 14437256 16885703 13445973
37254 13445973 7746530 4258801 4018287 5202514 6265225 6776593 6390170 5229042
37246 5229042 4924043 7121129 10690031 12179482 9659376 4852572 993288 -150780
37238 -150780 1368468 4663128 8063272 9395373 7970394 5813455 5310577 6064224 6061322
37229 6061322 5721171 7909613 12982895 16937403 16977700 16524830 21196605 31117224 40866780
37220 40866780 46113054 46071281 40112940 27841585 13974834 7119367 9956430 15034092
37212 15034092 14310120 9010718 5727580 6714364 9521393 12815295 15910200 14881506
37204 14881506 6689670 -3607746 -7276392 -3774454 -779727 -1592536 -785049 5059188
$$ packed form
37262B565621m007857k443709K07787L855119P158843P101452K448447l439730
37254A3445973n699443l487729k40514J184227J062711N11368l86423j161128
37246E229042l04999K197086L568902J489451k520106m806804l859284j144068
37238a50780J519248L294660L400144J332101j424979k156939n02878P53647k902
37229F061322l40151K188442N073282L954508M0297m52870M671775R920619R749556
37220D0866780N246274m1773n958341j2271355j3866751o855467K837063N077662
37212A5034092p23972n299402l283138R86784K807029L293902L094905j028694
37204A4881506q191836j0297416l668646L501938K994727q12809Q07487N844237
$$ plain form
37196 5059188 10627218 10632461 8219752 8617011 10049141 7863621 3680218 3147615 6788493
37187 6788493 9876120 10453532 11285243 13797819 15482043 14222206 11115914 8062515
37179 8062515 5603911 3662180 1980191 -115240 -2299078 -2470936 221939 2948831
37171 2948831 2783297 1360923 2439512 5974598 8608606 9262442 9745085 9830459 6531770
37162 6531770 -374227 -6049147 -5890315 -614742 5409208 8731870 8543105 5920049
37154 5920049 2857187 997257 616099 1430795 3783969 7637071 11279300 12983673
37146 12983673 13109770 12499116 10070156 4885100 -437580 -1802855 1311199 6041583
37138 6041583 10529067 14266221 14899029 9864740 1902180 -2225735 -390644 2053415
$$ packed form
37196E059188N568030N243k412709L97259J432130k185520m183403n32603L640878
37187F788493L087627N77412Q31711K512576J684224j259837l106292l053399
37179H062515k458604j941731j681989k095431k183838j71858K692875K726892
37171B948831j65534j422374J078589L535086K634008O53836M82643Q5374l298689
37162F531770o905997n674920J58832N275573O023950L322662j88765k623056
37154E920049l062862j859930l81158Q14696K353174L853102L642229J704373
37146A2983673J26097o10654k428960n185056n322680j365275L114054M730384
37138F041583M487484L737154O32808n034289p962560m127915J835091K444059
$$ plain form
37130 2053415 461117 -2476828 -1842070 1304885 1550452 -2407909 -5344943 -2300571
37122 -2300571 4864368 9349885 7362820 2824096 2688857 7751424 11112832 7768988
37114 7768988 2214956 1896148 5618064 5317229 -849407 -4920937 -1046723 6178939
37106 6178939 9630715 9751305 10881295 12251503 9755920 4192326 728053 938490
37098 938490 1542973 992632 1490377 3721937 4989369 4124528 3511465 4277219 3927136
37089 3927136 1448635 758360 5260594 11637575 13333786 9154253 4450980 3675628
37081 3675628 5279733 5278766 3202426 2194783 4249000 7522820 8572912 5932624 1149669
37072 1149669 -2670361 -2935364 691557 5710530 8652392 8445715 7361533 7802561 9076827
$$ packed form
37130B053415j592298k937945O34758L146955K45567l958361k937034L044372
37122b300571P164939M485517j987065m538724j35239N062567L361408l343844
37114G768988n554032l18808L721916l00835o166636m071530L874214P225662
37106F178939L451776J20590J129990J370208k495583n563594l464273K10437
37098I38490O04483n50341M97745K231560J267432q64841o13063P65754l50083
37089C927136k478501o90275M502234O376981J696211m179533m703273p75352
37081C675628J604105r67k076340j007643K054217L273820J050092k640288m782955
37072A149669l820030k65003L626921N018973K941862k06677j084182M41028J274266
$$ plain form
37063 9076827 8723175 6207229 3317663 1173630 -905057 -3147483 -4087010 -2535687
37055 -2535687 810442 4697301 8783402 12813976 15873897 17924789 21093067 27972697
37047 27972697 38976201 51910738 63175206 68778473 65974476 55849903 43492435
37040 43492435 33620278 26305049 18822933 11413034 8361353 11937058 17566721 18150622
37032 18150622 12815952 8097165 9216207 13328920 14359053 12206311 12454657 17187977
37024 17187977 21274706 19744101 14544397 10819855 9813057 9230370 8131834 7241499
37016 7241499 5975351 3386784 1294009 2595275 6763892 10281601 11158351 10158741
37008 10158741 8469945 7239645 8202554 11258489 12649413 9271143 3491321 -176845
$$ packed form
37063I076827l53652k515946k889566k144033k078687k242426r39527J551323
37055b535687L346129L886859M086101M030574L059921K050892L168278O879630
37047B7972697J1003504J2934537J1264468N603267k803997j0124573j2357468
37040D3492435r872157p315229p482116p409899l051681L575705N629663N83901
37032A8150622n334670m718787J119042M112713J030133k152742K48346M733320
37024A7187977M086729j530605n199704l724542j006798n82687j098536q90335
37016G241499j266148k588567k092775J301266M168617L517709Q76750r99610
37008A0158741j688796j230300R62909L055935J390924l378270n779822l668166
$$ plain form
37000 -176845 -1400880 -2545181 -3069432 -1087648 1344594 1073374 593339 4687481 11298920
36991 11298920 13824360 12060547 11950653 14372261 14348661 12494298 15760218 24216803
36983 24216803 29994303 34205496 50367668 81459145 106761562 105204533 82653700
36976 82653700 61719694 51724796 44606889 35768513 30915682 31555849 29894459 22423779
36968 22423779 16039093 15845488 17319352 15437447 12412781 11303573 10085269 7415481
36960 7415481 7159592 11509715 15425204 13473735 7595623 3129955 1212886 -156598
36952 -156598 -1061269 -474835 305042 -826806 -3333178 -4985017 -4784275 -2948798 167997
36943 167997 3401573 4852454 4057463 2505265 1413791 921142 1426864 3121921 4352871
$$ packed form
37000a76845j224035j144301n24251J981784K432242k71220m80035M094142O611439
36991A1298920K525440j763813j09894K421608k3600j854363L265920Q456585
36983B4216803N777500M211193J6162172L1091477K5302417j557029k2550833
36976H2653700k0934006r994898p117907q838376m852831O40167j661390p470680
36968B2423779o384686j93605J473864j881905l024666j109208j218304k669788
36960G415481k55889M350123L915489j951469n878112m465668j917069j369484
36952a56598r04671N86434P79877j131848k506372j651839K00742J835477L116795
36943A67997L233576J450881p94991j552198j091474m92649N05722J695057J230950
$$ plain form
36934 4352871 3456615 1902243 2298942 3987595 4593506 4984033 7585082 10357036 8527104
36925 8527104 2707378 -1045415 -326749 974735 695633 2008131 6207946 8764760
36917 8764760 6651991 3808834 4912555 8684549 11548441 13146042 14003103 12382907
36909 12382907 7879324 3882596 2474458 1519988 681236 4338904 13050689 18212723
36901 18212723 12822890 3009405 430643 6271964 11537602 11428226 10165739 11305659
36893 11305659 12030635 9359565 5134369 2031975 -37673 -1124869 321154 3631538
36885 3631538 4763499 1768623 -1896619 -2055549 964213 4016966 5517778 5912262
36877 5912262 5859677 6039352 7180821 8715267 9056171 8520787 9785558 13505711 15658864
$$ packed form
36934D352871q96256j554372L96699J688653O05911L90527K601049K771954j829932
36925H527104n819726l752793P18666J301484k79102J312498M199815K556814
36917H764760k112769k843157J103721L771994K863892J597601Q57061j620196
36909A2382907m503583l996728j408138r54470q38752L657668Q711785N162034
36901A8212723n389833r813485k578762N841321N265638j09376j262487J139920
36893A1305659P24976k671070m225196l102394k069648j087196J446023L310384
36885C631538J131961k994876l665242j58930L019762L052753J500812L94484
36877E912262n2585J79675J141469J534446L40904n35384J264771L720153K153153
$$ plain form
36868 15658864 12223138 5337179 1376843 2773326 5117169 3847375 783501 861582
36860 861582 4037861 4802517 348893 -4961360 -5716453 -2737810 -645098 -401604 1227890
36851 1227890 5571221 9854778 11414848 10301217 7271257 2944320 -475264 -508833
36843 -508833 1708376 2651464 2175214 3559233 6724130 6777348 1815208 -2979026 -2618229
36834 -2618229 706943 1935299 521136 -904171 -1919589 -3621196 -5060507 -4832764
36826 -4832764 -4048897 -3722645 -1858747 2393654 4603161 698352 -5310467 -5494882 881623
36817 881623 6476532 6247561 3026686 1764194 3345667 5832698 7660179 7651400 5030759
36808 5030759 1056835 -1790987 -3079214 -4390301 -5796824 -5539314 -3743171 -2879076
$$ packed form
36868A5658864l435726o885959l960336J396483K343843j269794l063874P8081
36860H61582L176279P64656m453624n310253p55093K978643K092712K43494J629494
36851A227890M343331M283557J560070j113631l029960m326937l419584l3569
36843e08833K217209R43088m76250J384019L164897N3218m962140m794234L60797
36834b618229L325172J228356j414163j425307j015418j701607j439311K27743
36826d832764P83867L26252J863898M252401K209507l904809o008819j84415O376505
36817H81623N594909k28971l220875j262492J581473K487031J827481q779k620641
36808E030759l973924k847822j288227j311087j406523K57510J796143Q64095
$$ plain form
36800 -2879076 -3296474 -1857721 2871902 7096682 6406398 2158316 146597 3305982
36792 3305982 8361095 10392821 8802606 7036846 7138680 7090335 4744692 2162285 3035183
36783 3035183 6604469 7815809 4150405 -1124359 -3782500 -3401855 -1581604 1191124
36775 1191124 4308783 5511204 3559931 505274 -1051234 -961920 14786 2024782 4231790
36766 4231790 4156781 1398716 -1033429 -1468422 -1980625 -3475399 -2996253 428135 2262128
36757 2262128 -412769 -3256020 -1967267 -161274 -2709162 -5915581 -3275418 2467665
36749 2467665 3208976 -509458 -479444 4161735 4502546 -2932653 -9369593 -7075895 -540532
36740 -540532 1580135 -1314171 -3770433 -3175055 -848426 1693498 2682258 -36688 -4871235
$$ packed form
36800b879076m17398J438753M729623M224780o90284m248082k011719L159385
36792C305982N055113K031726j590215j765760J01834m8345k345643k582407Q72898
36783C035183L569286J211340l665404n274764k658141L80645J820251K772728
36775A191124L117659J202421j951273l054657j556508Q9314R76706K009996K207008
36766D231790p5009k758065k432145m34993n12203j494774M79146L424388J833993
36757B262128k674897k843251J288753J805993k547888l206419K640163N743083
36749B467665P41311l718434L0014M641179L40811p435199o436940K293698O535363
36740e40532K120667k894306k456262N95378K326629K541924R88760k718946m834547
$$ plain form
36731 -4871235 -6047065 -1474950 2848720 801546 -5184539 -8309942 -7047230 -5140535
36723 -5140535 -4218371 -2178679 1649305 4665933 4864427 3120442 1087439 -675796
36715 -675796 -1996043 -2379380 -1690857 -730116 -671972 -1649956 -1717048 1551892 7217725
36706 7217725 10612499 9355809 7661247 10559351 15485401 15219099 8765344 2877165
36698 2877165 1740157 1792646 -768915 -3677832 -3439568 -1104916 822470 2599216 4439440
36689 4439440 4105291 1527994 1252680 5417197 8613566 5402877 -656572 -1758915
36681 -1758915 2897312 7016474 6930828 5146294 4468977 4373032 4112873 4835577 7000325
36672 7000325 8655879 7623074 3874032 -547616 -3088036 -2878028 -1949763 -2570113 -3033771
$$ packed form
36731d871235j175830M572115M323670k047174n986085l125403J262712J906695
36723e140535R22164K039692L827984L016628J98494j743985k033003j763235
36715f75796j320247l83337O88523R60741N8144r77984o7092L268940N665833
36706G217725L394774j256690j694562K898104M926050k66302o453755n888179
36698B877165j137008N2489k561561k908917K38264K334652J927386J776746J840224
36689D439440l34149k577297k75314M164517L196369l210689o059449j102343
36681a758915M656227M119162q5646j784534o77317r5945k60159P22704K164748
36672G000325J655554j032805l749042m421648k540420K10008R28265o20350m63658
$$ plain form
36663 -3033771 656409 7855739 12390771 11007790 8053632 8206799 9381703 7749000
36655 7749000 5205479 5417067 6007770 2258934 -3402883 -3582139 2685512 8165994 7937933
36646 7937933 4874976 2991373 1639491 -959583 -3572757 -4542703 -4806090 -5608143 -6159458
36637 -6159458 -5693450 -5078329 -4460684 -1886811 3843246 11046069 17285246 21576970 23402940
36628 23402940 21893340 17486527 12608093 9468421 8554988 9697875 12524546 15125018
36620 15125018 14564735 10245329 5388464 3846018 6049145 8764981 8495152 5029241
36612 5029241 1749550 1722787 3475318 2501682 -2393032 -6958587 -7330233 -4913801 -2780512
36603 -2780512 -410684 3989519 8542970 9848826 8305929 6461128 3746881 -1573156
$$ packed form
36663c033771L690180P199330M535032j382981k954158J53167J174904j632703
36655G749000k543521K11588N90703l748836n661817j79256O267651N480482k28061
36646G937933l062957j883603j351882k599074k613174r69946k63387q02053n51315
36637f159458M66008O15121O17645K573873N730057P202823O239177M291724J825970
36628B3402940j509600m406813m878434l139672r13433J142887K826671K600472
36620A5125018n60283m319406m856865j542446K203127K715836k69829l465911
36612E029241l279691k6763J752531r73636m894714m565555l71646K416432K133289
36603b780512K369828M400203M553451J305856j542897j844801k714247n320037
$$ plain form
36595 -1573156 -6442767 -5469998 556520 4933875 4654926 3499936 4153057 3831896 523109
36586 523109 -2439847 -1800884 470341 1346197 1910209 4385341 7505337 8798782 8614850
36577 8614850 8280903 6956159 3842528 1078924 1007789 2659843 3915564 4852217 6088552
36568 6088552 6422186 5245736 4666169 5866195 6091243 3099734 76038 1680395 6933388
36559 6933388 10339321 8963547 4730492 1055194 644383 4690894 10286921 10837175
36551 10837175 3836854 -3745690 -3393776 3266710 7156627 5221060 3548794 6132416
36543 6132416 8681088 7065532 4818605 6942544 11470425 13210650 12414572 13478163
36535 13478163 16797341 17861253 14281676 8912868 5558335 5505138 8747179 14710103
$$ packed form
36595a573156m869611R72769O026518M377355k78949j154990O53121l21161l308787
36586E23109k962956O38963K271225Q75856N64012K475132L119996J293445j83932
36577H614850l33947j324744l113631k763604p1135J652054J255721R36653J236335
36568F088552L33634j176450n79567J200026K25048k991509l023696J604357N252993
36559F933388L405933j375774m233055l675298m10811M046511N596027N50254
36551A0837175p000321p582544L51914O660486L889917j935567j672266K583622
36543F132416K548672j615556k246927K123939M527881J740225p96078J063591
36535A3478163L319178J063912l579577n368808l354533n3197L242041N962924
$$ plain form
36527 14710103 20516776 21915371 17990713 12898607 11199271 12991240 15133553 15860091
36519 15860091 16309526 18034175 20633217 22161897 21221668 18417272 15826946 14935070
36511 14935070 15243582 15283352 14608999 13902166 13324691 12177868 10648394 10509532 12936768
36502 12936768 16425960 18219921 17544350 16157611 15590051 15153074 13463972 11061251
36494 11061251 10176100 11830588 14286374 15145361 14440433 14615001 17410606 21738520 25053325
36485 25053325 26032374 25260389 24021035 23427655 24279391 26497637 28696405 29470990 29273454
36476 29273454 29782414 31022850 30559717 26696155 21474263 18836884 19910385 21656308
36468 21656308 20854067 18307321 17796328 21113534 25679786 27863304 27375356 26679204 26828961
$$ packed form
36527A4710103N806673J398595l924658n092106j699336J791969K142313P26538
36519A5860091M49435J724649K599042J528680r40229k804396k590326q91876
36511A4935070L08512L9770o74353p06833n77475j146823j529474j38862K427236
36502A2936768L489192J793961o75571j386739n67560m36977j689102k402721
36494A1061251q85151J654488K455786Q58987p04928J74568K795605M327914L314805
36485B5053325R79049p71985j239354n93380Q51736K218246K198768P74585j97536
36476B9273454N08960J240436m63133l863562n221892k637379J073501J745923
36468B1656308q02241k546746n10993L317206M566252K183518m87948o96152J49757
$$ plain form
36459 26828961 26593641 26004995 27362112 30760616 31985550 28509939 24974826 27601259
36451 27601259 34578428 38280582 37125591 37831771 43397643 46583534 41069834 32981422
36443 32981422 33282968 42069520 49107529 49082937 47667310 50975153 56773739 59708319
36435 59708319 59386136 58817099 58654275 57280383 54405185 51194383 48298214 46184265
36427 46184265 45952171 47703797 49324071 48559524 45386894 41525574 38926577 39029588
36419 39029588 41557660 43779406 43173595 40751910 38980881 36962162 31915206 25592803
36411 25592803 23833648 28007427 32234794 31943289 30165649 31647862 35343990 37343150
36403 37343150 37424431 37738864 38081779 37535060 38103812 41348231 43560977 40019685 32778212
$$ packed form
36459B6828961k35320n88646J357117L398504J224934l475611l535113K626433
36451B7601259O977169L702154j154991P06180N565872L185891n513700q088412
36443C2981422L01546Q786552P038009k4592j415627L307843N798586K934580
36435E9708319l22183n69037j62824j373892k875198l210802k896169k113949
36427D6184265k32094J751626J620274p64547l172630l861320k598997J03011
36419C9029588K528072K221746o05811k421685j771029k018719n046956o322403
36411B5592803j759155M173779M227367k91505j777640J482213L696128J999160
36403C7343150Q1281L14433L42915n46719N68752L244419K212746l541292p241473
$$ plain form
36394 32778212 28604961 29661563 31543772 30700041 28804878 28864764 31047966 33530840
36386 33530840 34543361 32977302 29342955 26065068 24779449 24320225 23597996 24385198
36378 24385198 27849422 30569322 28666146 24441137 23727301 27252681 29867264 28468837
36370 28468837 25719071 25214233 27339966 30606353 33203188 32949384 29555279 26785818
36362 26785818 28226765 31407907 30925157 26826574 24254859 25006730 25964133 26368358 29244751
36353 29244751 33731783 33660016 27325092 21718443 22414994 25420006 24471962 20978972 20294564
36344 20294564 22326107 22863347 21630560 21996008 23728544 22586112 17511764 12797858
36336 12797858 11850744 13103673 13816557 14527829 17260584 21056125 21956653 17945199 12611372
$$ packed form
36394C2778212m173251J056602J882209q43731j895163N9886K183202K482874
36386C3530840J012521j566059l634347l277887j285619m59224p22229P87202
36378B4385198L464224K719900j903176m225009p13836L525380K614583j398427
36370B8468837k749766n04838K125733L266387K596835k53804l394105k769461
36362B6785818J440947L181142m82750m098583k571715P51871R57403M04225K876393
36353B9244751M487032p1767o334924n606649O96551L005012r48044l492990o84408
36344B0294564K031543N37240j232787L65448J732536j142432n074348m713906
36336A2797858r47114J252929P12884P11272K732755L795541R00528m011454n333827
$$ plain form
36327 12611372 12112472 17895410 24331331 25535453 22715714 21441702 23058516 23634561
36319 23634561 21278846 18926095 18496873 17789924 15581076 14504177 15557984 14809981
36311 14809981 9911421 5557836 7352814 13439884 17392227 17015077 15264535 14316175
36303 14316175 13747077 13494580 14057016 14350676 13094705 11478722 11101383 10602374 8005668
36294 8005668 5114006 5656166 9889753 14556192 17286089 17814396 16246635 13802222
36286 13802222 13848881 17997125 22063662 20128680 12235811 4358045 1196077 2502418
36278 2502418 5766506 8739893 9729730 8833492 8370175 9264101 8716271 4998928 2106349
36269 2106349 4604079 9839884 11319187 8666980 7579538 10140074 12333596 12099328
$$ packed form
36327A2611372m98900N782938O435921J204122k819739j274012J616814N76045
36319B3634561k355715k352751m29222p06949k208848j076899J053807p48003
36311A4809981m898560m353585J794978O087070L952343l77150j750542r48360
36303A4316175n69098k52497N62436K93660j255971j615983l77339m99009k596706
36294H005668k891662N42160M233587M666439K729897N28307j567761k444413
36286A3802222M6659M148244M066537j934982p892869p877766l161968J306341
36278B502418L264088K973387R89837q96238m63317Q93926n47830l717343k892579
36269B106349K497730N235805J479303k652207j087442K560536K193522k34268
$$ plain form
36261 12099328 12536539 14784924 14652390 10074024 6155657 8231437 14132852 17764676
36253 17764676 17092198 14452758 11616213 8719323 6581270 6587251 8822706 12182810 15309517
36244 15309517 16476581 14546901 11093156 9255065 9524063 9353359 7867580 7619316
36236 7619316 10175815 13324870 14525022 14026761 12892708 11277208 10366520 12238969
36228 12238969 15747824 16569256 13736517 11846438 14003880 17297848 18772619 20656489
36220 20656489 24681143 26149803 20322371 11316880 7521056 10159724 13352785 14078893
36212 14078893 14670441 15682348 13910712 9048460 5794224 6897104 9274647 9468501
36204 9468501 8509413 8912182 10629264 12369198 13836881 14712094 14120280 12549251 11718779
$$ packed form
36261A2099328M37211K248385j32534m578366l918367K075780N901415L631824
36253A7764676o72478k639440k836545k896890k138053N981K235455L360104L126707
36244A5309517J167064j929680l453745j838091K68998j70704j485779k48264
36236G619316K556499L149055J200152m98261j134053j615500r10688J872449
36228A2238969L508855Q21432k832739j890079K157442L293968J474771J883870
36220B0656489M024654J468660n827432r005491l795824K638668L193061P26108
36212A4078893N91548J011907j771636m862252l254236J102880K377543J93854
36204I468501r59088M02769J717082J739934J467683Q75213n91814j571029q30472
$$ plain form
36195 11718779 11771020 11435772 11166379 12468510 14009539 12895666 10195727 9819177 10930356
36186 10930356 7891405 174854 -4435343 -744745 5853895 7652063 5529359 5173139
36178 5173139 6888936 6824484 5640196 7936239 13724289 17639818 17082121 15036110 14021860
36169 14021860 12719073 9817594 6693521 5133996 5895863 9517665 14926788 18134375
36161 18134375 16739542 14476067 15997384 18760817 16950899 12264696 12074426 16438414
36153 16438414 16854446 10651803 6462203 10246946 15421271 14186434 10457001 12392962
36145 12392962 18255782 19721421 15307156 10668985 8124815 5649329 4931307 10475406
36137 10475406 20056080 25012279 22064653 17606919 18129434 22523627 25821638 25171756
$$ packed form
36195A1718779N2241l35248k69393J302131J541029j113873k699939l76550J111179
36186A0930356l038951p716551m610197L690598O598640J798168k122704l56220
36178E173139J715797o4452j184288K296043N788050L915529n57697k046011j014250
36169A4021860j302787k901479l124073j559525P61867L621802N409123L207587
36161A8134375j394833k263475J521317K763433j809918m686203j90270M363988
36153A6438414M16032o202643m189600L784743N174325j234837l729433J935961
36145A2392962N862820J465639m414265m638171k544170k475486p18022N544099
36137A0475406R580674M956199k947626m457734N22515M394193L298011o49882
$$ plain form
36129 25171756 20522131 14205047 10728640 12292354 14618775 12643578 9435355 12200354
36121 12200354 19673107 22480808 17908010 14974257 20733231 29925063 33834323 32388584
36113 32388584 31064059 31414062 31473175 31573815 33393061 35885805 37283853 38685311 41551023
36104 41551023 44547761 46554369 49257157 53024347 54334997 51574582 49151360 51231183
36096 51231183 55697275 59145414 62961840 68628394 72060531 69908478 67360579 71630402
36088 71630402 80699697 86685382 87987493 89628848 93237948 95556570 96309276 98871803
36080 98871803 102807561 103895385 102229217 102412850 104947788 105525598 104077568 106070580
36072 106070580 112602992 117469114 117149312 115924732 117420099 118640523 116964482 116084696
$$ packed form
36129B5171756m649625o317084l476407J563714K326421j975197l208223K764999
36121A2200354P472753K807701m572798k933753N758974R191832L909260j445739
36113C2388584j324525L50003N9113J00640J819246K492744J398048J401458K865712
36104D1551023K996738K006608K702788L767190J310650k760415k423222K079823
36096E1231183M466092L448139L816426N666554L432137k152053k547899M269823
36088G1630402R069295N985685J302111J641355L609100K318622P52706K562527
36080I8871803L935758J087824j666168J83633K534938N77810j448030J993012
36072A06070580O532412M866122l19802j224580J495367J220424j676041q79786
$$ plain form
36064 116084696 119511756 123907305 124540737 122693062 122170461 122450950 120613660 116800380
36056 116800380 112879847 108587375 103454761 99800534 99572235 100807815 101001650 101039995
36048 101039995 101992342 101340720 96865946 91302895 88435580 87202822 84429483 80855397
36040 80855397 79314969 79061154 77253679 74443945 73164503 72354502 68855827 63824805
36032 63824805 61944050 64055011 65826589 64311373 60901940 57106556 52511672 48284890
36024 48284890 47636748 50448082 51717019 48175590 42989374 40973751 42159464 43304117
36016 43304117 43244366 43024665 42334797 39808309 36434593 34962040 35393979 34416419 30699166
36007 30699166 27842203 29518559 33592207 34438422 30686337 27116424 27889955 31183780
$$ packed form
36064A16084696L427060M395549O33432j847675n22601K80489j837290l813280
36056A16800380l920533m292472n132614l654227k28299J235580J93835L8345
36048A01039995R52347o51622m474774n563051k867315j232758k773339l574086
36040H0855397j540428k53815j807475k809734j279442q10001l498675n031022
36032F3824805j880755K110961J771578j515216l409433l795384m594884m226782
36024D8284890o48142K811334J268937l541429n186216k015623J185713J144653
36016D3304117n9751k19701o89868k526488l373716j472553M31939r77560l717253
36007C0699166k856963J676356M073648Q46215l752085l569913P73531L293825
$$ plain form
35999 31183780 32784113 32245593 31985387 31917978 29384439 24497228 21406336 22820603 26398234
35990 26398234 28266664 27542671 25575683 23046860 20023826 17393648 16356217 17352396
35982 17352396 20262603 24149683 26391713 24563584 20134589 17485390 17967425 18251675
35974 18251675 16481991 16115699 20185487 25223941 25716258 22447263 21133366 23661261
35966 23661261 26100314 25786052 25144142 26666919 28415722 27389514 24476797 22896503
35958 22896503 23273542 23294678 21897029 21164201 23151491 26355126 26951736 23480117 18877459
35949 18877459 16966665 17986506 19265917 19657975 20739521 23248650 25158521 24748467
35941 24748467 23202511 22260342 21470225 20108707 19735225 21652200 23166692 20142802
$$ packed form
35999C1183780J600333n38520k60206o7409k533539m887211l090892J414267L577631
35990B6398234J868430p23993j966988k528823l023034k630178j037431R96179
35982A7352396K910207L887080K242030j828129m428995k649199M82035K84250
35974A8251675j769684l66292M069788N038454M92317l268995j313897K527895
35966B3661261K439053l14262o41910J522777J748803j026208k912717j580294
35958B2896503L77039K1136j397649p32828J987290L203635N96610l471619m602658
35949A8877459j910794J019841J279411L92058J081546K509129J909871m10054
35941B4748467j545956r42169p90117j361518l73482J916975J514492l023890
$$ plain form
35933 20142802 13297603 8632046 10566206 16856996 21410360 20678236 16440316 13323363
35925 13323363 14295865 18090594 20768718 19962389 17133272 15290548 15352356 15622026 14211725
35916 14211725 11125569 8359131 8283355 11142404 14100383 14208783 12430794 12580581 15738256
35907 15738256 18444833 17791593 15489488 14753503 15629964 16001163 15195654 13961690 12691410
35898 12691410 12256962 14598416 19563689 23188122 22467268 19985656 20078292 22127165 22064946
35889 22064946 19365105 17539186 17759697 17031693 13906194 11645906 13472714 17628515
35881 17628515 19570908 17589339 14468366 13998340 16561435 18502681 16730234 13564747
35873 13564747 14292772 19241608 22449154 20674679 18903334 22204418 26649580 25308758
$$ packed form
35933B0142802o845199m665557J934160O290790M553364p32124m237920l116953
35925A3323363R72502L794729K678124q06329k829117j842724O1808K69670j410301
35916A4211725l086156k766438p5776K859049K957979J08400j777989J49787L157675
35907A5738256K706577o53240k302105p35985Q76461L71199q05509j233964j270280
35898A2691410m34448K341454M965273L624433p20854k481612R2636K048873o2219
35889B2064946k699841j825919K20511p28004l125499k260288J826808M155801
35881A7628515J942393j981569l120973m70026K563095J941246j772447l165487
35873A3564747P28025M948836L207546j774475j771345L301084M445162j340822
$$ plain form
35865 25308758 20235586 19908494 25478627 28478705 23752691 16580223 14006798 16040050
35857 16040050 18977237 21312481 22348316 20275246 15818414 13356459 14729349 16258734
35849 16258734 15196170 14153280 15343519 15838325 13433737 12059974 15397547 19548207
35841 19548207 18794682 15172844 15073313 18747176 20718925 19370059 18590061 19990068 20660121
35832 20660121 19583127 19595980 21168889 20292921 15269374 10595958 10850645 14405947 16335128
35823 16335128 14819706 11869190 9716953 9032311 9538737 10607064 11763116 13121482
35815 13121482 14521652 14753646 13399773 12707120 14985522 18583748 19611933 17579120
35807 17579120 15777191 15802496 15768874 14957265 15788350 18950276 20674183 18198343 14785664
$$ packed form
35865B5308758n073172l27092N570133L000078m726014p172468k573425K033252
35857A6040050K937187K335244J035835k073070m456832k461955J372890J529385
35849A6258734j062564j042890J190239M94806k404588j373763L337573M150660
35841A9548207p53525l621838r9531L673863J971749j348866p79998J400007O70053
35832B0660121j076994J2853J572909q75968n023547m673416K54687L555302J929181
35823A6335128j515422k950516k152237o84642N06426J068327J156052J358366
35815A3121482J400170K31994j353873o92653K278402L598226J028185k032813
35807A7579120j801929K5305l3622q11609Q31085L161926J723907k475840l412679
$$ plain form
35798 14785664 15359105 19187687 21043087 18722022 15443707 14508392 14917747 13599140
35790 13599140 9928276 6482293 5971868 8351034 10938769 11102370 8557472 4887980
35782 4887980 1538334 -633949 -462441 2745721 7199852 9621518 9358842 9629036 13204142
35773 13204142 18449831 21374305 20413620 17428077 14862964 13700027 13730692 14379482 15437356
35764 15437356 17590022 21223420 24092196 22193603 14849041 7278731 5458583 9105075
35756 9105075 12303329 10902486 6945731 5556672 9344150 16157315 20865374 19376937
35748 19376937 12424214 5340678 2885187 4858300 8042522 10767780 12918549 13146859
35740 13146859 10457968 8234620 11563698 19127242 22621620 17134472 8069017 3969196
$$ packed form
35798A4785664N73441L828582J855400k321065l278315r35315M09355j318607
35790A3599140l670864l445983n10425K379166K587735J63601k544898l669492
35782D887980l349646k172283J71508L208162M454131K421666k62676K70194L575106
35773A3204142N245689K924474r60685k985543k565113j162937L0665O48790J057874
35764A5437356K152666L633398K868776j898593p344562p570310j820148L646492
35756I105075L198254j400843l956755j389059L787478O813165M708059j488437
35748A9376937o952723p083536k455491J973113L184222K725258K150769K28310
35740A3146859k688891k223348L329078P563544L494378n487148r065455m099821
$$ plain form
35732 3969196 5679895 7278249 5677500 3841909 4507402 5731148 4584609 2105565
35724 2105565 2163200 6588650 12981835 17155472 17322794 15755092 15725505 17034221 16495160
35715 16495160 13343044 11058600 11812559 12512400 10050890 7446705 9485832 14218647
35707 14218647 15267819 12169985 11327711 15432148 19206932 18655083 17517197 19721195
35699 19721195 21596854 18153801 12524656 11519244 14415118 14159158 8976650 4969003
35691 4969003 6087448 8558161 7832389 5309747 4698798 6013923 6948581 7336166 8840953
35682 8840953 12037351 16356122 21326066 25794381 27531163 25540078 21404447 17036557
35674 17036557 12981987 10194421 10735262 14362761 16860208 14776583 10027505 6638653
$$ packed form
35732C969196J710699J598354j600749j835591O65493J223746j146539k479044
35724B105565N7635M425450O393185M173637J67322j567702k9587J308716n39061
35715A6495160l152116k284444P53959O99841k461510k604185K039127M732815
35707A4218647J049172l097834q42274M104437L774784n51849j137886K203998
35699A9721195J875659l443053n629145j005412K895874k55960n182508m007647
35691D969003J118445K470713p25772k522642o10949J315125R34658L87585J504787
35682H840953L196398M318771M969944M468315J736782j991085m135631m367890
35674A7036557m054570k787566N40841L627499K497447k083625m749078l388852
$$ plain form
35666 6638653 4690405 1589297 -1590847 -108827 7014848 14081840 15841031 14174866
35658 14174866 14282214 16692098 17579529 16047075 15734108 17855920 17871529 12919177 8605166
35649 8605166 12336929 21360210 24464703 16995866 7502052 5744457 9907072 11519687
35641 11519687 8701389 6760242 7504044 6553311 2412674 383810 4064599 9113791
35633 9113791 9899618 7711305 7517025 9990235 11841307 11858533 11685035 11778702 11030549
35624 11030549 9782697 9282192 8557308 5666508 1979851 1437954 4985624 9026573
35616 9026573 10286372 9401609 8660045 8646091 8485910 7762084 7032291 7319825 9319027
35607 9319027 12152705 13382893 11775418 9438915 9235539 10690573 10947110 9297952
$$ packed form
35666F638653j948248l101108l180144J482020P123675P066992J759191j666165
35658A4174866J07348K409884Q87431j532454l12967K121812J5609m952352m314011
35649H605166L731763R023281L104493p468837r493814j757595M162615J612615
35641A1519687k818298j941147P43802r50733m140637k028864L680789N049192
35633I113791P85827k188313j94280K473210J851072J7226j73498R3667p48153
35624A1030549j247852n00505p24884k890800l686657n41897L547670M040949
35616I026573J259799q84763p41564j3954j60181p23826p29793K87534J999202
35607I319027K833678J230188j607475k336503k03376J455034K56537j649158
$$ plain form
35599 9297952 7709386 6883792 5415209 3668983 4627056 8847281 12027683 10653606
35591 10653606 7530451 7963082 11825799 13547939 10142873 5513428 5080710 8534423
35583 8534423 10357697 6884401 756977 -2183005 798298 7242135 13127434 16761400
35575 16761400 18338578 17527442 13925840 9417178 7203176 7612754 7322183 4341961
35567 4341961 1622152 3253654 8541789 12896574 14067938 14100393 14559849 13438637 9043659
35558 9043659 4228273 3245325 5528913 6479789 4764357 4884404 10366303 17507855 19472866
35549 19472866 15113087 9723187 7178299 5577997 2193164 -1122120 -669057 3153848
35541 3153848 6149826 5682397 2749030 -644701 -3004261 -2447829 2112596 7986180
$$ packed form
35599I297952j588566q25594j468583j746226R58073M220225L180402j374077
35591A0653606l123155M32631L862717J722140l405066m629445m32718L453713
35583H534423J823274l473296o127424k939982K981303O443837N885299L633966
35575A6761400J577178q11136l601602m508662k214002M09578k90571k980222
35567D341961k719809J631502N288135M354785J171364L2455M59456j121212m394978
35558I043659m815386r82948K283588R50876j715432J20047N481899P141552J965011
35549A9472866m359779n389900k544888j600302l384833l315284M53063L822905
35541C153848K995978m67429k933367l393731k359560N56432M560425N873584
$$ plain form
35533 7986180 10128502 7205099 3623773 3652069 5973182 6524441 4588861 2830437 2540458
35524 2540458 2489501 2344385 3657053 6586716 8726711 8719299 8412727 9380909 9646802
35515 9646802 6866337 3323228 3950475 9207085 13592976 12859909 9664581 9223852 11353883
35506 11353883 10758054 5146261 -814407 -1423163 2848639 6630969 6676206 4820418 4286244
35497 4286244 5651952 7206646 7565285 6950461 6717380 7979843 9910885 9605732 5189691
35488 5189691 -803319 -3230373 -515411 2884650 1862869 -2967068 -6449516 -5550800
35480 -5550800 -2307607 -115141 405599 769145 1627092 2047203 1214221 -359613 -1342472
35471 -1342472 -778056 1164027 3360412 4727188 5063045 4760788 3959814 2492650 478200
$$ packed form
35533G986180K142322k923403l581326K8296K321113N51259j935580j758424k89979
35524B540458n0957j45116J312668K929663K139995p412l06572R68182K65893
35515I646802k780465l543109O27247N256610M385891p33067l195328m40729K130031
35506A1353883n95829n611793n960668o08756M271802L782330M5237j855788n34174
35497D286244J365708J554694L58639o14824k33081J262463J931042l05153m416041
35488E189691n993010k427054K714962L400061j021781m829937l482448Q98716
35480e550800L243193K192466N20740L63546Q57947M20111q32982j573834r82859
35471a342472N64416J942083K196385J366776L35857l02257q00974j467164k014450
$$ plain form
35462 478200 -1653234 -3547673 -4670886 -4047032 -1391063 1596807 2400625 460591 -2263928
35453 -2263928 -3555725 -2476336 1186783 6784954 11456458 11445259 6607098 1741711
35445 1741711 1263488 3974328 5444186 4216709 2732085 2929851 4322145 6447364
35437 6447364 9782239 13271263 13963414 10672293 5776697 1968011 -737950 -3319147
35429 -3319147 -5192894 -5250634 -3902291 -2254883 -440142 1699446 3506409 4611082
35421 4611082 5868603 7637861 8411939 6844704 3989546 1915243 1271455 1704574 3146157
35412 3146157 4910804 5215419 3732214 2863997 4018362 4619805 2139990 -694747 900993
35403 900993 6067380 8522255 5119223 -29796 -1366346 1706548 5884659 8413233
$$ packed form
35462D78200k131434j894439j123213O23854K655969K987870Q03818j940034k724519
35453b263928j291797J079389L663119N598171M671504j1199m838161m865387
35445A741711m78223K710840J469858j227477j484624J97766J392294K125219
35437F447364L334875L489024O92151l291121m895596l808686k705961k581197
35429c319147j873747n7740J348343J647408J814741K139588J806963J104673
35421D611082J257521J769258P74078j567235k855158k074303o43788M33119J441583
35412C146157J764647L04615j483205q68217J154365O01443k479815k834737J595740
35403I00993N166387K454875l403032n149019j336550L072894M178111K528574
$$ plain form
35395 8413233 8596628 7239706 6359085 7628310 9834308 9669152 5975598 1231664 -1915509
35386 -1915509 -3288146 -3618729 -3054120 -2314608 -2617710 -3184727 -1642198 1750744 3481420
35377 3481420 2181208 1166160 3013644 4975579 3254547 -837611 -2835163 -1289694
35369 -1289694 1730520 4633393 6965757 7477914 5585024 3900147 5336798 8282849
35361 8282849 8663390 6352469 5111365 6048628 6009555 3759779 3083500 7015830 12405040
$$ packed form
35395H413233J83395j356922q80621J269225K205998j65156l693554m743934l147173
35386a915509j372637l30583N64609P39512l03102n67017J542529L392942J730676
35377C481420j300212j015048J847484J961935j721032m092158j997552J545469
35369a289694L020214K902873K332364N12157j892890j684877J436651K946051
35361H282849L80541k310921j241104R37263l9073k249776o76279L932330N389210
$$ [...]
##END NTUPLES=NMR SPECTRUM
##END=
