##TITLE=31Pdec_2PBDP2110
 CDCl3, 24 sc
 22.10.2020
##JCAMPDX= 6.0         $$ Bruker NMR JCAMP-DX V2.0
##DATA TYPE= NMR SPECTRUM
##DATA CLASS= NTUPLES
##ORIGIN= UXNMR, Bruker Analytische Messtechnik GmbH
##OWNER= root
$$ XWIN-NMR		Version 3.5
$$ Thu Oct 22 10:22:42 2020 Russian Standard Time (UT+4h)  she@DPX200
##.OBSERVE FREQUENCY= 81.013821
##.OBSERVE NUCLEUS= ^31P
##.ACQUISITION MODE= SIMULTANEOUS
##.ACQUISITION SCHEME= undefined
##.AVERAGES= 24
##.DIGITISER RES= 17
##SPECTROMETER/DATA SYSTEM= spect
##.PULSE SEQUENCE= zgpg30
##.SOLVENT NAME= CDCl3
##.SHIFT REFERENCE= (INTERNAL, CDCl3, 0, 182.463)
##AUDIT TRAIL= $$ (NUMBER, WHEN, WHO, WHERE, WHAT)
$$ ##TITLE= Audit trail, XWIN-NMR		Version 3.5
$$ ##JCAMPDX= 5.01
$$ ##ORIGIN= Bruker BioSpin GmbH
$$ ##OWNER= she
$$ F:/spectra/data/she/nmr/P31/1/pdata/1/auditp.txt
$$ ##AUDIT TRAIL=  $$ (NUMBER, WHEN, WHO, WHERE, WHAT)
(   1,<2020-10-22 10:21:34.48 +0400>,<she>,<DPX200>,
      <created by zg, POWCHK disabled, PULCHK disabled
       configuration hash MD5:
       00 E9 B6 7A A2 85 ED C7 34 08 36 98 17 FE 4E 26
       data hash MD5: 32K
       94 CE 1E E9 10 DE E4 94 A0 69 9F 6C 35 A7 43 0A>)
(   2,<2020-10-22 10:21:37.29 +0400>,<she>,<DPX200>,
      <Start of raw data processing
       efp BC_mod = 2 LB = 1 FT_mod = 6 PKNL = 1 PHC0 = -2389.802 PHC1 = 64.80058 SI = 64K 
       data hash MD5: 64K
       1E 13 D4 38 1D 30 26 BC B2 39 15 84 EE 5C 89 AA>)
(   3,<2020-10-22 10:21:53.53 +0400>,<she>,<DPX200>,
      <pk PHC0 = 6.967667 PHC1 = 0 
       data hash MD5: 64K
       65 C5 EC 1D 54 48 5E 86 77 11 1E 76 9C 3A D8 AC>)
(   4,<2020-10-22 10:21:56.95 +0400>,<she>,<DPX200>,
      <abs ABSG = 5 
       data hash MD5: 64K
       CA B1 7F CB 65 F3 40 27 29 EC DD F6 CA E7 02 1E>)
(   5,<2020-10-22 10:22:06.96 +0400>,<she>,<DPX200>,
      <abs ABSG = 5 
       data hash MD5: 64K
       35 DB 25 F1 B5 67 7F 90 CD 6B 8A F9 39 4D D5 13>)
$$ ##END=
$$ 
$$ hash MD5
$$ DD 97 60 CF D5 54 C9 8F C9 A2 B9 8B BD F5 BB BC
##$RELAX= 
##$RELAX= 
##$RELAX= 
##$RELAX= 
##$RELAX= 
##$RELAX= 
##$RELAX= 
##$RELAX= 
$$ Bruker specific parameters
$$ --------------------------
##$DU= <F:/spectra>
##$EXPNO= 1
##$NAME= <P31>
##$PROCNO= 1
##$TYPE= <nmr>
##$USER= <she>
##$AMP= (0..31)
100 100 100 100 100 100 100 100 100 100 100 100 100 100 100 100 100 100 
100 100 100 100 100 100 100 100 100 100 100 100 100 100 
##$AQSEQ= 0
##$AQ_mod= 1
##$AUNM= <au_zg>
##$AUTOPOS= <>
##$BF1= 81.014009
##$BF2= 200.13
##$BF3= 200.13
##$BF4= 200.13
##$BF5= 200.13
##$BF6= 200.13
##$BF7= 200.13
##$BF8= 200.13
##$BYTORDA= 1
##$CFDGTYP= 0
##$CFRGTYP= 5
##$CHEMSTR= <none>
##$CNST= (0..31)
1 1 145 1 1 1 1 1 1 1 1 1 1 1 1 1 1 1 1 1 1 1 1 1 1 1 1 1 1 1 1 1 
##$CPDPRG= <waltz16>
##$CPDPRG1= <>
##$CPDPRG2= <waltz16>
##$CPDPRG3= <>
##$CPDPRG4= <mlev>
##$CPDPRG5= <mlev>
##$CPDPRG6= <mlev>
##$CPDPRG7= <mlev>
##$CPDPRG8= <mlev>
##$CPDPRGB= <>
##$CPDPRGT= <>
##$D= (0..31)
0 1 0 0 0 0 0 0 0 0 0 0.03 2e-05 3e-06 0 0 0 0 0 0 0 0 0 0 0 0 0 0 0 0 
0 0 
$$ [...]
##$SUBNAM3= <"">
##$SUBNAM4= <"">
##$SUBNAM5= <"">
##$SUBNAM6= <"">
##$SUBNAM7= <"">
##$SUBNAM8= <"">
##$SUBNAM9= <"">
##$SW= 369.568048894756
##$SWIBOX= (0..15)
0 1 3 0 0 0 0 0 0 0 0 0 0 0 0 0 
##$SW_h= 29940.119760479
##$TD= 32768
##$TD0= 1
##$TE= 0
##$TE2= 300
##$TE3= 300
##$TEG= 300
##$TL= (0..7)
0 120 53 12 22 120 120 120 
##$TP= (0..7)
150 150 150 150 150 150 150 150 
##$TP07= 0
##$TPNAME0= <>
##$TPNAME1= <>
##$TPNAME2= <>
##$TPNAME3= <>
##$TPNAME4= <>
##$TPNAME5= <>
##$TPNAME6= <>
##$TPNAME7= <>
##$TPOAL= (0..7)
0.5 0.5 0.5 0.5 0.5 0.5 0.5 0.5 
##$TPOFFS= (0..7)
0 0 0 0 0 0 0 0 
##$TUNHIN= 0
##$TUNHOUT= 0
##$TUNXOUT= 0
##$USERA1= <user>
##$USERA2= <user>
##$USERA3= <user>
##$USERA4= <user>
##$USERA5= <user>
##$V9= 5
##$VALIST= <valist>
##$VCLIST= <CCCCCCCCCCCCCCC>
##$VD= 0
##$VDLIST= <DDDDDDDDDDDDDDD>
##$VPLIST= <PPPPPPPPPPPPPPP>
##$VTLIST= <TTTTTTTTTTTTTTT>
##$WBST= 1024
##$WBSW= 4
##$XGAIN= (0..3)
0 0 0 0 
##$XL= 0
##$YL= 0
##$YMAX_a= 34959
##$YMIN_a= -27770
##$ZGOPTNS= <>
##$ZL1= 120
##$ZL2= 120
##$ZL3= 120
##$ZL4= 120
##$ABSF1= 182.463
##$ABSF2= -187.1042
##$ABSG= 5
##$ABSL= 3
##$ALPHA= 0
##$AQORDER= 0
##$ASSFAC= 0
##$ASSFACI= 0
##$ASSFACX= 0
##$ASSWID= 0
##$AUNMP= <proc_1d>
##$AZFE= 0.1
##$AZFW= 0.5
##$BCFW= 0
##$BC_mod= 2
##$BYTORDP= 0
##$COROFFS= 0
##$CY= -3
##$DATMOD= 1
##$DC= 0
##$DFILT= <>
##$DTYPP= 0
##$F1P= 0
##$F2P= 0
##$FCOR= 1
##$FTSIZE= 65536
##$FT_mod= 6
##$GAMMA= 0
##$GB= 0
##$INTBC= 1
##$INTSCL= 5.30512e-09
##$ISEN= 30
##$LB= 1
##$LEV0= 0
##$LPBIN= 0
##$MAXI= 10000
##$MC2= 0
##$MEAN= 0
##$ME_mod= 0
##$MI= 50
##$NCOEF= 0
##$NC_proc= -6
##$NLEV= 6
##$NOISF1= 182.463
##$NOISF2= 159.3651
##$NSP= 0
##$NTH_PI= 0
##$NZP= 0
##$OFFSET= 182.463
##$PC= 4
##$PHC0= -2382.834
##$PHC1= 64.80058
##$PH_mod= 1
##$PKNL= yes
##$PPARMOD= 0
##$PSCAL= 0
##$PSIGN= 0
##$REVERSE= no
##$SF= 81.014009
##$SI= 65536
##$SIGF1= 159.3651
##$SIGF2= -187.1042
##$SINO= 113.3802
##$SIOLD= 16384
##$SREGLST= <1H.CDCl3>
##$SSB= 0
##$STSI= 65536
##$STSR= 0
##$SW_p= 29940.119760479
##$SYMM= 0
##$S_DEV= 0
##$TDeff= 32768
##$TDoff= 0
##$TI= <>
##$TILT= no
##$TM1= 0
##$TM2= 0
##$TOPLEV= 0
##$USERP1= <user>
##$USERP2= <user>
##$USERP3= <user>
##$USERP4= <user>
##$USERP5= <user>
##$WDW= 1
##$XDIM= 65536
##$YMAX_p= 419388347
##$YMIN_p= -12518955
$$ End of Bruker specific parameters
$$ ---------------------------------
##NTUPLES= NMR SPECTRUM
##VAR_NAME=  FREQUENCY,     SPECTRUM/REAL,   SPECTRUM/IMAG
##SYMBOL=    X,             R,               I
##VAR_TYPE=  INDEPENDENT,   DEPENDENT,       DEPENDENT
##VAR_FORM=  AFFN,          ASDF,            ASDF
##VAR_DIM=   65536,         65536,           65536
##UNITS=     HZ,            ARBITRARY UNITS, ARBITRARY UNITS
##FACTOR=    0.456856943014862, 1,           1
##FIRST=     14782.0589164895, 0,            0
##LAST=      -15158.0608439895, 0,           0
##MIN=       -15158.0608439895, -12518955,   0
##MAX=       14782.0589164895, 419388347,    0
$$ Real data points
##PAGE= N=1
##DATA TABLE= (X++(R..R)), XYDATA
$$ [...]
41414b685850K026172K440604J450347o24696j620165j19551K088863K132497
41406E088221K00408p86938K36641Q89509o63238k627962k395747n68106K81830
41397c45382k17463o0833J318679J834372J74845j829498j796845j84731P57018
41388c49838M67270L96659J083372J113845l34929j763081j481134k30983j8311
41379a117130r80464j263217l4515J177698Q48424k71964m16074N37271J050922
41370d69049L67556l64942J45625J329943J380463l03853k149648k309370r58954
41361c332229J53762K59278M18605J371240J896158O29689j379198j721123J3591
41352a690227J758062K012630J476288J057475K19885j434552k565612j858311
$$ plain form
41414 -2685850 -659678 1780926 3231273 2606577 986412 866861 2955724 5088221
41406 5088221 5288629 4501691 4738332 5627841 4964603 2336641 -59106 -627212 -345382
41397 -345382 -562845 -623678 695001 2529373 2704218 874720 -922125 -1106856 -349838
41388 -349838 117432 514091 1597463 2711308 2376379 613298 -867836 -1098819 -1117130
41379 -1117130 -2097594 -3360811 -3395326 -2217628 -1369204 -1641168 -2057242 -1519971 -469049
41370 -469049 -101493 -466435 -320810 1009133 2389596 2085743 -63905 -2373275 -3332229
41361 -3332229 -3178467 -2919189 -2500584 -1129344 766814 1396503 17305 -1703818 -1690227
41352 -1690227 67835 2080465 3556753 4614228 4834113 3399561 833949 -1024362
41344a024362l90337l23711j651800k121569n32101J534171J916312O55243l49610
41335b287764Q7167J151828J390248O42440p737q376q4738p23565r34922K32351
41325e43068J605890J100100j067352k338582j442293n1681R7219k47245L40354
41316b546658J323871J295488N02291K50901N43732K61696p26860j389423j184781
41307a669743m33540N40860J245432O67263j262483k561209j489900O39811J151217
41298c172292M6716k07659J099450J807088O79873m63038J43264J260807P41583
41289A935792j004712j729491p23224M40721L81177l57131l53539P46054J793684
41280A129331J501780J7198j181495j094450l43464k1324j29146o5747L1254l03549
$$ plain form
41344 -1024362 -1414699 -1738410 -3390210 -5511779 -6043880 -4509709 -2593397 -1938154 -2287764
41335 -2287764 -2200597 -1048769 341479 983919 976182 967806 883068 159503 -775419 -543068
41325 -543068 1062822 2162922 1095570 -1243012 -2685305 -2736986 -2639767 -2887012 -2546658
41316 -2546658 -1222787 72701 574992 825893 1369625 1631321 904461 -484962 -1669743
41307 -1669743 -2103283 -1562423 -316991 350272 -912211 -3473420 -4963320 -4323509 -3172292
41298 -3172292 -3125576 -3333235 -2233785 -426697 253176 -209862 -66598 1194209 1935792
41289 1935792 931080 -798411 -1521635 -1080914 -699737 -1056868 -1410407 -664353 1129331
41280 1129331 2631111 2648309 1466814 372364 28900 7576 -121570 -187317 -156063 -459612
41270d59612o50661l34520J76593M6174k18921L74863J176335P45191m35149n46900
41260a26607L05320K13500q61012o96145J006388J411046p56971k509470j083483
41251c097434J583748J923196K10515m24917Q29949J747292J000082k90296r47137
41242B534998j042896o72498K65697R12157K05334j072306j099096L86J85148
41233B16924j117680j913170p20294J231369J956731J269204K45167n61739j155771
41224e49259j258570n86528M85232J277713J458529R63327j28683j224091j372598
41215i34928l77892O58467M52792r22881j949417j220069Q54495K109009R69198
41206c61226j298019j758831L42451K316402J679024l75059r53048K05420P95488
$$ plain form
41270 -459612 -1110273 -1444793 -1268200 -1222026 -1440947 -1066084 110251 855442 420293 -126607
41260 -126607 178713 392213 -468799 -1164944 -158556 1252490 495519 -2013951 -3097434
41251 -3097434 -1513686 409510 620025 195108 1025057 2772349 3772431 3482135 2534998
41242 2534998 1492102 819604 1085301 1997458 2202792 1130486 31390 31776 216924
41233 216924 -900756 -2813926 -3534220 -2302851 -346120 923084 1168251 606512 -549259
41224 -549259 -1807829 -2394357 -1909125 -631412 827117 1790444 1661761 437670 -934928
41215 -934928 -1312820 -654353 -201561 -1124442 -3073859 -4293928 -3439433 -1330424 -361226
41206 -361226 -1659245 -3418076 -3075625 -759223 919801 544742 -408306 -202886 592602
41197E92602j14768q78775l06551N55313M70232k41276q99664j508766j693473
41188d025126n75431J197152J398033l37371j189086P03803K832318J833306j112004
41179G25594j850228L51673J748220N1437k129392j528229R09489J899688P43436
41170I21688m02363k88435J66628L01549P90328J605678J128625j336533l681472
41161g94307l294716m68562K012006K289087J041763j35065n05475j38330O04403
41152F10804R75710K40782j191570j815370q70222N04833O73441m22902j324664
41143b619158r14129M23390J393806J132407K6916o44279j41002P16898N67050
41134e8101m55126p16091M87102J663342J171789m36349j290900p58030J38733
$$ plain form
41197 592602 477834 -400941 -707492 -152179 318053 76777 -822887 -2331653 -4025126
41188 -4025126 -4600557 -3403405 -2005372 -2342743 -3531829 -2828026 4292 1837598 725594
41179 725594 -1124634 -772961 975259 1026696 -1102696 -2630925 -1721436 178252 921688
41170 921688 519325 230890 397518 699067 1489395 3095073 4223698 2887165 -794307
41161 -794307 -4089023 -4557585 -2545579 -256492 785271 650206 144731 6401 610804
41152 610804 1586514 1827296 635726 -1179644 -2049866 -1545033 -871592 -1294494 -2619158
41143 -2619158 -3533287 -3109897 -1716091 -583684 -556768 -1201047 -1342049 -625151 -58101
41134 -58101 -513227 -1229318 -742216 921126 2092915 1656566 365666 -392364 -253631
41125b53631M61503K71562n3013k97800k10753L01668Q50861J146276J532144
41116C748817K086919J775277j82579k465086k777780r02164R02857Q77879k49757
41107B814383p60074j61558P78033J241892Q97802p1131r29994r64713l99809
41098B444831j31355m40760p87689r37397j238476j595944j353284n47361o4796
41089d652231r7581K54091J220904J599260O72262l96378k63454N99525R32552
41080a31050P60760R25104J215365O43340o50388j320774p83094m88k0506o72998
41070c4729j044724o14797K64295O25732k08345j546567j635241J90072K190160
41061a814144K173382L96507q56192m82107K63593J41388k06089K74360J056676
$$ plain form
41125 -253631 207872 479434 426421 128621 -82132 219536 1070397 2216673 3748817
41116 3748817 5835736 7611013 7428434 4963348 2185568 1283404 2186261 3064140 2814383
41107 2814383 2054309 1892751 2670784 3912676 4810478 4739347 3809353 2844640 2444831
41098 2444831 2313476 1872716 1085027 147630 -1090846 -2686790 -4040074 -4587435 -4652231
41089 -4652231 -4749812 -4495721 -3274817 -1675557 -1003295 -1399673 -1663127 -1063602 -131050
41080 -131050 629710 1554814 2770179 3413519 2763131 1442357 659263 658775 638269 -34729
41070 -34729 -1079453 -1694250 -1429955 -804223 -1012568 -2559135 -4194376 -4004304 -1814144
41061 -1814144 359238 755745 -100447 -582554 -318961 -177573 -383662 -109302 947374
41052I47374R10705k3492n09516k28867j00131n42142p29889k468J019748J344871
41042B086193R09505L30597q3545l92065m88131k20891J39282J66376j00502k90504
41032B056315k86068j92592M3269M38272O53213M67301K46758K50218n8634j022898
41022B595154j622294o84260J024265J595507Q34340L74216O91853K93995j286675
41013C816101k085907q12385Q00124P09774k49579k16086L07141l60785j666997
41004B41401j544266Q0230J298779J340214R75951K72590j105817j702277K42902
40995I9707L003416K696455r00619l482487k364960O4466P59136L96005R23904
40986A195023J708871J055706n40762j422991j416373j118136k55127J001263
$$ plain form
41052 947374 1858079 1834587 1325071 1096204 996073 453931 -275958 -278426 741322 2086193
41042 2086193 2995698 3326295 3242750 2850685 2362554 2141663 2280945 2447321 2346819 2056315
41032 2056315 1770247 1577655 1620924 2059196 2712409 3179710 3426468 3676686 3618052 2595154
41022 2595154 972860 288600 1312865 2908372 3742712 4116928 4808781 5102776 3816101
41013 3816101 1730194 917809 1717933 2427707 2178128 1962042 2269183 1908398 241401
41004 241401 -1302865 -1222635 76144 1416358 2392309 2664899 1559082 -143195 99707
40995 99707 3103123 5799578 4898959 1416472 -948488 -884022 -124886 271119 1195023
40986 1195023 2903894 3959600 3418838 1995847 579474 -538662 -793789 207474
40978B07474R75407q00041j770659m7153K018546J208017j270593j632188M11855
40969f99335J478280J14271j376861j099253J2025P08999J215667J527134P43122
40960B624049q29641j406496n53388P2846l06327l80165M67527Q02597k6839l00236
40950A63927R76820J769388J53042k170976k226556l63940L82459r54274j979599
40941d249709p71823J300811J649634p6705j802342j676848M2817J662765J945032
40932a976368J068181L935n59357n25929j04424L19180L03491j30454l22521J65536
40922a758730P98813P96947K90804J83N1662j9595l12870n08165n86075p01163
40912a948189n44989K17825J094676J318328R99828P51177N64010J83419N2427
$$ plain form
40978 207474 1182881 382840 -1387819 -1434972 583574 1791591 520998 -1111190 -699335
40969 -699335 778945 893216 -483645 -1582898 -1570873 -861874 353793 1880927 2624049
40960 2624049 1794408 387912 -165476 -92630 -398957 -779122 -311595 491002 464163 163927
40950 163927 1140747 2910135 3063177 892201 -1334355 -1698295 -1315836 -2270110 -4249709
40941 -4249709 -5021532 -3720721 -2071087 -2147792 -3950134 -5626982 -5584165 -3921400 -1976368
40932 -1976368 -908187 -904252 -1463609 -1989538 -2093962 -1774782 -1471291 -1601745 -1924266 -1758730
40922 -1758730 -959917 -162970 127834 128017 179679 160084 -152786 -660951 -1247026 -1948189
40912 -1948189 -2493178 -2275353 -1180677 137651 1137479 1888656 2452666 2636085 2688512
40903B688512M96813N63166o08140j786024j128597O55625J079853j39758o18677
40894A202773N91486J304120r4068j859084j714710l72479k3833q13726j095129
40885b874650k92407N97583R24313J038514J179463J056445N28588j50984o34521
40876A372344n87151K0351M76847N2865o28407k06558J080826J323547q9219j238945
40866A576500n57739Q18486J028479K03060m48736p79045j089190p34908O29687
40857F46594J564538P40065o31058m79598P70610Q76182o59219j995084j783150
40848i50120n18106Q51145J718618J330533n31557k326150k067304N221J729313
40839g58407J951329J414414Q32999P7590n65642l19207M88259N20886m57030
$$ plain form
40903 2688512 3185325 3748491 3140351 1354327 225730 881355 1961208 1821450 1202773
40894 1202773 1794259 3098379 3004311 1145227 -569483 -941962 -965795 -1779521 -2874650
40885 -2874650 -3167057 -2569474 -1645161 -606647 572816 1629261 2157849 2006865 1372344
40876 1372344 785193 805544 1282391 1335256 706849 500291 1581117 2904664 2815445 1576500
40866 1576500 1018761 1837247 2865726 3068786 2620050 1841005 751815 16907 646594
40857 646594 2211132 2951197 2320139 1840541 2611151 3487333 2828114 833030 -950120
40848 -950120 -1468226 -617081 1101537 2432070 1900513 -425637 -2492941 -2487720 -758407
40839 -758407 1192922 2607336 3440335 3517925 2952283 2633076 3121335 3642221 3185191
40830C185191j233957j233011j190218j357394q61883N00820J512680J311418
40822F33646M84469k05177p44818j013088n44641K57729K26443o43127r58523
40813b507087k56617J69780l97977p26582K84373J719361K113939J481401O89037
40804B569628M3272m00336l48821j27390o95693j806429j723669N773J268014
40795a215651N02889o32197J68522K081968K434961P95941p95541j165501j031730
40786A143661q71557k23921O99126R09333M64891M01934N93340k34254j941625
40777I40928k610640j442080N4964O39034R89162J608749J239534q25484k583889
40768a989722j718826Q78950K196071J182696l11023n29631J86894O56443N20747
$$ plain form
40830 3185191 1951234 718223 -471995 -1829389 -2691272 -2190452 -677772 633646
40822 633646 1118115 912938 168120 -844968 -1389609 -1131880 -905437 -1548564 -2507087
40813 -2507087 -2763704 -2593924 -2991901 -3718483 -3434110 -1714749 399190 1880591 2569628
40804 2569628 2612900 2212564 1863743 1736353 1040660 -765769 -2489438 -2483665 -1215651
40795 -1215651 -712762 -1344959 -1176437 905531 3340492 4136433 3340892 2175391 1143661
40786 1143661 272104 48183 747309 1656642 2121533 2523467 3116807 2882553 940928
40777 940928 -1669712 -3111792 -3056828 -2417794 -1428632 180117 1419651 594167 -1989722
40768 -1989722 -3708548 -2829598 -633527 549169 238146 -291485 -104591 551852 1072599
40759A072599J47568l7889K65165R18752J129123L79445n43288n11470J09402
40750B929407m6765r93977j165881K8496J096389P62328j55912l39599p8721l25991
40740A709774p45065m15806K57881J50717n10343m98750J87655L29344k39163
40731B26244k92280M72948P19021j74330q20147r824J296655J480017N92020j98318
40721C292006n55649r40005j279940j096331n69435k67441j17751K88215P24891
40712e21440P19777N23080N91101M93064m31032j577608j561542j88033J225584
40703g27049J577908J011831J91711m14682m54917J19304O52636M40442j73956
40694B223228k11268M59357R46321O12680l54191j503428k266114j785544J42953
$$ plain form
40759 1072599 1220167 1182278 1447443 2366195 3495318 3874763 3331475 2820005 2929407
40750 2929407 2882642 1888665 722784 751280 1847669 2609997 2454085 2114486 2035765 1709774
40740 1709774 964709 548903 806784 957501 447158 -51592 136063 465407 226244
40731 226244 -66036 406912 1125933 951603 131456 121632 1418287 2898304 3490324 3292006
40721 3292006 2736357 1796352 516412 -579919 -1149354 -1416795 -1534546 -1246331 -521440
40712 -521440 198337 721417 1312518 1805582 1374550 -203058 -1764600 -1952633 -727049
40703 -727049 850859 1862690 2054401 1639719 1184802 1304106 1956742 2397184 2223228
40694 2223228 2011960 2471317 3417638 4030318 3676127 2172699 -93415 -1878959 -1736006
40685a736006K060481K154679O65988l88023j6429P13339P06533K65712q3213
40676D343061o08542j372811j573801q22615O0251L81188N79257J039702J084132
40667C109822J89466q03892p92724Q6401R45679J268001P75240o87263k198199
40658A892531j992273R6876J687949Q83470r16054j072574L84392J110845K03751
40649B278913p28695l40761P01079J202851R67472L01301n59243j046423o08890
40640B167604J41671j4096q31198o43779R00815J825071O33254j306148j641995
40631A231199k55963J010961J167439Q76477O72471J11325r46690j617566j250970
40622I98683m22026O7910L73418R05043J104556J51192j285269j384264K67817
$$ plain form
40685 -1736006 324475 2479154 3145142 2757119 2740690 3454029 4160562 4426274 4343061
40676 4343061 3734519 2361708 787907 -34708 25543 406731 985988 2025690 3109822
40667 3109822 3299288 2495396 1702672 1789073 2734752 4002753 4777993 4090730 1892531
40658 1892531 -99742 -2866 1685083 2568553 1652499 579925 964317 2075162 2278913
40649 2278913 1550218 1209457 1910536 3113387 4080859 4382160 3822917 2776494 2167604
40640 2167604 2309275 2295179 1463981 820202 1721017 3546088 4179342 2873194 1231199
40631 1231199 975236 1986197 3153636 4030113 4702584 4813909 3867219 2249653 998683
40622 998683 576657 644567 1017985 1923028 3027584 3178776 1893507 509243 777060
40613G77060J665867R33511r52321j395144J62224J450129O24175j230410j847441
40604A87650q92578O3245P5891j80029J05271P35271J138319J110920N90497m02506
40594B531951j210830q51183N24971J282328K18473j709512k429815j205987P85240
40585b064364K100955K318363J675353M78179o67465q49585J41728J168482Q61884
40576E163530o85691j937689j650585j16712J353874J707801Q25516n73879j489250
40567B596915j437778q36548l41512L2066N84791R59341M92556l72627k64909
40558A412295J004969J737543O24370j347255k328947j932347q98467M62552J890854
40549F25567K205058P31004r27622p56838M42392J83937j492603j858200l7106
$$ plain form
40613 777060 2442927 3376438 2424117 1028973 1191197 2641326 3265501 2035091 187650
40604 187650 -704928 -641683 -565792 -745821 -640550 94721 1233040 2343960 2934457 2531951
40594 2531951 1321121 469938 994909 2277237 2495710 786198 -1643617 -2849604 -2064364
40585 -2064364 36591 2354954 4030307 4508486 3841021 2991436 3133164 4301646 5163530
40576 5163530 4477839 2540150 889565 772853 2126727 3834528 4660044 4086165 2596915
40567 2596915 1159137 322589 -18923 13143 597934 1557275 2049831 1677204 1412295
40558 1412295 2417264 4154807 4779177 3431922 1102975 -829372 -1727839 -1265287 625567
40549 625567 2830625 3561629 2634007 1877169 2319561 2503498 1010895 -847305 -884411
40540h84411J372066M92340r12182o34201M10959K89523l43222L27361J598634
40531A716867J143604r60347k043617p88443J136403J781497J138614J13243q73440
40522B364381j505265j232919j13922R51090J312453J140014P25293P8327o24395
40513C095057r85515q84977m19768M45761J455870J709377O87946p32631j288572
40504C082548r22050l86294P9862M67001J94798q31355j161237K74171J876253
40495B673697J328962o50941j221818M6158O29237m95408j183247j63195N29961
40486A493406p17947j794432j62783K581984K741490P89k317368k108949o17306
40477i01116M61878J202141J933000J824193L66829j229603j511531p49810k53485
$$ plain form
40540 -884411 487655 979995 67813 -566388 -155429 134094 -209128 118233 1716867
40531 1716867 2860471 1900124 -143493 -931936 204467 1985964 3124578 3237821 2364381
40522 2364381 859116 -373803 -487725 463365 1775818 2915832 3641125 3719452 3095057
40513 3095057 2109542 1224565 804797 1250558 2706428 4415805 5103751 4371120 3082548
40504 3082548 2160498 1774204 1854066 2321067 2515865 1684510 523273 797444 2673697
40495 2673697 4002659 3351718 2129900 2176058 2805295 2309887 1126640 963445 1493406
40486 1493406 775459 -1018973 -1181756 1400228 4141718 4142507 1825139 -283810 -901116
40477 -901116 -439238 762903 2695903 4520096 4886925 3657322 2145791 1395981 1142496
40468A142496l69247l65225j0758k7032o80123r01661L77847K406828L105091
40459D678216J577420p29580j932899j948549j847304j696556o37042J018135
40451a518159J609778O39505k13536L88646J345392R40966l69663p34570J92961
40442B281320R72330Q11124M86885O00069N39555k03597j005071j152419q92101
40433B438095o75799l10319K85082L95653k99285o30379N28734K087629J829038
40424E648449k71357j670392q50369N25050L29936p32626n17994R01311J389535
40415D751543L22993n06498m6033L36009n87481j706035j453614k69766M93940
40406A335058Q01354J272564J401148L95392r55260j204327n32765k68200n67678
$$ plain form
40468 1142496 773249 408024 397266 370234 -309889 -1211550 -833703 1573125 4678216
40459 4678216 6255636 5526056 3593157 1644608 -202696 -1899252 -2536294 -1518159
40451 -1518159 91619 731124 517588 906234 2251626 3192592 2822929 2088359 2281320
40442 2281320 3253650 4064774 4551659 5151728 5691283 5487686 4482615 3330196 2438095
40433 2438095 1762296 1451977 1737059 2132712 1833427 1203048 1731782 3819411 5648449
40424 5648449 5377092 3706700 2856331 3381381 3711317 2978691 2460697 3362008 4751543
40415 4751543 5074536 4568038 4522005 4858014 4270533 2564498 1110884 841118 1335058
40406 1335058 2136412 3408976 4810124 5205516 4250256 3045929 2513164 2244964 1677286
40397A677286m64022J00655K19618j43749j20385L35900M61618L06931N34171
40388B908023P90087K59532l79330J70763J114124L77429j624152j979385J29464
40379A766555J776586O88120j359421j451805L26080J796509K029881J599779
40371G172284P70172m43815j227684q26404J02038M10543J05732j36254k85761
40362E640851n48310m38441M66069J498591J724760J149467K53863q01787j664699
40353G280364j535273m24683L60711J92o19278m59674J4440j46374p32176q42663
40343B895586j35971J156766K425897K433798M42270j882986j788677M74611J368150
40334G389444p33242k806589j791127P33796J388478K98960R7202J124721J335832
$$ plain form
40397 1677286 1213264 1313919 1533537 1389788 1269403 1605303 2066921 2373852 2908023
40388 2908023 3698110 3957642 3578312 3749075 4863199 5240628 3616476 1637091 1766555
40379 1766555 3543141 4231261 2871840 1420035 1746115 3542624 5572505 7172284
40371 7172284 7942456 7498641 6270957 5444553 5546591 5957134 6062866 5926612 5640851
40362 5640851 5092541 4654100 5120169 6618760 8343520 9492987 9746850 8945063 7280364
40353 7280364 5745091 5320408 5681119 5681311 5062033 4602359 4616799 4470425 3738249 2895586
40343 2895586 2759615 3916381 6342278 8776076 9218346 7335360 5546683 6021294 7389444
40334 7389444 6656202 3849613 2058486 2792282 4180760 4479720 4576922 5701643 7037475
40325G037475K79912l39256N2380J89435l20864l76310K49303M31014o3295j45560
40315F994234L99979M28181m11950r62537n22498J16552J10866k90200m35891
40306E426736j00058N31039R42057N75393l43356q70870p76935q06582r06085
40297C671339R4103J985468K479353O32191j188936q38592K77379j08050j220962
40288E783293r77919K22248O21461M67245J033446J676246J089582J75248M99361
40279A0590211J283629J042860N52918R59701R39834o93842j804036k80106J859918
40270A4451087J975637J617074L055125M222143K727453J459055L664691O158280
40262C9330545M997920L852572P713585J2922313J4831015K0244095L6221615
$$ plain form
40325 7037475 7317387 6978131 7030511 7219946 6899082 6522772 6772075 7203089 7139794 6994234
40315 6994234 7394213 7822394 7410444 6447907 5925409 6041961 6152827 5862627 5426736
40306 5426736 5326678 5857717 6799774 7375167 7031811 6160941 5384006 4577424 3671339
40297 3671339 3765442 5750910 8230263 8862454 7673518 6834926 7112305 7004255 5783293
40288 5783293 4805374 5027622 5649083 6116328 7149774 8826020 9915602 10090850 10590211
40279 10590211 11873840 12916700 13469618 14429319 15369153 14675311 12871275 12591169 14451087
40270 14451087 16426724 18043798 21098923 25321066 28048519 29507574 33172265 39330545
40262 39330545 44328465 48181037 55894622 68816935 83647950 103892045 140113660
40255A40113660M9134219L5407927l057918l4423002l5939610j8402582j279525
40248A31553169J5152381L4614534M0648747J4883728k8337392n2394862m3574872
40241A12545433k3495564j4318943j3456337r451178l170670j369126k625185
40234D4658430j810429j65943j180433k768663j424170J242720K497763L784378
40226D4833653O658670Q947604R959330J3506374K0327896K3565911J7881203
40219A45680641P583646n42720p071460j5552451k3127923k3670950j7558548
40212F5740235j0943007p022629m429709k598804k422883k630178j222346L07278
40204C4777957p18366k765376k120617P63348K145900J346485J022246J788748
$$ plain form
40255 140113660 189247879 224655806 221597888 187174886 151235276 132832694 131553169
40248 131553169 146705550 181320084 221968831 236852559 208515167 156120305 112545433
40241 112545433 89049869 74730926 61274589 51823411 48652741 47283615 44658430
40234 44658430 42848001 42682058 41501625 38732962 37308792 38551512 41049275 44833653
40226 44833653 51492323 60439927 70399257 83905631 104233527 127799438 145680641
40219 145680641 153264287 152721567 145650107 130097656 106969733 83298783 65740235
40212 65740235 54797228 47774599 43344890 40746086 38323203 35693025 34470679 34777957
40204 34777957 34059591 31294215 29173598 29936946 32082846 33429331 34451577 36240325
40196C6240325J840272J555524L180043O019880P322813Q068103J2062900J8325882
40188I4615742K0306603J4783816O173109p37725p155702j5438464k2202857k1700258
40180F8644264j4263376o513290l354184l505623l342303j891528o49435n63843
40172C4560682j016765j034036j44554J718359L997065N043536L108891j292992
40164D4940186m835314m555151j265055J629662K442932K424324K642829K245521
40156D5669934Q41721M7571P38892Q76829j458899m368566m197705n47604L239630
40147D0841803M168392K031882j674354m985532n943474m159119j910472j712739
40139B6656387k969830l084236j558382m29744n20056j04383J758937L154861
$$ plain form
40196 36240325 38080597 39636121 42816164 48836044 56158857 64226960 76289860 94615742
40188 94615742 114922345 129706161 135879270 135141545 127985843 112547379 90344522 68644264
40180 68644264 54380888 47867598 44513414 41007791 37665488 35773960 35124525 34560682
40172 34560682 33543917 32509881 32365327 34083686 38080751 43124287 46233178 44940186
40164 44940186 40104872 35549721 34284666 35914328 38357260 40781584 43424413 45669934
40156 45669934 46511655 46559226 47298118 48174947 46716048 42347482 38149777 37602173 40841803
40147 40841803 45010195 47042077 45367723 40382191 34438717 30279598 28369126 26656387
40139 26656387 23686557 20602321 19043939 18614195 18094139 17989756 19748693 22903554
40131B2903554K211264K16464j20445J484338K686951J961074P15763J441049
40123C3500012M433978P077689O483228K445632k622044o318684p936959p692307
40115B9370545n770316k866367n16706J73551m24046j226582j474351p29497Q57694
40106A7393925J850711P67196j319480j453106R17760K719172J870906M43871
40098B3190955Q47874J577972J48690j909832j189262J690089K789096J162893
40090B8308475K6004J120151K191632J424747O07436J774053L491494K815965
40082D1759957o85636m582242o175718m590947j433286K89052p49823k296854
40074B1534503j480498Q07730J105110j244659l151096k690448j552623j479468
$$ plain form
40131 22903554 25114818 25331282 25210837 26695175 29382126 31343200 32058963 33500012
40123 33500012 37933990 45011679 51494907 53940539 51318495 44999811 37062852 29370545
40115 29370545 23600229 20733862 20217156 20390707 19966661 18740079 17265728 16536231 17393925
40106 17393925 19244636 20011832 18692352 17239246 18157006 20876178 22747084 23190955
40098 23190955 24038829 25616801 25765491 23855659 22666397 24356486 27145582 28308475
40090 28308475 28334479 29454630 31646262 33071009 33678445 35452498 38943992 41759957
40082 41759957 41074321 36492079 30316361 25725414 24292128 24581180 23831357 21534503
40074 21534503 20054005 20861735 21966845 20722186 17571090 14880642 13328019 11848551
40066A1848551j585109q80642m45035j065895j343936k71629O50813L7125q40130
40057F104113l89674M27843j8188r94455p23587N96578J385348J193051O31436
40048H212465q6882p17051l15834J223887K289795J920738J518066K306944K820862
40039A9172990J238141j275771k037590m06620K421124N617471Q015610O862520
40031C9607875Q75235o222962q856919o255677k787727j702155j934924j585892
40023A1136854j036480j159801j195300k73198P42324N83164m15500q86712k37926
40014G257425Q62001J177882j09586k301067l196040j388271J604402K888835
40006F795581J770816K54041K0925O37674R69087O82349q3475j088317j660445
$$ plain form
40066 11848551 10263442 9382800 8937765 7871870 6527934 6256305 6907118 6944243 6104113
40057 6104113 5714439 6142282 6124094 5129639 4406052 5002630 6387978 7581029 8212465
40048 8212465 8125583 7408532 7092698 8316585 10606380 12527118 14045184 16352128 19172990
40039 19172990 20411131 19135360 17097770 16691150 19112274 24729745 32745355 39607875
40031 39607875 40483110 34260148 25403229 19147552 16359825 14657670 12722746 11136854
40023 11136854 10100374 8940573 7745273 7472075 8214399 8797563 8382063 7495351 7257425
40014 7257425 8119426 9297308 9187722 6886655 3690615 2302344 3906746 6795581
40006 6795581 8566397 8820438 8841363 9479037 10448124 11130473 11046998 9958681 8298236
39997H298236j300461p62910j132229j824282j211116O27118J666641Q88659l53538
39988D896118n25411J95251Q60608J040492N70418m87532j144425l44881J035069
39979F095707Q69055r66441k004614p03656J413744K183148J459398J91155j233840
39970G303656k314047j949783k59838P57826K9737p60119Q8123J423355J282502
39961E601412K66841L08859J155472Q92469n13529r69666L45426J746597J651822
39952A0485703N04450l87351l78129M81466J588450J829714P52813m33815m23993
39943A4019308K2743o65759j811824j133549J342405K754735J772992Q57753K419878
39934A9578682M893245M979583K421229J0333n37250l00822p48087j765537k640788
$$ plain form
39997 8298236 6997775 6234865 5102636 3278354 2067238 2694356 4360997 5249656 4896118
39988 4896118 4370707 4565958 5426566 6467058 7037476 6549944 5405519 5060638 6095707
39979 6095707 6964762 5998321 3993707 3290051 4703795 6886943 8346341 8537496 7303656
39970 7303656 4989609 3039826 2779988 3537814 3567551 2807432 2895555 4318910 5601412
39961 5601412 5868253 6177112 7332584 8225053 7711524 6741858 7087284 8833881 10485703
39952 10485703 10990153 10602802 10224673 10706139 12294589 14124303 14877116 14443301 14019308
39943 14019308 14042051 13376292 11564468 10430919 11773324 14528059 16301051 17158804 19578682
39934 19578682 24471927 29451510 31872739 31883072 31345822 31045000 30296913 28531376 25890588
39925B5890588l307374l734230l290331j754793k38271o4989j012296j545766
39917A0942538q45042J46940Q2242q50364j066562K16157J636619J296510n26500
39908A1032538j326749M96369L284810L876776J418745j654998k627793j464768
39900A3034930j47001J24036j07873j47179l08308r04823j183583m31058M31385
39891A0360526j77274j917935k498072q59748J052759R68276l77631l83241J419795
39882G587455K577418J258642j278615k666370k359358j363545k53198R42547
39874D444976J585790R19006m10631q67373k42721M4115p50801j427650o24648
39865B670063J158284K247901J869009O73121l60942p71986o56773n42722j008042
$$ plain form
39925 25890588 22583214 18848984 15558653 13803860 13565589 13500600 12488304 10942538
39917 10942538 10097496 10244436 10326678 9476314 8409752 8625909 10262528 11559038 11032538
39908 11032538 9705789 10202158 13486968 17363744 18782489 17127491 14499698 13034930
39900 13034930 12887929 13011965 12904092 12756913 12448605 11543782 10360199 9929141 10360526
39891 10360526 10183252 8265317 5767245 4907497 5960256 6928532 6550901 6167660 7587455
39882 7587455 10164873 11423515 10144900 7478530 5119172 3755627 3502429 4444976
39874 4444976 6030766 6949772 6539141 5671768 5429047 5473162 4722361 3294711 2670063
39865 2670063 3828347 6076248 7945257 8618378 8257436 7485450 6828677 6285955 5277913
39856E277913j902434k238661j372826P8268J058373J350583J335137R92956J55302
39847D734611n79633l55107N51275R53966M59386j51725l52816m59410n14827
39838D285720O3713J143580J477664M78619p57655j120230j009413j091218p68964
39829B701816N38300J609568Q96224p48788r62774N35659J421776L38033j047386
39820E282428o44941R73874J554665L08403j340554j799782r56753K16682R10954
39811D504976J077943J069865R36309L84070m05405n11272M62277J388179J009614
39802I916556l6609p6747Q41967R17948l22884r98758N4889J163027M05708j247819
39792A0617278j462283j32888Q18463P34291R58964K173428L192805L165810L221517
$$ plain form
39856 5277913 3375479 1136818 -236008 -157740 900633 2251216 3586353 4579309 4734611
39847 4734611 4154978 3799871 4351146 5305112 5764498 5612773 5259957 4800547 4285720
39838 4285720 4349433 5493013 6970677 7449296 6691641 5571411 4561998 3470780 2701816
39829 2701816 3240116 4849684 5745908 4997120 4034346 4570005 5991781 6329814 5282428
39820 5282428 4637487 5611361 7166026 7474429 6133875 4334093 3377340 3594022 4504976
39811 4504976 5582919 6652784 7589093 7973163 7567758 7056486 7518763 8906942 9916556
39802 9916556 9879947 9803200 10645167 11563115 11240231 10241473 10296362 11459389 11865097 10617278
39792 10617278 9154995 9022107 9840570 10574861 11533825 13707253 16900058 20065868 23287385
39783B3287385M688245O621299O361751K488673l346248p620561p998257n382519
39775A9099768k849843k408662l154761k879949r06267J303978J959511P20823
39767A0884598j094158j704310o21621O63733M74184o33250o47413N28934O88460
39758H539157p69274j196116J014697L122108K109740j56181J36148K259113K340781
39749A7400173N94870J367989N026372N775510L74055o118622p283544l997478
39741A3139325j585989j482998r57227P21087J258650K0602j018767j198902j881941
39732G013840k837615j950844N97579J670583P6646j278852N2760K283330K333128
39723G960555L27274j116468o27691Q42700J727379J179495m86491j732879j133241
$$ plain form
39783 23287385 27975630 34596929 40958680 43447353 40101105 32480544 24482287 19099768
39775 19099768 16249925 13841263 10686502 7806553 6900286 8204264 10163775 10884598
39767 10884598 9790440 8086130 7464509 8128242 8602426 7969176 7321763 7850697 8539157
39758 8539157 7769883 6573767 7588464 10710572 12820312 12664131 12800279 15059392 17400173
39749 17400173 17995043 19363032 24389404 30164914 30538969 24420347 17136803 13139325
39741 13139325 11553336 10070338 9113111 9834198 11092848 11113450 10094683 8895781 7013840
39732 7013840 4176225 2225381 2822960 4493543 4570189 3291337 3344097 5627427 7960555
39723 7960555 8287829 7171361 6543670 7386370 9113749 10293244 9806753 8073874 6940633
39714F940633N74077J060949k98437j336010k97875J503811J670594P0047j325449
39705H562340j126867K43911J453927J483837M88618j36474N92981J440911L28987
39696A3332171k221383l189668j456308L14646k44476j611947j153819N06029
39688D275245Q13686k94833m91932Q65337J801465J105542K1965q0318M28383
39679H444540P10821Q24578R16324M87740n70196j256852p09654M74832R45509
39670A0267642L38912k05475O49989K658196L749755K185792j041332k969525
39662A5633954k197078m44230P5296n96387j185717j497752j981504k078734j001532
39653D726316M53353P68173K7723l27781K32063Q93197J018024O50902p4617o97162
$$ plain form
39714 6940633 7514710 8575659 8277222 6941212 6643337 8147148 9817742 9887789 8562340
39705 8562340 7435473 7679384 9133311 10617148 11105766 10969292 11562273 13003184 13332171
39696 13332171 11110788 7921120 6464812 6779458 6534982 4923035 3769216 4275245
39688 4275245 5088931 4794098 4302166 5167503 6968968 8074510 8096475 8016157 8444540
39679 8444540 9155361 9979939 10896263 11384003 10813807 9556955 8847301 9322133 10267642
39670 10267642 10606554 10401079 11051068 13709264 17459019 19644811 18603479 15633954
39662 15633954 13436876 12992646 13067942 12471555 11285838 9788086 7806582 5727848 4726316
39653 4726316 5179669 5947842 5975565 5647784 5879847 6773044 7791068 8441970 8367353 7670191
39643G670191l09408R07654J096715n80028j956946q50350J281285J516749K30618
39634I006480K69204J957942K706008J744036J559225L809042O896751Q324074
39626C6272762O750740J743955n124450r071369o323893K2870L199544K602663
39618C0072822M489858J0646344J3091930N037467q113810j5031129j2481815
39611B7711667o804968l544988k271395j200108o63482p83660l63652M72247j9250
39602A2532411j897229k953256k116974o86681K57050R46798J180855K90997q35660
39593F718311m77929Q86281J062955r8544m22654P04253J312632M61419k57201
39584I889523J05875J88974p86620j263343j70443R76486O55297j31229J05406
$$ plain form
39643 7670191 7360783 8268437 9365152 8785124 6828178 5977828 7259113 8775862 9006480
39634 9006480 9275684 11233626 13939634 15683670 17242895 21051937 27948688 36272762
39626 36272762 43023502 44767457 39643007 30571638 24247745 24270615 27470159 30072822
39618 30072822 34562680 45209024 58300954 63338421 55224611 40193482 27711667
39611 27711667 20906699 17361711 15090316 13890208 13226726 12443066 12079414 12551661 12532411
39602 12532411 10635182 7681926 5564952 4878271 5135321 6082119 7262974 7553971 6718311
39593 6718311 6240382 7126663 8189618 8091074 7668420 8372673 9685305 10146724 9889523
39584 9889523 9995398 10184372 9397752 8134409 7963966 8940452 9595749 9464520 9569926
39575I569926N91021k01095j531238j196034J004454K510107J194085j672707
39567A0268519k575922n2023L169491L897197L769152P403830J3985860J5081292
39559E4947396N091696r217855j5555184j1161210m603082k628125k637495m36990
39551A3799151J858427N38950k395526k517395l30986L09024q54868n77868J688351
39542A1517260K700876P55209j931903k832792j986089o38208M45576P40101O6648
39533H836678o71544m60468J58412o2473r16303j158802p04840n45475p20817
39524C754368k69058Q19305J322889O26655n19465j151712r40449o9530P77453
39515D350456P19384j35599m86407K26775O78643k88839j542924j217381M57695
$$ plain form
39575 9569926 10160947 9959852 8428614 7232580 8237034 10747141 11941226 10268519
39567 10268519 7692597 7640574 10810065 14707262 18476414 25880244 39866104 54947396
39559 54947396 60039092 50821237 35266053 24104843 19501761 16873636 14236141 13799151
39551 13799151 15657578 16196528 13801002 11283607 10952621 11261645 10406777 9828909 11517260
39542 11517260 14218136 14973345 13041442 10208650 8222561 7584353 8029929 8770030 8836678
39533 8836678 8165134 7704666 7863078 7800605 6884302 5725500 5020660 4475185 3754368
39524 3754368 3485310 4304615 5627504 6254159 5734694 4582982 3642533 3573003 4350456
39515 4350456 5069840 4934241 4447834 4674609 5353252 5064413 3521489 2304108 2761803
39506B761803J640548J570910J023433N21196j26473o43855k47691J029700K074767
39497I604338J943255Q07029k76400l45161L33413L14719r65784j784801m93268
39488I137340J372617J026579q48826r03984J040695J318787j120452k383685
39480H639071k50932J686922J16536k202530j233758J552108K220007J001281
39472A1528705O30602Q74560J35474j22823J814846L311657J557531m40827J381116
39463B0670841M560406N105346O616370J4023308K0283033J2338223p978634k2059197
39455E3559696j8461861p098199k696743m883447m201966N24158K429234l02590
39447A8868282k519201j763777r40900j619122j839436p66037J11330L90657R14498
$$ plain form
39506 2761803 4402351 5973261 6996694 7517890 7391417 6747562 6499871 7529571 9604338
39497 9604338 11547593 12354622 12078222 11733061 12066474 12381193 11415409 9630608 9137340
39488 9137340 10509957 11536536 10687710 9783726 10824421 12143208 11022756 8639071
39480 8639071 8388139 10075061 10191597 7989067 6755309 8307417 10527424 11528705
39472 11528705 12159307 13033867 13169341 13046518 14861364 18173021 19730552 19289725 20670841
39463 20670841 25231247 30336593 36952963 50976271 71259304 83597527 75618893 53559696
39455 53559696 35097835 27999636 25302893 20419446 16217480 16741638 19170872 18868282
39447 18868282 16349081 14585304 13644404 12025282 10185846 9419809 9531139 9921796 10836294
39438A0836294J220428O89208P56951K287015K971384J235778j75771J132403
39430B0953690K450830R63971m25339J649658M234098M037151N690088J3957595
39422E3511742K0833606J3005726p344099k1787173j9142457q471833l564158
39415B7041354n062740n460680l068490j549046j057565Q85732K712831J029850
39407A5471246k346287k594923J39269J346124j63118j191263m20705n2725r03986
39398I283632j002588J61512M63466q07586j619547r20759k10434l96458l31129
39389D620109M20004L71176j025485j966925j129148L41793R67536J018048J150148
39380D767256Q54038k62957j130042o30630O53125J312418R44507K13336j99732
$$ plain form
39438 10836294 12056722 12745930 13502881 15789896 18761280 19997058 19821287 20953690
39430 20953690 23404520 24368491 23943152 25592810 29826908 33864059 39554147 53511742
39422 53511742 74345348 87351074 80006975 58219802 39077345 30605512 27041354
39415 27041354 21978614 16517934 13449444 11900398 10842833 11728565 14441396 15471246
39407 15471246 13124959 10530036 10669305 12015429 11852311 10661048 10240343 10187618 9283632
39398 9283632 8281044 8442556 8906022 8098436 6478889 5558130 5347696 4951238 4620109
39389 4620109 5040113 5411289 4385804 2418879 1289731 1631524 2599060 3617108 4767256
39380 4767256 5621294 5358337 4228295 3597665 4250790 5563208 6507715 6721051 6521319
39371F521319o373O45347J049052N91637j87878j50538N53373L95039j152069
39362H258909k439283j830106k6311R89525O61568K58389Q48045K004452K595303
39353A1320491K061067P59383m53890r04271o80068m56424n08775k87554N46558
39344A1396517J195269P89245P9316O77753K394464K997573J687963J231225M461374
39335B6910699R307340J0058519M369105l252610o455550l871763Q72129M462758
39327D2400627O527827P428213O448189L268228o86815l734351n699113p176523
39319D8776282p976086p408879n588178l510376k090157j658324k026053k516557
39311A6001672k295345j195032j309M27608J40617J5338Q88421K714005M270879
$$ plain form
39371 6521319 6514946 7160293 8209345 8800982 8613104 8462566 9015939 9410978 8258909
39362 8258909 5819626 3989520 3963209 4952734 5614302 5872691 6720736 8725188 11320491
39353 11320491 13381558 14140941 13687051 12782780 12102712 11646288 11137513 10849959 11396517
39344 11396517 12591786 13381031 13460347 14138100 16532564 19530137 21218100 22449325 26910699
39335 26910699 36218039 46276558 50645663 47393053 40937503 37065740 37937869 42400627
39327 42400627 48928454 56356667 62804856 66073084 65386269 61651918 55952805 48776282
39319 48776282 40800196 33391317 27803139 24292763 22202606 20544282 18518229 16001672
39311 16001672 13706327 12511295 12509986 12937594 13078211 13093549 13981970 16695975 20966854
39302B0966854L972867J632183p68776r13656J298847L929701N584904O588076
39294D2291000P450509P680109O861686N726484N086605M428168K614762l22786
39286H1816537k956383m062562m045313m609828o873152r692612j0396066p761227
39278C1419394l736823j321319j261950j986029k193491j900658j258669k40571
39270A7519884M69875J53783k96347N70364J958302J527176o00864j274224J123564
39261B1151513M199459N229177M796531M731064M679238L207928O15609j831135
39253D6779384m071837o306394p255188n874070l622670k509474k050571q25582
39245A4263598K23669p26232k509559k233550j69573L85273j434912k476462o31961
$$ plain form
39302 20966854 24939721 26571904 25803128 24889472 26188319 30118020 35702924 42291000
39294 42291000 49741509 57421618 64283304 70009788 75096393 79524561 82139323 81816537
39286 81816537 78860154 74797592 70752279 66142451 59269299 49576687 39180621 31419394
39278 31419394 27682571 26361252 25099302 23113273 20919782 19019124 17760455 17519884
39270 17519884 17989759 18143542 17847195 18417559 20375861 21903037 21302173 20027949 21151513
39261 21151513 25350972 30580149 35376680 40107744 44786982 47994910 48610519 46779384
39253 46779384 42707547 36401153 29145965 23271895 19649225 17139751 15089180 14263598
39245 14263598 14487267 13761035 11251476 9017926 8848353 9233626 7798714 5322252 4690291
39236D690291J854758J980809K02730j044404j018028o78496m39395Q719M39243
39227E996227L70857J31937L50892P79507O52161j11158q51476j039242o75872
39218E603833j52339Q226k98071l80196M21358J523442J602848M17387q47071
39209G899417j230780r88566o84578l48326R2811M40165O01392N82023Q4035r28249
39199E519344j400477k68675J586628K003119M63204j185800j401702p55276m00511
39190D159854l17819n7683R5485j96589m79398k80331J25212M31220Q42855J287751
39180E610557J160439M81367J41448L43493J11213q99937j557058j164453p04292
39171C522777r73256j021126K5811J001913M49063p33563m55097J342064K599239
$$ plain form
39236 4690291 6545049 8525858 8728588 7684184 6666156 5987660 5548265 5556984 5996227
39227 5996227 6367084 6499021 6849913 7629420 8281581 8170423 7318947 6279705 5603833
39218 5603833 5451494 5459720 5161649 4781453 5202811 6726253 8329101 8746488 7899417
39209 7899417 6668637 5680071 4995493 4647167 4739978 5180143 5781535 6363558 6447593 5519344
39199 5519344 4118867 3850192 5436820 7439939 7903143 6717343 5315641 4560365 4159854
39190 4159854 3842035 3784352 3879837 3683248 3203850 2923519 3048731 3479951 4322806 5610557
39180 5610557 6770996 7252363 7393811 7737304 7848517 6948580 5391522 4227069 3522777
39171 3522777 2549521 1528395 1554206 2556119 3005182 2271619 1816522 3158586 5757825
39162E757825K042536M24885j036412j875757j978912j346874m33792K67371Q80027
39153B700897J502546J408004J48788r96058k97525J769878K775776J499641n89184
39144I922763j449942q09230J82169N88070L23592j49130k61647N0010K6945r95425
39134G428175k333917k508064j230114J14096L65982N3490L24328J167550J541899
39125D923425R37637N0727r5096P53053J892642K325909J618076L00587n53934
39116A2153026k93325O71621J175547L71535j323106k379454j513220R92434L456139
39107A3311197M348939L641882K806674L601637O307234Q602705O925512L10322
39099D9856102p345628j0570029q264726m662802l640509m137853k895333J10852
$$ plain form
39162 5757825 7800361 8225246 7188834 5313077 3334165 1987291 1553499 1820870 2700897
39153 2700897 4203443 5611447 5760235 4764177 4466652 6236530 9012306 10511947 9922763
39144 9922763 8472821 7663591 7845760 8433830 8757422 8608292 8346645 8396655 8423600 7428175
39134 7428175 5094258 2586194 1356080 1470176 1836158 1889648 2213976 3381526 4923425
39125 4923425 5861062 5911789 5816693 6569746 8462388 10788297 12406373 12706960 12153026
39116 12153026 11859701 12531322 13706869 14078404 12755298 10375844 8862624 9855058 13311197
39107 13311197 17660136 21302018 24108692 27710329 34017563 42620268 49545780 49856102
39099 49856102 42510474 31940445 23675719 19012917 15372408 11234555 8339222 8450074
39091H450074J756589O53955r97104r68765K7024J55311n53194o81792Q2736O05301
39081H530135K05134m32953m58021m3040N1124m37742j126951j687315k118698
39072B481673k247132j526550J64578J851655K268206J309448J05094l14607K05788
39063D298153J337343K457185K465915O96461j658011k385567j133523k3600n36109
39054E518247j366918p50472O05953Q39376M7967j80722K97278J50984p07021
39045D454672q45572n3169N2538j081755j655511l52900J346338J254731l97887
39036B721485j554078j262916m57535r3050J36335R96313K392671L211955K410083
39027H501263K95623j454216j495067l81880K00090l96373j255837j438403r19523
$$ plain form
39091 8450074 10206663 10860618 9863514 8894749 8921773 9077084 8523890 7842098 7924834 8530135
39081 8530135 8735269 8302316 7844295 7801255 7852379 7414637 6287686 4600371 2481673
39072 2481673 234541 -1292009 -1127431 724224 2992430 4301878 4406972 4092365 4298153
39063 4298153 5635496 8092681 10558596 11255057 9597046 7211479 6077956 6054356 5518247
39054 5518247 4151329 3400857 4006810 4846186 4894153 4713431 5010709 5161693 4454672
39045 4454672 3609100 3555931 3608469 2526714 871203 518303 1864641 3119372 2721485
39036 2721485 1167407 -95509 -553044 -646094 -509759 486554 2879225 6091180 8501263
39027 8501263 8796886 7342670 5847603 5465723 5665813 5269440 4013603 2575200 1655677
39018A655677P5367J358191K077131J176058p57953j510705j30289J441628R31015
39009F316120j104794k254204j689090p96329n69210l08451N54310J008110K0230
39000A176692j434213j337274N69194K207582J747520j86247j588285j663456
38992e08487j249856r02167J7814J787547L059260K289740j17223k170686k534694
38983c28752j523553j70540O96430O43817n9599l70013L62330J279044J091835
38974A620999J07795j04754Q51371J474342M86545j470593k794068k652832j335169
38965c816364K67864J129823Q29573J28196R8817O63611R25365Q14150J049081
38956B090116J420861P82781q04549j619561p67410M22189M77452j27319j15763
$$ plain form
39018 1655677 1731044 3089235 5166366 6342424 5584471 4073766 3943477 5385105 6316120
39009 6316120 5211326 2957122 1268032 471703 -97507 -405958 148352 1156462 1176692
39000 1176692 -257521 -1594795 -1025601 1181981 2929501 2743254 1154969 -508487
38992 -508487 -1758343 -2660510 -2642696 -855149 2204111 4493851 4376628 2205942 -328752
38983 -328752 -1852305 -2022845 -1326415 -682598 -742197 -1112210 -749880 529164 1620999
38974 1620999 1728794 1624040 2475411 3949753 4436298 2965705 171637 -2481195 -3816364
38965 -3816364 -3548500 -2418677 -1589104 -1460908 -1362091 -698480 226885 1041035 2090116
38956 2090116 3510977 4293758 3489209 1869648 1102238 1524427 2001879 1874560 1758797
38947A758797N51970J023294J004182P17855J94629m03211n10101p9460M6336
38938D304291n25231r85233p14133l27841m09592l67878L26960Q81396M11265
38929B594004n06740p37027k05049M43620Q90747R07763J92510o10711j18782
38920B850335J472759J931569K22849j624216j600480o95730o26404o51726M94680
38911A773636J339996j36427k327081j936750N42942J439160k9352n90553J350035
38902A425606K981674J765593p39509j856406j625391j356132q47050M62858J492756
38893A703999J106717K79264N15293J307272J135969o1479j252588k135862k822487
38884b23902k589044p69235J661036K920696K456079J084043k21571p65649k99362
$$ plain form
38947 1758797 2310767 3334061 4338243 5056098 5250727 4847516 4337415 4257955 4304291
38938 4304291 3779060 2793827 2079694 1751853 1342261 974383 1301343 2182739 2594004
38929 2594004 2087264 1350237 1145188 1588808 2479555 3387318 3579828 2969117 2850335
38920 2850335 4323094 6254663 6477512 4853296 3252816 2557086 1930682 1278956 1773636
38911 1773636 3113632 2977205 650124 -1286626 -743684 695476 666124 75571 1425606
38902 1425606 4407280 6172873 5433364 3576958 1951567 595435 -251615 211243 1703999
38893 1703999 2810716 3089980 3605273 4912545 6048514 5987035 4734447 2598585 -223902
38884 -223902 -2812946 -3582181 -1921145 999551 3455630 4539673 4318102 3552453 3253091
38875C253091L03723l10384j694658j507822R32320K748167J215907k017233k941943
38866a8832o26177J938406K200043Q06830k78815l44322L6989P9300o48700j744090
38856A400632j930487m63435J543028K267622J465909M76070K29089N22406J002930
38847F513764J471542J378001M25818m82480l68789j2166r25666k598488k785352
38838B616184q63327J156553J650689J406762J575373J519708L03594j143619
38830H221917j262315l82365o7652l64172L11197K366265L956733L509970J950573
38821A8240151J212127J374458P59556j299535l289814l609884k615765j685123
38813I086171j189170o11072k494J79228L27923J125637J875988J300242P9679
$$ plain form
38875 3253091 3556814 3246430 1551772 43950 976270 3724437 4940344 2923111 -18832
38866 -18832 -645009 1293397 3493440 4300270 4021455 3677133 3714122 3793422 3144722 1400632
38856 1400632 -529855 -993290 549738 2817360 4283269 4759339 4988428 5510834 6513764
38847 6513764 7985306 9363307 9789125 9306645 8937856 8925690 8000024 5401536 2616184
38838 2616184 1752857 2909410 4560099 5966861 7542234 9061942 9365536 8221917
38830 8221917 6959602 6577237 6509585 6145413 6456610 8822875 12779608 16289578 18240151
38821 18240151 19452278 20826736 21586292 20286757 16996943 13387059 10771294 9086171
38813 9086171 7897001 7285929 7283435 7462663 7790586 8916223 10792211 12092453 12172132
38804A2172132L32626K021395K479195P41682l65770J479170M199771M510191
38796B7570392L002311K682513L782610L809714K352585K203247N305367J0427169
38788F1135908J5232030J8716721K2544264L2085747N2568315P7849978Q5430976
38781C65563939N3824408j0171263o9584625r0417253p2978038m4582553k6763138
38774A04891477j9319226j3663357q390103o602167o940842n351335k198888j287097
38766D1138462l343339n399884n825280n703793n416066l697181o65591J349806
38758A2437134J044898j25902m71005l41868p10216j117673n62373N53089Q48871
38749A1554955l6965j030952j103272l44700L89985K99665p96757k126372k342564
$$ plain form
38804 12172132 12504758 14526153 17005348 17747030 17381260 18860430 23060201 27570392
38796 27570392 30572703 33255216 37037826 40847540 43200125 45403372 50708739 61135908
38788 61135908 76367938 95084659 117628923 149714670 202282985 280132963 365563939
38781 365563939 419388347 409217084 339632459 249215206 176237168 131654615 104891477
38774 104891477 85572251 71908894 63518791 56916624 49975782 44624447 42425559 41138462
38766 41138462 37795123 32395239 26569959 20866166 15450100 11752919 11087328 12437134
38758 12437134 13482032 13356130 12885125 12543257 11833041 10715368 10152995 10706084 11554955
38749 11554955 11517990 10487038 9383766 9039066 9429051 9728716 8931959 6805587 4463023
38740D463023r29441Q50221J218039J38378o59968j99159M04167r3378r21704
38731D270178n62120O00990P49176m22355j231202q43105n19754j100084j234158
38722b92434K67477J942433J630159j38104j001352m50966k12821r99953j375393
38713f30954m32764O45275P34515N51841R86090J286938N11824m85635l06220
38704B860910N84885N58922m69371q95790n0900P49741L10579o56568o90907L60346
38694B661847J333909J317995M59962n40253j083579r15287k82898J37049m1492
38685C047253k39966M46544J735361K022016M38113j511667j493201N33359J999231
38676F977043R99692j295754k385755j592035k19668P21712J346324J613568Q91615
$$ plain form
38740 4463023 3533582 4383803 5601842 5740220 5080252 4881093 5285260 5191882 4270178
38731 4270178 3708058 4309048 5058224 4635869 3404667 2561562 2041808 941724 -292434
38722 -292434 -24957 1917476 3547635 3409531 2408179 1957213 1744392 744439 -630954
38713 -630954 -1063718 -418443 316072 867913 1854003 3140941 3652765 3167130 2860910
38704 2860910 3445795 4004717 3535346 2639556 2588656 3338397 3648976 2992408 2301501 2661847
38694 2661847 3995756 5313751 5773713 5233460 4149881 3234594 2951696 3088745 3047253
38685 3047253 2807287 3253831 4989192 7011208 7449321 5937654 4444453 4977812 6977043
38676 6977043 7976735 6680981 4295226 2703191 2483523 3205235 4551559 6165127 7056742
38667G056742p49039k048091j982704q61660M03627J294084J575126J053683l2571
38658E709197r78249j299062r76752q9216R85443J197104p5752j584826j448867
38649A439020k5639L31554j075019k045634r93372N42874O45998K10353R89252
38640A9387K084893J292499r69846k071781j170734O3883O62882J359847K079468
38631C350498J463134k23087o07908R90515J956593L78981j711889j407331O31761
38622D821267J421082J66231j161864j233200p95571o66073n00180l7161J46131
38613B160662k55166o78033p30176p68719r60366p13065L43573J445777J369446
38604A213933j72680k025986k439450o82848J868729K710912Q97567j610542k054018
$$ plain form
38667 7056742 6307703 4259612 2276908 1415248 1818875 3112959 4688085 5741768 5709197
38658 5709197 4730948 3431886 2455134 2365918 3351361 4548465 4472713 2887887 1439020
38649 1439020 1413381 1744935 669916 -1375718 -2369090 -1826216 -1180218 -969865 19387
38640 19387 2104280 3396779 2426933 355152 -815582 -751699 -88817 1271030 3350498
38631 3350498 4813632 4590545 3982637 4973152 6929745 7308726 5596837 4189506 4821267
38622 4821267 6242349 6408580 5246716 4013516 3217945 2551872 2051692 2014531 2160662
38613 2160662 1905496 1227463 497287 -271432 -1231798 -1944863 -1601290 -155513 1213933
38604 1213933 1041253 -984733 -3424183 -4107031 -2238302 472610 1370177 -240365 -2294383
38595b294383m7197K224579K746831J570915O009q98725p06880N18639J938899
38586E058687K142102M40539k094957l395704k381970r3890J320976Q50399l65906
38577A480276o20207P3229J75875q96204j810902j401629l28102L84319J090729
38568a852616K246184K608534Q93632j500569j915581l88820M16634n29791j239312
38559a261705m16115K95528n98345j622515q64629O11082N00280q91293j260803
38550e508515m0425J144679J426199J497016J437343L40869j369846j680325j4093
38541b767098J511929J056128m30827r63837l16742M16573Q40224J179147J012663
38532A538160j83951j591816j714621m71584O69429P41327L06397K16327L92823
$$ plain form
38595 -2294383 -2341580 -117001 2629830 4200745 4206754 3308029 2601149 3119788 5058687
38586 5058687 7200789 7641328 5546371 2150667 -231303 -325193 995783 1846182 1480276
38577 1480276 860069 933298 1109173 212969 -1597933 -2999562 -3327664 -2943345 -1852616
38568 -1852616 393568 3002102 3895734 2395165 479584 90764 507398 -22393 -1261705
38559 -1261705 -1677820 -1382292 -1980637 -3603152 -4467781 -3856699 -3356419 -4247712 -5508515
38550 -5508515 -5548940 -4404261 -2978062 -1481046 -43703 297166 -1072680 -2753005 -2767098
38541 -2767098 -1255169 -199041 -629868 -1593705 -1910447 -1493874 -653650 525497 1538160
38532 1538160 1354209 -237607 -1952228 -2423812 -1754383 -1013056 -706659 -490332 -97509
38523i7509L03114q2392l16622p8494N41541J086546R97945K03429n59306m92651
38513A505601J44377K49699o24228j589639j566485n72180N56154J239909J388438
38504G31646R41940m4830r53803r88320j58331O89243R53237P81164L49026n04196
38494A796776j431568j287110L29431J892411J644182J58578l73299N00759P35813
38485C965973q35917k266588j262407J183919K088779P25307p39308p46851j10158
38476B002749J80408N57278J220280J014133m48040j311054j13300J482181R22320
38467E506955j187024j913146n84422K74140r09987k339329j819871L2749J248324
38458a691611J497750J678767J662981N93193j096380j939504j584388r67407
$$ plain form
38523 -97509 205605 123213 -193409 -271903 269638 1356184 2354129 2557558 1998252 1505601
38513 1505601 1649978 1899677 1275449 -314190 -1880675 -2452855 -1896701 -656792 731646
38504 731646 1673586 1628756 674953 -313367 -471698 217545 1170782 1951946 2300972 1796776
38494 1796776 365208 -921902 -592471 1299940 2944122 3102700 2729401 3230160 3965973
38485 3965973 3130056 863468 -398939 784980 2873759 3599066 2859758 2112907 2002749
38476 2002749 2183157 2740435 3960715 4974848 4526808 3215754 3102454 4584635 5506955
38467 5506955 4319931 2406785 1822363 2096503 1186516 -1152813 -2972684 -2939935 -1691611
38458 -1691611 -193861 1484906 3147887 3741080 2644700 705196 -879192 -1846599
38450a846599m41157M70740J363792J004593l41956o15700R57265K300239J507251
38441D358468j65722l68308M58222j41651k332107l273997j364993J296389K035268
38432E01569J185469P32920R05399M17510o58154p52633L91657J015423J23475
38423C862635q90091m84137O17665O73125l48128q51931j29865O59753K73620
38414C382646q76045j329454m84474O28311N44840q22837j889252j215804O19738
38405a442331J658466J050714l6057l34127j99408n65898j120190q36114J45107
38396a679838O11525K12240p8776L06319O16032J88953k88694J77839J242230
38387A307830J551493N29352r03959j446061q10342J07699K65665m40324j155135
$$ plain form
38450 -1846599 -2287756 -1817016 -453224 551369 209413 -406287 550978 2851217 4358468
38441 4358468 4192746 3824438 4282660 4141009 1808902 -1465095 -2830088 -1533699 501569
38432 501569 1687038 2419958 3325357 3742867 3084713 2332080 2723737 3739160 3862635
38423 3862635 2972544 2488407 3106072 3779197 3431069 2579138 2449273 3109026 3382646
38414 3382646 2506601 1177147 692673 1320984 1865824 1042987 -846265 -2062069 -1442331
38405 -1442331 216135 1266849 1230792 896665 697257 131359 -988831 -1824945 -1679838
38396 -1679838 -1068313 -856073 -934849 -628530 -12498 176455 -112239 65600 1307830
38387 1307830 2859323 3388675 2484716 1038655 228313 336012 601677 161353 -993782
38378i93782j084893k96849O16810J272270J516700J149314K71189l73603j75319
38369A901837L91803L93410j76780n74147o74635r24660r34130K92270K240051
38360A935019K672693O18550j808131k043217n25115K49211m15708n33913J249463
38351A398852L216862K613413o51456l571119l427677q24150J262769J135769
38343A153263P6018K3591P63846P71960O6391J34985J028289Q94223q07713j955740
38333B149113j063906K09755j51192j107920m97374J049599J137950k18232o58769
38324H49024L96586Q62033k84862j357726j011740k97318l94567n93634Q404P28630
38314a095170O80289K90799J43624q7799l68050K49126J580498J663925j96279
$$ plain form
38378 -993782 -2078675 -2375524 -1758714 -486444 1030256 2179570 2450759 2077156 1901837
38369 1901837 2293640 2687050 2510270 1936123 1261488 336828 -597302 -305032 1935019
38360 1935019 4607712 5226262 3418131 1374914 849799 1099010 683302 149389 1398852
38351 1398852 4615714 7229127 6577671 3006552 -421125 -1245275 17494 1153263
38343 1153263 1229281 1252872 2016718 2788678 2855069 2990054 4018343 4912566 4104853 2149113
38333 2149113 1085207 1294962 1143770 35850 -461524 588075 1726025 1507793 849024
38324 849024 1245610 2107643 1822781 465055 -546685 -844003 -1238570 -1832204 -1823800 -1095170
38314 -1095170 -414881 -124082 19542 -68257 -436307 -187181 1393317 3057242 2860963
38305B860963j642383n56435J552011J792784J63680r74945p20866k70988k29998
38296A973823J75954J205022K025772K159139J894883J474637J316484K376618
38288A4602332M468043N038097J974587k840704n273393m029028j559520j33404
38280A2247010K29345l3014p05327k89480K746757O188175N116696j312454p322474
38271A6865234p389176l128555l17580j067968k504391k161756r46320m68660
38263a119172m89514q6471O21202J029683J138343J217093J103020M29634p72494
38254C071324j917541k181327j233554J24714N91103M920l38253M57199J546738
38245A25323J632983P99202J07104J4135J70042K42863K6635p18131j640637j650977
$$ plain form
38305 2860963 1218580 662145 2214156 4006940 4170620 3195675 2474809 2203821 1973823
38296 1973823 2149777 3354799 5380571 7539710 9434593 10909230 12225714 14602332
38288 14602332 19070375 24108472 26083059 23242355 17968962 13939934 12380414 12247010
38280 12247010 12476355 12443341 11738014 11448534 14195291 20383466 25500162 24187708 16865234
38271 16865234 9476058 6347503 6029923 4961955 2457564 295808 -650512 -1119172
38263 -1119172 -1608686 -1695157 -1073955 -44272 1094071 2311164 3414184 3843818 3071324
38254 3071324 1153783 -1027544 -2261098 -2136384 -1545281 -1540361 -1878614 -1421415 125323
38245 125323 1758306 2557508 2664612 2678747 2848789 3091652 3118287 2400156 759519 -891458
38235h91458l57568R93702J040437J16654n12033n10239l71068j61737K59059
38226c94251L62136k76442q49925m79898L7763n93544j623622r49248J509883
38217c257148L178573K253930R6430p75211J44822J281539J353063O99179K95088
38208E270265J88474n11208j976525k699000j283716J035156J456596l48164j429708
38199b97830n1870J393355K54796j739067j056891J725114K521771K9508k478697
38190C00189k275458n36209N61054Q84026J020295P33337L35926J041580K389136
38181D453876J914171q89098k920194j816005O01816J490113J058603Q33164L43443
38172E069889j170432j831791K50789K800657J896918j874761l807999j765984
$$ plain form
38235 -891458 -1249026 -255324 785113 901767 389734 -120505 -491573 -653310 -394251
38226 -394251 -32115 -308557 -1158482 -1638380 -1600617 -2194161 -3817783 -4767031 -3257148
38217 -3257148 -78575 2175355 2271785 1496574 1641396 2922935 4275998 4975177 5270265
38208 5270265 5458739 4947531 2971006 272006 -1011710 23446 1480042 1131878 -297830
38199 -297830 -349700 1043655 1298451 -440616 -1497507 227607 2749378 2778886 300189
38190 300189 -1975269 -2511478 -1950424 -1066398 -46103 687234 1023160 2064740 4453876
38181 4453876 6368047 5478949 2558755 742750 1344566 2834679 3893282 4726446 5069889
38172 5069889 3899457 2067666 2318455 5119112 7016030 5141269 1333270 -432714
38164d32714J259299J994376Q86954K3262q6896m7390j6693r3107o83635j408044
38154A395412j122435J16284O96132r2645q91823n25524K34663L05326J21492
38145B36882M34798O34403r9478r19736l04923J518681K647110J894241k3123
38136F018855j661938k233677j727706n36357O54642J088325N43985k91599l88762
38127A465768M40097J129468O37618m80245o61397L23831Q60103J7746p91394
38118B941595m3255J224272Q87726q66781j816344j088468n0113K47727L06783
38109A743142N33228M94908L39067Q67138J593221Q91733j143514k246419j395814
38100A676690l41155m04265k52634J224120K163906M66896k403483l207519j531510
$$ plain form
38164 -432714 826585 2820961 3707915 3731177 3644281 3596891 3580198 3487091 2803456 1395412
38154 1395412 272977 389261 1085393 992748 100925 -424599 -189936 115390 236882
38145 236882 671680 1306083 1206605 286869 -18054 1500627 4147737 6041978 6018855
38136 6018855 4356917 2123240 395534 -140823 513819 1602144 2146129 1854530 1465768
38127 1465768 1905865 3035333 3672951 3192706 2531309 2855140 3715243 3732989 2941595
38118 2941595 2898340 4122612 5010338 4143557 2327213 1238745 1188632 1436359 1743142
38109 1743142 2276370 2771278 3110345 3977483 5570704 6462437 5318923 3072504 1676690
38100 1676690 1335535 931270 678636 1902756 4066662 4533558 2130075 -1077444 -2608954
38091b608954J16368K56034j07344J63083Q35113J323569J350847N05274j200977
38082F33013k360524j436878R22718K378186J786027K26837p96857p98874m0407
38073E13241P99905Q12950k4732l49153N60192J024706p29826l176190l039821
38064c608728j64746K033589J483334q915j46737O43050R25695Q37547J047309
38055C041398R88211J08282n69863o0316O41472R9950j156105j648910j391786
38046E2333j333990j187599K0765J661192J933724N91158o78434p92181m91621
38037b24653o50265q68020l70786P32587J635743J643074O25620p53724j382292
38028C87284q99728k35012k19678k81654L84724J035610L51079j186987j701267
$$ plain form
38091 -2608954 -2492586 -2236552 -2343896 -2180813 -1345700 -22131 1328716 1833990 633013
38082 633013 -1727511 -3164389 -2241671 136515 1922542 2149379 1352522 553648 513241
38073 513241 1313146 2126096 2101364 1752211 2312403 3337109 2607283 -568907 -3608728
38064 -3608728 -3773474 -1739885 -256551 -265466 -412203 230847 1156542 1994089 3041398
38055 3041398 4029609 4137891 3568028 3507712 4149184 4249134 3093029 1444119 52333
38046 52333 -1281657 -2469256 -2448491 -787299 1146425 1737583 1059149 266968 -224653
38037 -224653 -874918 -1742938 -2113724 -1381137 254606 1897680 2523300 1769576 387284
38028 387284 -512444 -747456 -967134 -1248788 -864064 171546 522625 -664362 -2365629
38019b365629o90129M20622O87648P20137Q84326M15879p65863j151517J79399
38010a665127J874874K136165J094778Q2036m33431q11660j010914p72011l70079
38001A24631Q824Q52270K050774K050594n9316k445604k519345n76554O57811
37992A44085j9520j016170q55059j00432L28476O77001J124761Q84645j56138
37983A011649n17180O22433J653797P88604j035536j494712l96831K85121l41292
37974E76053r56727m57436L76576L82764k41002n64652k89382K90162Q95562J169369
37964A181287O71916l84707r93292n42218L38310O10917K5865r19646j622943
37955a634511j528845l35073J315523J970107R69974n52011j058142n32983j07347
$$ plain form
38019 -2365629 -3055758 -2635136 -1947488 -1227351 -343025 72854 -693009 -1844526 -1665127
38010 -1665127 209747 2345912 3440690 3522726 3089295 2277635 1266721 494710 124631
38001 124631 133455 985725 3036499 5087093 5027777 2582173 62828 -513726 144085
37992 144085 124565 -891605 -1746664 -1847096 -1518620 -841619 283142 1167787 1011649
37983 1011649 494469 1116902 2770699 3559303 2523767 1029055 632224 917345 576053
37974 576053 -380674 -838110 -461534 -78770 -319772 -884424 -1173806 -883644 11918 1181287
37964 1181287 1853203 1468496 475204 -67014 271296 882213 908078 -11568 -1634511
37955 -1634511 -3163356 -3498429 -2182906 -212799 757175 205164 -852978 -1385961 -1493308
37946a493308j31186J87391J152757J730914Q75721r40372k095551j503323L26530
37937a890427J741182J420679l20080j717039j386034J12704J030819O73075R8567
37928b36554L34133P68444J30897j395132k084008q46334J286270K318455J506809
37919A782980q1758r90630p78477q125N73986N65677N5940l53518q69R02417J131685
37908B799308p6478j648266j741086k77390P18955j19796j480028j181760O73258
37899b333283J809998R68159m62134n56666M89671Q52722k42818j455536j185437
37890b115324K47439R78880L8325j327440j267347J69360J074750L58931o52862
37881b495288p6175J801440K841670J938138L17202l92676k91270n82816j492290
$$ plain form
37946 -1493308 -1624494 -1437103 -284346 1446568 2322289 1381917 -713634 -2216957 -1890427
37937 -1890427 -149245 1271434 951354 -765685 -2151719 -2039015 -1008196 -335121 -236554
37928 -236554 97579 866023 996920 -398212 -2482220 -3328554 -2042284 276171 1782980
37919 1782980 1701222 710592 -67885 -76010 497976 1063653 1119593 766075 765206 1667623 2799308
37908 2799308 2722830 1074564 -666522 -943912 -224957 -344753 -1824781 -3006541 -2333283
37899 -2333283 -523285 444874 -17260 -573926 -84255 768467 525649 -929887 -2115324
37890 -2115324 -1867885 -889005 -850680 -2178120 -3445467 -3276107 -2201357 -1842426 -2495288
37881 -2495288 -2571463 -770023 2071647 4009785 4326987 3934311 3643041 3060225 1567935
37872A567935j906580j100264Q6312K94563n46814j098502l30827J159436J900622
37863B5881J295384J28950n24828l58389J63186K64214o25492k069556k389496
37854d090146l57321K621574L438950J188028j314239j234977M09890N92176r64507
37845B89428j479205M05626K463549K160952N4282j459322j378876o47501l27075
37836H1858m98056n73161O4928J341714K095737J219968n24856j054433J32480
37827B286179J002694j25355k123939k753330j632582p2481J027299J506874J042830
37818A58189k82623j087469k12109J197756R82144p94003j801572q28008O52591
37809b015104Q26803j38298q91626p73542p9338O54315R24251M67712l25206p29107
$$ plain form
37872 1567935 -338645 -1438909 -1352597 -1058034 -1604848 -2703350 -3034177 -1874741 25881
37863 25881 1321265 1450215 925387 566998 730184 994398 368906 -1700650 -4090146
37854 -4090146 -4447467 -1825893 1613057 2801085 1486846 251869 661759 1253935 289428
37845 289428 -1189777 -784151 1679398 3840350 3894632 2435310 1056434 408933 81858
37836 81858 -416198 -989359 -924431 417283 2513020 3732988 3208132 2153699 2286179
37827 2286179 3288873 3163518 1039579 -1713751 -3346333 -3418814 -2391515 -884641 158189
37818 158189 -124434 -1211903 -1424012 -226256 755888 -38115 -1839687 -2667695 -2015104
37809 -2015104 -1188301 -1326599 -2218225 -2991767 -3071105 -2416790 -1492539 -1024827 -1350033 -2079140
37799b079140o03815l81471j31199N04586J357623J658924J116536K28870n72953
37790A097961j190093j251860l63759Q78971J270640O42990K7893k4044l1617
37781A057082k17842J8138P44232J008302L94068k38159k61792j76070k45726
37772B082233J90852J033851P41455j144560k360973q57366J774150K220523K61077
37763C941242r40214M14427K192534J596052q86509k440580j863831p68631q78907
37754C65583j616371j200295N99759K035717J806361P34797K67752K82712k83017
37745B992998j230975j278972l56024J39428l01285n34932O2880N72585M73658
37736E39361N91771J050928M91984j191107j685296J28654J713889O74014j159859
$$ plain form
37799 -2079140 -2682955 -3064426 -3195625 -2691039 -1333416 325508 1442044 1670914 1097961
37790 1097961 -92132 -1343992 -1707751 -828780 441860 1084850 1112743 1088699 1057082
37781 1057082 839240 857378 1601610 2609912 3003980 2765821 2504029 2327959 2082233
37772 2082233 2273085 3306936 4048391 2903831 542858 -314508 1459642 3680165 3941242
37763 3941242 3001028 3415455 5607989 7204041 6317532 3876952 2013121 1244490 365583
37754 365583 -1250788 -2451083 -1851324 184393 1990754 2725551 2993303 3276015 2992998
37745 2992998 1762023 483051 127027 266455 -34830 -569762 -506882 65703 539361
37736 539361 1131132 2182060 2674044 1482937 -202359 -73705 1640184 2314198 1154339
37727A154339p70458P66652J83485j908059j627281J425332K924558O25106k052253
37718G21421j487175Q34981J375545K6036o79729N5102P99185P25167L37868n716
37708B702685k97815j77489M12333O19319N2998k78334K79853O37936j49263r92019
37698B810204n57132L51479J79012p68764j162601j047634j252748j341872l96731
37689c186787R19398J270728Q83148P23585L58332r68571k041893j196285O08332
37680b630013J147762O89226J129493J941389Q35239j527581j735497O45905J850121
37671B346044P369j706783m11828J790061J585140k51194r08681m59731q92633
37662A097764j923352j625583k42422K52669j84243J34019J100639Q56183o41748
$$ plain form
37727 1154339 383881 1150533 1334018 -574041 -2201322 -775990 2148568 2773674 721421
37718 721421 -765754 69227 1444772 1470808 791079 846181 1645366 2370533 2708401 2702685
37708 2702685 2404870 2227381 2639714 3259033 3312031 3033697 3313550 3951486 3802223 2810204
37698 2810204 2253072 2604551 2783563 2014799 852198 -195436 -1448184 -2790056 -3186787
37689 -3186787 -2267389 -996661 -113513 610072 968404 -167 -2042060 -3238345 -2630013
37680 -2630013 -1482251 -793025 336468 2277857 3113096 1585515 -149982 495923 2346044
37671 2346044 2353413 646630 234802 2024863 3610003 3358809 2450128 1990397 1097764
37662 1097764 -825588 -2451171 -2693593 -2440924 -2625167 -2491148 -1390509 -534326 -1176074
37653a176074j355110p64770n43348j062612m64759J690283K914481J551727n74376
37644B15442j139546o16760m63373j42942J342803K482591R78756k095609k958829
37635b397467l23490K702798K877835Q04260p68009q96223p62320r70071o89377
37626d22064M44985J356254J069650K2373q34387j220947j102116j51263J308777
37617D71262J796165N18309r78787o86393Q19768J199465M6846o01484J67357
37608B752508O94198m0370m18971O90473J249748p53881l240106k565404P57578
37599h74227K474126P69114j440461j241921L91353J021819N13757L27711P28438
37590B669709P36967m2518j100844j863240j791098n22544J123577J380835r6205
$$ plain form
37653 -1176074 -2531184 -3295954 -3839302 -4901914 -5366673 -3676390 -761909 789818 215442
37644 215442 -924104 -1540864 -2004237 -2147179 -804376 1678215 2656971 561362 -2397467
37635 -2397467 -2720957 -18159 2859676 3663936 2895927 1999704 1237384 267313 -422064
37626 -422064 22921 1379175 2448825 2471198 1636811 415864 -686252 -837515 471262
37617 471262 2267427 2785736 1806949 1120556 1940324 3139789 3186635 2585151 2752508
37608 2752508 3446706 3406336 2987365 3677838 4927586 4173705 933599 -1631805 -874227
37599 -874227 1599899 2369013 928552 -313369 77984 1099803 1613560 1941271 2669709
37590 2669709 3406676 3364158 2263314 400074 -1391024 -1913568 -789991 590844 494639
37581D94639j257172m18023J151176J142431k08713o22189M81147J064056k21097
37572A606255j832049j583506K62423J566772J283451L98861j6267k80379r84963
37563D20598j447407n46805J208186J901209Q46195l81999l54616J53011j66560
37554A631812p30209k89607L88542l68247j758626j250184R71776J572662o75702
37545e07783k412035o34305K605137L327003J365110l31952p24673j331678k382958
37536a028134k059097n8870J295970N93104o01698m24066O91420J393728J550084
37527A352441J572356J095559j80434j383922j548573j035958p75142p65633l90429
37518b059735K87428N28916L3297n85233m01098Q54332K198740K071930K70377
$$ plain form
37581 494639 -762533 -1180556 -29380 1113051 904338 282149 763296 1827352 1606255
37572 1606255 -225794 -1809300 -1546877 19895 1303346 1702207 1685940 1405561 420598
37563 420598 -1026809 -1573614 -365428 1535781 2381976 1999977 1645361 1798372 1631812
37554 1631812 901603 611996 1000538 632291 -1126335 -2376519 -1404743 167919 -507783
37545 -507783 -2919818 -3554123 -948986 2378017 3743127 3411175 2686502 1354824 -1028134
37536 -1028134 -3087231 -3146101 -1850131 -1257027 -1858725 -2282791 -1591371 -197643 1352441
37527 1352441 2924797 4020356 3839922 2456000 907427 -128531 -903673 -1669306 -2059735
37518 -2059735 -1772307 -1243391 -1210094 -1795327 -2196425 -1342093 856647 2928577 3198954
37509C198954j256298p18384Q37139Q95282o37591j210780J95044J247469N3518
37500B604353j566371q51467J508274K429194J021949n90867q52683n62720o46709
37491B492953m68867N55914J374495P07661q94876j656733q23058O03033J217050
37482C107572O91227r8300j14019P02259J343301R20641k53335j129811j264964
37473C904571j107815j018170p38645o3300O15145Q32723O92423N57254M16402
37464D090588j458o40166j056095r55331n16889j38175m7578j99548l64626k56084
37454h5362K27544P36943O69183p6445p28668n16716J55807J01553r05324j593684
37444b015169r28685M04001J067121R38793Q16704P86978K63744n67769q34363
$$ plain form
37509 3198954 1942656 1224272 2061411 2956693 2319102 1108322 1303366 2550835 2604353
37500 2604353 1037982 186515 1694789 4123983 5145932 4555065 3702382 3139662 2492953
37491 2492953 2024086 2580000 3954495 4662156 3767280 2110547 1287489 1890522 3107572
37482 3107572 3798799 3700499 3586480 4288739 5632040 6552681 6299346 5169535 3904571
37473 3904571 2796756 1778586 1039941 976641 1591786 2424509 3116932 3674186 4090588
37464 4090588 4089130 3448964 2392869 1437538 920649 782474 734896 535348 170722 -85362
37454 -85362 142182 879125 1548308 1471863 743195 226479 382286 483839 -421485 -2015169
37444 -2015169 -2943854 -2539853 -1472732 -533939 282765 1069743 1333487 765718 -68645
37435f8645n37957n26991p45530k11591Q25560O29369j159031k271322r46114
37426e012252J240920J596043K27075m61523L68634R43462j35783j813730k160580
37417e207734p44912J207187K211062J721879N45325J13158P92012J224699J77696
37408B040372j434183j626630j85989J060239R00399J73483J39699P41074J115115
37399B923579Q34904N8184p52062q69767Q2127J252785J241679k2321j116292
37390C632816j191871r76530j110545q45142M87942J770890J334477n54152j797312
37381G50573j052481Q08595J953536J505074n755j445364j938195j280703j427
37372g06147R05590O37096o38471j685051j354028J5715Q97050N29423j71043
$$ plain form
37435 -68645 -606602 -1133593 -1879123 -2090714 -1265154 -635785 -1794816 -4066138 -5012252
37426 -5012252 -3771332 -2175289 -1948214 -2409737 -2041103 -1097641 -1233424 -3047154 -5207734
37417 -5207734 -5952646 -4745459 -2534397 -812518 -267193 -154035 637977 1862676 2040372
37408 2040372 606189 -1020441 -1206430 -146191 754208 927691 1067390 1808464 2923579
37399 2923579 3758483 3816667 3064605 2194838 2276965 3529750 4771429 4749108 3632816
37390 3632816 2440945 1464415 353870 -491272 -3330 1767560 3102037 2547885 750573
37381 750573 -301908 506687 2460223 3965297 3959542 2514178 575983 -704720 -706147
37372 -706147 199443 836539 198068 -1486983 -2841011 -2825296 -1928246 -1398823 -1569866
37363a569866j58921K18879J84587Q7356O14072J163139P22469r5753J17175R06101
37353B189238M10696j293845j837397l58770Q53058j6118j312407n94151J437933
37344e21763K090297P15851p58431q94976k75112m3510n46428j427970j881540
37335c543582j013881R93388K522351K351174J197873L42804l27370j417271k164071
37326a058585j427242J22369Q44207O75308P22264P73256k98014j770596j486798
37317b903831N19072J535389K92279r94483j71658J484538J385977m72186j783561
37308a108464j175893N74689J988071K108235P85209j026976j678093n84647Q49922
37299G32053R93164J01016l15809K86643R94195Q63250j15646j275317j730726
$$ plain form
37363 -1569866 -1728787 -1509908 -1325321 -1237965 -623893 539246 1261715 1165962 1283137 2189238
37353 2189238 2599934 1306089 -531308 -890078 -37020 -53138 -1365545 -1959696 -521763
37344 -521763 1568534 2284385 1525954 630978 355866 312356 -234072 -1662042 -3543582
37335 -3543582 -4557463 -3564075 -1041724 1309450 2507323 2850127 2522757 1105486 -1058585
37326 -1058585 -2485827 -2363458 -1519251 -843943 -121679 651577 353563 -1417033 -2903831
37317 -2903831 -2384759 -849370 -557091 -1551574 -1723232 -238694 1147283 675097 -1108464
37308 -1108464 -2284357 -1709668 278403 2386638 3171847 2144871 466778 -117869 732053
37299 732053 1725217 1826233 1510424 1797067 2791262 3654512 3538866 2263549 532823
37290E32823q82154P85778J723246R16093p65951j551123q99872O3950J81574
37281A04364l52866m26775M75626J459487J159029m46068j737497j524912o53335
37272a942947m44276l44607R69727K576958K018964n59503j845686k17830J610128
37263A820928Q49217j021129j026406K38440o8332j771479j732305P95822K647992
37254G32748J582425n45354r89745M4133O17064K08529l02478n17455n44456n618
37244B79793J290634K193026J286369r56595k351908j558585L73251J354535O69396
37235B579916m60537o80826k59487l72784r91334q31884K65056O18345n06401
37226f39936j127980M82604K520551K003001n06863j702843p95756m32750j807784
$$ plain form
37290 532823 -349331 436447 2159693 3075786 2309835 758712 -141160 -77210 104364
37281 104364 -248502 -675277 -199651 1259836 2418865 1972797 235300 -1289612 -1942947
37272 -1942947 -2387223 -2731830 -1762103 814855 2833819 2274316 428630 210800 1820928
37263 1820928 2670145 1649016 622610 861050 792718 -978761 -2711066 -1915244 732748
37254 732748 2315173 1769819 780074 824207 1441271 1649800 1347322 829867 285411 279793
37244 279793 1570427 3763453 5049822 4093227 1741319 182734 555985 1910520 2579916
37235 2579916 2119379 1438553 1179066 806282 -185052 -1016936 -751880 -133535 -639936
37226 -639936 -1767916 -1285312 1235239 3238240 2731377 1028534 232778 -199972 -2007756
37217b007756k511616p85861J361742J495108M84120L62474P03590l0121j214641
37208b142961j089744O5593N72596L72857P52409J599510J499856L01766p04310
37199A227572r37341p72306o1968J362279K168683R96877q13224o50578J198734
37190C718728J670358l59443k372277k176270q60608l58083m22816J12585Q37457
37181b10369N37774n59541j049525l46429P79355J300142Q55345m368k08489N59760
37171A653655J064008R2277j386273j351638j9095K48313j132903j625757N23063
37162a934350L292427L657202J605875n85749j666278j917995j486198l68125
37154E96809O00366O33630L20525M64206M13446o69856j752377j266431J18397
$$ plain form
37217 -2007756 -4519372 -5305233 -3943491 -2448383 -1964263 -1601789 -898199 -928320 -2142961
37208 -2142961 -3232705 -3167112 -2594516 -2221659 -1469250 130260 1630116 1931882 1227572
37199 1227572 290231 -482075 -544043 818236 2986919 3983796 3170572 2519994 3718728
37190 3718728 5389086 5029643 2657366 481096 -379512 -737595 -1160411 -1047826 -210369
37181 -210369 327405 -232136 -1281661 -1628090 -848735 451407 1306752 1302384 1093895 1653655
37171 1653655 2717663 2809940 1423667 72029 52934 301247 -831656 -2457413 -1934350
37162 -1934350 1358077 5015279 6621154 6035405 4369127 2451132 964934 596809
37154 596809 1197175 1830805 2151330 2615536 3028982 2359126 606749 -659682 -541285
37145e41285L91707m27374l00165J282071K243022J176901m82668p26275K19325
37136B835259O79348L4177q78411j258999j132685q60107o51397n84179o83580
37127b500574q64783q53740k87524P91508J537446J043345k56858p90469l218
37118b184867P03004J07461q38108n48718N64995P94660n4490m89412J68043R92087
37108g85345J235454J048155K71441j452079k940374k050234J024664L039241
37100f09077J695805j249020k455227j239642M44750J241914J494862J474250
37092G98615O16219j012572k035170j404016J29714R89970P89137O18950J367152
37083H57999K378707K200319M23108j732192k714744k031143k46134J649847K481325
$$ plain form
37145 -541285 -149578 -576952 -877117 404954 2647976 3824877 3342209 2615934 2835259
37136 2835259 3514607 3548784 2670373 1411374 278689 -581418 -1232815 -1816994 -2500574
37127 -2500574 -3365357 -4219097 -4506621 -3715113 -2177667 -1134322 -1391180 -2181649 -2184867
37118 -2184867 -1481863 -1374402 -2212510 -2761228 -2196233 -1401573 -1456063 -1945475 -1777432 -785345
37108 -785345 450109 1498264 1769705 317626 -2622748 -4672982 -3648318 -609077
37100 -609077 1086728 -162292 -2617519 -3857161 -3412411 -2170497 -675635 798615
37092 798615 1414834 402262 -1632908 -3036924 -2907210 -1917240 -1128103 -509153 857999
37083 857999 3236706 5437025 5860133 4127941 1413197 -617946 -864080 785767 3267092
37074C267092J411933q73486k207027j289854M91264Q38243l24572j035760m09910
37065a32077K54097k11491j157491j477027j213651q96090m07178M90169J306970
37056c443769J407784R05688L55154K7691j05434j63498l29526m99096p6145J044433
37046h76718J597457L99105j445475j506628N30997K216199J729171J33491o74804
37037B102795n68722n24499p22987o08134P5851J182996K207386K062191K29925
37028E436802j591659j024426J251276J828658k91368j852549n13810J196017
37020D438941J2868k590818k824043o84249N22915j10780j43348J423327K411061
37011B455874J348196l10574r74686j061472j188021q13515O2892J95806o07013
$$ plain form
37074 3267092 4679025 3805539 1598512 308658 799922 1638165 1313593 277833 -132077
37065 -132077 122020 -89471 -1246962 -2723989 -3937640 -4833730 -5240908 -4750739 -3443769
37056 -3443769 -2035985 -1130297 -775143 -747452 -852886 -1016384 -1345910 -1845006 -1921151 -876718
37046 -876718 720739 1119844 -325631 -1832259 -1301262 914937 2644108 2777599 2102795
37037 2102795 1534073 1009574 286587 -321547 -245696 937300 3144686 5206877 5436802
37028 5436802 3845143 2820717 4071993 5900651 5609283 3756734 3242924 4438941
37020 4438941 4451809 1860991 -963052 -1647301 -1124386 -1235166 -1378514 44813 2455874
37011 2455874 3804070 3493496 2518810 1457338 269317 -544198 -481306 -285500 -892513
37002h92513o34804Q97264K169764J443891l05724j064272o67832l88723o90252
36993a33201r23711o05107J44430R00783J009334J37609p66255k02053J583450
36984A145279K347623P97436j470524k073471q19263N95733R87027N53744n4801
36975B008783m24269m19700k71217l10013k84232L87510J354606J318400j07861
36966C252007j488933j333101j1041Q78331M49208q19101j794935j545231r6509
36957b509305J257810J140738j05400p19974L0682Q51703M42979o38557r79699
36948a229023k43204P41268J081515L70784j095261k119373j508304L11272J538191
36939b152135J286186M77075L5834k92408o03274l1981J464836K067632M64058
$$ plain form
37002 -892513 -1527317 -630053 1539711 2983602 2677878 1613606 945774 557051 -133201
36993 -133201 -1056912 -1662019 -1517589 -616806 392528 530137 -236118 -438171 1145279
36984 1145279 3492902 4290338 2819814 746343 -72920 522813 1509840 2063584 2008783
36975 2008783 1584514 1164814 893597 583584 299352 686862 2041468 3359868 3252007
36966 3252007 1763074 429973 418932 1297263 1746471 927370 -867565 -2412796 -2509305
36957 -2509305 -1251495 -110757 -216157 -936131 -905449 -53746 389233 -249324 -1229023
36948 -1229023 -1472227 -730959 350556 721340 -373921 -2493294 -4001598 -3690326 -2152135
36939 -2152135 -865949 -388874 -353040 -645448 -1248722 -1280703 184133 2251765 2715823
36930B715823j873726k485680j176963J98193N82982O08308Q80842J008564N52196
36921A010539j84666o53665p37947p42337r33802j057550m59031Q68691J732503
36912a157265J190921J58559J17365N93341l3418j314820j025754Q26313J367963
36903G23205m55927j713347j19716K070844J631624n85774j420746m08558L81583
36894A03188J96873o6410l85651j214548j448055m0368J251169K39736j447577
36885b811643n03341K194437K378495o77723k738600j292704Q61312P11931l77720
36876b255556Q3650J246415R18381l63815m84466N69588J042578M30568k36342
36867I51001m16698l97308k37824L3384j43411q98347j251015n92259J83912K52419
$$ plain form
36930 2715823 842097 -1643583 -2820546 -2622353 -2039371 -1431063 -550221 458343 1010539
36921 1010539 825873 172208 -565739 -1308076 -2241878 -3299428 -3758459 -2889768 -1157265
36912 -1157265 33656 192215 309580 902921 869503 -445317 -1471071 -644758 723205
36903 723205 267278 -1446069 -1565785 505059 2136683 1550909 130163 -278395 103188
36894 103188 300061 233651 -152000 -1366548 -2814603 -2854971 -1603802 -1364066 -2811643
36885 -2811643 -3314984 -1120547 1257948 580225 -2158375 -3451079 -2589767 -1877836 -2255556
36876 -2255556 -2171906 -925491 -7110 -370925 -855391 -285803 756775 1187343 951001
36867 951001 534303 136995 -100829 -67445 -210856 -1109203 -2360218 -2952477 -2768565 -2516146
36857b516146L59834J320494K180443J558588o4185j063548j023391q08247p87855
36848h44013m67227L55717J214899J575536J091204k48842j625601j796228o31585
36839a376140O17769J122762J351008J538875R05419n38557j090470J81404J541316
36830D253386R48166r27584j972428j802254j525839j234137j38030J202701J205304
36821I285j02511q96802k99245N60735N99130J50414k22349o63526j054453n40151
36811b459473J007756K108872J343812o40809j737936q33456J011637J894514
36803A694917J149600j77100p56816l98428J74302M21867K53862l49814j088583
36794I23807j073223P3473J161927Q54983j39549j0303J206395J741243J201342
$$ plain form
36857 -2516146 -2156312 -835818 1344625 2903213 2839028 1775480 752089 -56158 -844013
36848 -844013 -1311240 -955523 259376 1834912 2926116 2677274 1051673 -744555 -1376140
36839 -1376140 -758371 364391 1715399 3254274 4159693 3621136 2530666 2712070 4253386
36830 4253386 5201552 4273968 2301540 499286 -1026553 -2260690 -2398720 -1196019 9285
36821 9285 -93226 -990028 -1289273 -728538 -129408 21006 -201343 -864869 -1919322 -2459473
36811 -2459473 -1451717 657155 2000967 1360158 -377778 -1211234 -199597 1694917
36803 1694917 2844517 2667417 1910601 1512173 1686475 2108342 2362204 2012390 923807
36794 923807 -149416 -75943 1085984 1940967 1801418 1791115 2997510 4738753 5940095
36785E940095J026187J436940Q59057o86645p90059J255665K813833K284526J705551
36776A5845150K641471L413440L627676O810229J3313357J4917888M264385j2298242
36768E2535354j9906942j3733245m160771j440531l413324k807935N54485J615781
36760I242872m00620j613041p62397n25702j903819k542261j178431L77732N94264
36751A288597L31212O45455R83881N29145m27707j141944j216423n89780K25657
36742F28093K01262q06332j371807n21337M81628L7763j045717p83039P10267
36733b469219J445421P30730j46277l20475k60954j94834L07049R32000P23486
36724G46927j47504m81997j32917k10559j000249j463666j065435l64448L51443
$$ plain form
36785 5940095 6966282 8403222 9262279 8575634 7785575 9041240 11855073 14139599 15845150
36776 15845150 18486621 21900061 25527737 32337966 45651323 60569211 64833596 52535354
36768 52535354 32628412 18895167 14734396 13293865 9880541 7072606 7627091 9242872
36760 9242872 8842252 7229211 6466814 5941112 4037293 1495032 316601 694333 1288597
36751 1288597 1619809 2265264 3249145 3778290 3350583 2208639 992216 402436 628093
36742 628093 829355 23023 -1348784 -1870121 -1388493 -1350730 -2396447 -3179486 -2469219
36733 -2469219 -1023798 -293068 -439345 -759820 -1020774 -1215608 -908559 23441 746927
36724 746927 599423 117426 -15491 -226050 -1226299 -2689965 -3755400 -4119848 -3768405
36715c768405J182644J355831J1377j615956j286739N79753J107506l75257r40476
36706c749722J161661L339939K565999j02954j647425j654542j658425j499010
36698c244479J40711K304940K386045K37520j409940j041211p1713J23196J50381
36689d24550N49135L28513r46448j647521m11812J496054J875103O13671n41919
36680H90226n09809K24120P14516M23089o07622j566589j362106k9208J013854
36671h09529Q16068J39295N8811L80955N24230Q37711J594663J693090J64517
36662E399811j732594j921808o33220m6817q79551j454575n07268J061683J842120
36653A127781J594969O47589p27177j643979r96544O60805J262030J48779q80716
$$ plain form
36715 -3768405 -2585761 -1229930 -1218553 -2834509 -4121248 -3541495 -2433989 -2809246 -3749722
36706 -3749722 -2588061 751878 3317877 3214923 1567498 -87044 -1745469 -3244479
36698 -3244479 -3103768 -798828 1587217 1824737 414797 -626414 -698127 -574931 -424550
36689 -424550 124585 453098 -493350 -2140871 -2552683 -1056629 818474 1432145 890226
36680 890226 380417 604537 1319053 1742142 1134520 -432069 -1794175 -1823383 -809529
36671 -809529 6539 145834 204645 585600 1109830 1947541 3542204 5235294 5399811
36662 5399811 3667217 1745409 1112189 1065372 185821 -1268754 -1776022 -714339 1127781
36653 1127781 2722750 3370339 2643162 999183 2639 663444 1925474 2074253 1193537
36644A193537m90806J13294m88225j339984q14281N34822J002347N40287L01826
36635E52817K57186l57519q58565L0264J405096R60762j245189k432338j158085
36626b845571O70706Q44670k11933p99558m75095J22595N94296P02364J58117
36617a239409m91349k0335J442535J962895N94394q34787l02776J279717J403614
36608C794499l62259j936434j645084O3423J694546K112009R68082j018775k250591
36599A419416j745280l31397M77592L56290m5293m90712r70879p47027P09305
36590a367985K147640J776461K2704q91878l17758o668r80291j764632r54312
36581b336719L95187O26330K38582P92520K020406K173817Q80016l90092p80727
$$ plain form
36644 1193537 702731 816025 327800 -1012184 -1826465 -1291643 -289296 250991 552817
36635 552817 810003 452484 -406081 -375817 1029279 1990041 744852 -1687486 -2845571
36626 -2845571 -2174865 -1330195 -1542128 -2341686 -2816781 -2694186 -2099890 -1397526 -1239409
36617 -1239409 -1730758 -1751093 -308558 1654337 2248731 1413944 1111168 2390885 3794499
36608 3794499 3432240 1495806 -149278 -85855 1608691 3720700 4688782 3670007 1419416
36599 1419416 -325864 -657261 -179669 176621 131328 -359384 -1330263 -2077290 -1367985
36590 -1367985 779655 2556116 2578820 1686942 1369184 1362516 382225 -1382407 -2336719
36581 -2336719 -1941532 -1315202 -1076620 -284100 1736306 3910123 4790139 4400047 3619320
36572C619320j107168j998340k624687k105626r64187k32517L4771M39881J060862
36563c877691J458043J429493J021885J92602q25661j238602n67160N13996J012859
36554h80236R59495J025001J174662Q40222K03466n1413k41550j350409k878896
36545a199658k817570o33850J382355J081907o23654j375769o98262J57636P39767
36536c987098J553647K188414J617598L44277j46N79491L48136r94141j423014
36527B27164J22156J736957J286543n98240j810465j626904p44613K72620J011709
36518a23073P71775l40299q54467O6591J136006R60431L31938O58832J270263
36509C877997N51674j022948j448161m23641L41986k4990o67942r46012j018939
$$ plain form
36572 3619320 2512152 513812 -2110875 -4216501 -5180688 -5413205 -5378434 -4938553 -3877691
36563 -3877691 -2419648 -990155 31730 224332 -601329 -1839931 -2407091 -1893095 -880236
36554 -880236 79259 1104260 2278922 3119144 3322610 3271197 3029647 1679238 -1199658
36545 -1199658 -4017228 -4651078 -3268723 -2186816 -2810470 -4186239 -4884501 -4726865 -3987098
36536 -3987098 -2433451 -245037 1372561 1716838 1716692 2296183 2644319 1650178 227164
36527 227164 349320 2086277 3372820 2774580 964115 -662789 -1407402 -1134782 -123073
36518 -123073 648702 308403 -546064 -479473 656533 1616964 1948902 2607734 3877997
36509 3877997 4429671 3406723 1958562 1534921 1876907 1851917 1183975 237963 -780976
36500g80976m43348J357496K942043J857964j406225l121236j275037J542759
36492F73440J879495j9488j369492r41879J58663P34115M77806n78227j837016
36483h22583j943052l84613J315674J496885P06669N17806Q07077K58881r09502
36474A043242j039268J09119Q27437K52215l81142m9489L87973n7681o84064m10484
36464b142K83167K14943m94552p23775j99685K76672K47592R4683J60387L09376
36454A66666L73008L05981R451l57098k12850M99071O73010n07014j866944j526333
36444b443052K05843J052133K36315l39654O04719J362280M3358j920285j637393
36435b835736P41530K183589J312000k3484k24039k14001r92125j381350j46326
$$ plain form
36500 -780976 -1224324 133172 3075215 4933179 3526954 405718 -869319 673440
36492 673440 2552935 2533447 1163955 222076 380739 1114854 1592660 1014433 -822583
36483 -822583 -2765635 -3150248 -1834574 -337689 368980 886786 1693863 1952744 1043242
36474 1043242 3974 113093 940530 1192745 811603 762114 1150087 1092406 408342 -2142
36464 -2142 281025 495968 1416 -722359 -922044 -645372 -397780 -303097 -142710 166666
36454 166666 539674 845655 855106 498008 285158 784229 1457239 950225 -916719 -2443052
36444 -2443052 -2237209 -1185076 -948761 -1288415 -683696 678584 721942 -1198343 -2835736
36435 -2835736 -2094206 89383 1401383 1377899 1153860 939859 -52266 -1433616 -1579942
36426a579942J447349J358412j37337j162891j133566q27177k88349J010725K217133
36417I04357J710276j15049r12443J83452J218330M21768j220197j621425n04423
36408F4646O58541P54175p0258j036641j362380p32708J72952J53331r47537j783010
36398d128889j211069K31990J243311J434775J269494R09178J22033q93927j430424
36389b453528j022431J29487J310830J624021O38026r14768j611224r41779J14037
36380c127329N51129O27481R86375J234712M73881j077273k030739j430900K61356
36371c531307J744920J948867P54042q10446j339140n31064M44905N71914L74064
36362c73245Q42009J553980J137000n37481j896709j632412j16184J375608J897301
$$ plain form
36426 -1579942 -132593 1225819 1088482 -74409 -1207975 -2035152 -2323501 -1312776 904357
36417 904357 2614633 2499584 1587141 1770593 2988923 3410691 2190494 569069 64646
36408 64646 723187 1477362 1407104 370463 -991917 -1724625 -1551673 -1398342 -2345879 -4128889
36398 -4128889 -5339958 -5107968 -3864657 -2429882 -1160388 -251210 -129177 -1023104 -2453528
36389 -2453528 -3475959 -3346472 -2035642 -411621 226405 -688363 -2299587 -3241366 -3127329
36380 -3127329 -2576200 -1948719 -962344 272368 746249 -331024 -2361763 -3792663 -3531307
36371 -3531307 -1786387 162480 916522 106076 -1233064 -1764128 -1319223 -747309 -373245
36362 -373245 468764 2022744 3159744 2622263 725554 -906858 -1023042 352566 2249867
36353B249867J093730o65724j985588j412241N87902J654038M61606j346533j416289
36344g79232m5571M54916n69096j215981l06934N45436m05699j890012j254235
36335e466408J437317L231288K360649L96806l86457K8921K63376r1652m68575
36326A305265p45377j142986j263804o10531L54746R01637J258583J817573J750854
36317C625960J62882j774135j892517k90254O02467l25108j279724n61178Q45618
36308h85989J110310M13022K10648O73126O67886j60468r11604r62135o85168
36299e30372n04358k35787L20966P83840N54423m22023j451748j708742j079648
36290d273449j97151M60560R90524J280953P28429m07915m73144J214183K466726
$$ plain form
36353 2249867 3343597 2677873 692285 -719956 -132054 1521984 1983590 637057 -779232
36344 -779232 -824803 -369887 -938983 -2154964 -2461898 -1916462 -2322161 -4212173 -5466408
36335 -5466408 -4029091 -797803 1562846 1959652 1573195 1602116 1865492 1773840 1305265
36326 1305265 559888 -583098 -1846902 -2457433 -2102687 -1201050 57533 1875106 3625960
36317 3625960 3788842 2014707 122190 -168064 434403 109295 -1170429 -1731607 -885989
36308 -885989 224321 637343 847991 1521117 2189003 2028535 1116931 154796 -530372
36299 -530372 -1034730 -1270517 -949551 -165711 388712 -33311 -1485059 -3193801 -4273449
36290 -4273449 -4470600 -4010040 -3019516 -1738563 -1010134 -1418049 -1891193 -677010 1789716
36281A789716R64454j751472j934054O86824K215159N00171j673940j157934Q85023
36272E23947J467553M83411o8111K02426J60840k58102l24081l82893r35676r78895
36262a09581J87542Q49570n16762j956346q26930J345182R25756j591048k071669
36253c764286L46797J746183N9077j538525j26241K233865K276219O70354k9811
36244A873632J7900r42614k305309j927846m4912R50693L42072j62274M47993
36235a750665J123654Q76888J81380l02271p58744j339051j474002p26213M14231
36226c754793J048213P95045P5926k56395L06529J274595J555956P31399m43302
36217A333173r63977n31054M45898J123324N97575j013327j965976p20014J596355
$$ plain form
36281 1789716 2754170 1002698 -931356 -244532 1970627 2470798 796858 -361076 523947
36272 523947 1991500 2474911 2406800 2609226 2770066 2511964 2187883 1804990 869314 -109581
36262 -109581 77961 927531 410769 -1545577 -2372507 -1027325 -101569 -1692617 -3764286
36253 -3764286 -3417489 -1671306 -1612229 -3150754 -3276995 -1043130 1233089 1903443 1873632
36244 1873632 1891532 948918 -1356391 -3284237 -3329149 -2378456 -2036384 -2198658 -1750665
36235 -1750665 -627011 249877 431257 128986 -629758 -1968809 -3442811 -4169024 -3754793
36226 -3754793 -2706580 -1911535 -1835609 -2092004 -1785475 -510880 1045076 1776475 1333173
36217 1333173 369196 -161858 284040 1407364 2004939 991612 -974364 -1694378 -98023
36208i8023K240725O54545q07667o00698j17532p76295j307470q0309J653572
36199G60848J417113o31430j991024j426743l9127R35548J278438Q87378k96631
36190H94370j397364j317875l74675K43988M15918Q67482J334271Q55523j65476
36181A356162k23373P43843J065122N2866r33658q63582o18525j136097j566490
36172b123732o85846R19126J532754O67287m61232o73121j80771q7330r27842
36163b020707j895891j680898j78715J129242J057151M01395P16828J794384J803128
36154A125917Q2062j667033j607834r0074J051730P78950l20180j002165n55689
36145b204316P01558J726182J752404J090873N85487L46237l38281j723522k916424
$$ plain form
36208 -98023 2142702 2797247 1989580 1388882 1271350 495055 -812415 -892724 760848
36199 760848 2177961 1546531 -444493 -1871236 -1910363 -974815 303623 1191001 894370
36190 894370 -502994 -1820869 -2195544 -1951556 -1535638 -668156 666115 1521638 1356162
36181 1356162 1132789 1876632 2941754 2994620 2060962 1197380 578855 -557242 -2123732
36172 -2123732 -2809578 -1890452 -357698 309589 -151643 -824764 -1005535 -1092865 -2020707
36163 -2020707 -3916598 -5597496 -5776211 -4646969 -3589818 -3188423 -2471595 -677211 1125917
36154 1125917 1207979 -459054 -2066888 -2156962 -1105232 -326282 -646462 -1648627 -2204316
36145 -2204316 -1502758 223424 1975828 3066701 3652188 3998425 3660144 1936622 -979802
36136i79802k752892r67823J575621L391998L253549J294512p55709j212800l80698
36127B465956m6169r57443j841748j339636Q5209R39262P22720K38040J65003
36118D31194K44234K8409k55039j08291K66997J02821o77013j066900m49130K27597
36108a255121j94323j077840r18480l0755j67886j138518m47744K415043M069313
36099A253689J951773j402079j919397q3193L40634j297403j742543L67001K217723
36090c13795J590253J34926J0719M83203J20328l62370M4778K13023j062786k374116
36080a515837j717490K18595J310609J276778J174965Q22814n21601j782141j261811
36071a995119K59105M86983n09999l28902J605453K817740J590659n33133j316668
$$ plain form
36136 -979802 -3732694 -4700517 -3124896 267102 3520651 4815163 4059454 2846654 2465956
36127 2465956 2419787 1462344 -379404 -1719040 -1633831 -694569 28151 266191 431194
36118 431194 675428 703837 448798 340507 607504 710325 33312 -1033588 -1482718 -1255121
36108 -1255121 -1449444 -2527284 -3445764 -3476519 -3644405 -4782923 -5230667 -2815624 1253689
36099 1253689 3205462 1803383 -116014 -199207 141427 -1155976 -2898519 -2531518 -313795
36090 -313795 1276458 1411384 1422103 1905306 2025634 1663264 1708042 1921065 858279 -1515837
36080 -1515837 -3233327 -3014732 -1704123 -427345 747620 1570434 1048833 -733308 -1995119
36071 -1995119 -1736014 -1249031 -1759030 -2087932 -482479 2335261 3925920 3392787 2076119
$$ [...]
##END NTUPLES=NMR SPECTRUM
##END=
