##TITLE=31Pdec_2PBDP1910
 CDCl3, 24 sc
 20.10.2020
##JCAMPDX= 6.0         $$ Bruker NMR JCAMP-DX V2.0
##DATA TYPE= NMR SPECTRUM
##DATA CLASS= NTUPLES
##ORIGIN= UXNMR, Bruker Analytische Messtechnik GmbH
##OWNER= root
$$ XWIN-NMR		Version 3.5
$$ Tue Oct 20 11:30:02 2020 Russian Standard Time (UT+4h)  she@DPX200
##.OBSERVE FREQUENCY= 81.013821
##.OBSERVE NUCLEUS= ^31P
##.ACQUISITION MODE= SIMULTANEOUS
##.ACQUISITION SCHEME= undefined
##.AVERAGES= 24
##.DIGITISER RES= 17
##SPECTROMETER/DATA SYSTEM= spect
##.PULSE SEQUENCE= zgpg30
##.SOLVENT NAME= D2O
##.SHIFT REFERENCE= (INTERNAL, D2O, 0, 182.463)
##AUDIT TRAIL= $$ (NUMBER, WHEN, WHO, WHERE, WHAT)
$$ ##TITLE= Audit trail, XWIN-NMR		Version 3.5
$$ ##JCAMPDX= 5.01
$$ ##ORIGIN= Bruker BioSpin GmbH
$$ ##OWNER= she
$$ F:/spectra/data/she/nmr/P31/1/pdata/1/auditp.txt
$$ ##AUDIT TRAIL=  $$ (NUMBER, WHEN, WHO, WHERE, WHAT)
(   1,<2020-10-20 11:29:00.12 +0400>,<she>,<DPX200>,
      <created by zg, POWCHK disabled, PULCHK disabled
       configuration hash MD5:
       00 E9 B6 7A A2 85 ED C7 34 08 36 98 17 FE 4E 26
       data hash MD5: 32K
       29 46 BD 7D 4A B1 30 2F CE C0 DB 2E 25 20 D9 91>)
(   2,<2020-10-20 11:29:02.71 +0400>,<she>,<DPX200>,
      <Start of raw data processing
       efp BC_mod = 2 LB = 1 FT_mod = 6 PKNL = 1 PHC0 = -2748.265 PHC1 = 71.60141 SI = 64K 
       data hash MD5: 64K
       87 DE 79 2F FE CB 3D 8F BF 9F 9D C8 08 A1 BC 9E>)
(   3,<2020-10-20 11:29:20.92 +0400>,<she>,<DPX200>,
      <pk PHC0 = 16.34319 PHC1 = -34.2 
       data hash MD5: 64K
       E9 0A 0A 3A BA BD 49 01 50 85 4B 20 E2 E5 8E CC>)
$$ ##END=
$$ 
$$ hash MD5
$$ 46 B2 AB BA D0 66 AC 80 90 61 5C D3 CC 6C 62 48
##$RELAX= 
##$RELAX= 
##$RELAX= 
##$RELAX= 
##$RELAX= 
##$RELAX= 
##$RELAX= 
##$RELAX= 
$$ Bruker specific parameters
$$ --------------------------
##$DU= <F:/spectra>
##$EXPNO= 1
##$NAME= <P31>
##$PROCNO= 1
##$TYPE= <nmr>
##$USER= <she>
##$AMP= (0..31)
100 100 100 100 100 100 100 100 100 100 100 100 100 100 100 100 100 100 
100 100 100 100 100 100 100 100 100 100 100 100 100 100 
##$AQSEQ= 0
##$AQ_mod= 1
##$AUNM= <au_zg>
##$AUTOPOS= <>
##$BF1= 81.014009
##$BF2= 200.13
##$BF3= 200.13
##$BF4= 200.13
##$BF5= 200.13
##$BF6= 200.13
##$BF7= 200.13
##$BF8= 200.13
##$BYTORDA= 1
##$CFDGTYP= 0
##$CFRGTYP= 5
##$CHEMSTR= <none>
##$CNST= (0..31)
1 1 145 1 1 1 1 1 1 1 1 1 1 1 1 1 1 1 1 1 1 1 1 1 1 1 1 1 1 1 1 1 
##$CPDPRG= <waltz16>
##$CPDPRG1= <>
##$CPDPRG2= <waltz16>
##$CPDPRG3= <>
##$CPDPRG4= <mlev>
##$CPDPRG5= <mlev>
##$CPDPRG6= <mlev>
##$CPDPRG7= <mlev>
##$CPDPRG8= <mlev>
##$CPDPRGB= <>
##$CPDPRGT= <>
##$D= (0..31)
0 1 0 0 0 0 0 0 0 0 0 0.03 2e-05 3e-06 0 0 0 0 0 0 0 0 0 0 0 0 0 0 0 0 
0 0 
##$DATE= 1603178939
##$DBL= (0..7)
120 120 120 11 120 120 24 19 
##$DBP= (0..7)
150 150 150 150 150 150 150 150 
##$DBP07= 0
##$DBPNAM0= <>
##$DBPNAM1= <>
##$DBPNAM2= <>
##$DBPNAM3= <>
##$DBPNAM4= <>
##$DBPNAM5= <>
##$DBPNAM6= <>
##$DBPNAM7= <>
##$DBPOAL= (0..7)
0.5 0.5 0.5 0.5 0.5 0.5 0.5 0.5 
##$DBPOFFS= (0..7)
0 0 0 0 0 0 0 0 
$$ [...]
##$SUBNAM2= <"">
##$SUBNAM3= <"">
##$SUBNAM4= <"">
##$SUBNAM5= <"">
##$SUBNAM6= <"">
##$SUBNAM7= <"">
##$SUBNAM8= <"">
##$SUBNAM9= <"">
##$SW= 369.568048894756
##$SWIBOX= (0..15)
0 1 3 0 0 0 0 0 0 0 0 0 0 0 0 0 
##$SW_h= 29940.119760479
##$TD= 32768
##$TD0= 1
##$TE= 0
##$TE2= 300
##$TE3= 300
##$TEG= 300
##$TL= (0..7)
0 120 53 12 22 120 120 120 
##$TP= (0..7)
150 150 150 150 150 150 150 150 
##$TP07= 0
##$TPNAME0= <>
##$TPNAME1= <>
##$TPNAME2= <>
##$TPNAME3= <>
##$TPNAME4= <>
##$TPNAME5= <>
##$TPNAME6= <>
##$TPNAME7= <>
##$TPOAL= (0..7)
0.5 0.5 0.5 0.5 0.5 0.5 0.5 0.5 
##$TPOFFS= (0..7)
0 0 0 0 0 0 0 0 
##$TUNHIN= 0
##$TUNHOUT= 0
##$TUNXOUT= 0
##$USERA1= <user>
##$USERA2= <user>
##$USERA3= <user>
##$USERA4= <user>
##$USERA5= <user>
##$V9= 5
##$VALIST= <valist>
##$VCLIST= <CCCCCCCCCCCCCCC>
##$VD= 0
##$VDLIST= <DDDDDDDDDDDDDDD>
##$VPLIST= <PPPPPPPPPPPPPPP>
##$VTLIST= <TTTTTTTTTTTTTTT>
##$WBST= 1024
##$WBSW= 4
##$XGAIN= (0..3)
0 0 0 0 
##$XL= 0
##$YL= 0
##$YMAX_a= 29796
##$YMIN_a= -25405
##$ZGOPTNS= <>
##$ZL1= 120
##$ZL2= 120
##$ZL3= 120
##$ZL4= 120
##$ABSF1= 0
##$ABSF2= 0
##$ABSG= 0
##$ABSL= 0
##$ALPHA= 0
##$AQORDER= 0
##$ASSFAC= 0
##$ASSFACI= 0
##$ASSFACX= 0
##$ASSWID= 0
##$AUNMP= <proc_1d>
##$AZFE= 0.1
##$AZFW= 0.5
##$BCFW= 0
##$BC_mod= 2
##$BYTORDP= 0
##$COROFFS= 0
##$CY= -3
##$DATMOD= 1
##$DC= 0
##$DFILT= <>
##$DTYPP= 0
##$F1P= 0
##$F2P= 0
##$FCOR= 1
##$FTSIZE= 65536
##$FT_mod= 6
##$GAMMA= 0
##$GB= 0
##$INTBC= 1
##$INTSCL= 5.30512e-09
##$ISEN= 30
##$LB= 1
##$LEV0= 0
##$LPBIN= 0
##$MAXI= 10000
##$MC2= 0
##$MEAN= 0
##$ME_mod= 0
##$MI= 50
##$NCOEF= 0
##$NC_proc= -5
##$NLEV= 6
##$NOISF1= 182.463
##$NOISF2= 159.3651
##$NSP= 0
##$NTH_PI= 0
##$NZP= 0
##$OFFSET= 182.463
##$PC= 4
##$PHC0= -2731.922
##$PHC1= 37.40141
##$PH_mod= 1
##$PKNL= yes
##$PPARMOD= 0
##$PSCAL= 0
##$PSIGN= 0
##$REVERSE= no
##$SF= 81.0140089999434
##$SI= 65536
##$SIGF1= 159.3651
##$SIGF2= -187.1042
##$SINO= 113.3802
##$SIOLD= 16384
##$SREGLST= <1H.CDCl3>
##$SSB= 0
##$STSI= 65536
##$STSR= 0
##$SW_p= 29940.119760479
##$SYMM= 0
##$S_DEV= 0
##$TDeff= 32768
##$TDoff= 0
##$TI= <>
##$TILT= no
##$TM1= 0
##$TM2= 0
##$TOPLEV= 0
##$USERP1= <user>
##$USERP2= <user>
##$USERP3= <user>
##$USERP4= <user>
##$USERP5= <user>
##$WDW= 1
##$XDIM= 65536
##$YMAX_p= 317353388
##$YMIN_p= -7752085
$$ End of Bruker specific parameters
$$ ---------------------------------
##NTUPLES= NMR SPECTRUM
##VAR_NAME=  FREQUENCY,     SPECTRUM/REAL,   SPECTRUM/IMAG
##SYMBOL=    X,             R,               I
##VAR_TYPE=  INDEPENDENT,   DEPENDENT,       DEPENDENT
##VAR_FORM=  AFFN,          ASDF,            ASDF
##VAR_DIM=   65536,         65536,           65536
##UNITS=     HZ,            ARBITRARY UNITS, ARBITRARY UNITS
##FACTOR=    0.456856943014862, 1,           1
##FIRST=     14782.0589164792, 0,            0
##LAST=      -15158.0608439998, 0,           0
##MIN=       -15158.0608439998, -7752085,    0
##MAX=       14782.0589164792, 317353388,    0
$$ Real data points
##PAGE= N=1
##DATA TABLE= (X++(R..R)), XYDATA
$$ [...]
42755f34623P99579O18203J20918k60029j61952K58050L66650q1132m84109l20971
$$ -634623 164956 783159 904077 644048 482096 740146 1106796 1025664 541555 220584
42745B20584l9863k55788n64176k09159M19749K35104o94738j094311m58990K56089
$$ 220584 180721 -75067 -639243 -848402 -428653 -193549 -888287 -1982598 -2441588 -2185499
42735b185499L20780K86824P03462R82978M73250k82958l97006m4192K0908j79545
$$ -2185499 -1864719 -1577895 -874433 108545 581795 298837 -98169 -142361 -121453 -300998
42725c00998o3458K97681L01694P50N9075M74344M10230m08767j089055q38130
$$ -300998 -364456 -66775 234919 235669 294744 769088 1179318 770551 -318504 -1156634
42715a156634o5305L86241M61697O02894P08877L03991m21433o71788k60625R1435
$$ -1156634 -1221939 -835698 -374001 228893 937770 1241761 820328 148540 -112085 -20650
42705b0650l5951r5420L61221P24218K52991n97328p78608k67704R096k31692
$$ -20650 -56601 -152021 209200 933418 1186409 589081 -189527 -457231 -448135 -679827
42695f79827k87768J40526M23993K54152K47059O98550Q53139K08408m92584n17554
$$ -679827 -967595 -827069 -403076 -148924 98135 796685 1649824 1858232 1365648 848094
42685H48094l84544p08447q01087J13943J098929O81235o36031r57016M1000P03415
$$ 848094 463550 -244897 -1045984 -932041 166888 848123 212092 -744924 -703924 -509
42675e09J59873n16054m61704l67465p31275o14552N39173J422930Q22226j93556
$$ -509 159364 -356690 -818394 -1185859 -1917134 -2531686 -1992513 -569583 252643 59087
42665E9087J32852J334909J401407l7398j203797r39064j54328k5754k70352m2167
$$ 59087 191939 1526848 2928255 2890857 1687060 747996 593668 567914 297562 255395
42655B55395N37050O81757J79944m49999p39754o63789m16281j46829J42799N23867
$$ 255395 792445 1474202 1654146 1204147 464393 -199396 -615677 -762506 -619707 -95840
42645i5840Q47709O81726j02353q48900p97732j84200K3800m32465o95348j31290
$$ -95840 751869 1433595 1331242 482342 -315390 -499590 -475790 -908255 -1603603 -1734893
42635a734893O57161P08105N4877m49242l52435K180J96367K59630L87029N48069
$$ -1734893 -1077732 -369627 -314750 -763992 -1116427 -1114247 -917880 -658250 -271221 276848
42625B76848N44833K66937j90709n68990o41782m72552l60148l97677k84143J69159
$$ 276848 821681 1088618 897909 328919 -312863 -785415 -1145563 -1543240 -1827383 -1658224
42615a658224N52305L20706k99935m12557L35893J109398Q89428j47821q13562
$$ -1658224 -1105919 -785213 -1085148 -1497705 -1161812 -52414 837014 689193 -124369
42606a24369m39304L22330M43982j62448o75131m88183J36697N49097M76334J52694
$$ -124369 -563673 -241343 202639 40191 -634940 -1123123 -986426 -437329 39005 191699
42596A91699j12583k72649m25690m74066r9589P37800J394703J057652j83872
$$ 191699 79116 -193533 -619223 -1093289 -1192878 -455078 939625 1997277 1813405
42587A813405j198731j096827k94395J69516L9115j11851l0400j06052m61264
$$ 1813405 614674 -482153 -776548 -607032 -567917 -679768 -710168 -816220 -1277484
42578a277484o03195l08771o0611j34349j3661O32395J079346N47119l99742m94424
$$ -1277484 -1880679 -2189450 -2250061 -2384410 -2398071 -1765676 -686330 -139211 -538953 -1033377
42568a033377L63300R42271M93348k66076l56920R6295K90590j4855l34243k71915
$$ -1033377 -670077 272194 765542 499466 142546 238841 529431 514576 180333 -91582
42558i1582L8992K17970j7708o81905j368788j405189n25799O59743J219564Q86683
$$ -91582 -52590 165380 147672 -534233 -1903021 -3308210 -3834009 -3174266 -1954702 -1068019
42548a068019J60483m86679r75292j123709m95393P68444J517183Q11299o28502
$$ -1068019 -907536 -1394215 -2369507 -3493216 -3988609 -3220165 -1702982 -891683 -1520185
42539a520185j106420j74237P91337O17737m8876L8021P09429P74453J0242n89473
$$ -1520185 -2626605 -2800842 -2009505 -1391768 -1440644 -1402623 -693194 81259 91501 -497972
42529d97972n37438m70260p10444n09561N51109J453972J031746k83117r77969
$$ -497972 -1035410 -1505670 -2216114 -2725675 -2174566 -720594 311152 28035 -949934
42520i49934l93428O80501J137596O27073l42693q69965m48018L44641L46501
$$ -949934 -1343362 -662861 474735 1101808 759115 -110850 -558868 -214227 132274
42511A32274o21651j322018p91985K72572O58109M26236M42870O93427M34521
$$ 132274 -489377 -1811395 -2603380 -2330808 -1672699 -1246463 -803593 -110166 324355
42502C24355k60917n45977l42939m10533p33364l26271R32647J678129R64128
$$ 324355 63438 -482539 -825478 -1236011 -1969375 -2295646 -1362999 315130 1279258
42493A279258l61873r59260o84021k02459J68521L76068J75174l42085m16165
$$ 1279258 917385 -41875 -725896 -928355 -759834 -383766 -208592 -550677 -966842
42484i66842L01218R35087N59344l61851o83631k95133o1594k95247l71727R4500
$$ -966842 -665624 269463 828807 466956 -216675 -511808 -573402 -868649 -1240376 -1145876
42474a145876O34471P21391N01994M32549N90590N98812J06384o93432j070831
$$ -1145876 -511405 209986 711980 1144529 1735119 2333931 2440315 1746883 676052
42465F76052n68266K23441K69948m16180p03118r7976M24008M4983m84448j69923
$$ 676052 107786 331227 601175 184995 -518123 -616099 -192091 -147108 -631556 -801479
42455h01479L90217j6555r73155r02302L43571J121023N11349m32777n44739j84689
$$ -801479 -411262 -427817 -1400972 -2303274 -1959703 -838680 -327331 -760108 -1304847 -1489536
42445a489536j72510l02988K5669N82771P52975N92318N04987L98364N3258j52286
$$ -1489536 -1662046 -1965034 -1939365 -1356594 -603619 -11301 493686 892050 945308 793022
42435G93022J70287N00669P2687p80619r58924k15705N27667N95975L66443L70696
$$ 793022 963309 1463978 1536665 756046 -202878 -418583 109084 705059 1071502 1442198
42425A442198M12931R4267l55397l76849M6314L25812L1116o07664r64458o15895
$$ 1442198 1855129 1949396 1593999 1217150 1263464 1589276 1620392 1012728 48270 -567625
42415e67625K77956J059744J114258M56288k79404n37024m09378l39968m09583
$$ -567625 -289669 770075 1884333 2340621 2061217 1524193 1114815 774847 365264
42406C65264k87598Q0606K03847k22993o84784m74936K27352N66101K89929N3954
$$ 365264 77666 158272 362119 139126 -545658 -1020594 -793242 -227141 62788 116742
42396A16742K19449K15068l48538p43393k12693N93577M20249o19211j091570
$$ 116742 336191 551259 202721 -540672 -753365 -159788 260461 -358750 -1450320
42387a450320l08839Q11680J184839P81929R1639n76954q08393j67843Q37475
$$ -1450320 -1759159 -947479 237360 1019289 1110928 533974 -274419 -442262 395213
42378C95213R34539o7581o90983M5241J002328P16094k12683j91753N72958L49822
$$ 395213 1329752 1262171 571188 616429 1618757 2334851 2122168 1930415 2503373 2853195
42368B853195j144545k041445j092190N44762J128545O18600J28888J03733J43773
$$ 2853195 1708650 -332795 -1424985 -880223 248322 866922 995810 1099543 1243316
42359A243316L8299l9525n6676r3303n3568M6064j36435o57272q97526m11751
$$ 1243316 1281615 1242090 1185414 1092111 1038543 1084607 948172 290900 -606626 -1018377
42349a018377K41183K30646l00711n00597j21025K38058J69255k0835M0029K46874
$$ -1018377 -777194 -546548 -847259 -1347856 -1468881 -1230823 -1061568 -1082403 -1042374 -795500
42339g95500L19577J75783j38918m64523l90383L82815J372720J538127N12560
$$ -795500 -475923 -300140 -439058 -903581 -1293964 -911149 461571 1999698 2512258
42330B512258p85929j185183o23016m1614q5497m18687m07808l4506J81403l4114
$$ 2512258 1726329 541146 -81870 -123484 -208981 -627668 -1035476 -1069982 -888579 -922693
42320i22693l52537k89991K33387Q61970J137669P76408j36004j016855j099082
$$ -922693 -1275230 -1565221 -1331834 -469864 667805 1444213 1308209 291354 -807728
42311h07728k24487P98720J004364L58015l49689n86839n12762l51086k7309L69364
$$ -807728 -1032215 -233495 770869 1128884 779195 192356 -320406 -671492 -698801 -329437
42301c29437M48808J90703J06123L16206J85624n30543r35195k86886N77389L00092
$$ -329437 119371 310074 416197 732403 918027 387484 -547711 -834597 -257208 42884
42291D2884q56459j263516l21536P48484Q30652L50499J68395J69490j43807m99687
$$ 42884 -813575 -2077091 -2398627 -1650143 -819491 -468992 -300597 -131107 -274914 -774601
42281g74601l32083J22078J97676o0049p3403J69492J42624j57235j22963L54950
$$ -774601 -1106684 -984606 -786930 -846979 -920382 -750890 -608266 -765501 -888464 -533514
42271e33514N58814N1115n86430n74502j4319L38144J04892l33333l92738P2381
$$ -533514 25300 76415 -510015 -1084517 -1098836 -760692 -655800 -989133 -1381871 -1309490
42261a309490O81613R36543O99154K72077l669j04429j73471k17022j86918j76553
$$ -1309490 -627877 308666 1007820 1279897 1276228 1171799 998328 781306 594388 417835
42251D17835k25199j25636J83408K64976k22192p54972m97863L97216Q65063M52269
$$ 417835 192636 67000 250408 515384 293192 -461780 -959643 -562427 302636 754905
42241G54905j06790j64619q7268l43324n63928l32306j34443m90724p63367o5196
$$ 754905 648115 483496 396228 52904 -511024 -843330 -977773 -1468497 -2231864 -2297060
42231b297060J049503J201949L62572q6726L80555O67484O2451n19214k04030
$$ -2297060 -1247557 -45608 316964 230238 610793 1278277 1340728 821514 617484
42222F17484K87611k4029n99158l85755K28453J10484n03802l82443L95183M01798
$$ 617484 905095 881066 281908 -103847 124606 235090 -268712 -651155 -255972 145826
42212A45826o09748j023269N3774J187259P51789o17861j083800k43339P02604
$$ 145826 -463922 -1487191 -1433417 -246158 505631 -112230 -1196030 -1439369 -736765
42203g36765Q93057N53439N1945n15885q21466m93947Q1796J03763m06518n93704
$$ -736765 156292 709731 761676 245791 -575675 -1069622 -987826 -884063 -1290581 -1884285
42193a884285j11428M42420O31997P82348J103402J093882L73094n65611j007442
$$ -1884285 -1995713 -1553293 -921296 -138948 964454 2058336 2431430 1865819 858377
42184H58377r03020n97776j90740K78576M65924J78783j40287j5584K45836L497
$$ 858377 -44643 -642419 -833159 -554583 -88659 90124 -50163 -65747 180089 183586
42174A83586o27204q50525l49041L17485O09330O55812O97611M60919l38984j177768
$$ 183586 -443618 -1294143 -1643184 -1325699 -716369 -60557 637054 1097973 758989 -418779
42164d18779j119773j16121P18748M99198k28580k83547M17288P86035L20316
$$ -418779 -1538552 -1654673 -935925 -436727 -665307 -948854 -531566 254469 574785
42155E74785o5515M37421J050327N05349q62684j417253n83522L76622K92667
$$ 574785 509270 946691 1997018 2502367 1639683 222430 -361092 15530 308197
42146C08197l85919o21385l48083j21907N9442N57822J094158R29132k2603r97426
$$ 308197 -77722 -699107 -1047190 -1169097 -1109655 -551833 542325 1471457 1448854 451428
42136D51428j310589r43075k66860L10267M71519K05045j22121j79566j0922K54466
$$ 451428 -859161 -1802236 -2069096 -1758829 -1287310 -1082265 -1204386 -1383952 -1394874 -1140408
42126a140408O50612R92552P42206j79934r05926o65894L8911J33491m26658o89824
$$ -1140408 -489796 502756 1244962 1065028 159102 -506792 -467881 -334390 -761048 -1450872
42116a450872k54009K18988J81653k1335J04958M04002M25736J07083k36711k82963
$$ -1450872 -1704881 -1485893 -1304240 -1325575 -1220617 -816615 -390879 -283796 -520507 -803470
42106h03470P4386N55404N79089n3261o66634m80190K38965N18310J45178q4461
$$ -803470 -729084 -173680 405409 352148 -314486 -794676 -555711 -37401 107777 23316
42096B3316K69886O12186L82479k2955K2329L46779K96249k98184r55467j105670
$$ 23316 293202 905388 1287867 1264912 1287241 1634020 1930269 1632085 676618 -429052
42086d29052n50529L43554P95257L72522l41526m14082Q6873J99835l42979o30001
$$ -429052 -979581 -636027 159230 531752 190226 -223856 -136983 62852 -280127 -910128
42076i10128p5740O01850N75035J76536J38373L08787Q2254m30385o06162l11912
$$ -910128 -985868 -384018 191017 367553 505926 814713 896967 466582 -139580 -451492
42066d51492J13834N01798P14010L40397n92988j087073l74486O93009O02510
$$ -451492 -337658 164140 878150 1218547 625559 -461514 -836000 -142991 459519
42057D59519o42944j468063q74983M38417J269832J229462O19123j09900m57385
$$ 459519 -183425 -1651488 -2526471 -2088054 -818222 411240 1030363 920463 463078
42048D63078j75159K52336P6611o03904r08572m78764R8140L60561N54201P94835
$$ 463078 287919 540255 616866 12962 -895610 -1374374 -1276234 -915673 -361472 433363
42038D33363N97431j86708p93254o11849j40075r7378j97407K58800R75107R18776
$$ 433363 1030794 844086 50832 -561017 -701092 -798470 -995877 -737077 238030 1156806
42028A156806o4959q84740o96012J5461K64157q0165l26425p8311K76610K39652
$$ 1156806 1091847 207107 -488905 -473444 -209287 -289452 -615877 -694188 -417578 -177926
42018a77926j02734l15939k64421j44671K875L38496P06660N90885j11926p09783
$$ -177926 -280660 -596599 -861020 -1005691 -1002816 -664320 42340 633225 521299 -188484
42008a88484n60485M1531L62005L17694L78900N50729L07221l51894o38520j56371
$$ -188484 -748969 -707438 -345433 -27739 351161 901890 1209111 857217 218697 62326
41998F2326L65839R0709o75402r03113k56783N43745P29324L13475j77922l90376
$$ 62326 428165 518874 -156528 -1059641 -1316424 -772679 -43355 270120 92198 -298178
41988b98178l32972j33221J12448K70703J86630j01855k84142j06872K58392M09655
$$ -298178 -631150 -764371 -651923 -381220 -194590 -296445 -580587 -687459 -429067 -19412
41978a9412K61311Q0522m7635l33565o93648o03606O4795N86720L40226k19360
$$ -19412 241899 322421 274786 -58779 -752427 -1356033 -1291238 -704518 -364292 -583652
41968e83652k42579K05946L42479n0732m22605m55485l72269k29025J77866N90980
$$ -583652 -826231 -620285 -277806 -328538 -751143 -1206628 -1578897 -1807922 -1630056 -1039076
41958a039076M23455j76027l39695J32559L81300p2395m79315j03597N62424O31781
$$ -1039076 -615621 -791648 -1131343 -998784 -617484 -689879 -1169194 -1272791 -710367 -78586
41948g8586J85838n4720Q8226K40700K78103L41649L16894J3974l29305l53437
$$ -78586 107252 52532 140758 381458 659561 1001210 1318104 1332078 1002773 649336
41938F49336j96405k37570m28401m30697k22486l7253R9167K60891K68883l5155
$$ 649336 452931 215361 -213040 -643737 -866223 -903476 -804309 -543418 -274535 -309690
41928c09690l59277l04868M2809L06366L60011K62202k5984l81272l66554R6454
$$ -309690 -668967 -973835 -931026 -624660 -264649 -2447 -28431 -409703 -776257 -679803
41918f79803L16884k23419r08481p68574Q5838O90851O78470N52053N95598M91002
$$ -679803 -362919 -586338 -1494819 -2263393 -2177555 -1486704 -808234 -256181 339417 830419
41908H30419J13333k07906m00756p62459j129104q11844K44754J030851P42023
$$ 830419 943752 735846 335090 -427369 -1556473 -2368317 -2123563 -1092712 -350689
41899c50689j12930m54440o1697L19537P3355n84944r70828o91992j5573M36010
$$ -350689 -463619 -918059 -979756 -660219 -586864 -1171808 -2142636 -2834628 -2850201 -2414191
41889b414191L65089R5771P6222K82723M08612M38069N79176P41139N97939J56982
$$ -2414191 -2049102 -1953331 -1877109 -1594386 -1185774 -747705 -168529 572610 1170549 1327531
41879A327531k39056m78340p16446q29653m48571L15663P81141N90232J70258
$$ 1327531 1088475 610135 -106311 -935964 -1384535 -1068872 -287731 302501 472759
41870D72759l364j09594n28282j045389j019174k60664O10247P75022P9498p74197
$$ 472759 469395 359801 -168481 -1213870 -2233044 -2493708 -1883461 -1108439 -1028941 -1803138
41860a803138r51487l67417L58649Q14560J197372J614462J635791J090041O78019
$$ -1803138 -2754625 -3122042 -2763393 -1948833 -751461 863001 2498792 3588833 4266852
41851D266852R34815J087460Q6620j503353k013531j137385m33169q98782j454209
$$ 4266852 5201667 6289127 6375747 4872394 2858863 1721478 1288309 389527 -1064682
41842a064682p44284O71511J142366K91193o48422o09504K00529R28852J022011
$$ -1064682 -1808966 -1137455 4911 296104 -352318 -961822 -761293 167559 1189570
41833A189570M75145k90031p10575n95240l15936k45841k29787N0536M35093M46415
$$ 1189570 1664715 1374684 664109 68869 -247067 -492908 -722695 -672159 -237066 209349
41823B09349l1556n97709p91518m91996N939J91978j31273m48307q0745P52411
$$ 209349 177793 -419916 -1211434 -1703430 -1697491 -1505513 -1636786 -2085093 -2165838 -1413427
41813a413427J034802L93511k73513j33436L17911J19513n57897o71870M6529
$$ -1413427 -378625 14886 -258627 -392063 -74152 45361 -512536 -1184406 -1137877
41804a137877O98008N50977m8125l48788j69358J15364J63282m2173k88062l56444
$$ -1137877 -439869 111108 62983 -285805 -455163 -339799 -176517 -218690 -506752 -863196
41794h63196k29951p2072L8523J88010L58021L61238K08209J84682L31982K72975
$$ -863196 -1093147 -1165219 -1126696 -938686 -580665 -219427 -11218 173464 505446 778421
41784G78421j16615l34616r218M20910L44637j00397l54041l03641j69240Q7043
$$ 778421 661806 327190 317972 738882 1083519 983122 629081 325440 156200 243243
41774B43243M69947M50902l22223j107295r04520l7730K61284j86157k86484L38844
$$ 243243 713190 1164092 841869 -265426 -1169946 -1207676 -946392 -1132549 -1419033 -1080189
41764a080189N66837l42862j324762j012385K10114Q39018M18651j02039R447
$$ -1080189 -513352 -856214 -2180976 -3193361 -2983247 -2144229 -1725578 -1827617 -1818170
41755a818170L86597M26912J79653O4227K44324N66850Q01510P65660M27217m0815
$$ -1818170 -1431573 -1004661 -825008 -760781 -516457 50393 851903 1617563 2044780 2003965
41745B003965m46366p41125q39491n17577J66179N95754K66223l93323m76212
$$ 2003965 1557599 816474 -23017 -540594 -374415 221339 487562 94239 -381973
41736c81973J10757M89753J30571l81368l20814N8389L1294l98376n81078k98817
$$ -381973 -271216 218537 349108 -32260 -353074 -294685 -263391 -661767 -1242845 -1541662
41726a541662M1326K53257N88388R81097R13981L38406q0321p0286k61242r51271
$$ -1541662 -1500336 -1247079 -658691 322406 1236387 1574793 1494472 1424186 1162944 211673
41716B11673j246222m16805O13311M42472n70422p43185L25289J181073Q51924
$$ 211673 -1034549 -1451354 -838043 -395571 -965993 -1709178 -1383889 -202816 649108
41707F49108J79520J38783K89669p3491m73102k29150P9622m18123j140292q28554
$$ 649108 828628 967411 1257080 1183589 710487 481337 560959 142836 -997456 -1826010
41697a826010K94712P39285Q4157m29277P2374Q35644Q10850J63090k41873j15696
$$ -1826010 -1531298 -792013 -707856 -1137133 -1064759 -229115 581735 744825 502952 387256
41687C87256J46548J59699j47108n70971o76832j66219N87522P86689J84670n91490
$$ 387256 533804 693503 546395 -24576 -701408 -867627 -280105 506584 691254 99764
41677I9764q42743n05304M7345M40514M17978K206l41918j60720L04188L90490
$$ 99764 -742979 -1248283 -1200938 -760424 -342446 -340240 -682158 -842878 -538690 -148200
41667a48200P033k50217n1878K53899L27956K63087J35247j68010m39161k11421
$$ -148200 -141167 -391384 -443262 -189363 138593 401680 536927 368917 -70244 -281665
41657b81665L59943M45888j87893o01236M0294J200249J634132R05261l28421
$$ -281665 78278 524166 336273 -264963 -224669 975580 2609712 3514973 3186552
41648C186552j206113j347153r28859m96921m63973n64924j72427O93317J232072
$$ 3186552 1980439 633286 -295573 -792494 -1256467 -1821391 -1993818 -1300501 -68429
41639f8429R80116M01162L0857k27530m94365m09976R0189K45033m43422j198874
$$ -68429 911687 1312849 1343706 1116176 621811 211835 302024 547057 103635 -1095239
41629a095239r79744k6042N79235N29704M28090N03462L01685k69571n64784j55838
$$ -1095239 -2074983 -2101025 -1521790 -992086 -563996 -60534 241151 -28420 -593204 -749042
41619g49042N35185Q39441N87221Q1440k64772j79230K16453L94772n515o75561
$$ -749042 -213857 625584 1212805 1294245 1029473 850243 1066696 1461468 1455953 780392
41609G80392j035515r45735o17993j01614N62834R07107M77622l31618n97613
$$ 780392 -255123 -1200858 -1818851 -1920465 -1357631 -450524 27098 -304520 -902133
41600i02133j10970L36069R2059m65497m84566K42578J000029R25974L953p77302
$$ -902133 -1013103 -677034 -584975 -1050472 -1535038 -1292460 -292431 633543 637496 -139806
41590a39806m73692O05414J183419O45053k33729n03288k63942j15458j20244
$$ -139806 -613498 -8084 1175335 1820388 1586659 1083371 819429 703971 583727
41581E83727j03802l25854q95342j092492l64196N00578M10011k39195j99424
$$ 583727 479925 154071 -741271 -1833763 -2197959 -1697381 -1287370 -1526565 -1725989
41572a725989M97361O37641J718k74667K24757M79406m6606l97426J29145O92233
$$ -1725989 -1228628 -590987 -589269 -863936 -639179 -159773 -206379 -603805 -474660 217573
41562B17573L80711k88400m51065l55016n40601n56958J76617J006373R11334
$$ 217573 598284 309884 -141181 -496197 -1036798 -1593756 -1417139 -410766 500568
41553E00568J68970j65365J4160j9791l38251l58538j61176m21429r88783q63541
$$ 500568 669538 504173 518333 498542 160291 -198247 -359423 -780852 -1769635 -2633176
41543b633176J50190R53362P35090N3000j78611M1187J40040r265m2218K09042
$$ -2633176 -2482986 -1529624 -794534 -741534 -920145 -878958 -738918 -748183 -790401 -581359
41533e81359M61217L46183j84319p81184r99844p40140k74627K10635P72854J249567
$$ -581359 -120142 226041 41722 -739462 -1739306 -2479446 -2754073 -2543438 -1770584 -521017
41523e21017J159885M69484q8615k4849J37176j70707m42917J9610O30342K60243
$$ -521017 638868 1108352 1019737 994888 1132064 961357 518440 538050 1168392 1428635
41513A428635p72765r71005l0902N96619j5474q92259q25914j36594K36279L31448
$$ 1428635 655870 -315135 -346037 250582 235108 -657151 -1483065 -1619659 -1383380 -1051932
41503a051932O61786Q99029L63343n99100r45451m76635l925k3186j46220P3136
$$ -1051932 -390146 508883 872226 273126 -672325 -1148960 -1152885 -1176071 -1322291 -1249155
41493a249155M98602P18862M65161k62945j022052j046930j14278R01277R64988
$$ -1249155 -750553 -31691 433470 170525 -851527 -1898457 -2012735 -1111458 -146470
41484a46470J99903m10916m46045l53918m33396m23504k17880j25647j95518n2118
$$ -146470 53433 -357483 -803528 -1157446 -1590842 -2014346 -2232226 -2357873 -2553391 -2605509
41474b605509L46026N31128L77040L61007O41888O64829J43036l17386j54950
$$ -2605509 -2259483 -1728355 -1351315 -990308 -348420 316409 459445 142059 -12891
41465a2891K36840J87493k03702l74219k11597o730J28010J92124M0139k29818
$$ -12891 223949 411442 207740 -166479 -378076 -384806 -256796 -64672 -24533 -254351
41455b54351j03856M85371O90278k2600p47445l37238P04791Q50564j13638q24035
$$ -254351 -358207 127164 817442 794842 47397 -289841 414950 1265514 1151876 327841
41445C27841n43335j35103l70843o91550m55918j76192m39889n88952K47830J439168
$$ 327841 -215494 -350597 -721440 -1412990 -1868908 -2045100 -2484989 -3073941 -2826111 -1386943
41435a386943J507396K52237r69438j060977k81877N18627Q43304N70047j46947
$$ -1386943 120453 372690 -596748 -1657725 -1939602 -1420975 -577671 -7624 -154571
41426a54571p34966n96465J08462N78879M23536Q1131N4364K62714L57040J99069
$$ -154571 -889537 -1486002 -1377540 -798661 -375125 -293994 -239630 23084 380124 579193
41416E79193j68864n89330o73597j22815O33966O69406k42920j139121r96334
$$ 579193 410329 -179001 -852598 -975413 -341447 327959 85039 -1054082 -2050416
41407b050416J1353Q29334Q16410K56315k55273m50569l92026j89102J26807N21569
$$ -2050416 -2039063 -1209729 -393319 -137004 -392277 -842846 -1234872 -1423974 -1297167 -775598
41397g75598Q00276O18866j32864r48035j043276k90905M70924L80007l76869
$$ -775598 24678 643544 510680 -437355 -1480631 -1771536 -1300612 -920605 -1297474
41388a297474q18971m53760J32715J56710k42929k23709M58346R26291L62527
$$ -1297474 -2116445 -2570205 -2437490 -2280780 -2523709 -2747418 -2289072 -1362781 -1000254
41379a000254o65041p92680K25568J056766O55213k21544j83963O66896R17105
$$ -1000254 -1665295 -2457975 -2232407 -1175641 -520428 -741972 -925935 -259039 658066
41370F58066P717r51111q25805N7348N98113L72341j89565n64936n21077q8509
$$ 658066 665783 -285328 -1111133 -1053785 -455672 -83331 -272896 -837832 -1358909 -1447418
41360a447418L85750M42166J05843n4800K38174N11971K87792j66290k97317r3656
$$ -1447418 -1061668 -619502 -513659 -568459 -330285 181686 469478 303188 5871 -87785
41350h7785O0437L6843l6545j51352k98815k27155J89239N60844M31406r2158
$$ -87785 -27348 9495 -27050 -178402 -477217 -704372 -515133 45711 477117 384959
41340C84959n67690p94704p39578k63412N17565R57443O24711L2892n4994K43965
$$ 384959 -182731 -977435 -1717013 -1980425 -1462860 -505417 119294 152186 97192 341157
41330C41157K79793O6912J73619N32630M30833j97185n25461k05176K4442l97192
$$ 341157 620950 687862 861481 1394111 1824944 1627759 1102298 897122 921564 524372
41320E24372q71912o25053M0052K78933J6714j11284J39376L79045L59486K75472
$$ 524372 -347540 -972593 -932541 -653608 -636894 -748178 -608802 -229757 129729 405201
41310D05201K25789r519m54889o80195l53755K25495M33435L2363o19847r83306
$$ 405201 630990 621471 166582 -513613 -867368 -641873 -208438 -176075 -795922 -1779228
41300a779228p92994j85685M17109N67797J80564k60449j40182M75576P78485
$$ -1779228 -2572222 -2757907 -2340798 -1773001 -1592437 -1852886 -1993068 -1517492 -739007
41291g39007K94762l16387j37949N61268O37491j24045n76304j8695O43594L94583
$$ -739007 -444245 -760632 -898581 -337313 300178 176133 -400171 -418866 224728 619311
41281F19311j90932K6381O86886M27583p74326j369074n95713L99243L81850k83386
$$ 619311 428379 454760 1141646 1569229 794903 -574171 -1169884 -770641 -388791 -672177
41271f72177n43914k33699J47165M25474O13953M13633k22929n42662N7739R28552
$$ -672177 -1216091 -1449790 -1302625 -877151 -263198 150435 -72494 -615156 -557417 371135
41261C71135R73244K76085r1129K14921L45298k97445j083534j082513l30182
$$ 371135 1344379 1620464 1529335 1744256 2089554 1792109 708575 -373938 -704120
41252g04120L66758N27452L73652K44427J24977r6128k24351J4119L86225K63550
$$ -704120 -337362 190090 563742 808169 933146 837018 612667 626786 1013011 1276561
41242A276561m12453p40968l4584R37503P63709n82138j549337j129205j19085
$$ 1276561 864108 123140 88556 1026059 1789768 1207630 -341707 -1470912 -1589997
41233a589997L02696K38770L96259O04071K28659m23155m28235J73264L57128
$$ -1589997 -1287301 -1048531 -652272 -48201 180458 -242697 -670932 -497668 -140540
41224a40540k42590q00706o62032k14159m518J20664M66674P80464O63927K04777
$$ -140540 -383130 -1183836 -1845868 -2060027 -2064545 -1943881 -1477207 -696743 -32816 171961
41214A71961k89256p55739j123931j009752k07157P51871J041201M96764k16998
$$ 171961 -117295 -873034 -1996965 -3006717 -3213874 -2462003 -1420802 -924038 -1141036
41205a141036l98702m0378K80237J40297j95191j20062M36798Q26707N92667J39095
$$ -1141036 -1539738 -1580116 -1299879 -1159582 -1354773 -1474835 -1038037 -211330 381337 520432
41195E20432K8578M3083l12178o90306l02726O08298Q40732N6787n87437j94346
$$ 520432 549010 592093 279915 -410391 -713117 -104819 735913 792700 205263 10917
41185A0917N31479N09634k7527j31438J89388J00174n10158p90908l17348K76838
$$ 10917 542396 1052030 1024503 893065 1082453 1182627 672469 -118439 -435787 -158949
41175a58949L20110q815j44381O6990L36290L30991n7151n35267n25952J14395
$$ -158949 161161 152346 7965 74955 411245 742236 685085 149818 -376134 -261739
41165b61739O09516J42431q14054r04889J53437R74776M17050p61504j032237
$$ -261739 347777 490208 -323846 -1228735 -1075298 -100522 316528 -444976 -1477213
41156a477213k60478L64083K67904J24863M17707N68138O8963m58571j92195M96555
$$ -1477213 -1737691 -1373608 -1105704 -980841 -563134 5004 73967 -384604 -576799 -80244
41146h0244N39269j88233o79876l05749L52528M65482P3290k07346j29533K8215
$$ -80244 459025 270792 -409084 -714833 -362305 103177 176467 -30879 -160412 -132197
41136a32197J0355j37731k51749k43063j72516k22033m22266m21274R1398P05095
$$ -132197 -121842 -259573 -511322 -754385 -926901 -1148934 -1571200 -1992474 -1901076 -1195981
41126a195981O40336j4181j81047O00797J256344O84808n04037q77717l16303
$$ -1195981 -555645 -569826 -750873 -150076 1106268 1791076 1287039 409322 93019
41117I3019Q0200j9732J59356P08689N60829n77800j341425p32452K57878K71546
$$ 93019 173219 153487 312843 1021532 1582361 1004561 -336864 -1069316 -811438 -539892
41107e39892k79177j75825L56791J26142p18807p29935M00808J211007P62135
$$ -539892 -819069 -994894 -638103 -511961 -1230768 -1960703 -1559895 -348888 413247
41098D13247k458J6692L41590O398o27716m67750M29223Q71599L25109m25715
$$ 413247 410789 427481 769071 775469 147753 -319997 109226 980825 1305934 880219
41088H80219n69431l05163k16586k87082p9848M32877P42557M75626j45139n96541
$$ 880219 310788 5625 -210961 -498043 -577891 -145014 597543 1073169 928030 331489
41078C31489o22534l81927j39923m674K0390o3961j67595r5235J87457M05372
$$ 331489 -291045 -672972 -812895 -817569 -797179 -861140 -1028735 -1123970 -936513 -531141
41068e31141L22164J06351O0442J11920l7426l25240l75702j77501j80829n22287
$$ -531141 -208977 -102626 -42184 69736 32310 -292930 -668632 -846133 -1026962 -1549249
41058a549249o73058k11007M80750P29851M77680J80403K7341j92215n05507n85460
$$ -1549249 -2222307 -2433314 -1952564 -1222713 -745033 -564630 -537289 -729504 -1235011 -1820471
41048a820471k71543J71621M83618P15911Q70017N96149k92586j165219j027906
$$ -1820471 -2092014 -1920393 -1436775 -720864 149153 745302 452716 -712503 -1740409
41039a740409J57373J101280O40719o91478j240648m03783N77746M06870m57078
$$ -1740409 -1583036 -481756 158963 -532515 -1773163 -2176946 -1599200 -1192330 -1649408
41030a649408n94506K70652J052663J061664P99656P38712M23069n70722j617667
$$ -1649408 -2243914 -1973262 -920599 141065 940721 1679433 2102502 1531780 -85887
41021h5887j787784j080975k09883M11534P76840P95959M40635Q9262M0482j6858
$$ -85887 -1873671 -2954646 -3164529 -2752995 -1976155 -1180196 -739561 -650299 -609817 -626675
41011f26675l66554n00822J23142Q94031P03279l14576q58749l98950J35795m3871
$$ -626675 -993229 -1494051 -1370909 -476878 226401 -88175 -946924 -1345874 -1210079 -1253950
41001a253950m27515k51503K54680M51293L83807M50866N11835J84609l07225
$$ -1253950 -1681465 -1932968 -1678288 -1226995 -843188 -392322 119513 304122 -3103
40992c103l90288n2260K01974J74102J25129J89681K00206N1105k21996o27779
$$ -3103 -393391 -445651 -243677 -69575 55554 245235 445441 496546 274550 -353229
40982c53229j048961j052476l71370N54047J011190Q51854M14582j27322o75364
$$ -353229 -1402190 -2454666 -2826036 -2271989 -1260799 -408945 5637 -121685 -797049
40973g97049p12859J65725J223234J107712k54341j238684n84781R05932J507249
$$ -797049 -1509908 -1344183 -120949 986763 732422 -506262 -1091043 -185111 1322138
40964A322138Q17620o5011l07131k37800l99238o32635n53036l19164l46966n49129
$$ 1322138 2139758 2074747 1767616 1529816 1130578 497943 -55093 -374257 -721223 -1270352
40954a270352m24522J39493O29141O02288K71106J25723K00109R5904k88549m90186
$$ -1270352 -1694874 -1555381 -926240 -323952 -52846 72877 272986 368890 80341 -409845
40944d09845j75351K36890Q6556n17064p23162j03743O84333P40497J08289l34592
$$ -409845 -585196 -348306 -261750 -778814 -1501976 -1605719 -921386 -180889 -72600 -407192
40934d07192o1431N04590O72729L71508Q2895R5318J54717j00950n64493o87373
$$ -407192 -468623 35967 708696 1080204 1163099 1258417 1413134 1312184 747691 60318
40924F0318j18366P57210J068822L70932p81234j371614j032319l44243M6405
$$ 60318 -58048 699162 1767984 2138916 1357682 -13932 -1046251 -1390494 -1344089
40915a344089K24099N78603R14927O29017k33912p91015n02602L0700m3933n73816
$$ -1344089 -1119990 -541387 373540 1002557 768645 -22370 -524972 -494272 -538205 -1112021
40905a112021o87179j09006N28866O68940M28004J02427k67450n94536n91960
$$ -1112021 -1799200 -1908206 -1379340 -710400 -282396 -179969 -447419 -1041955 -1633915
40896a633915k50731J8818L8050J49681N08193O53520L01023P99L04436P10137
$$ -1633915 -1884646 -1865828 -1827778 -1678097 -1169904 -516384 -215361 -214562 89874 800011
40886H00011L23934o24736q95217J6367J095924J134305J93723p00545q87457
$$ 800011 1123945 499209 -396008 -379641 716283 1850588 2044311 1343766 456309
40877D56309n69389k00355R4718L87827N62800L73461j00610l50953o8808L17889
$$ 456309 -113080 -313435 -218717 169110 731910 1105371 1004761 653808 585000 902889
40867I02889K02522k05143j42518L47333K47742p66511j472035p96831M43696
$$ 902889 1105411 900268 757750 1105083 1352825 586314 -885721 -1682552 -1238856
40858a238856P11075M2123k63039Q4405P3376n45437o46736K79516J080440P24320
$$ -1238856 -527781 -485658 -748697 -664292 -590916 -1136353 -1783089 -1503573 -423133 301187
40848C01187j70958n63554n88814q08584q42929p1807R46981J081749L03205l78793
$$ 301187 130229 -433325 -1022139 -1830723 -2673652 -2745459 -1798478 -716729 -413524 -792317
40838g92317l96746k5291M43536R00765R72092L65060m17479o08871l29053l29345
$$ -792317 -1189063 -1214354 -770818 129947 1102039 1467099 1049620 440749 111696 -217649
40828b17649p03862p96188l69942N7146J21033J1384j07899k78368l00261Q4685
$$ -217649 -921511 -1717699 -2087641 -2030495 -1909462 -1898078 -2005977 -2284345 -2584606 -2499921
40818b499921N20639L85178j37709k19321K85564O17490L94901J29290J59875
$$ -2499921 -1979282 -1594104 -1731813 -1951134 -1665570 -1048080 -653179 -523889 -364014
40809c64014O7650l86931o50380k82351K74926M19903K41344R7416l9409k52239
$$ -364014 -296364 -683295 -1333675 -1616026 -1341100 -921197 -679853 -582437 -621846 -874085
40799h74085k58159R7522L94612K23844j90012l93748k94230L8706O15196J147947
$$ -874085 -1132244 -1034722 -640110 -416266 -606278 -1000026 -1294256 -1255550 -640354 507593
40789E07593J039244K60060l62226k99415j20620m59601q55732n19045K73098
$$ 507593 1546837 1806897 1444671 1145256 1024636 565035 -290697 -809742 -536644
40780e36644N66916K10741p5305M3964J77477R9476M7285M7706j76160m64616
$$ -536644 30272 241013 165708 209672 387149 486625 533910 581616 405456 -59160
40770e9160k28471N37406J013884O83812K1268l49122n38531q94352j141403p42367
$$ -59160 -287631 249775 1263659 1947471 1968739 1619617 1081086 186734 -954669 -1697036
40760a697036J15437O08130L99610R5788L30312Q17084P33401j19885j009896
$$ -1697036 -1581599 -973469 -573859 -478071 -147759 669325 1402726 1282841 272945
40751B72945j197008p46933j86173K41149N27057M47709j53979p34029m72850
$$ 272945 -924063 -1670996 -1857169 -1616020 -1088963 -641254 -795233 -1529262 -2002112
40742b002112N30549J229856J042778N33712L28124J74861l11939p45553o08334
$$ -2002112 -1471563 -241707 801071 1334783 1662907 1837768 1525829 780276 171942
40733A71942j95556m1176P6525N87030J046126P24310l5149k72623o1449l48116
$$ 171942 -23614 -64790 11735 598765 1644891 2369201 2334052 2061429 1999980 1651864
40723A651864j102883j123278r1808O27745K3745r90168j053701l79082o6734
$$ 1651864 548981 -574297 -666105 -38360 -14615 -1004783 -2058484 -2437566 -2504300
40714b504300j60532K07834J077544J444102Q25102j09540o55839q26178p34071
$$ -2504300 -2664832 -2456998 -1379454 64648 889750 780210 124371 -701807 -1435878
40705a435878k07790N43430P49364J80147k79503J07122O65880K40048r32816
$$ -1435878 -1643668 -1100238 -350874 -170727 -450230 -343108 322772 562820 -369996
40696c69996j356719m01615P19514O05987m42970r53096k98353O38676Q12454
$$ -369996 -1726715 -2128330 -1408816 -802829 -1245799 -2198895 -2497248 -1858572 -1046118
40687a046118K84417j31995j5542K80665K35978j44205l18405R3054O47295M42268
$$ -1046118 -761701 -893696 -909238 -628573 -392595 -536800 -855205 -762151 -114856 327412
40677C27412n99615j225987k96859J471161K116081R16334o98203j136092n75502
$$ 327412 -272203 -1498190 -1795049 -323888 1792193 2708527 2010324 874232 298730
40668B98730j61277j39356P7700M70692L20953m62994j023818p70815o1391N41721
$$ 298730 137453 -1903 75797 546489 867442 404448 -619370 -1390185 -1451576 -909855
40658i09855R02993R55484M87549l20175p66766m67156J28299L65421J24123l09401
$$ -909855 -6862 948622 1436171 1115996 349230 -117926 10373 375794 499917 190516
40648A90516o53425o70764k44277L44260O05977M62732K41225L0194l24624n52351
$$ 190516 -462909 -1133673 -1377950 -1033690 -427713 35019 276244 306438 -18186 -570537
40638e70537j57822M94991L26788p46404j312447m49112P93587R56587L50822
$$ -570537 -728359 -233368 93420 -652984 -1965431 -2414543 -1620956 -664369 -313547
40629c13547L19312R10579Q78292j31097r57401p54958r1391K31317K71730K90045
$$ -313547 5765 916344 1794636 1663539 706138 -48820 -140211 91106 362836 652881
40619F52881N6761m55946n82371K4851O16713M36471k4856J94778R38286J127898
$$ 652881 709642 253696 -328675 -303824 312889 749360 724504 919282 1857568 2985466
40609B985466L59488o36341j095010r70825n77101k26043k73242p94015j145458
$$ 2985466 3344954 2708613 1613603 642778 65677 -160366 -433608 -1227623 -2373081
40600b373081n91207N36632J099218P48508L69703N83200P64413J95422o53127
$$ -2373081 -2964288 -2427656 -1328438 -579930 -210227 372973 1137386 1332808 679681
40591F79681q62122m64375j59982j00891K8086O2531l80429q52106m81400N00215
$$ 679681 -182441 -646816 -806798 -907689 -879603 -817072 -1197501 -2049607 -2531007 -2030792
40581b030792Q51260K16890k65034K27970R26045P84518J17860q3153K27199L11419
$$ -2030792 -1179532 -962642 -1227676 -999706 -73661 710857 828717 745564 972763 1284182
40571A284182K0835q9952J25999J75312j45100m11019l23344j44961j90065l65897
$$ 1284182 1305017 1215065 1341064 1516376 1371276 960257 636913 491952 301887 -64010
40561f4010l99802j83313J97292N17149N13957J59297k52381m52831m45508k85614
$$ -64010 -463812 -647125 -449833 67316 581273 740570 488189 35358 -410150 -695764
40551f95764Q266J68374j33393n54176k80864O09674R01307M8466p61275l77563
$$ -695764 -687498 -519124 -652517 -1206693 -1487557 -877883 23424 71890 -689385 -1066948
40541a066948M69354M62274o9048M9118M88921m884r99121p03184Q74319J519642
$$ -1066948 -597594 -135320 -204368 -155250 333671 328787 -670334 -1373518 -499199 1020443
40531A020443K73158j003529o23255M76657P00175L02211K32295J24325o26921
$$ 1020443 1293601 290072 -333183 143474 843649 1145860 1378155 1502480 875559
40522H75559j142166m81706L08946k40789j304668r51537N31218J035329J80131
$$ 875559 -266607 -748313 -439367 -680156 -1984824 -2936361 -2405143 -1369814 -1189683
40513a189683j45573Q71176J595533P77687m45738o08872j63630k27973n18587
$$ -1189683 -1335256 -464080 1131453 1909140 1463402 854530 690900 462927 -55660
40504e5660j36747N63577N08583k37247n96453k12314J99448J65766J5117J5792
$$ -55660 -192407 371170 879753 642506 46053 -166261 33187 198953 214070 229862
40494B29862r1189m15564n12307n7386N42735O35141J75399k61579k52937p154
$$ 229862 138673 -276891 -789198 -846584 -303849 331292 506691 245112 -7825 -14979
40484a4979J5578k47457m21710k52467P5246K56811K45616J57074N2296J4726
$$ -14979 599 -246858 -668568 -921035 -845789 -588978 -343362 -186288 -133992 -119266
40474a19266J70461L93665K98257j77492n23121l80738j49121l51540p42537o91665
$$ -119266 51195 444860 743117 565625 42504 -338234 -487355 -838895 -1581432 -2273097
40464b273097k18351P5499j0716q4266P3239K47001L33469M68609N43563K65118
$$ -2273097 -2491448 -2415949 -2426665 -2510931 -2437692 -2190691 -1857222 -1388613 -845050 -579932
40454e79932j85942k26556K25376N64503M38353K50065M19392P01529O30365K32044
$$ -579932 -765874 -992430 -767054 -202551 235802 485867 905259 1606788 2237153 2469197
40444B469197q3635r1832O5932J11720j05562m69263p13391p64169p75419o95316
$$ 2469197 2385562 2293730 2359662 2471382 2365820 1896557 1183166 418997 -356422 -1051738
40434a051738k13023N49624Q52897M06060J3988L51351P12648J17743q36518o97493
$$ -1051738 -1264761 -715137 137760 543820 557808 909159 1621807 1739550 903032 205539
40424B05539M49251R39371Q3092q64826q07920l37846l41067m38705J02198R28031
$$ 205539 654790 1594161 1677253 812427 4507 -333339 -674406 -1113111 -1010913 -82882
40414h2882J190224Q44639L81322r8400o31608q35791m92500j38539k40224l47648
$$ -82882 1107342 1951981 2333303 2234903 1603295 767504 275004 136465 -103759 -451407
40404d51407P1107N38977K85156m16602o34396j91190K54432L18109K02956N9267
$$ -451407 -380300 158677 443833 27231 -607165 -798355 -543923 -225814 -22858 36409
40394C6409j61796k96734r4390L02516N09987L95681M0407m70308q38149o14227
$$ 36409 -125387 -422121 -516511 -213995 295992 691673 732080 261772 -576377 -1190604
40384a190604P7935M43930J47338j28995J64104N19428L58479Q7260K14356K66742
$$ -1190604 -1112669 -668739 -521401 -650396 -486292 33136 391615 478875 693231 959973
40374I59973k57883o70216j95062M20741R227q48227n63771P87978J451515P27915
$$ 959973 702090 31874 -163188 257553 266780 -581447 -1145218 -357240 1094275 1822190
40364A822190j34468j42832J14302p1202l50591l43156m18756o87828n26375J25737
$$ 1822190 1687722 1544890 1659192 1587990 1237399 894243 475487 -212341 -738716 -612979
40354f12979L19609k20875l67120M46435R57550J30408q40226l04803J047038
$$ -612979 -293370 -514245 -881365 -434930 522620 653028 -187198 -492001 555037
40345E55037J167796q7624p91084n0948P33024K70805o99155q43891k78466o605
$$ 555037 1722833 1635209 844125 793177 1526201 1797006 1097851 253960 -24506 -31111
40335c1111j80558j49063K02164L23495J01621M8974K64734J30824n93618j157622
$$ -31111 -211669 -360732 -158568 164927 266548 315522 580256 711080 117462 -1040160
40325a040160q74402j93341L0696p9078K75635J013602J047113K8350q25536l63461
$$ -1040160 -1914562 -2107903 -2077207 -2156285 -1880650 -867048 180065 208415 -617121 -980582
40315i80582Q31346J305891P22615k3271l21357l82005l63123p5517K99970K11201
$$ -980582 -149236 1156655 1879270 1855999 1534642 1152637 789514 713997 1013967 1225168
40305A225168k79985m26578l3950J39534l41250p96480n27855N2067J19240l06796
$$ 1225168 945183 518605 484655 624189 282939 -513541 -1041396 -989329 -870089 -1176885
40295a176885n63464l95458r2174J41433L13818L49246J95416M7177M6727K7539
$$ -1176885 -1740349 -2135807 -2227981 -2086548 -1772730 -1423484 -1228068 -1180891 -1134164 -1106625
40285a106625o2067J10491O08596P67603Q7945p68462p03610K56727R62976P02215
$$ -1106625 -1168692 -1058201 -449605 317998 405943 -362519 -1066129 -809402 153574 855789
40275H55789k5445m11918l00084j083K28891K18013j24373n23957m61208J16650
$$ 855789 830344 418426 118342 117259 346150 564163 439790 -84167 -545375 -428725
40265d28725N69896L89166p8632j34041K63076M56417M7053n38549o09143q6201
$$ -428725 141171 530337 451705 317664 580740 1037157 1084210 545661 -63482 -149683
40255a49683M44205N02011K63414J93182L17721K05644k91591o66027m16493J57047
$$ -149683 294522 796533 1059947 1253129 1570850 1776494 1484903 818876 402383 559430
40245E59430K61264l12827q51133o11344K71055J013253J094515O51318J11248
$$ 559430 820694 507867 -343266 -954610 -683555 329698 1424213 2075531 2186779
40236B186779k30318k87291j60252j23695l79764p20242o91745k31298J74130
$$ 2186779 1956461 1669170 1508918 1385223 1005459 285217 -406528 -637826 -463696
40227d63696J92564J47680M01841N90653J52254n47409n06453L36299P46409p1455
$$ -463696 -271132 -123452 278389 869042 1021296 473887 -32566 303733 1050142 978687
40217I78687j185374j174439r2600P52198O83218L01032K49163L12808N9316l61000
$$ 978687 -206687 -1381126 -1473726 -721528 -38310 262722 511885 824693 884009 523009
40207E23009n08155l14789p8524l8075j87947l45982l14611j21941l8883j55787
$$ 523009 14854 -299935 -378459 -416534 -604481 -950463 -1265074 -1387015 -1425898 -1581685
40197a581685j39850K57910P14476Q14389P26117P88149P15806M0077q45417j045057
$$ -1581685 -1721535 -1463625 -749149 65240 791357 1579506 2295312 2335389 1489972 444915
40187D44915n46809k06104k50403K0834P22985Q57757j2117p35820k36535P21339
$$ 444915 -101894 -307998 -558401 -537567 185418 1043175 1031058 295238 58703 780042
40177G80042O49384l87867r50360m47964J27675j19869o75811m87173N22018J396009
$$ 780042 1429426 1041559 91199 -356765 -229090 -348959 -1024770 -1511943 -989925 406084
40167D06084J348715N77554j16864k52631k4694J88742L30249M33093K49513l36583
$$ 406084 1754799 2332353 2215489 1962858 1938164 2126906 2457155 2890248 3139761 2803178
40157B803178p47933l25209N38114P44686R7269m24152k87805k11261p29823j055894
$$ 2803178 2055245 1730036 2268150 3012836 3110105 2685953 2398148 2186887 1457064 401170
40147D01170l48621P12130Q01445q9077p23622m28682K11696M13878Q8022l51532
$$ 401170 52549 764679 1566124 1477047 753425 324743 536439 950317 1038339 686807
40137F86807m33945N6410P36845Q39559K33931k11812J21920N93320L54012k04326
$$ 686807 252862 309272 1046117 1885676 2119607 1907795 2029715 2623035 2977047 2772721
40127B772721j52716L15379K31264m01497o09189j84121K48l68285m73094Q2009
$$ 2772721 2620005 2935384 3166648 2765151 2155962 1971841 1972089 1603804 1130710 1212719
40117A212719M37887p5283p08141m16172N00098Q16142R7435p79535p49777K52671
$$ 1212719 1650606 1575323 867182 451010 951108 1767250 1864685 1085150 335373 588044
40107E88044J234815J130239p0766j245664j407422p94429k72913m7739K49825
$$ 588044 1822859 2953098 2882332 1636668 229246 -565183 -838096 -885835 -636010
40098f36010N02720K43685j82454J63905J166541J473689N14673m98098l92252
$$ -636010 -133290 110395 -72059 91846 1258387 2732076 3246749 2748651 2356399
40089B356399K06752J5353q29588j107502m87715J24561J39646K3794K82106O43283
$$ 2356399 2563151 2578504 1748916 641414 153699 278260 417906 441700 723806 1367089
40079A367089O66324M98863N47350P81437Q30944O13658M76501O82541J018252
$$ 1367089 2033413 2532276 3079626 3861063 4692007 5305665 5782166 6464707 7482959
40070G482959J065849P58035M69392N78457J190497K348833M136802O259913P810054
$$ 7482959 8548808 9306843 9776235 10354692 11545189 13894022 18030824 24290737 32100791
40061C2100791P863518O183316L072981j047796n346945q269778q522837o496669
$$ 32100791 39964309 46147625 49220606 48172810 42825865 34556087 26033250 19536581
40053A9536581l983245k339238j555978j126220r00735p98894n43924j68970r9842
$$ 19536581 15553336 13214098 11658120 10531900 9631165 8832271 8288347 8119377 8019535
40044H019535k97149m0566Q88289J519923R20138m27754j221336r35335q1641
$$ 8019535 7722386 7681820 8570109 10090032 11010170 10582416 9361080 8425745 8344104
40035H344104Q05256J626248K290678K632729K862628L479308M493809N109311
$$ 8344104 9149360 10775608 13066286 15699015 18561643 22040951 26534760 31644071
40027C1644071M389341K110080j032979l862102n413781n483549m596358l415585
$$ 31644071 36033412 38143492 37110513 33248411 27834630 22351081 17754723 14339138
40019A4339138k273532j317357q19089r87432j514228j658237j003860m5168K49060
$$ 14339138 12065606 10748249 9929160 8941728 7427500 5769263 4765403 4720235 4969295
40010D969295m06435j111334q07345K87555Q65348L01951m72311l54402L67318
$$ 4969295 4562860 3451526 2644181 2931736 3797084 4099035 3626724 3272322 3639640
40001C639640O16275J85467j77544o1936K37463N11286P80971O93388j70647j290625
$$ 3639640 4255915 4441382 4263838 4201902 4439365 4950651 5731622 6425010 6254363 4963738
39991D963738j552679p91893m319J56838M8074j4412k92556o99706m98405M67570
$$ 4963738 3411059 2619166 2614847 2771685 2819759 2805347 2512791 1813085 1314680 1782250
39981A782250J244445J102955M92527Q7001j65920m18867l44754P8757J53808
$$ 1782250 3026695 4129650 4622177 4709178 4543258 4124391 3779637 3858394 4012202
39972D012202l62386n81794J28648R53299Q14703J2929l68242j07607J37419M0497
$$ 4012202 3649816 3068022 3196670 4149969 4964672 4977601 4609359 4501752 4639171 4679668
39962D679668j18871j28550m2002R0386J91240J43907Q1860K18284K83141j17046
$$ 4679668 4560797 4432247 4390245 4480631 4671871 4815778 4897638 5115922 5399063 5282017
39952E282017n32847j35680P43982Q90614K44938O9043O81147Q83136K77515R0797
$$ 5282017 4749170 4613490 5357472 6248086 6493024 6562067 7243214 8126350 8403865 8494662
39942H494662P85339J075348M82710M61587J533417J971369J189075J476845L883945
$$ 8494662 9280001 10355349 10838059 11299646 12833063 14804432 15993507 17470352 21354297
39933B1354297N518164M235108K874936M608000O996889O010693L613795M981071
$$ 21354297 26872461 31107569 33982505 38590505 45587394 51598087 55211882 60192953
39925F0192953R582308J2542200J5029283K4829741M3349474N8833178N7150603
$$ 60192953 69775261 82317461 97346744 122176485 165525959 224359137 281509740
39918B81509740L5154105O89543l4735618n9234070o3392393m8027748k6682075
$$ 281509740 316663845 317353388 282617770 223383700 159991307 111963559 85281484
39911H5281484j3633844j0369679q727795m710775k121721l529435n585917n197575
$$ 85281484 71647640 61277961 52550166 47839391 45717670 42188235 36602318 31404743
39903C1404743m084072m373930m532941k807434r04300r93863j916010j458103
$$ 31404743 27320671 22946741 18413800 15606366 14702066 13708203 11792193 10334090
39895A0334090j97457j41135j183130j639320j163866p30024n38818o4389M20810
$$ 10334090 10136633 9995498 8812368 7173048 6009182 5279158 4740340 4675951 5096761
39886E096761K24078k89900j76967M72929P44304M00959Q184j49886k42024k55724
$$ 5096761 5320839 5030939 4853972 5326901 6071205 6472164 6480348 6330462 6088438 5832714
39876E832714o4632J64027L22577O85762J247586J347710O96221J15063M18302
$$ 5832714 5768082 5932109 6254686 6940448 8188034 9535744 10231965 10347028 10765330
39867A0765330J186163J546399J514454J515454J208236R8585j012684o13723
$$ 10765330 11951493 13497892 15012346 16527800 17736036 17834621 16821937 16208214
39859A6208214J367058L137880L082911J407808m91377j569411j746198j574831
$$ 16208214 17575272 20713152 23796063 25203871 24712494 23143083 21396885 19822054
39851A9822054j666147k151727k549550k351816j675267j033170o25590k99534
$$ 19822054 18155907 16004180 13454630 11102814 9427547 8394377 7768787 7469253
39843G469253q9996k44937o80441r25159p42631m06052k23535j55796o1087Q244
$$ 7469253 7379257 7134320 6453879 5528720 4786089 4380037 4156502 4000706 3939619 3947863
39833C947863l4715q6839j2280R9051K5030k56154m56807k77313J93705M76657
$$ 3947863 3913148 3826309 3814029 3913080 3938110 3681956 3225149 2947836 3141541 3618198
39823C618198K24110k97672m45346N5074P96427J176218R84268M46845o8286k89555
$$ 3618198 3842308 3544636 3099290 3154364 3950791 5127009 6111277 6558122 6489836 6200281
39813F200281k21912j80014l82311m74357J14817J166872J543565N04990j187161
$$ 6200281 5978369 5798355 5416044 4941687 5056504 6223376 7766941 8271931 7084770
39804G084770k010691j372362j00365O57467N92225K83179M06637R37914J058234
$$ 7084770 5074079 3701717 3601352 4258819 4851044 5134223 5540860 6478774 7537008
39795G537008Q5244j389983j833068o90940O01626L90603q48414j142304N9202
$$ 7537008 7622252 6232269 4399201 3708261 4309887 4700490 3852076 2709772 2768974
39786B768974J056990N07268n77995n50194K56110K12861q20449j204264j45855
$$ 2768974 3825964 4333232 3755237 3205043 3461153 3674014 2853565 1649301 1503446
39777A503446J046046R80242Q7231m47542n55184q63585j158076o78098L37726
$$ 1503446 2549492 3529734 3616965 3169423 2614239 1750654 592578 -85520 252206
39768B52206P63024K90161j71800k7520J85215q4842m46636l11181J71461N11625
$$ 252206 1015230 1305391 1133591 1106071 1291286 1206444 759808 448627 620088 1131713
39758A131713N95177M66636J4322n73605o64328j15281K66688q8974n09070j46559
$$ 1131713 1726890 2193526 2207848 1634243 969915 854634 1121322 1032348 523278 376719
39748C76719N14361L54315n09818q12079j02220N94311L88482k36377l08997K77157
$$ 376719 891080 1245395 735577 -76502 -178722 415589 804071 567694 258697 535854
39738E35854Q44374Q48316K79485m53772p47279l08864L46810L71769k78003p47636
$$ 535854 1380228 2228544 2508029 2054257 1306978 998114 1344924 1716693 1438690 691054
39728F91054n40998j85487k52396m20805j32159M02717O16019N96662Q29139J118603
$$ 691054 150056 -35431 -287827 -708632 -840791 -438074 177945 774607 1603746 2722349
39718B722349P15710l70227j036960m80877O69232J143693O13221q9716k03603
$$ 2722349 3438059 3067832 2030872 1549995 2219227 3362920 3976141 3886425 3682822
39709C682822Q6082J35401k50742p11245q64023o09141n8276M86389O01087J94321
$$ 3682822 3768904 3904305 3653563 2942318 2078295 1469154 1410878 1897267 2498354 2692675
39699B692675j79932N9002O08026N82069j78397p94447o19542j09714J8744j95349
$$ 2692675 2512743 2571745 3179771 3761840 3583443 2788996 2169454 2059740 2078484 1883135
39689A883135l61129m64560m79343N0415J122507J634508P87205m05170l88758
$$ 1883135 1522006 1057446 578103 628518 1751025 3385533 4172738 3767568 3378810
39680C378810N02618N19147o48988j298563m46754N97587L08202q30909j331090
$$ 3378810 3881428 4400575 3751587 2453024 2006270 2603857 2912059 2081150 750060
39671G50060q75892k59975J12806M59906P74146P81580N20718K34364l3910k03032
$$ 750060 -125832 -385807 -273001 186905 961051 1742631 2263349 2497713 2463803 2260771
39661B260771K142M39049M21406j75979m48843J23437O29022R8170q55685r94613
$$ 2260771 2262913 2701962 3123368 2947389 2498546 2621983 3251005 3349175 2493490 1498877
39651A498877m07222j18887k50021r5666K53067K0969n60089l79894N00836O50288
$$ 1498877 1091655 972768 722747 627081 880148 901117 341028 -38866 461970 1112258
39641A112258l51543j002489k34276Q26122O72409k08364k70137N53889Q50212
$$ 1112258 760715 -241774 -476050 350072 1022481 814117 543980 1097869 1948081
39632A948081K399r99371j153890o37184m6009N38756J169162J449544J060273
$$ 1948081 1950480 951109 -202781 -839965 -885974 -347218 821944 2271488 3331761
39623C331761M74204M34565Q28681P47138k03150j230143j370795p45549k47095
$$ 3331761 3805965 4240530 5069211 5816349 5613199 4383056 3012261 2266712 2019617
39614B019617k21898j73415K14600N47494N04867M23663N86274N59959p1731q16724
$$ 2019617 1797719 1624304 1838904 2386398 2891265 3314928 3901202 4461161 4389430 3572706
39604C572706q97840m02068Q581K02017M58804N23039r0431q83318p11988M07066
$$ 3572706 2674866 2272798 2281379 2483396 2942200 3465239 3374808 2491490 1779502 2186568
39594B186568J031604L31430p14395q61107l45182j50196l01691m4637O57329
$$ 2186568 3218172 3549602 2835207 1974100 1628918 1478722 1177031 1132394 1789723
39585A789723R43743L99128l19001m18390N8253M67015M09807R3061n4001L0320
$$ 1789723 2733466 3132594 2813593 2395203 2453456 2920471 3330278 3423339 3369338 3399658
39575C399658k5641l79171n08619J11380R81699R86863L217p48292m01700L37706
$$ 3399658 3374017 2994846 2486227 2597607 3579306 4566169 4569386 3821094 3419394 3757100
39565C757100L75953j26450k52456Q5543K01940J2106J44441O43028P06156L1903
$$ 3757100 4133053 4006603 3754147 3839690 4041630 4053736 4198177 4841205 5547361 5579264
39555E579264n41132k03194P69385J608380K060920K282461K291832K175797K481140
$$ 5579264 5038132 4834938 5604323 7212703 9273623 11556084 13847916 16023713 18504853
39546A8504853L731238N594856O927394O604514M178416Q2657m366345p409085
$$ 18504853 22236091 27830947 34758341 41362855 45541271 45623928 41257583 33848498
39538C3848498p916354o247718l867115k082533j261639j064371j022146q26940
$$ 33848498 25932144 19684426 15817311 13734778 12473139 11408768 10386622 9559682
39530I559682m02075O4395K51709K6259l83071n96418m55835j37406J08798K68700
$$ 9559682 9157607 9222002 9473711 9499970 9116899 8520481 8064646 7927240 8036038 8304738
39520H304738N45305J053441J666726K234486K807968L495688M192116M636149
$$ 8304738 8850043 9903484 11570210 13804696 16612664 20108352 24300468 28936617
39512B8936617M665807M229611L278315J938951O60408k63264j262198k976960
$$ 28936617 33602424 37832035 41110350 43049301 43709709 43446445 42184247 39207287
39504C9207287n039944o076483n346949l753108k592234j908550r73823Q1247
$$ 39207287 34167343 28090860 22743911 18990803 16398569 14490019 13516196 13597443
39496A3597443L98190Q5070L29471J396308J981165J521135J773793M359155P429543
$$ 13597443 13995633 14080703 14410174 15806482 17787647 19308782 21082575 25441730 32871273
39487C2871273O966922J788760m501677p485971o564642m493051l367914k782189
$$ 32871273 39838195 41626955 37125278 29639307 23074665 18581614 15213700 12431511
39479A2431511j737675o29336n25784j385664j991919j528734n41353j04971m01408
$$ 12431511 10693836 10064500 9538716 8153052 6161133 4632399 4091046 3986075 3584667
39470C584667n76789o6478M55518J2516j035985j211941l8236J012021M50997
$$ 3584667 3007878 2941400 3396918 3409434 2373449 1161508 1123272 2135293 2586290
39461B586290j044585j492211l31096R36279R39782J16377k92811J3485L94014
$$ 2586290 1541705 49494 -281602 654677 1594459 1710836 1418025 1431510 1825524
39452A825524M25134K75282J62248R0041Q7832K47459M82946N44813L24767K588
$$ 1825524 2250658 2525940 2688188 2778229 2866061 3113520 3596466 4141279 4466046 4468634
39442D468634j18571J16689N68574R70932J305521J768564K131870J549889l50385
$$ 4468634 4350063 4466752 5035326 6006258 7311779 9080343 11212213 12762102 12411717
39433A2411717k429083k992982j869004n86358k42220k27396L58418J055029P99540
$$ 12411717 9982634 6989652 5120648 4534290 4292070 4064674 4423092 5478121 6277661
39424F277661l24785j200920j239095q46486m85446j62219J47887L13124L34504
$$ 6277661 5952876 4751956 3512861 2666375 2180929 2018710 2166597 2479721 2814225
39415B814225K86156P9041k15926j37216M02070N49089l39567j358620j099586
$$ 2814225 3100381 3179422 2963496 2826280 3228350 3777439 3437872 2079252 979666
39406I79666J34121O18178j46072o88531l8553O90003K62520n20043j62776R51216
$$ 979666 1113787 1731965 1585893 897362 858809 1548812 1811332 1291289 1128513 2079729
39396B079729J100675l3192r20216n88875J06677J27872j76038L4850N70272N73918
$$ 2079729 3180404 3147212 2226996 1638121 1744798 1872670 1696632 1731482 2301754 2875672
39386B875672r0002p08226p71601m38071k8104L11510M06741P8173m54713o02666
$$ 2875672 2785670 2077444 1305843 867772 839668 1151178 1557919 1636092 1181379 578713
39376E78713j04137N50497O57871J41346l97332m33464q0962J84030J50798Q335
$$ 578713 474576 1025073 1682944 1824290 1426958 993494 912532 1096562 1247360 1255695
39366A255695n5786r4819j68753j51288K5545J61459J26801K29181P81684J337986
$$ 1255695 1199909 1105090 936337 785049 810594 972053 1098854 1328035 2109719 3447705
39356C447705R56577m91271j788023j667296l58159P52337Q43339L64786J6205
$$ 3447705 4404282 3913011 2124988 457692 99533 851870 1695209 2059995 2076200
39347B076200j57120l08895k02068K64763M90874k3460o24942k21050J019741
$$ 2076200 1919080 1610185 1408117 1672880 2163754 2140294 1515352 1294302 2314043
39338B314043J707913J185266M21399M66200R47946R13477M38468L72054Q72271
$$ 2314043 4021956 5207222 5628621 6094821 7042767 7956244 8394712 8766766 9639037
39329I639037J260472J206703J040145Q24516J28680r98778j724070j563731j100371
$$ 9639037 10899509 12106212 13146357 13970873 14099553 13100775 11376705 9812974 8712603
39320H712603j005083r38661j29771J266771K080862J411678l66244j894332k000309
$$ 8712603 7707520 6768859 6639088 7905859 9986721 11398399 11032155 9137823 7137514
39311G137514p56042N09219N12968n53240j270784p97917J24196L10406l01293
$$ 7137514 6381472 6890691 7403659 6850419 5579635 4781718 4905914 5216320 4915027
39302D915027q19312p34466l85082k63112m76615q18964q69511j91086J021771
$$ 4915027 4095715 3361249 2976167 2713055 2236440 1417476 547965 356879 1378650
39293A378650J710112J080593j60009n45616J47193O00345n6014r57046q79739
$$ 1378650 3088762 4169355 4009346 3463730 3610923 4211268 4155254 3198208 2318469
39284B318469j06908Q0734n96956j005600k87267R06127J298430N86195l68881
$$ 2318469 2211561 2292295 1695339 689739 402472 1308599 2607029 3193224 2824343
39275B824343p23437n12491k56452j22343J54311O05903P47333K31566m82818
$$ 2824343 2100906 1588415 1331963 1209620 1363931 1969834 2717167 2948733 2465915
39266B465915n88904l4154L30412j06423q62749j017833m12520K66475M44862
$$ 2465915 1877011 1842857 2173269 2066846 1204097 186264 -226256 40219 485081
39257D85081K01101j34764l93577m08746P0360R28572J453397J037447L5931n30981
$$ 485081 686182 551418 157841 -250905 -180545 748027 2201424 3238871 3274802 2743821
39247B743821k07837L68445L68107j64977n10475l20534N212J2028j84451j85935
$$ 2743821 2535984 2904429 3272536 3107559 2597084 2276550 2281762 2293790 2109339 1923404
39237A923404N9508K27853J44491Q3911M37586J121060J433750P40987n95368
$$ 1923404 1982912 2210765 2355256 2439167 2876753 3997813 5431563 6172550 5577182
39228E577182j292276n60027P84925J251786O45848K49223Q16503J412540R53413
$$ 5577182 4284906 3724879 4509804 5761590 6407438 6656661 7473164 8885704 9839117
39219I839117J1749n7930P16514R79705J89916o29629n74209r7810m911j91389
$$ 9839117 9850866 9792936 10509450 11489155 11679071 11049442 10475233 10377423 10372512 10181123
39209A0181123j39033O8007K9544j58417j19880J19305L03133M79056P58813Q55935
$$ 10181123 10042090 10110097 10139641 9981224 9861344 9980649 10283782 10762838 11521651 12377586
39199A2377586M82170m3530j78329O7131K88551L76061M48457L44789j47834p14040
$$ 12377586 12859756 12816226 12637897 12705028 12993579 13369640 13818097 14162886 14015052 13301012
39189A3301012q28753n73660n08314p91140j036992r95212p79393m91321j99521
$$ 13301012 12472259 11898599 11390285 10599145 9562153 8566941 7787548 7296227 7096706
39180G096706j68120m67289n31011J25673R15124Q49440J39378m429O80137J003382
$$ 7096706 6928586 6461297 5930286 6055959 6971083 7820523 7959901 7955472 8635609 9638991
39170I638991K48115o18164m86460J43562N0243p44258j098762n52553J30814
$$ 9638991 9887106 9268942 8782482 8926044 8976287 8232029 7133267 6580714 6711528
39161F711528K33228n6233k63859l70747n67541p40491n97845j35598K84096L19463
$$ 6711528 6944756 6888523 6624664 6253917 5686376 4945885 4348040 4212442 4496538 4816001
39151D816001K9902j87980r1209P9427o1546m69801p31943o48752l93161j08590
$$ 4816001 4845903 4657923 4566714 4646141 4584595 4114794 3382851 2734099 2340938 2232348
39141B232348K28244N37105O73862P24613P79651N44594j48736o15597p6708Q97602
$$ 2232348 2460592 2997697 3671559 4396172 5175823 5720417 5571681 4956084 4879376 5776978
39131E776978R33919L3134k44387P21781J514091J001015J88082M38060J325755
$$ 5776978 6710897 6744031 6499644 7221425 8735516 9736531 9924613 10362673 11688428
39122A1688428J937007K879075M747069N636468K995636k214238n910482n842313
$$ 11688428 13625435 16504510 21251579 26888047 29883683 27669445 21758963 15916650
39114A5916650l785624k259197j519307q58273n62333r43979j133267m96393O5198
$$ 15916650 12131026 9871829 8352522 7494249 6931916 5987937 4854670 4358277 4423475
39105D423475k56335n48748J97688J066661O61701m19644n56719K03534N74473
$$ 4423475 4167140 3618392 3816080 4882741 5544442 5124798 4568079 4771613 5346086
39096E346086O48413J684032L247892L037089L02927k602234l217392j927499
$$ 5346086 5994499 7678531 10926423 13963512 14266439 11664205 8446813 6519314
39088F519314p17265l18141p1992K62029J82913l49185p18002o98686o97594q40567
$$ 6519314 5802049 5483908 5411916 5673945 5856858 5507673 4789671 4090985 3393391 2552824
39078B552824o85358o9466M67821M46742J06249o5395o2060j92552m21834l62340
$$ 2552824 1867466 1798000 2265821 2712563 2818812 2753417 2691357 2498805 2076971 1714631
39068A714631Q6106M98833M89856K35476J88833M18337N10497J24953n68854j047194
$$ 1714631 1800737 2299570 2789426 3024902 3213735 3632072 4142569 4267522 3698668 2651474
39058B651474q83870p5178Q89059J297643Q28241l9897m56703j42128L24775K69829
$$ 2651474 1767604 1692426 2581485 3879128 4707369 4667472 4210769 4068641 4393416 4663245
39048D663245k60578o41766m72968j7699J40240k32907p40967p99441l56301K1660
$$ 4663245 4402667 3760901 3287933 3270234 3410474 3177567 2436600 1637159 1280858 1302518
39038A302518r1133m00282l58709M5955L87598M74949M23371K17362k09044n46582
$$ 1302518 1211385 811103 452394 498349 885947 1360896 1784267 2001629 1792585 1246003
39028A246003l97560M7224K57881K39266M34739P99433Q09500M30307J63862N1676
$$ 1246003 848443 895667 1153548 1392814 1827553 2626986 3436486 3866793 4030655 4082331
39018D082331l42960q02388m93272N02815R42844K88244l77280k2030Q74005J347856
$$ 4082331 3739371 2936983 2443711 2946526 3889370 4177614 3800334 3778304 4652309 6000165
39008F000165J337245J131456N25768m51618r58311n15603J66801M51533P31059
$$ 6000165 7337410 8468866 8994634 8543016 7584705 7069102 7235903 7687436 8418495
38999H418495J196860J083674L22721L10665J563413K522694K624353M191719
$$ 8418495 9615355 10699029 11021750 11332415 12895828 15418522 18042875 22234594
38991B2234594Q174720J0138647N036830m706409j0742758r096592m427259k589692
$$ 22234594 30409314 40547961 45584791 40878382 30135624 21039032 16611773 14022081
38983A4022081l365711l203079j428516o3028K63354N70373Q77857L58922n58587
$$ 14022081 10656370 7453291 6024775 5961747 6225101 6795474 7673331 8032253 7473666
38974G473666p92093p00455j286554j914499j137449O01075J357111O15905k61782
$$ 7473666 6681573 5981118 4694564 2780065 1642616 2243691 3600802 4216707 3954925
38965C954925m74412o31511j023469r57455k29716L44798L32806K71761M71593
$$ 3954925 3480513 2849002 1825533 868078 638362 983160 1315966 1587727 2059320
38956B059320M46000o8689n79520o69591m95179k62560j0698N8007j48660j22990
$$ 2059320 2505320 2436631 1857111 1187520 692341 429781 419083 477090 328430 205440
38946B05440N42573J166885P71080l08152p95808l86574J039j12096k07809m5575
$$ 205440 748013 1914898 2685978 2377826 1582018 1195444 1196483 1084387 876578 831003
38936H31003j19169m80335m00865K96304P40457M06223o2908k0326J82513J7883
$$ 831003 711834 231499 -169366 126938 867395 1273618 1210710 1190384 1372897 1390780
38926A390780k67912k23496n06N2177N449J8566l6174j40312Q5468O74544R60661
$$ 1390780 1122868 899372 898866 951043 956492 975058 938884 798572 884040 1558584 2519245
38915B519245M46868m35881q85326o38341P64N90579P28910K82319l12105m73455
$$ 2519245 2966113 2530232 1644906 1006565 1007329 1597908 2326818 2609137 2297032 1823577
38905A823577l49576o01653j159931j084041p3746Q02356N78537j72802k44146
$$ 1823577 1474001 872348 -287583 -1371624 -1445370 -643014 -64477 -237279 -481425
38896d81425M09692P41094K34661m50507n12361J4329N02160N15026J47392j82239
$$ -481425 -71733 669361 904022 453515 -58846 -44517 457643 972669 1120061 937822
38886I37822j37656K32583N46839M86623J35076j10504J5268K61491L1129q38451
$$ 937822 800166 1032749 1579588 2066211 2201287 2090783 2106051 2367542 2398671 1560220
38876A560220j566878j199703L4807Q13370M77529q3315R8571N70429M01506j02347
$$ 1560220 -6658 -1206361 -1171554 -358184 119345 36030 134601 705030 1106536 1004189
38866A004189P0942Q19762J067746N71100J53090J12948j37726o59942o92734
$$ 1004189 1075131 1894893 2962639 3533739 3686829 3799777 3662051 3002109 2309375
38857B309375j59397l0053o36897j003045n20249K3346j15411m04518j46984L04931
$$ 2309375 2149978 2119925 1483028 479983 -40266 -16920 -132331 -536849 -683833 -378902
38847c78902L91208L56787M63984K21764n66253r83037l60445M61456M34097j1685
$$ -378902 12306 369093 833077 1054841 488588 -494449 -854894 -393438 40659 28974
38837B8974J22407N85435M01120l63985p60348m65969J31029Q83733J629034J532656
$$ 28974 151381 736816 1137936 773951 13603 -452366 -321337 562396 2191430 3724086
38827C724086J78725j146768r06686K67615L99290p14755j194043j53694R18539
$$ 3724086 3902811 2756043 1849357 2116972 2516262 1801507 607464 453770 1372309
38818A372309O10537l66784o65893l94831m26351o69087m15376K04876L97291
$$ 1372309 1982846 1616062 950169 555338 128987 -540100 -955476 -750600 -353309
38809c53309M4946j66464J54120O86901R82936Q10408Q3972q98525j307958n94283
$$ -353309 -308363 -474827 -320707 366194 1349130 2159538 2243510 1344985 37027 -557256
38799e57256N84145R50961K23410n54276n00697l772J28446k0376J73848N43097
$$ -557256 26889 977850 1201260 646984 146287 142515 270961 250585 424433 967530
38789I67530J97620r08269j497233o65823P11170J128559M62745j77629k50912
$$ 967530 1165150 256881 -1240352 -1906175 -1195005 -66446 396299 218670 -32242
38780c2242k15005k47069J12970P65648Q25081J40042k05545L28869O69648j33569
$$ -32242 -247247 -494316 -381346 384302 1209383 1349425 1143880 1472749 2142397 2008828
38770B008828j177403j015081J03984P26692L91237j15157l56634o33404q69363
$$ 2008828 831425 -183656 -79672 647020 1038257 923100 566466 -66938 -936301
38761i36301n42254J56568L68621k2248j95669J62761L87993J34219N866L95208
$$ -936301 -1478555 -1321987 -953366 -975614 -1171283 -1008522 -620529 -486310 -480444 -85236
38751h5236P12309M05523q9479j16841J22542k0741n50490p82253k78172N59084
$$ -85236 627073 1032596 943117 826276 948818 928077 377587 -404666 -682838 -123754
38741a23754Q50173J75631p89921q52620J97901J096383P07730l30057m83249
$$ -123754 726419 902050 112129 -740491 -542590 553793 1261523 931466 448217
38732D48217M56476J168605P95192n5503n18311n50217l92638J9776N56653O31731
$$ 448217 904693 2073298 2868490 2812987 2294676 1744459 1351821 1371597 1928250 2559981
38722B559981K7920o49680p93866m84171n0931L66085N25973J16696n62619p10744
$$ 2559981 2587901 1938221 1144355 660184 609253 975338 1501311 1618007 1055388 344644
38712C44644j84716K40456J38096M5814L29758M26376n8182m09086J02151Q96920
$$ 344644 159928 400384 538480 584294 914052 1340428 1282246 873160 975311 1872231
38702A872231Q95088J60329k97149j07421N5848l42730r19563r76136m06764K19265
$$ 1872231 2767319 2927648 2630499 2523078 2578926 2236196 1316633 340497 -66267 152998
38692A52998L33364M0597Q687N20777R06120M25578n08854q06061l15127J6744
$$ 152998 486362 526959 535646 1056423 1962543 2388121 1879267 1073206 758079 774823
38682G74823k76039n36050k39743K26332N09138Q57077J154715O20861p11876
$$ 774823 498784 -37266 -277009 -50677 458461 1315538 2470253 3091114 2379238
38673B379238j432460p04808L44484L80546j02110P2971N84308L21664m29945
$$ 2379238 946778 241970 586454 967000 864890 937861 1522169 1843833 1413888
38664A413888m33181K15143J95422o33861q71930J5764O97001J01687q99606q68935
$$ 1413888 980707 1195850 1391272 757411 -114519 -98755 598246 699933 -199673 -1068608
38654a068608J90678J108742J129101M73729j83518k80964J91480N48454J91485
$$ -1068608 -877930 230812 1359913 1833642 1650124 1369160 1560640 2109094 2300579
38645B300579l92858j76362P43390J023809L2207j111929j149687m40678j81168
$$ 2300579 1907721 1731359 2474749 3498558 3530765 2418836 1269149 828471 647303
38636F47303n39050o71196k68086M9120q2837j51069L36718J019795J193519P52111
$$ 647303 108253 -562943 -831029 -781909 -864746 -1015815 -679097 340698 1534217 2286328
38626B286328K04198k8149N4471K70541M44509L53422j12567o02195n19037J24264
$$ 2286328 2490526 2462377 2516848 2787389 3231898 3585320 3472753 2870558 2351521 2475785
38616B475785M61993j19802r53266q81949N3348O10641J54292m84394l57179K95779
$$ 2475785 2937778 2817976 1864710 982761 1036109 1646750 1801042 1316648 959469 1255248
38606A255248P24835Q54441R70602Q81011L41514j39401R5288P54658J052958
$$ 1255248 1980083 2834524 3805126 4686137 5027651 4888250 4983538 5738196 6791154
38597F791154R79997J112183J366368J079883L55295K02828J068855K153284K568632
$$ 6791154 7771151 8883334 10249702 11329585 11684880 11887708 12956563 15109847 17678479
38588A7678479K460324K603899L420449M710872O089487P624017J0129689J4249228
$$ 17678479 20138803 22742702 26163151 30874023 36963510 44587527 54717216 68966444
38580F8966444J8713178K0374604J7186077J0587596L539098l191542j0704611
$$ 68966444 87679622 108054226 125240303 135827899 139366997 136175455 125470844
38573A25470844j8132354k1903492k0001541j4827870j0243071p410193n262872
$$ 125470844 107338490 85434998 65433457 50605587 40362516 32952323 27689451
38566B7689451l486799k683339k442437j710346q74813j273911k548242k664967
$$ 27689451 24202652 21519313 19076876 17366530 16491717 15217806 12669564 10004597
38558A0004597j061986K97313r9172j121530j035631j74367M0061l88457l53071
$$ 10004597 8942611 9239924 9140752 8019222 6983591 6809224 6849285 6460828 6107757
38549F107757J29123n3949r47410j239242m61612K02148l2444k58876L36416P88617
$$ 6107757 6236880 6182931 5235521 3996279 3534667 3736815 3704371 3445495 3781911 4570528
38539D570528p9327j406579j378440m5713Q11551N33728L33561Q47499R29606
$$ 4570528 4491201 3084622 1706182 1660469 2472020 3005748 3339309 4186808 5116414
38530E116414j65300j136601n82155P11877J009255K09478m51671n80396p44756
$$ 5116414 4951114 3814513 3232358 3944235 4953490 5162968 4711297 4130901 3386145
38521C386145q57074k93114M78313K20363r37310j434568p18749l2150j90685
$$ 3386145 2529071 2235957 2714270 2934633 1997323 562755 -155994 -188144 -378829
38512c78829l04732L65418Q79069K30439p61183o67446K87772O85680J27493m38819
$$ -378829 -683561 -318143 560926 791365 30182 -637264 -349492 336188 463681 24862
38502B4862l85194q3869J05085L82437P98774Q77812L24255m44633p90360n61886
$$ 24862 -360332 -444201 -339116 43321 842095 1719907 2044162 1599529 809169 247283
38492B47283j39058K8282j60163m04531l91988k02640j21778j11995J13106M72202
$$ 247283 108225 136507 -23656 -428187 -820175 -1022815 -1144593 -1256588 -1143482 -671280
38482f71280N17463J85337m2766N9806J25190q1362k51311j82167j58164l02319
$$ -671280 -153817 31520 -11246 48560 173750 92388 -158923 -341090 -499254 -801573
38472h01573k58193N7737J47107j50536k66800R181O881n28407o52876K41512
$$ -801573 -1059766 -1002029 -854922 -1005458 -1272258 -1263077 -1256196 -1784603 -2437479 -2195967
38462b195967J096517O93100l32967n03010Q6072Q7328o37146p43762K36762J022762
$$ -2195967 -1099450 -406350 -739317 -1242327 -1156255 -1068927 -1706073 -2449835 -2213073 -1190311
38452a190311O23507j93448k39228M15767R04523Q63397N16281Q6236k42521k59881
$$ -1190311 -566804 -760252 -999480 -583713 320810 1184207 1700488 1786724 1544203 1284322
38442A284322q9255j43236m07954l56907J05112L01757j61300o64055m74362J50457
$$ 1284322 1195067 1051831 643877 286970 392082 693839 532539 -131516 -605878 -455421
38432d55421M05358J16259j47305M9622N23639P93278N57456o3265n73170n37140
$$ -455421 -50063 66196 -81109 -31487 492152 1285430 1842886 1779621 1206451 669311
38422F69311r0889J92170J1686l70684o07098o50784n60248l19474j4185J76178
$$ 669311 578422 770592 782278 411594 -195504 -846288 -1406536 -1726010 -1740195 -1564017
38412a564017K88664M94265O28471L09818l17822n36601m8772N09662M43820o0120
$$ -1564017 -1275353 -781088 -152617 157201 -160621 -697222 -745994 -236332 207488 147368
38402A47368l12972p7096L20439N53128N15277J68992l92997q19729p79194l29775
$$ 147368 -165604 -242700 77739 630867 1146144 1315136 922139 102410 -676784 -1006559
38392a006559J76746M49067L80953N6635j74578R0872P40665J053180N63427j53717
$$ -1006559 -829813 -380746 207 56842 -117736 -26864 713801 1766981 2330408 2176691
38382B176691m6470J038196J973141J582387K8104j331877j445878o42902o2280
$$ 2176691 2130221 3168417 5141558 6723945 6752049 5420172 3974294 3331392 3269112
38373C269112k62428p58566q56791m61517O7010L72682J82644n59416j277310
$$ 3269112 3006684 2248118 1391327 929810 996820 1369502 1552146 992730 -284580
38364b84580j036284K18579J223418R13895q1850l54881K58948O58182L06269
$$ -284580 -1320864 -1102285 121133 1035028 953178 598297 857245 1515427 1821696
38355A821696j48652k04759k43468n53928o94526l56269L4851J07628J13485K03666
$$ 1821696 1673044 1468285 1224817 670889 -23637 -379906 -345055 -237427 -123942 79724
38345G9724Q013m81168m98127K85814R62189O50410j56594m42644k23264k02399
$$ 79724 87737 -393431 -891558 -605744 356445 1006855 850261 407617 184353 -18046
38335a8046l77154j53717L88934N02596M0959k78974l5784L19755K80783J853
$$ -18046 -395200 -548917 -159983 342613 383572 104598 68814 388569 669352 671205
38325F71205p7044J52720M56374N48191K86111j99384n74793o61992n76366l74545
$$ 671205 594161 746881 1203255 1751446 2037557 1838173 1263380 601388 25022 -349523
38315c49523P5567O16569O68404J2263p30223r01014o41887l82218k4866O23859
$$ -349523 -273956 342613 1011017 1023280 293057 -607957 -1249844 -1632062 -1656928 -1033069
38305a033069J094769Q23130J62595n4623K72187N93086P08131P61408N59264
$$ -1033069 61700 884830 1047425 992802 1264989 1858075 2566206 3327614 3886878
38296C886878j2619j64849Q96444K316093K258630M33844j422687j948623j653702
$$ 3886878 3874259 3709410 4605854 6921947 9180577 9614421 8191734 6243111 4589409
38287D589409j491290j346457q13181k77271j70727m7547N97150J371517J783682
$$ 4589409 3098119 1751662 938481 661210 490483 442936 1040086 2411603 4195285
38278D195285K143245K595204K120700q4792k779131l755271k614238j078176
$$ 4195285 6338530 8933734 11054434 10969642 8190511 4435240 1821002 742826
38270G42826n27722n91345m28084r2706j4445q7993j628J37616J02086L2054J50783
$$ 742826 215104 -376241 -804325 -897031 -911476 -999469 -1001097 -863481 -761395 -729341 -578558
38259e78558L30736L19716J26549p4678j54561m889L38486M64098k5372p42961
$$ -578558 -247822 71894 198443 123765 -30796 -35685 302801 766899 741527 -1434
38249a434p56066Q8529P29021L07211n60741o85815p5785J56438l98576p40725
$$ -1434 -757500 -668971 60050 367261 -193480 -879295 -955080 -798642 -1197218 -1937943
38239a937943L4301J290689J626330P32872k92147m94953j94288j99415m65391
$$ -1937943 -1903642 -612953 1013377 1746249 1454102 959149 764861 565446 100055
38230A00055k56920M83230P76965j1244j088919j223581m73724o0781n09696q66952
$$ 100055 -156865 326365 1103330 1092086 3167 -1220414 -1694138 -1754919 -2264615 -3131567
38220c131567k16787Q14152Q90740r1245q50290n12363L28844O86224N78084O93520
$$ -3131567 -3348354 -2534202 -1643462 -1734707 -2584997 -3097360 -2768516 -2082292 -1504208 -810688
38210h10688J067882R33453l4481j015038r88018j6045Q71238R17063L20875k86389
$$ -810688 257194 1190647 1156166 141128 -846890 -862935 8303 925366 1246241 959852
38200I59852n77282n77181l82950j44034o9483j31709L3384N84755J037837Q20542
$$ 959852 382570 -194611 -577561 -721595 -791078 -922787 -889403 -304648 733189 1553731
38190A553731J38102k60198j51814n5494k64148l58032j8866L19164J65049j99544
$$ 1553731 1691833 1431635 1279821 1224327 960179 602147 583281 902445 1067494 867950
38180H67950k24551k0803o0826k48866j12961K23604J58304k71490l11066K27823
$$ 867950 643399 622596 561770 312904 199943 423547 581851 310361 -705 227118
38170B27118N01825o8029p85117o14921L70431J153446J077430M10576k00107
$$ 227118 728943 660914 -124203 -739124 -368693 784753 1862183 2272759 2072652
38161B072652l53392j11373N7870k46655o95407m44415O13638J348335P85725
$$ 2072652 1719260 1607887 1665757 1419102 723695 279280 892918 2241253 3026978
38152C026978m35699q46534j41281N52943L96541j32771k04475J74956L97230
$$ 3026978 2591279 1744745 1603464 2156407 2552948 2420177 2215702 2390658 2787888
38143B787888J42562l99357q40883q10325j82328O25945Q79500K94796o39941
$$ 2787888 2930450 2531093 1690210 879885 697557 1323502 2203002 2497798 1857857
38134A857857j237607j215485o60521J78150Q80655J050634P55038M37800K50030
$$ 1857857 620250 -595235 -1255756 -1077606 -196951 853683 1608721 2046521 2296551
38125B296551r3716o04423p24067j39625N74862O42355J00769l63273l78395j90146
$$ 2296551 2202835 1598412 874345 734720 1309582 1951937 2052706 1689433 1311038 1120892
38115A120892j12716j30004n0131K33765O29658Q37056N79249n584m05085l30096
$$ 1120892 1008176 878172 828041 1061806 1691464 2528520 3107769 3102185 2697100 2367004
38105B367004l0321J46456J80431J43894o2876l93327m43838k836M77047M12111
$$ 2367004 2336683 2483139 2663570 2807464 2744588 2351261 1907423 1904587 2381634 2793745
38095B793745j35447o31089p59774n09663J13059Q84721J152590N08555m59300
$$ 2793745 2658298 2027209 1267435 757772 870831 1755552 2908142 3416697 2957397
38086B957397p80746m08360j78394m38520n34838N2266P98704Q77470L23333j22050
$$ 2957397 2176651 1768291 1589897 1151377 616539 668805 1467509 2344979 2668312 2546262
38076B546262r0789L5499j73383n49399n85537j65106K29821J25343l00941m38140
$$ 2546262 2455473 2490972 2317589 1768190 1182653 1017547 1247368 1372711 1071770 633630
38066F33630o8662L53778L36744r2306o04088r36195q28746q9184R06402J275701
$$ 633630 564968 918746 1255490 1163184 559096 -377099 -1205845 -1295029 -388627 887074
38056H87074O93066p5291k46946q5288j72213k47112J82040N78440Q5772p41311
$$ 887074 1580140 1504849 1257903 1172615 1000402 753290 935330 1513770 1599542 858231
38046H58231m85108P50412J190414J34247q50279m33163L62407j2539r61463p63063
$$ 858231 373123 1123535 2313949 2448196 1597917 1164754 1527161 1514622 553159 -209904
38036b09904M53251Q05241l31196j335831q53876L01001N94346n2570n49499l69553
$$ -209904 243347 1048588 717392 -618439 -1472315 -1171314 -576968 -629538 -1179037 -1548590
38026a548590P637N0300k24816m84858l89611J88776Q69256R36027K25434m55080
$$ -1548590 -1540953 -1490653 -1715469 -2200327 -2589938 -2401162 -1531906 -595879 -370445 -825525
38016h25525l07540L28363M77980Q35k49946J62992N45619K18770l23282j64468
$$ -825525 -1133065 -804702 -326722 -325887 -575833 -412841 132778 351548 28266 -136202
38006a36202M98421M99945n49718j501496j090119M04470J482693J178638l0375
$$ -136202 362219 862164 312446 -1189050 -2279169 -1874699 -392006 786632 756257
37997G56257r86417j032056l59918L91788O68411L60693j45683l67682k37824
$$ 756257 -230160 -1262216 -1622134 -1230346 -561935 -201242 -346925 -714607 -952431
37988i52431p9618n7499O5120M56929P87578N99997j653m08976k98489k5827n9619
$$ -952431 -1032049 -1089548 -1024428 -567499 220079 820076 818423 409447 110958 85131 25512
37977B5512l04275l03272K5909K63953J44943m9413L6482K78754L26253J92326
$$ 25512 -278763 -582035 -556126 -292173 -147230 -196643 -160161 118593 444846 637172
37967F37172J78720K93027J90645k34722n83618m34483J32137N80901L57452n99067
$$ 637172 815892 1108919 1299564 1064842 481224 46741 178878 759779 1117231 518164
37957E18164j522292j281717K69788J659725J344884j82591r12801j11958P12747
$$ 518164 -1004128 -2285845 -2016057 -356332 988552 805961 -106840 -218798 493949
37948D93949K59357n40310j61813R18128R40988l27205j261276q52227P4348M37875
$$ 493949 753306 212996 51183 969311 1910299 1583094 321818 -530409 -456061 -18186
37938a8186L12041K17010J58477L0720P6038L02373J85280m59614r60785p07965
$$ -18186 293855 510865 669342 700062 776100 1078473 1263753 804139 -156646 -864611
37928h64611k4377L67646K41159j66159n26533m30318L36331J159102R73430k57830
$$ -864611 -888988 -521342 -280183 -446342 -972875 -1403193 -1066862 92240 1065670 807840
37918H07840j201672q73715M6368L35455l3924j75880J87163M78944L45196R5799
$$ 807840 -393832 -1267547 -1221179 -885724 -919648 -1095528 -908365 -429421 -84225 11574
37908A1574N3696J05393k256k88094m87025k49320M10894Q47361M45799l65634
$$ 11574 65270 170663 168407 -119687 -606712 -856032 -445138 402223 848022 482388
37898D82388m84957K56745P46186K95677k92208j15599L31132J01810n33157o05458
$$ 482388 -2569 254176 1000362 1296039 1003831 888232 1219364 1321174 788017 182559
37888A82559j23245P5595j34243o4209M07631N73734J49155k64480j96571O9170
$$ 182559 59314 134909 666 -63543 344088 917822 1066977 802497 605926 675096
37878F75096J02365j50445n67347r32351q16062n9229O71701N47031k55030p82753
$$ 675096 777461 627016 59669 -872682 -1688744 -1747973 -1076272 -529241 -784271 -1567024
37868a567024o26702k02381J59152M90273O29863L66550J11410L98091P45128
$$ -1567024 -2193726 -2396107 -2236955 -1746682 -1116819 -750269 -638859 -240768 504360
37859E04360K12178q42876r53819J75544J040538O28663o5912K02082Q83817O31811
$$ 504360 716538 -126338 -1080157 -904613 135925 764588 698676 900758 1784575 2416386
37849B416386n01217j227270r31017j77142M22640P11828N07184k72785r72031
$$ 2416386 1915169 687899 -243118 -420260 2380 714208 1221392 948607 -23424
37840b3424p29370J74637M62048l30286j087289p07483L07414O50621J12797k89975
$$ -23424 -752794 -578157 -116109 -446395 -1533684 -2241167 -1933753 -1283132 -1170335 -1460310
37830a460310Q883L55760J30905j36671L13011J027879Q69036j96360r31062o12890
$$ -1460310 -1451427 -1095667 -964762 -1101433 -788422 239457 1108493 912133 -18929 -631819
37820f31819P7374L26857K92818L33734J78059k83924l28942M16768R78526M60530
$$ -631819 -554445 -227588 65230 398964 577023 293099 -35843 380925 1359451 1819981
37810A819981l16963r8262N68177J92309r44806j041427J78998Q37192j08315
$$ 1819981 1503018 1404756 1972933 2165242 1220436 179009 358007 1195199 1086884
37801A086884j244980j029247K9367O68731Q29323R77367P71289j14278q20805
$$ 1086884 -158096 -1187343 -1157976 -489245 340078 1317445 2088734 1974456 1153651
37792A153651m46442L79636M50227j18966l08706L065N3942l16302n10981l38447
$$ 1153651 707209 1086845 1537072 1418106 1109400 1112465 1166407 850105 339124 677
37782F77j64448m4631K30008L91580O0569l12654K2216P32123O91371k71723j003477
$$ 677 -163771 -208402 21606 413186 473755 161101 183317 915440 1606811 1335088 331611
37771C31611o32142L68489J002538Q82258K69148l79270o52283m50495j45759
$$ 331611 -300531 67958 1070496 1952754 2221902 1842632 1190349 739854 594095
37762E94095j15234j94464l3973J93991L7791m26920o63167m61902q5582K56348
$$ 594095 478861 284397 250424 444415 482206 55286 -607881 -1069783 -1155365 -899017
37752h99017M94985M31851R103l14373j01976L20371L23269m0016k29068j75028
$$ -899017 -404032 27819 36922 -277451 -379427 -59056 264213 224197 -4871 -179899
37742a79899k36216l71275k13144J43809K79395K56228M18895N30180J01580m97284
$$ -179899 -416115 -787390 -1000534 -856725 -577330 -321102 97793 627973 729553 232269
37732B32269l72527L76293O09697j34076r38239q74906j16531O84846J211537
$$ 232269 -140258 236035 845732 711656 -226583 -1101489 -1218020 -533174 678363
37723F78363J270493O53644l08038p90149m98501L105K38129L10679K39382k37925
$$ 678363 1948856 2602500 2294462 1504313 1005812 1008917 1247046 1557725 1797107 1559182
37713A559182q38722p45546M6998M22787j72762p62869l72587M31843N59292J46053
$$ 1559182 720460 -25086 21912 444699 271937 -490932 -863519 -431676 127616 273669
37703B73669J01334M46731L72302k71823p05583m74315k7794R4114q6481k92891
$$ 273669 375003 821734 1194036 922213 216630 -257685 -285479 -191365 -277846 -570737
37693e70737l56244j51892L22408P15355O17176J61206q0370J14287L16587Q2786
$$ -570737 -926981 -1078873 -756465 -41110 576066 737272 656902 771189 1087776 1170562
37683A170562m14109o13220l04178Q9722P3667j88317m4865N84441P83643j67892
$$ 1170562 756453 143233 -160945 -71223 2444 -185873 -230738 353703 1137346 969454
37673I69454j492264j653931l98581Q66408R68175L30636j0845J11790J92235
$$ 969454 -522810 -2176741 -2575322 -1708914 -740739 -410103 -420948 -309158 -116923
37664a16923M5553j66243m29722o73727m71774L33978J069216J012981M34235
$$ -116923 -71370 -237613 -667335 -1341062 -1812836 -1478858 -409642 603339 1037574
37655A037574J06061R0389j35629n19201l71216M09370R16766M30368n59594r85727
$$ 1037574 1143635 1234024 1098395 579194 207978 617348 1534114 1964482 1404888 419161
37645D19161n54418p919o8959m92335m55802J91976N76173M0918p18579n41389
$$ 419161 -135257 -143176 -212135 -704470 -1160272 -968296 -392123 -351205 -1069784 -1611173
37635a611173M09469P98468J69731l50147J02449P68701O24119O1651M4333L37738
$$ -1611173 -1201704 -403236 -233505 -583652 -481203 287498 911617 973268 1017601 1355339
37625A355339m8565j060330j586826j123141k49165N07988J136107J414473Q88201
$$ 1355339 1306774 246444 -1340382 -2463523 -2712688 -2204700 -1068593 345880 1234081
37616A234081j77387q01184n65329q6581K5625j06587j76995j85356j05708K23477
$$ 1234081 1056694 255510 -309819 -396400 -370775 -477362 -654357 -839713 -945421 -721944
37606g21944O14415N91145J46091k11553l02689m50410o74189n45270p3159J34703
$$ -721944 -107529 483616 629707 418154 115465 -334945 -1009134 -1554404 -1627563 -1492860
37596a492860p4378n9288M79385Q85723O09128Q9892l2682J00754M0581j31475
$$ -1492860 -1567238 -1626526 -1147141 -261418 347710 437602 404920 505674 546255 414780
37586D14780j07885J1365K1911P6603K66006K46691j24949l38955n2403K20001
$$ 414780 306895 318260 340171 416774 682780 929471 804522 465567 413164 633165
37576F33165k9971l48082j05125L14616J58716k97781k03068K80625J65678n77173
$$ 633165 603194 255112 149987 464603 623319 325538 122470 403095 568773 -8400
37566h400q09466j18975M11461l0674o28489k75943O22366Q32866K34817j36060
$$ -8400 -817866 -936841 -525380 -556054 -1184543 -1460486 -838120 -5254 229563 93503
37556I3503J74931M25559M369n86056n41994Q8108N84398M98122l4014o23964
$$ 93503 268434 693993 698362 112306 -429688 -341580 242818 740940 706926 82962
37546H2962q69928n15180K01805N66107K06311l00292j70425M12364N60288P9226
$$ 82962 -786966 -1302146 -1100341 -534234 -327923 -628215 -798640 -386276 174012 253238
37536B53238k37984P2889M27754K76626N4717K82891M44240j91480j092777j049317
$$ 253238 15254 88143 515897 792523 847240 1130131 1574371 1382891 290114 -759203
37526g59203q9184M59724j1058n43008k26771M56634O13111L36312K52836L27661
$$ -759203 -848387 -388663 -399721 -942729 -1169500 -712866 -99755 236557 489393 817054
37516H17054Q7162l38243l26305J77670M66097P955q93634j429284j016671J60716
$$ 817054 904216 565973 239668 417338 883435 891390 -2244 -1431528 -2448199 -2287483
37506b287483J148420J046067O7323o26190m00043J29343K42256K24946N85878
$$ -2287483 -1139063 -92996 -25673 -651863 -1051906 -922563 -680307 -455361 130517
37497A30517Q66253L23122o06428p36694Q0998P81969P62891N53927N57800K99195
$$ 130517 996770 1319892 713464 -23230 57768 839737 1602628 2156555 2714355 3013550
37487C013550n07149j133268q43301k8828M03685K68398L4894n2611j10368j70683
$$ 3013550 2506401 1373133 529832 501004 904689 1173087 1207981 1155370 1045002 874319
37477H74319k19578m28922p86265p72667n8938O92649M94004m99130r50761l9122
$$ 874319 654741 225819 -560446 -1333113 -1392051 -699402 -205398 -704528 -1655289 -1694411
37467a694411J414051J929490J107221r4863o35463m30315m0255K41427O33294
$$ -1694411 -280360 1649130 2756351 2661488 2026025 1595710 1555455 1796882 2430176
37458B430176J350644K230970K918191L096680K455191Q39355j262960k765838
$$ 2430176 3780820 6011790 8929981 12026661 14481852 15321207 14058247 11292409
37450A1292409k994448k432904j986018j737572j095867l4149O57487N15179K0482
$$ 11292409 8297961 5865057 3879039 2141467 1045600 1011451 1668938 2184117 2204599
37441B204599k40389l48318n69318p19112n25946j58049R3335K41658L03277O7282
$$ 2204599 1964210 1615892 1046574 327462 -198484 -356533 -263198 -21540 281737 349019
37431C49019l62366l55544L07638Q34329M88591k31508l54027M2881Q5134l66713
$$ 349019 -13347 -368891 -61253 773076 1261667 1030159 676132 719013 804147 437434
37421D37434n60756k11929Q9275L250o2334J01860M3526m07048o08561j20829
$$ 437434 -123322 -335251 -245976 -242726 -305060 -203200 -159674 -566722 -1175283 -1296112
37411a296112M70732L94451j95303n74368m68602j17168K97036O73245P36828
$$ -1296112 -825380 -430929 -626232 -1200600 -1669202 -1786370 -1489334 -816089 -79261
37402g9261L34317j90469l67088j73315J01163K91091L01065l4635n87174p57791
$$ -79261 255056 64587 -302501 -475816 -374653 -83562 217503 182868 -404306 -1162097
37392a162097j92715N77885P49044K92903j24236j18299N2628K0454k83665p12827
$$ -1162097 -1354812 -776927 -27883 265020 140784 22485 75113 95567 -188098 -900925
37382i00925j005956q79203l51526J56472L50680M40292O38488O57381K25070
$$ -900925 -1906881 -2786084 -3137610 -2981138 -2630458 -2190166 -1551678 -894297 -669227
37373f69227k38782j28223L96428O40032L82108j7141l23395n04136l10615L47793
$$ -669227 -908009 -1036232 -639804 228 382336 365195 41800 -462336 -772951 -425158
37363d25158P72087K25529p33299q05676N8190M97151r2652o00161j20582M78327
$$ -425158 346929 572458 -160841 -966517 -908327 -411176 -503828 -1103989 -1224571 -746244
37353g46244L0188r16454r51951n1019N12727K66954J09236O18141J069162O36450
$$ -746244 -716056 -1632510 -2584461 -2635480 -2122753 -1855799 -1746563 -1128422 -59260 577190
37343E77190l39632q96567o82459r8335M03724O58284O23280L07368j43284m98328
$$ 577190 237558 -659009 -1341468 -1439803 -1036079 -377795 245485 552853 409569 -88759
37333h8759o06823m73180k40409r8350r2919k6094L18892Q25679J037587N86364
$$ -88759 -695582 -1168762 -1409171 -1507521 -1600440 -1626534 -1307642 -481963 555624 1141988
37323A141988l64452j132242j088027l30481L44174L65368J10827L07759Q56040
$$ 1141988 777536 -354706 -1442733 -1773214 -1429040 -1063672 -952845 -645086 210954
37314B10954R00364J63317n45577n11856j09490n8876k92746k80002l8404j4752
$$ 210954 1111318 1274635 729058 217202 107712 48836 -243910 -523912 -562316 -577068
37304e77068k10071k23519m5999n0768k23117j14521L78766Q12927Q41436N28899
$$ -577068 -787139 -1010658 -1056657 -1107425 -1330542 -1445063 -1066297 -253370 588066 1116965
37294A116965K3402n32937q03734n70324k07298k06552l02876J34162Q41234P64325
$$ 1116965 1140367 607430 -196304 -766628 -973926 -1180478 -1483354 -1349192 -507958 256367
37284B56367l29237j301997j184675m16671N8457J76161M44717Q24561Q15500
$$ 256367 -72870 -1374867 -2559542 -2976213 -2917756 -2741595 -2296878 -1472317 -656817
37275f56817L86179r071k36197n70926r77214r66604l35937M58837Q57871P52789
$$ -656817 -270638 -279709 -515906 -1086832 -2064046 -3030650 -3366587 -2907750 -2049879 -1297090
37265a297090L37300k15002o76083o81500j09223N62442O63167J72079j93943
$$ -1297090 -959790 -1174792 -1850875 -2532375 -2641598 -2079156 -1415989 -1243910 -1437853
37256a437853N1047M43252K66778k65172k53373M03192O55183q5786q23813l54120
$$ -1437853 -1386806 -943554 -676776 -941948 -1195321 -792129 -136946 -222732 -1046545 -1400665
37246a400665Q23662J124277J87123o70280m41449K97359N22924J70318j97994
$$ -1400665 -577003 547274 734397 64117 -377332 -79973 442951 613269 415275
37237D15275l47133l38511j24561K19979L17580L3514k45161k78796l71681o62098
$$ 415275 68142 -270369 -394930 -174951 142629 176143 -69018 -347814 -719495 -1381593
37227a381593o63927j01313M32030L63013J20682M01118R20828Q37560J21040
$$ -1381593 -2045520 -2146833 -1714803 -1351790 -1231108 -829990 90838 928398 1049438
37218A049438m39930m58082k81766j61488M3699K62562J34014k79795l93282N1931
$$ 1049438 609508 151426 -130340 -291828 -248129 14433 148447 -131348 -524630 -472699
37208d72699N85177O62908K73474k47482n72080m64684L8891M55128L03003k00730
$$ -472699 112478 775386 1048860 801378 229298 -235386 -196495 258633 561636 360906
37198C60906l60692J5291L64945K31555j47049l37010l32693l69079m37548l14352
$$ 360906 214 15505 380450 612005 464956 127946 -204747 -573826 -1011374 -1325726
37188a325726P6406N18973O55417K86372l24180n54630j17826M65892M58187j28362
$$ -1325726 -1249320 -730347 -74930 211442 -112738 -667368 -785194 -319302 138885 10523
37178A0523n91379n01895r0043L16458O37861P31805L79882j79019l14151O0353
$$ 10523 -580856 -1082751 -1172794 -856336 -218475 513330 893212 714193 400042 460395
37168D60395K06133l20211q35701m92903L29210M61815l02203p91434j03023J048525
$$ 460395 666528 346317 -489384 -982287 -653077 -191262 -493465 -1284899 -1387922 -339397
37158c39397J246307K63895o86135n82977K12615O83643N00307R5501k39972o10582
$$ -339397 906910 1170805 484670 -98307 114308 797951 1298258 1393759 1153787 543205
37148E43205r29095q15948k70887J79327K68089L28127N19117L75506l42881r37817
$$ 543205 -385890 -1201838 -1472725 -1293398 -1025309 -697182 -178065 197441 -145440 -1083257
37138a083257o28023K79140Q14645O63359L02343M7463k15428m23858k82136J08081
$$ -1083257 -1711280 -1432140 -617495 45864 348207 395670 180242 -243616 -525752 -417671
37128d17671K60627O5288o8637Q9849L29952M76453N34252L38271k81896r38419
$$ -417671 -157044 -91756 -160393 -70544 259408 735861 1270113 1608384 1326488 388069
37118C88069r88630m96305j63606j91800l2073N01825P60361L33075j96759j42001
$$ 388069 -600561 -1096866 -1260472 -1452272 -1484345 -982520 -222159 110916 -85843 -227844
37108b27844K83848M51383K75551P6898r4218l74658o12266n20919j47909J95629
$$ -227844 56004 507387 782938 859836 765618 390960 -221306 -742225 -890134 -694505
$$ [...]
##END NTUPLES=NMR SPECTRUM
##END=
