##TITLE=31Pdec_2PBDP1301
 CDCl3, 24 sc
 16.1.2023
##JCAMPDX= 6.0         $$ Bruker NMR JCAMP-DX V2.0
##DATA TYPE= NMR SPECTRUM
##DATA CLASS= NTUPLES
##ORIGIN= UXNMR, Bruker Analytische Messtechnik GmbH
##OWNER= root
$$ XWIN-NMR		Version 3.5
$$ Mon Jan 16 13:58:39 2023 Russian Standard Time (UT+4h)  she@DPX200
##.OBSERVE FREQUENCY= 81.013821
##.OBSERVE NUCLEUS= ^31P
##.ACQUISITION MODE= SIMULTANEOUS
##.ACQUISITION SCHEME= undefined
##.AVERAGES= 24
##.DIGITISER RES= 16
##SPECTROMETER/DATA SYSTEM= spect
##.PULSE SEQUENCE= zgpg30
##.SOLVENT NAME= DMSO
##.SHIFT REFERENCE= (INTERNAL, DMSO, 0, 248.564)
##AUDIT TRAIL= $$ (NUMBER, WHEN, WHO, WHERE, WHAT)
$$ ##TITLE= Audit trail, XWIN-NMR		Version 3.5
$$ ##JCAMPDX= 5.01
$$ ##ORIGIN= Bruker BioSpin GmbH
$$ ##OWNER= she
$$ F:/spectra/data/she/nmr/P31/1/pdata/1/auditp.txt
$$ ##AUDIT TRAIL=  $$ (NUMBER, WHEN, WHO, WHERE, WHAT)
(   1,<2023-01-16 13:57:49.23 +0400>,<she>,<DPX200>,
      <created by zg, POWCHK disabled, PULCHK disabled
       configuration hash MD5:
       00 E9 B6 7A A2 85 ED C7 34 08 36 98 17 FE 4E 26
       data hash MD5: 32K
       46 0F BA 05 5C E0 03 DE 71 1B 60 08 8D 04 26 F3>)
(   2,<2023-01-16 13:57:53.64 +0400>,<she>,<DPX200>,
      <Start of raw data processing
       efp BC_mod = 2 LB = 1 FT_mod = 6 PKNL = 1 PHC0 = -10856.55 PHC1 = 661.0566 SI = 64K 
       data hash MD5: 64K
       36 F5 6C D7 7B AE BB 04 85 1F 64 5D 9E 8D A4 81>)
(   3,<2023-01-16 13:58:06.82 +0400>,<she>,<DPX200>,
      <pk PHC0 = 6.994492 PHC1 = 0 
       data hash MD5: 64K
       AF 7E 80 87 98 D1 3A B0 91 84 DD 27 12 6E 89 25>)
(   4,<2023-01-16 13:58:12.39 +0400>,<she>,<DPX200>,
      <abs ABSG = 5 
       data hash MD5: 64K
       F8 AA AD CD 11 E8 41 C7 8C CC 49 4A 18 C6 3F DA>)
$$ ##END=
$$ 
$$ hash MD5
$$ 9C 42 AD 99 5E 2A 71 6A A1 EB DB CF 53 3B F9 B7
##$RELAX= 
##$RELAX= 
##$RELAX= 
##$RELAX= 
##$RELAX= 
##$RELAX= 
##$RELAX= 
##$RELAX= 
##$RELAX= 
$$ Bruker specific parameters
$$ --------------------------
##$DU= <F:/spectra>
##$EXPNO= 1
##$NAME= <P31>
##$PROCNO= 1
##$TYPE= <nmr>
##$USER= <she>
##$AMP= (0..31)
100 100 100 100 100 100 100 100 100 100 100 100 100 100 100 100 100 100 
100 100 100 100 100 100 100 100 100 100 100 100 100 100 
##$AQSEQ= 0
##$AQ_mod= 1
##$AUNM= <au_zg>
##$AUTOPOS= <>
##$BF1= 81.014009
##$BF2= 200.13
##$BF3= 200.13
##$BF4= 200.13
##$BF5= 200.13
##$BF6= 200.13
##$BF7= 200.13
##$BF8= 200.13
##$BYTORDA= 1
##$CFDGTYP= 0
##$CFRGTYP= 5
##$CHEMSTR= <none>
##$CNST= (0..31)
1 1 145 1 1 1 1 1 1 1 1 1 1 1 1 1 1 1 1 1 1 1 1 1 1 1 1 1 1 1 1 1 
##$CPDPRG= <waltz16>
##$CPDPRG1= <>
##$CPDPRG2= <waltz16>
##$CPDPRG3= <>
##$CPDPRG4= <mlev>
##$CPDPRG5= <mlev>
##$CPDPRG6= <mlev>
##$CPDPRG7= <mlev>
##$CPDPRG8= <mlev>
##$CPDPRGB= <>
##$CPDPRGT= <>
##$D= (0..31)
0 1 0 0 0 0 0 0 0 0 0 0.03 2e-05 3e-06 0 0 0 0 0 0 0 0 0 0 0 0 0 0 0 0 
0 0 
##$DATE= 1673863068
##$DBL= (0..7)
120 120 120 11 120 120 24 19 
##$DBP= (0..7)
150 150 150 150 150 150 150 150 
##$DBP07= 0
##$DBPNAM0= <>
##$DBPNAM1= <>
$$ [...]
##$SUBNAM3= <"">
##$SUBNAM4= <"">
##$SUBNAM5= <"">
##$SUBNAM6= <"">
##$SUBNAM7= <"">
##$SUBNAM8= <"">
##$SUBNAM9= <"">
##$SW= 501.771253377433
##$SWIBOX= (0..15)
0 1 3 0 0 0 0 0 0 0 0 0 0 0 0 0 
##$SW_h= 40650.406504065
##$TD= 32768
##$TD0= 1
##$TE= 0
##$TE2= 300
##$TE3= 300
##$TEG= 300
##$TL= (0..7)
0 120 53 12 22 120 120 120 
##$TP= (0..7)
150 150 150 150 150 150 150 150 
##$TP07= 0
##$TPNAME0= <>
##$TPNAME1= <>
##$TPNAME2= <>
##$TPNAME3= <>
##$TPNAME4= <>
##$TPNAME5= <>
##$TPNAME6= <>
##$TPNAME7= <>
##$TPOAL= (0..7)
0.5 0.5 0.5 0.5 0.5 0.5 0.5 0.5 
##$TPOFFS= (0..7)
0 0 0 0 0 0 0 0 
##$TUNHIN= 0
##$TUNHOUT= 0
##$TUNXOUT= 0
##$USERA1= <user>
##$USERA2= <user>
##$USERA3= <user>
##$USERA4= <user>
##$USERA5= <user>
##$V9= 5
##$VALIST= <valist>
##$VCLIST= <CCCCCCCCCCCCCCC>
##$VD= 0
##$VDLIST= <DDDDDDDDDDDDDDD>
##$VPLIST= <PPPPPPPPPPPPPPP>
##$VTLIST= <TTTTTTTTTTTTTTT>
##$WBST= 1024
##$WBSW= 4
##$XGAIN= (0..3)
0 0 0 0 
##$XL= 0
##$YL= 0
##$YMAX_a= 3639
##$YMIN_a= -4962
##$ZGOPTNS= <>
##$ZL1= 120
##$ZL2= 120
##$ZL3= 120
##$ZL4= 120
##$ABSF1= 248.5645
##$ABSF2= -253.2056
##$ABSG= 5
##$ABSL= 3
##$ALPHA= 0
##$AQORDER= 0
##$ASSFAC= 0
##$ASSFACI= 0
##$ASSFACX= 0
##$ASSWID= 0
##$AUNMP= <proc_1d>
##$AZFE= 0.1
##$AZFW= 0.5
##$BCFW= 0
##$BC_mod= 2
##$BYTORDP= 0
##$COROFFS= 0
##$CY= -3
##$DATMOD= 1
##$DC= 0
##$DFILT= <>
##$DTYPP= 0
##$F1P= 0
##$F2P= 0
##$FCOR= 1
##$FTSIZE= 65536
##$FT_mod= 6
##$GAMMA= 0
##$GB= 0
##$INTBC= 1
##$INTSCL= 6.047779e-11
##$ISEN= 30
##$LB= 1
##$LEV0= 0
##$LPBIN= 0
##$MAXI= 10000
##$MC2= 0
##$MEAN= 0
##$ME_mod= 0
##$MI= 50
##$NCOEF= 0
##$NC_proc= -9
##$NLEV= 6
##$NOISF1= 182.463
##$NOISF2= 159.3651
##$NSP= 0
##$NTH_PI= 0
##$NZP= 0
##$OFFSET= 248.5645
##$PC= 4
##$PHC0= -10849.56
##$PHC1= 661.0566
##$PH_mod= 1
##$PKNL= yes
##$PPARMOD= 0
##$PSCAL= 0
##$PSIGN= 0
##$REVERSE= no
##$SF= 81.0140089999694
##$SI= 65536
##$SIGF1= 159.3651
##$SIGF2= -187.1042
##$SINO= 113.3802
##$SIOLD= 16384
##$SREGLST= <1H.CDCl3>
##$SSB= 0
##$STSI= 65536
##$STSR= 0
##$SW_p= 40650.406504065
##$SYMM= 0
##$S_DEV= 0
##$TDeff= 32768
##$TDoff= 0
##$TI= <>
##$TILT= no
##$TM1= 0
##$TM2= 0
##$TOPLEV= 0
##$USERP1= <user>
##$USERP2= <user>
##$USERP3= <user>
##$USERP4= <user>
##$USERP5= <user>
##$WDW= 1
##$XDIM= 65536
##$YMAX_p= 393321266
##$YMIN_p= -140442609
$$ End of Bruker specific parameters
$$ ---------------------------------
##NTUPLES= NMR SPECTRUM
##VAR_NAME=  FREQUENCY,     SPECTRUM/REAL,   SPECTRUM/IMAG
##SYMBOL=    X,             R,               I
##VAR_TYPE=  INDEPENDENT,   DEPENDENT,       DEPENDENT
##VAR_FORM=  AFFN,          ASDF,            ASDF
##VAR_DIM=   65536,         65536,           65536
##UNITS=     HZ,            ARBITRARY UNITS, ARBITRARY UNITS
##FACTOR=    0.620285442955139, 1,           1
##FIRST=     20137.2065510682, 0,            0
##LAST=      -20513.1999529968, 0,           0
##MIN=       -20513.1999529968, -140442609,  0
##MAX=       20137.2065510682, 393321266,    0
$$ Real data points
##PAGE= N=1
##DATA TABLE= (X++(R..R)), XYDATA
$$ [...]
42181 839601 -15496810 -25124064 -19911900 -9253306 -4928966 -6386931 -6985563 -5618419
42173 -5618419 -4841052 -4204424 -2423224 -1252324 -1646058 -815602 2055702 2380225 -2482186
42164 -2482186 -7791277 -9040788 -9808110 -15220020 -21851513 -21990503 -15675118 -10603183
42156 -10603183 -10314369 -9683148 -4078096 2472805 1975672 -6784370 -15398310 -14442901 -4022158
42147 -4022158 5593225 4575495 -6166632 -16408084 -16977971 -6953645 7553700 18399822
42139 18399822 20248718 14459985 8431950 8141792 11673821 12980717 10647448 8670891
42131 8670891 9456787 11060900 11509632 11157361 10253199 8403804 6764641 6733615 6697170
42122 6697170 4507631 2621626 5391513 11216775 13135277 8092326 341140 -5273905
42114 -5273905 -8115487 -8693027 -6132955 -754849 4735726 8108285 8914629 7342544
42106 7342544 5037655 5366469 8416720 8068288 -151762 -10588893 -13610245 -8066946
42098 -8066946 -208869 7046563 14407448 18136598 13283823 4709585 2607550 5678872
42090 5678872 1694327 -11805001 -20556046 -13516331 1573702 9918556 7468243 -263142
42082 -263142 -8261173 -12841812 -9972386 -1169216 4423041 811945 -6993592 -11413054
42074 -11413054 -12508091 -13999383 -15507755 -15395786 -15718435 -17737592 -17523012 -12331116
42066 -12331116 -6711934 -6129384 -8472993 -7351376 -421216 9545019 17989220 20176426
42058 20176426 14600678 7236829 6431312 11683103 14786935 13394661 13494154 15913572
42050 15913572 12609874 1880324 -5141298 -1333270 4109273 -337366 -11663479 -19036630
42042 -19036630 -19048139 -15153926 -9806815 -5601171 -6184738 -8464356 -3298056 8753354
42034 8753354 14056495 6840077 -161177 3180106 7873429 4579831 2786593 12238316
42026 12238316 19797502 8443225 -11265330 -14683396 -1576924 5574129 -1264831 -7506396
42018 -7506396 -5529854 -4982810 -8553950 -3693426 12066831 20402244 8943832 -9596638
42010 -9596638 -16953391 -12435709 -5606340 -348721 2462253 -958223 -9477392 -13817379
42002 -13817379 -10328585 -7665047 -11921822 -16550357 -15139640 -12219248 -12563238 -11982809
41994 -11982809 -8341054 -9148804 -17055178 -19934446 -8284764 8170122 14669581 12331107
41986 12331107 10739092 9157971 1500736 -7233035 -7158902 -1910152 -3456508 -10669125
41978 -10669125 -10442445 -446841 6541178 4429760 3922265 14316043 28439860 34287249
41970 34287249 31768090 28683463 26973168 22387191 14179098 6811480 3052981 1530700
41962 1530700 1042359 2565982 6424363 10996283 15176590 19436559 23253138 23849286
41954 23849286 19692584 13899355 11237130 11856101 11263029 7367705 3544643 2260463
41946 2260463 250438 -5055201 -8381951 -3535909 4436639 3384148 -8367108 -17760018
41938 -17760018 -14247653 -3223532 3513827 3892730 4397556 6997228 6145468 -1102549
41930 -1102549 -8524317 -6781641 6154642 21604626 27140956 18490244 4759667 -881529
41922 -881529 4002319 9640794 8030725 2561660 908481 4342298 9026564 12951860
41914 12951860 15315549 12661347 2989261 -7774045 -10589162 -5022162 -32223 -1585561
41906 -1585561 -4941432 -2274660 6037700 12162513 11542985 8514557 9569003 13622292
41898 13622292 12499666 1397462 -14235234 -24207981 -23988087 -17529687 -11695502 -10412648
41890 -10412648 -12588817 -13115547 -7743131 736648 4422318 1548380 789101 8517445
41882 8517445 17045464 14572550 3134984 -4509219 -4123438 -3302413 -5009218 -2233228
41874 -2233228 6475217 10113458 1976068 -8140986 -8061118 -297681 4877811 5180712
41866 5180712 4422152 2108839 -3124671 -5064050 2550670 13232193 14579841 6088664
41858 6088664 -1475668 -3419255 -5810216 -12201777 -17536960 -18097233 -17082303 -16402824
41850 -16402824 -12205560 -3374931 3591990 3806379 1498973 2538571 5113386 4327705
41842 4327705 1695644 2726008 7177600 8873465 5295314 1203706 990492 2394059
41834 2394059 895271 -3239514 -6518765 -8698281 -12295920 -15727447 -13378656 -5623441
41826 -5623441 -2688079 -11998189 -25378735 -27309154 -15241159 -3026671 -2398068 -9201798
41818 -9201798 -11747888 -5903144 3024382 8240686 6701101 652217 -2548652 3012819
41810 3012819 12378522 13183312 2616279 -6584976 -3322896 6098691 7944006 686579
41802 686579 -5578047 -5456536 -3134503 -2528699 -2912052 -4484810 -8979873 -13558071 -12317686
41793 -12317686 -5575241 -545817 -1161107 -3649473 -3693644 -1836133 -270432 43115 -2118178
41784 -2118178 -6918243 -9718959 -4883068 5180834 11032668 8367653 3089250 1537631
41776 1537631 1711496 -1623697 -7732250 -10698673 -7095316 781040 7899850 10256801
41768 10256801 7014050 1090076 -2791602 -1668597 3861118 10482124 14118716 12987103
41760 12987103 10299272 11317883 15304953 14130528 3470486 -8071194 -7856359 4246774
41752 4246774 15683890 17868686 15332712 15855418 18689117 17820404 12518056 8262649
41744 8262649 7861209 6884770 388765 -8343194 -10047203 -1753565 7248299 6432146 -1401352
41735 -1401352 -3772906 3378119 10138478 8072625 2004925 503618 2757750 2671884
41727 2671884 -532670 -3912072 -7082173 -8939597 -4769811 4313259 6455686 -5133667
41719 -5133667 -18493404 -18296014 -8622449 -5049162 -9304775 -9717994 -3921054 -1266989
41711 -1266989 -2530095 2161888 11993445 12724725 1283128 -6841909 -2866165 2144734
41703 2144734 -478923 -1203597 7785951 15005549 8654794 -2019557 -2339845 3734054
41695 3734054 4101138 1755136 6720315 13439674 8554408 -3671292 -6024056 3145943
41687 3145943 7455348 -477402 -9841356 -12670669 -14663926 -19208921 -18457342 -8816193
41679 -8816193 -438948 -1556162 -5316967 -2074978 5083697 7133184 3825809 1765890
41671 1765890 2865189 3410074 1490916 -1526501 -4733561 -7775489 -9229648 -8535078
41663 -8535078 -7383393 -6827995 -5719805 -3326792 166844 6251860 15725826 22954335
41655 22954335 19873441 8422988 1083585 4268707 8836916 4119086 -5129920 -5247334
41647 -5247334 6225656 17040041 17109296 10121391 5511140 5772576 6701777 6092610 6065410
41638 6065410 7464522 7492729 4896799 3270551 5335309 6844710 1929222 -6373932
41630 -6373932 -8004705 -29006 8380035 9162726 6438114 7824930 10964463 7832364
41622 7832364 -1288769 -8189637 -9632571 -10143032 -12030607 -12119436 -9471754 -7397338 -6151207
41613 -6151207 -2277271 2946113 3227341 -2324606 -7387607 -9262562 -11737966 -14496350
41605 -14496350 -11257346 -3245825 -1935344 -10651180 -15822573 -7345335 3667245 1462984
41597 1462984 -9053125 -10510750 -1353449 2739590 -4552240 -10616563 -5714100 1771877
41589 1771877 799626 -3853316 -115890 11543878 18660353 14877296 7456944 5323964
41581 5323964 6964767 4544345 -3054127 -6652314 1693405 16499885 23288766 15792722
41573 15792722 2873593 -4956070 -9172838 -16192116 -22316031 -17395619 -2785911 6633204
41565 6633204 2127410 -7445164 -9735794 -5792034 -4835963 -8323514 -8673600 -1614189
41557 -1614189 8320267 14596822 15185532 12103913 9015335 9335834 13034972 15624522
41549 15624522 13524081 9312125 7804081 8076653 4397713 -4516342 -11942315 -10844177
41541 -10844177 -2141544 6606976 8930108 4508663 -2069711 -6295600 -7636837 -8469035
41533 -8469035 -9355440 -7415782 -911571 6534903 8959853 4285441 -4590856 -13262869
41525 -13262869 -17674116 -14721595 -5370070 3752888 6265514 3112269 -434201 -3535627
41517 -3535627 -9244041 -15234229 -13347946 -1988259 8280495 7727025 1192569 1651726
41509 1651726 12513423 23548427 24302702 15564107 6342918 3891844 8171095 13195871
41501 13195871 12930774 7887351 5459253 11257561 21401161 27033198 25182837 20183240
41493 20183240 14910226 7173300 -3213171 -9855913 -6669791 3927868 13429087 15762350
41485 15762350 10949205 3003482 -2781438 -2757358 1562204 4249732 1597709 -3612196
41477 -3612196 -6408353 -5791169 -4169374 -3358058 -4308010 -8228737 -14034610 -16645805 -12216490
41468 -12216490 -4082526 358865 -2076863 -8456406 -14460178 -17030770 -14108360 -6917039
41460 -6917039 -1653184 -3362063 -8219757 -7570028 -115922 5967452 4586209 -642869
41452 -642869 -2930087 -917757 2754076 6482175 8785903 6247727 -2366423 -11900810
41444 -11900810 -15330671 -11728510 -6344753 -3414172 -1887606 1547987 7034542 9883861
41436 9883861 5161755 -5024508 -11105914 -6976399 465786 -526029 -8943426 -10751293
41428 -10751293 419111 12133878 10210759 -1180270 -6959768 -3453020 -938727 -5391339
41420 -5391339 -10149233 -8188843 -2233800 1995515 4595050 7939308 9981323 6989930
41412 6989930 92318 -5431478 -6108260 -3115770 -435138 -1221481 -4586910 -6280582
41404 -6280582 -4525743 -3200815 -5321807 -6056701 1027978 12089428 15860169 9202933
41396 9202933 1039569 -1552743 -1937912 -4402522 -5232598 -118201 6659703 8057267
41388 8057267 4231208 46468 -2506747 -3166189 -135517 5129966 5591110 -1058772
41380 -1058772 -5588576 9979 8609156 7868651 -709998 -5644926 -5133855 -7834826
41372 -7834826 -14503651 -15085788 -7266980 -2121339 -5138598 -6555655 476072 5887393
41364 5887393 -892480 -11519400 -10391013 1310972 8286985 4082890 -3287076 -7577823
41356 -7577823 -11885867 -17981994 -20608395 -16735507 -10837610 -6614932 -1804277 4542656
41348 4542656 7710163 5356108 2607172 3375275 3351850 -1492494 -5516651 -1271811 7028731
41339 7028731 7479611 -2925170 -14318692 -17434361 -13455138 -8756060 -7298885 -11355782
41331 -11355782 -22425921 -35822494 -40013690 -28802666 -11191610 -1437915 -592688 3466580
41323 3466580 16299153 26429693 20528394 2865923 -8810600 -5006378 5804817
41316 5804817 10211294 5768523 282880 -199837 2488183 3356532 892704 -2108517
41308 -2108517 -2477891 -205584 1762003 875445 -2235674 -4564240 -3715523 442589 6038985
41299 6038985 9912972 9494147 6175283 5513063 10845283 17500355 17539475 10411781 4086691
41290 4086691 4345172 8230773 10754377 12429887 15312493 16367102 11671087 4539698
41282 4539698 1883776 3210003 1033594 -6603623 -11761095 -8169541 -598045 2506466
41274 2506466 817075 269060 2570465 3844070 3069296 4555207 9845548 12962651
41266 12962651 7678301 -3973738 -14419680 -19361076 -19777761 -17066908 -11512474 -5608421
41258 -5608421 -3474916 -4961989 -4757180 -202908 3978094 2646210 -1452047 -1429814 3853209
41249 3853209 9298776 11795613 12768845 12745510 10307374 7669089 9783799 14665283 12038578
41240 12038578 -2759400 -19606557 -25344282 -20088248 -13843519 -10447074 -4859224 4215177
41232 4215177 9711052 7517544 3749465 5152755 8316031 5035927 -4918898 -12845766
41224 -12845766 -11939656 -3990384 4751061 10068545 11180161 9222984 6540643 5606035
41216 5606035 6335297 5101048 -1350725 -10562605 -15066118 -10238155 -263492 6175598
41208 6175598 5640476 2438850 1441121 2287566 2045945 -394176 -4910814 -11095149 -15497702
41199 -15497702 -12403045 -2098882 5713608 3047537 -4991587 -7377257 -3416092 -2711320
41191 -2711320 -9032832 -14321102 -11851148 -6307801 -5283610 -7813021 -8198475 -6605013
41183 -6605013 -8626769 -16095063 -24103146 -27157009 -24849341 -21241283 -19960477 -19521907
41175 -19521907 -14402371 -3279261 5975303 5389478 -448749 195187 7242127 6740576
41167 6740576 -7163781 -20019238 -16539196 -2849511 3267828 -2035034 -6893956 -4250832
41159 -4250832 541713 2650383 4275082 5589982 1829316 -6165792 -9610142 -5273031
41151 -5273031 -1181119 -2805998 -3401080 3979741 13317368 14198384 7699889 3570077
41143 3570077 4873501 5324163 1151071 -3067006 -2021561 2803617 5517068 2810295
41135 2810295 -2632558 -4894169 -1763273 1466384 -1394007 -7367134 -7469972 -1440786
41127 -1440786 -153614 -8346438 -15156349 -11218935 -5746361 -12518432 -25085312 -23609115
41119 -23609115 -5639499 8402093 5158681 -3179538 489633 12937059 18417303 12234155
41111 12234155 3267631 -1359259 -1656811 1873464 8583601 12796447 9078190 2063686
41103 2063686 1573800 7911096 11186328 5844763 -3245738 -10361145 -15200282 -17276294
41095 -17276294 -13435867 -5104541 161665 -829023 -2075304 1065737 3853055 820665
41087 820665 -4264902 -4529188 -741281 1893147 3249157 6129971 8057010 4556734
41079 4556734 -1114829 -1145186 3954977 5081608 -1142967 -6663168 -4102675 2969004
41071 2969004 6551956 5067853 2572815 1639569 2346541 5260299 10181605 13429750
41063 13429750 10733922 2559584 -5919350 -9496590 -6422815 552402 4959635 1284421
41055 1284421 -8561244 -15928048 -15230689 -10379299 -8409915 -9889758 -10224740 -8147491
41047 -8147491 -7071184 -8434749 -9448655 -8630749 -8488588 -10267104 -10304798 -5521887 -120177
41038 -120177 -2147475 -13008205 -23841819 -24494061 -14682807 -3746602 688282 771469
41030 771469 3173372 8656617 11785286 10541673 9840485 12549844 12927764 5052191 -5950841
41021 -5950841 -8992107 -2460535 3741045 3396049 2980210 10381847 20903395 22155817
41013 22155817 10470068 -4725355 -12775791 -12061996 -7587271 -3989632 -3413799 -5980986
41005 -5980986 -9012605 -8425184 -3784031 150218 -512644 -3513218 -4392331 -3535238 -4959004
40996 -4959004 -8956674 -10580397 -6147695 2388575 10452426 15036112 15309153 12770049
40988 12770049 11826093 16104124 22423394 22773028 14838708 6008371 3329217 4239716
40980 4239716 2453507 -1393175 -2254459 -1086440 -4111330 -11774048 -16792339 -15183243
40972 -15183243 -11948314 -12672321 -15627440 -15885548 -12115202 -5662530 2357778 9378663
40964 9378663 11498567 9299685 9000108 13492212 16962486 13621610 7200662 5339128
40956 5339128 8189804 9791646 8175830 6405244 4968750 1119362 -4202327 -6381738
40948 -6381738 -5028685 -4808055 -7021221 -7526856 -5254342 -5375132 -10128477 -13206489 -8718229
40939 -8718229 -647752 2698264 148966 -2539544 -2013923 -262678 771037 1553364
40931 1553364 1571527 -1059624 -4935154 -4539265 3265886 14347431 21187556 20287986 14180182
40922 14180182 7569193 3461119 2348706 3039688 3675516 2982864 1343546 591790 2518188
40913 2518188 7284156 12739451 15122919 11555498 3381234 -3213782 -2158731 5558000
40905 5558000 11370830 7548127 -4464393 -15813036 -19630473 -16569624 -11680279 -8782828
40897 -8782828 -8318594 -8075227 -5308219 -285203 2436221 -660612 -5868444 -6142318 -1710127
40888 -1710127 -696339 -6759192 -12807938 -11697590 -6819493 -5275776 -5936839 -3081402
40880 -3081402 1806404 2301244 -168921 3018703 12454535 16651632 7672777 -7605309
40872 -7605309 -17068976 -17174490 -11774988 -4021653 3455924 5443824 -712636 -9432245
40864 -9432245 -13272143 -13035104 -14926905 -19253264 -19366616 -12213204 -3124655 1823908
40856 1823908 2802921 3048752 3194163 2195150 1025101 1800187 4292038 6036778 5589325
40847 5589325 3614487 745034 -3620722 -9333924 -13624436 -13218630 -8489026 -3602513
40839 -3602513 -1418441 124605 4688076 11935708 17796705 19605920 18189178 15163190
40831 15163190 11268006 7606590 5493806 4583268 3973967 5191980 10335196 16724420
40823 16724420 17745068 10659499 -123822 -8898718 -13566852 -13423285 -7817132 -321669
40815 -321669 1425843 -4669723 -9937169 -5344571 5853958 12337388 9735110 4352763
40807 4352763 1870858 -464414 -7312421 -15898784 -18262307 -12015965 -4864044 -5948902
40799 -5948902 -13865604 -17281185 -9666058 702982 1151062 -7502500 -11921510 -5500917
40791 -5500917 2981294 3190270 -3974516 -12717457 -21321728 -26647345 -19707918 1216217
40783 1216217 20469273 22012629 11715915 7951192 13614282 14928636 7729719 5289869
40775 5289869 14503363 22528750 17319566 6613996 3845300 6760122 4314026 -3452865
40767 -3452865 -7577511 -7404370 -10636449 -17529633 -18932896 -11740781 -4494055 -4020926
40759 -4020926 -6137355 -4586174 -1871986 -4997705 -14308156 -22120172 -21474535 -12825519
40751 -12825519 -1974627 6452775 12020949 15334080 14632223 8644248 1286750 -1805172
40743 -1805172 -1815689 -5535971 -13749082 -18176922 -14081692 -8308873 -8463764 -11272035 -10086680
40734 -10086680 -7475658 -9547413 -12431395 -7172631 3608969 7112566 -487444 -8511599
40726 -8511599 -8086071 -2498401 2379735 6380978 8307984 2388566 -10418646 -17316430
40718 -17316430 -9831433 2322737 4327775 -2275673 -3047734 7091715 17157809 16629237
40710 16629237 8539986 2765607 3547584 7699539 10595550 10470161 9259851 10841707
40702 10841707 16331959 20992568 18949092 11207890 5202649 5308305 7525822 5762390
40694 5762390 549451 -1711909 2476395 8472709 8587501 1715485 -4624573 -3795001
40686 -3795001 531665 -1025687 -9749234 -15900698 -12528312 -6089885 -7404412 -16239362
40678 -16239362 -22448689 -20625617 -15693056 -13509890 -13416511 -12569205 -11575707 -12080795 -12754505
40669 -12754505 -11197200 -7313565 -2369759 2941076 7572742 9718926 9136869 7508476
40661 7508476 5006325 -530057 -8843902 -14674400 -13222883 -6621101 -1826975 -2654786
40653 -2654786 -6397293 -8260493 -6901339 -4521158 -2449724 1421945 9071571 16799689
40645 16799689 16951459 7661791 -2248992 -2680715 5067273 10434475 7974261 3279098
40637 3279098 3087039 5821281 5722042 1741615 -2197263 -3040726 -890158 2506682 4457461
40628 4457461 2319763 -3761279 -10847211 -17188740 -23070873 -26441353 -22743126 -12397531
40620 -12397531 -3526555 -2505082 -5955963 -7253932 -6565362 -7706065 -8725696 -4159925
40612 -4159925 4663868 10028637 8976248 6561701 6984698 8638169 9471738 10123510 9502365
40603 9502365 4399240 -3350744 -6253226 -1870461 2264727 -514136 -6202730 -7293217
40595 -7293217 -4563983 -4161228 -6245095 -4684935 2853316 11528123 16102665 15331959
40587 15331959 9820989 1563328 -4029698 -1888880 5406605 9517830 7159869 3723011
40579 3723011 4470518 8215280 12413658 17661542 22151533 18093422 1435059 -18547262
40571 -18547262 -27675116 -23291363 -14408113 -6703337 2947392 15498228 23697046 22641742
40563 22641742 18501066 19354615 22807097 20589724 11652404 2412724 -3595108 -7828559
40555 -7828559 -9928177 -7886094 -4954233 -6808985 -10397122 -5784212 7447377 16200486
40547 16200486 12365899 5330750 7146804 13956098 14049831 8223031 7679203 13774482
40539 13774482 15048022 6691230 -1200882 -565273 1899777 -2270518 -7591903 -3448556
40531 -3448556 7602394 13136326 10387027 9902982 17824030 25549901 22467209 11040404
40523 11040404 2172656 457540 1702271 2688291 5040347 8359821 6943842 -2430088
40515 -2430088 -13965068 -18865983 -15162089 -6958520 3272374 15042123 23582617 21637755
40507 21637755 10177351 95149 -1301687 737275 -1391691 -4750854 -1758818 5189963
40499 5189963 5742012 -2190676 -8425370 -4879170 4680869 12154986 14316806 10909952
40491 10909952 1706314 -9204380 -13327890 -8437102 -3579121 -6865269 -13751740 -14895541
40483 -14895541 -10486949 -7690789 -7665047 -5617059 -2082317 -2900542 -7070346 -5781109
40475 -5781109 2883820 8462137 3289223 -5343764 -6215492 -1161122 -1326065 -9224936
40467 -9224936 -14600607 -9320724 1859408 9016989 9538883 7704072 5437006 232744
40459 232744 -7240838 -9404580 -91877 15349459 23259237 16347369 1798200 -7767022
40451 -7767022 -8827184 -8734013 -14227135 -22778546 -26312800 -20014936 -6051683 8368711
40443 8368711 15128302 10881202 1259778 -3492620 -201991 2676125 -3830537 -16038729
40435 -16038729 -21300769 -14372429 -3911330 -861983 -5673897 -10409610 -9621862 -4896606
40427 -4896606 -721102 203627 -1606146 -2735270 640430 8298898 15054965 16293085
40419 16293085 12840741 8402262 4847887 3055242 5035136 10217703 12268511 6001286
40411 6001286 -3884729 -7852058 -4571874 -1063789 203480 4519824 12572858 15422912
40403 15422912 8081655 -835044 -1336295 3199665 3064649 -1550327 -2249876 2800372
40395 2800372 6937614 6994113 6908870 8773204 9559479 8039894 6606344 5119131 1292458
40386 1292458 -1975552 772182 5695989 1110273 -14673118 -26931579 -22825849 -8248023
40378 -8248023 1200093 -216657 -5981477 -9848998 -11798536 -13035602 -12571805 -9534799
40370 -9534799 -4554432 1418673 7176630 10998930 12246264 11929431 10683013 8185847
40362 8185847 4749371 410004 -6837164 -16933007 -22713413 -16391906 -1883156 7802692
40354 7802692 7596407 5484788 7310058 7428289 986526 -5158440 -3355114 1399710
40346 1399710 -416057 -7614239 -11643128 -9660552 -3930961 5992891 18555759 22706485
40338 22706485 9173031 -12686146 -22834196 -15320434 -2722333 4264311 8265372
40331 8265372 13691620 16618962 11979295 2001466 -7472671 -12565405 -10860947 -2794009
40323 -2794009 4332721 1723302 -8909863 -16285640 -14600917 -9515142 -6968655 -5296975
40315 -5296975 -2231977 -694825 -2221260 -2158567 2671144 7303417 4997547 -3971171
40307 -3971171 -13468077 -17327005 -12321265 -941240 7422927 4904889 -3749897 -6321492
40299 -6321492 -737467 2208494 -3433319 -9630766 -8534044 -4801879 -5799499 -9083514
40291 -9083514 -9186071 -8971762 -13662507 -19235388 -17347119 -8359983 -329201 2347701
40283 2347701 1635803 326711 958166 6728416 16242032 20967895 15256739 5162413
40275 5162413 -61315 -831152 -3138425 -5969202 -3086239 4888335 10145276 8617620
40267 8617620 2740053 -5223932 -13863590 -18280157 -14644452 -8242135 -7329719 -9706339
40259 -9706339 -6031412 3375340 7054361 331707 -6970901 -5673973 260329 2733111
40251 2733111 1917923 1762593 379026 -5693250 -11915886 -9921313 -185731 7245327
40243 7245327 5442154 -1877417 -6968469 -7456279 -6443299 -6298180 -6133137 -5161076 -5099888
40234 -5099888 -7060526 -8141399 -5004008 -520354 -1809073 -9541181 -14153679 -7138786
40226 -7138786 7205683 16242851 13083640 1717600 -9607446 -15050344 -13250720 -8383750
40218 -8383750 -7877492 -13794256 -18114791 -12381312 -114752 7327930 5734952 653320
40210 653320 -4317823 -11887268 -21491060 -25061252 -17739243 -6044654 274582 -182284
40202 -182284 -1929883 -1739346 -1483490 -4021862 -9621781 -15199604 -16126560 -11144641 -5200076
40193 -5200076 -3532917 -3974605 -1053769 3195253 1260635 -5779287 -6460556 4244362
40185 4244362 15779448 16342449 8071673 -77410 -6907162 -16017387 -23719554 -22090122
40177 -22090122 -12682875 -6211048 -7509634 -9864633 -6295563 1328406 7303603 9777975
40169 9777975 9913793 8209000 5396047 3980804 5715491 9064113 10915887 9456299
40161 9456299 4400383 -3863974 -13718135 -21273186 -21321709 -11521597 2498339 8202690
40153 8202690 -2485980 -21867182 -31967253 -24331496 -9452398 -2890698 -7477488 -14680770
40145 -14680770 -18408453 -19726595 -20669359 -20974105 -19873041 -15401184 -4473301 10099574
40137 10099574 16654068 7641112 -7404288 -12365643 -6279220 -2597762 -7090100 -10628576
40129 -10628576 -6999080 -2939123 -3275934 94720 13392352 26036648 23959965 10838232
40121 10838232 2420832 3923790 6711931 5740191 6435470 12155034 16496236 12804696
40113 12804696 3416554 -5040244 -9964876 -12719589 -14287321 -13970158 -10474130 -3955076
40105 -3955076 1218073 -1610161 -12441732 -20892481 -17867027 -8123416 -3108590 -3775733
40097 -3775733 -1127517 6622711 9899576 3817669 -3549404 -4611357 -3307833 -5286740
40089 -5286740 -6473942 -761886 8016190 11645070 9997368 8644087 8324116 6287395
40081 6287395 4630347 7248454 10606165 7721944 749668 -262373 7955643 17315925
40073 17315925 20072973 17073047 12266954 6664980 1022179 -1561134 788101 6601848
40065 6601848 14091146 21916290 26505704 24395002 18340763 15014807 15147305 12509886
40057 12509886 4837703 -1270920 22624 5488351 8386788 7019026 3507120 -867738
40049 -867738 -4492511 -4225707 -269560 1861255 -870793 -3349318 16569 5478723
40041 5478723 4306518 -4849566 -13992914 -15764182 -10788489 -5341294 -5123218 -10461626
40033 -10461626 -14878201 -10493286 1798261 10420877 6137383 -5570410 -11128473 -6242040
40025 -6242040 500522 1423816 -840863 -702141 826351 -277170 -2477362 -1069763
40017 -1069763 2290002 123727 -8860685 -15045676 -10285272 -498065 1454267 -6100427
40009 -6100427 -11294776 -6420156 849334 -234476 -6965179 -7681637 937605 10311953
40001 10311953 12464028 7644340 -67325 -6288846 -5333395 5118477 16653224 16385658
39993 16385658 3473505 -8775233 -10306818 -5665406 -4649239 -10062473 -18622911 -25598649
39985 -25598649 -24698504 -12837325 492861 -399164 -15190536 -23360635 -11045093 9557560
39977 9557560 18847937 16435176 14561750 14866590 9974861 2557534 3181794 10196571
39969 10196571 10188553 379614 -6410221 -3113210 993685 -2822965 -8981956 -8547683 -3072569
39960 -3072569 740527 1988001 3654177 5950164 7706211 9457959 10840649 9823530
39952 9823530 7319668 6756745 6976669 2619681 -6006340 -11317252 -9887992 -7349560
39944 -7349560 -7946102 -7622170 -2764803 2045179 1526139 -1396647 -865805 2597733 4274880
39935 4274880 3004081 1365354 911854 1276737 1670667 966627 -859263 -761777 3587778
39926 3587778 8445112 8652932 6912219 9818620 14755060 11823007 862334 -5948192
39918 -5948192 -3117570 -630728 -6431939 -12408820 -7812440 3579687 10669616 10860875
39910 10860875 7672353 632428 -10307973 -17043019 -12814788 -4392601 -2538939 -5305531
39902 -5305531 -3802906 63743 -3359407 -12874283 -16465724 -10836462 -6497355 -10365014
39894 -10365014 -16052658 -15849825 -11456963 -7847627 -5587961 -4057522 -4333811 -4425314 862415
39885 862415 10670604 15650976 10041155 540027 -2228116 3163656 9501915 11706569
39877 11706569 12043942 14953609 19628628 19394380 9879925 -2503451 -4997967 5370564
39869 5370564 15573025 12857709 2212989 -1748024 3222422 5302491 -1310439 -7809429
39861 -7809429 -6136204 -1126516 -664892 -3070481 -2240348 1480464 3524676 3127858 1641368
39852 1641368 -3069711 -12933724 -22928427 -25009673 -17612605 -6018496 4804022 12299307
39844 12299307 13436334 6552372 -3836316 -9820425 -8688833 -4353015 147796 6337135
39836 6337135 14683785 20167795 17280980 7038070 -4384068 -12501055 -16759163 -17085577
39828 -17085577 -12602569 -4791489 1951136 5487150 8778242 14256102 18003717 14639778
39820 14639778 6929073 4317133 10588324 18656937 20215425 15363276 9125769 3360232
39812 3360232 -2893147 -8557820 -11334626 -11336491 -9923796 -7418187 -5383514 -7098896 -11124723
39803 -11124723 -9368978 1550230 11467713 8277054 -4183835 -10038311 -2780685 7689049
39795 7689049 11159614 9827284 10523076 13150324 13559839 12201600 13111115 17009639 20161149
39786 20161149 18249860 8839010 -6827701 -21805175 -27093676 -21060320 -12233630 -9016828
39778 -9016828 -9457831 -5648588 3685550 10334537 6928924 -3924494 -13010058 -14891313
39770 -14891313 -12144549 -9669241 -8342294 -6569200 -5033766 -4985649 -3316594 3660749
39762 3660749 10808981 7159282 -7719603 -19052622 -15572700 -5129708 -2187772 -6447938
39754 -6447938 -6278210 457450 3150899 -3673727 -12124343 -13531436 -8966251 -4006692
39746 -4006692 -1615215 -2640837 -5574620 -4808314 2491805 8248540 2840452 -7848420
39738 -7848420 -8163137 3176185 10132147 4723472 -1297393 2108200 6676739 2444653
39730 2444653 -3577277 -86845 8408197 10073252 5901523 5200369 7218644 3927996
39722 3927996 -2522576 -1473043 8095279 15605043 15222332 11224397 7025973 1675642
39714 1675642 -1975283 1672878 9746390 12299506 7099209 1953843 267758 -3861729
39706 -3861729 -12580900 -17987862 -14430474 -7297298 -3611938 -2280469 506085 3936598
39698 3936598 6622272 10868951 16766099 18486684 12863390 5789289 3437926 2595093
39690 2595093 -2678054 -9123384 -7808309 1994517 10498873 9969105 3894228 1670953
39682 1670953 7414217 15890817 18555822 12999527 5850976 4871397 9051694 10269120
39674 10269120 5073475 -336748 661248 5929959 8832108 7729050 5961911 5036167
39666 5036167 3768829 3095037 5571011 9413345 8623937 1374359 -5978697 -6406212 -830054
39657 -830054 4290821 6110749 7846055 12020182 15405485 13143685 5997102 874983
39649 874983 4176631 15549149 27535097 30766632 21397725 5398213 -5872817 -6564192
39641 -6564192 -1448028 1997736 3704779 8433289 15170900 16289537 8205719 -3741641
39633 -3741641 -13067083 -18242957 -18386150 -10556917 3202446 12821195 11631847 6189997
39625 6189997 6767429 11622728 9840720 -1527717 -12543542 -13996309 -8156454 -3012582
39617 -3012582 -1720205 -1574664 219188 3476489 6407065 7897216 8503227 9450028 10725983
39608 10725983 11263521 10874248 9592560 5333238 -3431974 -12096670 -13247984 -7831936
39600 -7831936 -5569580 -10031401 -11809279 -3732583 5522546 3635581 -5773646 -8415044
39592 -8415044 -931645 5855395 4794593 1187206 2075161 6985017 11421845 11529039
39584 11529039 5012405 -4639343 -6752162 3724520 14632166 10626285 -3158654 -7331318
39576 -7331318 1497432 5229445 -6209132 -18939316 -18290084 -10755022 -9600212 -12500461
39568 -12500461 -9030663 -520474 3380088 1681524 1286988 3482685 3727781 1562909
39560 1562909 -207369 -2673495 -7128707 -8570772 -3152460 2661218 1358970 -2204059
39552 -2204059 966567 6881555 4032284 -6289621 -10311711 -3139187 4342707 2618516
39544 2618516 -4933964 -11239262 -14834566 -15573915 -11322195 -4352793 -2580799 -8851723
39536 -8851723 -15705413 -15732702 -11410354 -10038619 -13427344 -16566308 -13605321 -3362888
39528 -3362888 8254036 11800952 4626167 -3933291 -3875933 999255 -1305971 -11833543
39520 -11833543 -18061460 -12495365 -2970271 97624 -2911955 -5931040 -7145628 -7017903
39512 -7017903 -3353347 4393150 11017663 12132392 10310321 9337241 7756470 4241554
39504 4241554 3697219 10126900 17601034 16864348 8480809 1080770 -1988434 -5407541
39496 -5407541 -10805509 -11768818 -3592692 8257178 14535825 13806551 12626473 15018760
39488 15018760 16393408 10019605 -2852850 -12812794 -12506002 -3967328 5707071 12504465
39480 12504465 15890347 14480807 7694100 928521 1823702 9283184 12531666 4804311
39472 4804311 -7139428 -11847895 -7574979 -2254435 -1373471 -2146110 -204944 3247482
39464 3247482 3913834 1313825 -613526 -20489 -860433 -7195944 -15494249 -17192582 -9554027
39455 -9554027 886367 7639207 11496470 14803028 14596607 7891763 -851649 -5029600
39447 -5029600 -5039847 -4514237 -1724706 5611259 10859014 5909110 -3902740 -5660326 659139
39438 659139 2012953 -5964732 -12663613 -11704993 -10080385 -11673281 -8417098 2343626
39430 2343626 7642314 -1027840 -11277513 -8188508 2856736 7594460 6290491 7959560
39422 7959560 10241260 4849866 -2968354 -994841 7287513 7265368 -609631 -189074 12962883
39413 12962883 23861684 22219545 15377424 11295435 6857665 889466 1477002 10121353
39405 10121353 13647907 3301507 -10566585 -13824299 -7200726 907029 8662648 16014767
39397 16014767 16607260 7977435 977484 5122380 11955877 7297343 -6162967 -13545264
39389 -13545264 -10451203 -5315658 -1798882 4783162 13188346 14531340 8492322 7127050
39381 7127050 16454485 25743238 22646654 10410207 1965178 2505072 5517358 3255266
39373 3255266 -4969413 -13988967 -18223193 -15959732 -10069694 -4517189 -644728 1625080
39365 1625080 513766 -5824421 -14441574 -18783553 -15993801 -10036658 -6613473 -7585171
39357 -7585171 -10959465 -13554299 -12727631 -7719849 -264862 7168540 13226863 16518316
39349 16518316 14517253 6532238 -3496977 -10388062 -13091850 -13838564 -13326307 -10379687
39341 -10379687 -5437308 -677327 2705341 4161287 2159160 -3236056 -7692087 -7094192
39333 -7094192 -3491700 -1708797 -1407370 1465540 5935220 5710997 -1076672 -8097277
39325 -8097277 -8927301 -3773495 3641014 10447567 13684912 10614868 3323695 -1612625
39317 -1612625 -1414937 -862187 -4449319 -9105244 -9026313 -4475543 -1112083 -2329864 -6059223
39308 -6059223 -8169556 -6438450 -2159198 669464 -646497 -3638758 -3686939 -1376121
39300 -1376121 -2342775 -8289049 -13811684 -15359248 -17121970 -22406351 -24676801 -15418387
39292 -15418387 1783316 13728675 14004265 8988434 6276257 4882886 499759 -5740678
39284 -5740678 -9054690 -8111477 -5364842 -2051589 2642609 7959194 11247286 12195270
39276 12195270 14200236 19374952 23911904 21339982 10796655 -303562 -3821133 -90813
39268 -90813 2908458 -367228 -6585270 -8606940 -4683230 -73925 -501889 -6333052 -12932584
39259 -12932584 -14883676 -10030312 -1085685 6660124 10313459 11525487 12527355 11571338
39251 11571338 5248224 -5068658 -12637848 -12458673 -6446407 -151426 3264489 3933299
39243 3933299 2539200 -378214 -3519944 -6047255 -9040739 -12953897 -14381003 -9375324
39235 -9375324 -619715 3133309 -2704451 -12443068 -17636264 -17558743 -17415938 -18354869 -15700635
39226 -15700635 -7364128 2303385 9014873 13200610 15182112 11467533 1053058 -8715803
39218 -8715803 -9018153 -730275 6632716 6208824 -660142 -8913244 -14404406 -14488236 -9612599
39209 -9612599 -5091376 -6448833 -12031311 -14546010 -10493005 -3452144 2384280 6337565
39201 6337565 7713003 4436402 -1908919 -5246735 -2841454 841910 1762650 2641602
39193 2641602 6834554 10687657 8582541 2729912 996586 5935398 12336681 15990938
39185 15990938 18989041 24267259 29183831 27904206 19082339 9051609 6294374 12047916
39177 12047916 17413106 12709645 -172495 -9094061 -6938742 -63956 2543144 2793627
39169 2793627 8615856 18764455 22030176 12693206 -1069138 -7252071 -2916479 5820942
39161 5820942 11532370 9743035 139071 -11638855 -16124811 -8742626 4542530 13700907
39153 13700907 15675343 15473006 17173691 18410669 15082354 7874833 1157597 -2853470
39145 -2853470 -5519783 -7507872 -6479507 -959197 5684988 8256725 6287711 4481645
39137 4481645 5940567 7915816 6126475 1002183 -3044169 -3465318 -1990590 -1123210
39129 -1123210 -308488 3300958 10553082 17315898 16923259 7088766 -6012985 -12807659
39121 -12807659 -10013723 -3441433 -930789 -4976445 -12672036 -19480001 -21485560 -17170714
39113 -17170714 -9394249 -3518342 -1973794 -2799566 -3901866 -4830819 -3688198 1979261
39105 1979261 9025190 10104265 5089800 3846606 11667716 19318255 16086282 6211808
39097 6211808 1370084 1723001 -2257350 -11197508 -14589643 -8381819 -686230 3547638
39089 3547638 9473170 17965020 18311574 5123555 -9024167 -10058931 -2870170 -1981889
39081 -1981889 -8087298 -8798605 -161803 7725820 7962256 6194954 8449856 10854788
39073 10854788 8063102 3803751 5448334 12543836 17290790 14448225 6391371 -252111
39065 -252111 -106194 7178770 16253686 20263615 16739556 8047292 -2922096 -13461609
39057 -13461609 -18182278 -12286142 -56437 6605542 2418833 -4547730 -5711031 -4891613
39049 -4891613 -9973813 -17054738 -14936698 -4272196 754477 -6764766 -15555327 -12635060
39041 -12635060 -1358739 5562075 4011029 -377313 -4070103 -7768032 -9010128 -3573298
39033 -3573298 5638722 10844612 11220733 12834027 15745365 12412031 2483100 -2357860
39025 -2357860 4890880 14669778 13977164 3441780 -7418618 -14473784 -18255743 -15517768
39017 -15517768 -3996785 7941145 8966758 973143 -3628754 49904 5349417 7476339
39009 7476339 8379690 7251056 -309025 -10088576 -9606213 3093946 12866681 7559921
39001 7559921 -5608661 -12497723 -11428985 -9829252 -9322610 -6103117 -1493605 -613683
38993 -613683 -2739694 -2753955 -485664 265003 266802 3414714 7873229 7665467 2843359
38984 2843359 -590154 -1087568 -3057847 -6905331 -6621729 -207412 5498992 4527345 -30614
38975 -30614 -1871950 -337581 1131509 1418420 2000614 3252569 4381856 5654131 7748273
38966 7748273 9698660 9434407 5919076 -17415 -6198251 -10296250 -11551370 -11141880
38958 -11141880 -10164601 -8614188 -7419169 -8697770 -11488329 -10631573 -4163749 1336010
38950 1336010 -1465943 -9950356 -15420437 -15848339 -16529845 -18642785 -16993081 -11212251
38942 -11212251 -9192029 -14429950 -18489872 -12753844 -1115967 6265153 6764238 5390211
38934 5390211 5039171 4340226 2769867 858773 -2774217 -7974691 -8898351 -986937 9192776
38925 9192776 9601979 -1168535 -11526404 -12410848 -7433663 -4372717 -3880746 -1796249
38917 -1796249 2579611 6197821 7238447 6021955 3494062 1921568 3464933 4801467
38909 4801467 -1523108 -14829759 -20994524 -8468233 13454087 23321106 14611566 2602771
38901 2602771 1055974 4243802 105833 -8916309 -10298447 -1146656 9339756 14972535
38893 14972535 17380531 15627812 4794119 -11004968 -17023597 -7041661 5929025 7055117
38885 7055117 -856872 -5847002 -7050150 -12655555 -21600387 -22549433 -11951156 426543
38877 426543 6857588 9944693 11314075 5283858 -8104823 -15290349 -5968438 9995667
38869 9995667 14656621 5955917 -3033658 -5666329 -8235383 -14087454 -15425116 -6621091
38861 -6621091 5129547 9945627 8171907 5463479 1604662 -6620781 -15757262 -18857706
38853 -18857706 -16658454 -15849552 -16050724 -8782103 7286174 19623699 17277384 6458792
38845 6458792 2045138 6908908 9253279 805532 -11316327 -14838483 -8171472 -321178
38837 -321178 1921002 843950 2103067 6711825 10510161 9534846 4196338 -1496183
38829 -1496183 -3889561 -2285937 2147699 8209439 13572585 13584287 5324538 -6679861
38821 -6679861 -13204343 -10670721 -4556553 -64889 5238379 14495663 22235481 20001841
38813 20001841 9317667 547570 -1277221 -1031097 -2418651 -1611377 3605963 6765895
38805 6765895 2037020 -5359484 -6434107 -2377811 -2243080 -8184037 -12201625 -8853005
38797 -8853005 -3129196 -2258094 -5641558 -7344088 -4894249 -1318014 -62462 -1062374
38789 -1062374 -1545469 530102 3630819 3917941 854598 -325729 4475165 10383626
38781 10383626 8625259 -297511 -5656815 -1286863 6009035 7667293 6025810 8260020
38773 8260020 12802525 11432094 3040387 -4147725 -4554026 -1067401 2332570 5393803
38765 5393803 6604830 1999678 -6384861 -8417860 1187299 13305201 14935109 5695982
38757 5695982 -3190982 -3833067 1627889 7944500 12882264 15374175 13693179 8185422
38749 8185422 2649540 1233528 5375228 13290372 20455374 22146826 18489071 15256882
38741 15256882 16272162 17412113 12811687 4578348 177841 1657756 4453016 6327245
38733 6327245 9731517 14456675 15864788 12626966 8995683 7096271 4565019 2402572
38725 2402572 6057760 14087333 15523872 6205981 -1165708 6065002 20113366 22173784
38717 22173784 9213159 -2390524 -895350 6220466 6400185 -299614 -5513491 -7001561
38709 -7001561 -9076795 -11724294 -8851887 1200359 10339270 9923191 1909824 -3492341
38701 -3492341 -334723 7056451 11419438 11740519 11836222 12859070 12644937 11745284 13864893
38692 13864893 18536124 19010737 11153371 494663 -3715685 929481 8742850 13126713
38684 13126713 12086810 8605287 8040603 13113842 19614865 19771841 11462537 646418
38676 646418 -6571673 -9330641 -7860341 -958772 8394297 12066744 7410388 2618174
38668 2618174 4775540 8802705 6295541 -533843 -3417170 -1978532 -2693416 -7004557
38660 -7004557 -10841105 -13599584 -17194323 -18287807 -12447624 -4443931 -2847864 -5445533
38652 -5445533 -2415327 6296624 10336219 6872869 4831999 7825325 7179792 -2119147
38644 -2119147 -11465406 -11962561 -6694195 -2326856 1363659 6099452 8827695 8442092
38636 8442092 9741182 13409957 11575462 1251100 -7647174 -6804430 -2372452 -3101522
38628 -3101522 -5135518 -1000730 4236313 22683 -11252660 -16699481 -11630343 -3877127
38620 -3877127 -751865 -2259359 -6209663 -10400349 -10474167 -4147331 3308366 4904928
38612 4904928 1009154 -3982389 -9628373 -16017289 -17532662 -10122748 -504576 2499597
38604 2499597 1582777 4488286 8538244 5277727 -2723057 -4970950 -1583375 -2538158
38596 -2538158 -7751178 -5062836 7933586 16437509 9703615 -4202231 -12670730 -14987712
38588 -14987712 -15744160 -13179041 -4700753 4009833 5489089 820109 -3975169 -6525541
38580 -6525541 -6972691 -4466159 -1006903 -2381539 -8945339 -12137045 -6875158 -415360
38572 -415360 -1130688 -5344469 -4536964 171442 1349599 -561142 2609305 13023189
38564 13023189 22406674 22424352 13176531 1068238 -6691299 -6081237 345707 4743632
38556 4743632 2468787 -2644074 -5199155 -6610606 -10768347 -14997752 -13258921 -6854685
38548 -6854685 -3791839 -6926829 -9902864 -6692784 457877 4782349 2635375 -4098765
38540 -4098765 -9985474 -9855387 -3920101 870995 -1805322 -9026395 -11531202 -5637053
38532 -5637053 2194389 4099770 147878 -3431292 -2652800 330385 978229 -1638784
38524 -1638784 -3099479 1574430 11255305 18600837 18002631 11940970 7538200 8591944
38516 8591944 13398457 18495518 21168796 19450662 13423323 6504429 2482734 1213140
38508 1213140 -387360 -3525285 -6371613 -7427262 -7368750 -7438725 -8110784 -9163173 -9207732
38499 -9207732 -5915188 993659 7798976 10405015 9091472 6751354 3449888 -2919321
38491 -2919321 -10074821 -10303065 670837 16084204 23287225 16841980 4038269 -3859032
38483 -3859032 -4005400 -3022093 -6339847 -10920467 -11172984 -8188996 -7669808 -10420861 -11450609
38474 -11450609 -8812947 -6590563 -7234014 -7646254 -6045041 -6103546 -9715738 -11804185 -8156916
38465 -8156916 -3158155 -3109574 -6284628 -6743697 -4302364 -3059138 -2911737 -457571 3705858
38456 3705858 6236172 7643311 9877806 9562910 2431736 -7187325 -10908623 -9178533
38448 -9178533 -9264799 -11184573 -7857104 -192594 1733815 -3643280 -4577884 4323237 11057645
38439 11057645 4712473 -6704046 -9331549 -5089178 -5696394 -10958866 -8906742 3444102
38431 3444102 13859613 12125348 2709174 -3519161 -2339455 2587491 5932544 5312385
38423 5312385 2943958 3087008 5368192 3597211 -4266132 -9574719 -4066548 6465920
38415 6465920 9339533 3076510 -2949034 -5337327 -9738367 -16173206 -15969038 -7941719
38407 -7941719 -3689192 -9399111 -14913700 -10122384 -900045 2382539 2293245 7020713
38399 7020713 12993132 9513537 -2831424 -12083000 -11924244 -6877652 -1452707 4270486
38391 4270486 8143249 6038971 -380933 -5046763 -6464921 -6375286 -1581314 11084177
38383 11084177 22962500 20915681 7601632 -320832 3118424 6292240 2573963 2070903
38375 2070903 11222978 17543854 8996343 -4601583 -5944202 3527167 8685248 5326444
38367 5326444 2696178 5494323 9757216 14421458 21234691 24202177 14676307 -2590825
38359 -2590825 -13093907 -12988433 -11327675 -11383832 -6311763 3680142 7393133 2192106
38351 2192106 977839 10788443 19575122 15340961 5026287 1348760 2216652 -1860080
38343 -1860080 -8232048 -6011515 4787253 12702043 11842467 7034992 2798056 -1517217
38335 -1517217 -5540354 -6872944 -6703093 -7777586 -7161117 12267 9925671 13039117
38327 13039117 8574837 6126018 10334515 13515638 8005476 -2170128 -7835998 -7212997
38319 -7212997 -5830764 -7336522 -10024658 -11207884 -10699362 -9678557 -8393536 -5729358
38311 -5729358 -910745 4236019 5709655 1499919 -5330339 -9438797 -8713340 -5749520
38303 -5749520 -4539057 -6576893 -9063163 -6660814 2485665 12067199 12829573 3821968
38295 3821968 -6060110 -9380772 -7040522 -1342909 9388828 22953337 28208645 18140363
38287 18140363 3098161 -135383 9960719 19695732 20412031 17016369 15680401 14830588
38279 14830588 11861275 8936106 7390343 4052267 -2323199 -7169387 -6388272 -1057346
38271 -1057346 6667347 16262445 24916945 27386357 23017777 17324648 14047288 11446916
38263 11446916 8333316 6736064 6150049 2882858 -1562282 302939 9789057 17184734
38255 17184734 14907861 8121498 5657768 7190380 6984427 4613670 3658601 3934572
38247 3934572 3124975 3244846 7944443 15164127 18803193 16353923 10156341 3375982
38239 3375982 -1065166 -1012229 909101 -2001035 -10573260 -15235004 -7838698 6284321
38231 6284321 15212764 15527516 12912842 11266171 9874139 9232347 10971842 12932459
38223 12932459 12068777 11205948 15105553 20657662 19100616 8192461 -4933570 -12974125
38215 -12974125 -14048030 -9469699 -3548941 -4139142 -14417796 -24613548 -21372381 -5583752
38207 -5583752 8975979 15231101 19505785 26190144 28288433 19653530 6575672 -554651
38199 -554651 232739 4949496 11303187 16793381 16179558 9041053 4171042 8091792 14178464
38190 14178464 12007623 3151328 -2236310 -1659265 -2165272 -6253876 -6724836 1263759
38182 1263759 11329310 13879344 7886897 291487 -3139274 -2415379 -280423 2079321
38174 2079321 5338798 8846216 8909817 2771439 -5788257 -8808280 -4026156 1776911
38166 1776911 2482377 1137066 3827912 9330905 11717867 10337287 9255412 8397856
38158 8397856 4151475 -1233326 -506772 6082876 8522145 1408268 -8040090 -11891143
38150 -11891143 -13054291 -17069791 -19490710 -12166748 1379179 8080634 2987916 -4838916
38142 -4838916 -6105197 -2610637 -1132510 -2536914 -1954841 3749175 12500996 18859708
38134 18859708 17457022 7588278 -3830039 -7257631 -724206 7881301 10390067 6638762
38126 6638762 1332235 -2714293 -4622870 -2819508 2835492 8729503 11643220 13251719
38118 13251719 16645773 20712607 22310616 21767776 21205721 19087007 11942751 999666
38110 999666 -7755728 -9849514 -4799709 5891901 18005923 23677012 18129699 7326265
38102 7326265 2347302 5724410 9911345 9762736 8819341 11186151 14761985 16043216
38094 16043216 15382678 14035256 11626458 9412213 10084913 11787835 9153236 2965793
38086 2965793 641117 3513991 3271515 -3320764 -6521240 1114463 11356850 13230396
38078 13230396 10909554 15334818 24129400 25082786 16811136 10611208 11750329 13499425
38070 13499425 11805139 11978144 16467699 18224681 12184565 3706858 -138044 377567
38062 377567 2128854 4835699 7328994 5294155 -2252391 -10087644 -13895758 -14194330
38054 -14194330 -11084946 -3044911 6469561 10434362 9890396 14198567 24922066 30272548
38046 30272548 22431520 9874006 4073900 4091763 4220739 6894054 15506562 22641005
38038 22641005 19701318 12591747 13172131 19106106 17729814 8298600 4215378 11353566
38030 11353566 19138777 17755947 11609482 9687339 12780010 16818555 20853329 25103768
38022 25103768 26845855 23983589 19016365 16026266 17034384 22241836 28828273 29468159
38014 29468159 19381129 5935893 2720723 11500604 18925413 15047539 6064712 3146530
38006 3146530 7283179 12515898 16724471 20653744 22075200 19940306 19842761 26123978
37998 26123978 32096347 28043697 16891865 11370697 15415512 18850728 13374135 4553759
37990 4553759 2597645 7938564 12809682 13688018 15258904 21876043 30051651 32009707
37982 32009707 25126343 15415542 10949831 13333466 17654859 19992505 21332029 23137925
37974 23137925 23421960 20582182 17859951 19302854 23016152 23196995 18132073 11629856
37966 11629856 6923745 4024589 3428248 7255119 14929479 21803688 23996014 21385928
37958 21385928 14965527 5740303 -2112798 -2496765 4481587 10321267 8914723 5635206
37950 5635206 9722677 20582955 28952097 30401841 29358293 28594721 23572061 11904750
37942 11904750 1413332 1491040 10137658 16929869 17333806 16822994 20415035 25049722
37934 25049722 25013477 19803543 13193307 8165037 6256545 8942581 15531968 21286265
37926 21286265 21629466 17857219 15413524 16492402 17460763 14507580 9329177 7300906
37918 7300906 10854668 16347341 18093078 14913215 11414840 12124723 15861950 18085177
37910 18085177 17849095 18829111 22831984 26318023 25797579 23375113 23266523 24796382 23042436
37901 23042436 16232590 9156849 8278990 14845964 22999197 24285603 15378671 2328928
37893 2328928 -4539790 -1155457 6735728 11229355 10272377 6715835 3878941 4955293
37885 4955293 12035813 21381874 24386253 18766858 13977204 18299267 25310418 22966350
37877 22966350 12969879 9035790 16000141 23451047 23202095 20721311 23138309 26774039
37869 26774039 25034010 20354938 19058027 20562693 20960752 22241841 28197188 34676847
37861 34676847 33976773 27289579 23346575 25134919 26971597 25413671 24386965 27251418
37853 27251418 31130463 32119079 30328352 27189621 23202058 20856662 24001736 30659796
37845 30659796 31806905 22428757 10170098 7280062 15598093 24936208 26313156 21851401
37837 21851401 19772812 23289562 27913461 28520519 25373637 21890203 19013220 14836457
37829 14836457 9526882 7520516 12830777 23123222 30319152 27918153 17764837 8962011
37821 8962011 8808311 14831686 18168377 15545339 13800164 19438971 28534760 33339267
37813 33339267 35083154 40764430 48564069 48190949 38334591 31839272 37195844 45535512
37805 45535512 45089760 39533576 40215341 46501827 47559612 41309028 37941331 43115642
37797 43115642 49386249 48367793 42582957 40170921 43573910 48048860 48389593 44475495
37789 44475495 41574873 44990589 52947808 57726265 56837762 58002388 67154797 77241719
37781 77241719 78206153 73536856 74875955 82424507 84551258 77827401 73250892 78340547
37773 78340547 86047847 87903239 86746125 88270015 89366261 84223624 75602232 71558964
37765 71558964 75306468 84684528 97264555 110478216 120952656 128004762 133202542 134139467
37757 134139467 126148677 113383529 108654537 116851565 128168859 134152445 139738213 150807618
37749 150807618 160947489 162322888 160407716 164754754 172815119 176723308 179245991 187997445
37741 187997445 199655109 206067030 211201048 224350305 240126645 245300762 244750895 258630733
37733 258630733 290101269 317691505 327385868 331588921 344862932 359940077 363431560
37726 363431560 360087934 363293108 371977665 375374311 373924613 377580186 386973761 392881559
37718 392881559 392819923 392841326 393321266 388047448 378598552 374857877 378054780 377162840 366891453
37709 366891453 355931771 350525372 342371656 322543708 297417585 279429897 269236220
37702 269236220 259064010 248603803 244179075 243998026 237873089 223347633 209730281
37695 209730281 201994586 192272839 174408384 156946258 151419233 154339668 152479776 142739185
37687 142739185 134679504 133630531 133381299 128528326 122984129 120624053 116854559 107121626
37679 107121626 96678044 93169519 94409100 92478422 86705697 83313691 83636672 81876827
37671 81876827 75259247 68542594 66444247 67434400 66887060 62228023 54538848 48723694
37663 48723694 50625524 59308428 64927904 60691879 53514791 53825804 58065010 53916192
37655 53916192 42353459 39210830 50532507 61140074 56145016 41598807 33340260
37648 33340260 35251331 40136533 44199715 48011698 48495091 42421942 34779570 32756715
37640 32756715 34125799 31589530 25420515 21501510 20356006 19144615 20574547 26970680
37632 26970680 29224596 17471768 1505512 2622931 22377513 37402962 31838200
37625 31838200 18090447 15543782 23447979 27871367 24438974 20010876 18754554 19389955
37617 19389955 21739030 25376276 25868029 21322499 17700004 19219048 20127173 15544851
37609 15544851 12578404 18477310 25387787 21878703 13495516 14433422 22663947 22906701
37601 22906701 13577674 9778075 16468357 20146300 14165214 11063835 18396901 22264953
37593 22264953 10845042 -2487040 1005624 14969832 18598294 9419629 3297725 5870444
37585 5870444 6577976 1675908 1713348 11173235 19199278 17977496 14823814 17539852 21136398
37576 21136398 18619734 13849471 13547579 15249040 13159504 9369603 10065439 15460657
37568 15460657 20901935 23403923 21381687 13840717 5529274 5665733 14734046 20321250
37560 20321250 14245807 5650870 6761812 13403310 12857672 5617748 4098525 11406594
37552 11406594 16556385 12773782 7389875 9314522 16907643 22709336 22304232 15379265
37544 15379265 5378101 178512 5130052 13460693 12300901 651064 -8088733 -4975104
37536 -4975104 2961965 5144462 1875044 -431738 -161166 1136782 4505559 9716434
37528 9716434 11276285 6012281 -576963 -3072646 -5330667 -11892000 -16002074 -8118439
37520 -8118439 6612325 12579143 6094949 896980 7171693 16088734 12757194 -2555921
37512 -2555921 -14873648 -13354515 -2300753 6621476 7616933 4316459 3211827 6412419
37504 6412419 10989024 13932969 15962934 19612537 24614670 27005831 23436187 15715113
37496 15715113 10088759 10960197 15220769 14917394 7468166 856371 4383232 15452400
37488 15452400 21671912 17112854 9678060 8871401 12771245 13117353 8492567 4903578
37480 4903578 5519164 7115032 6267849 2967814 -1878830 -7029740 -9073341 -5607555
37472 -5607555 -477347 -80253 -3722190 -3710011 3265148 10901343 12402023 9442945 7940642
37463 7940642 8993180 8853085 5652976 1794369 479174 2843683 7726612 12024366
37455 12024366 12397457 8771369 5004216 4222237 5216506 5860228 7980670 14793937 24179333
37446 24179333 29151963 26426389 20875692 19154663 21696269 24063280 24118317 23772270
37438 23772270 24297310 24421936 23984030 25123235 27671659 27509969 23061639 19752130 22938668
37429 22938668 29023702 29974020 25588444 23881726 28139749 31124179 25939625 16743054
37421 16743054 13447813 19464134 29547487 37187901 39558440 36934949 31598928 27006841
37413 27006841 25550192 27542816 32687212 39668463 43992305 41433788 35607938 35900115
37405 35900115 44190170 50487315 47555023 42822881 46957990 56116461 56981987 47235160
37397 47235160 38941233 40478907 46355176 48776676 49620891 54571135 61900591 64223159
37389 64223159 58613256 49672925 43512994 41906581 41989604 40142061 36211844 33555309
37381 33555309 34431908 37620040 42320280 50457349 60854199 65395929 58197008 46152125
37373 46152125 42087833 48294782 55463468 57847119 59646778 64422865 68256059 67846240
37365 67846240 66780890 68341366 69582861 68614544 71021527 81793616 95704199 103118471
37357 103118471 102596603 101472307 105735243 114549547 123629683 129948391 133712868 138015979
37349 138015979 145557904 155226481 164438628 174225277 187121745 200452741 208799887 213969054
37341 213969054 223939608 239493556 251549654 256192512 262074341 275961178 290666418
37334 290666418 296290650 294777988 293153065 290540570 283889003 279086830 281814231 282574247
37326 282574247 267235914 240314624 220645690 213164924 202786274 180942737 160788984
37319 160788984 156458070 161172352 158434673 145424460 132160144 123397323 114738322 104810321
37311 104810321 99193244 100311716 102055071 97717950 87918290 77765315 69784925 62545080
37303 62545080 54854772 49265694 50630698 60401745 72545697 77404424 70906667 58122220
37295 58122220 46610635 38961157 33949746 31848960 34145266 38793941 40181782 35410057
37287 35410057 28366113 25810946 30186917 37405789 41381559 39517165 33231938 24494150
37279 24494150 14338795 5242852 1824386 6224744 14213704 19173166 19538560 19161999
37271 19161999 20541694 21571494 20019281 17440847 16209363 15287541 12016024 6923693
37263 6923693 3798452 4667975 6753947 5866935 2490686 2758312 11490881 24593773
37255 24593773 31447410 26734309 17454623 15231182 23215563 33805463 37958046 32992018
37247 32992018 22214502 11486951 6401925 8544871 13690076 17024257 19632401 25082764
37239 25082764 30486575 28603381 20583876 17865029 26019035 34366669 29942773 16473928
37231 16473928 9270457 13638013 19632544 19406399 18485465 24336957 32465029 32323363
37223 32323363 22591557 12166987 7488115 6472789 5604745 6301230 11394467 19493929
37215 19493929 25878515 26889377 22084846 14718332 11369387 17688956 31905376 44976332
37207 44976332 49703618 47555761 44225608 41462909 37116650 31144521 26925901 26864946
37199 26864946 29909838 32838885 31540019 23221171 11180543 4832846 9550852 18375139
37191 18375139 20121090 13913817 7736260 4015244 -2259442 -9516370 -6795391 8344350
37183 8344350 20625351 16186569 2494140 -2894562 2655081 6843257 4293653 3176144
37175 3176144 8473610 12835029 9767888 4903280 6391148 11578163 11327200 3359782
37167 3359782 -5484675 -7973813 -2721413 5975388 10772655 6517121 -3419549 -8901115
37159 -8901115 -4961622 1164901 -350169 -8268280 -12504950 -8599818 -2539012 176794
37151 176794 2768130 9561503 15587983 11890135 234789 -6048803 611064 10722813
37143 10722813 10222710 -334024 -7930458 -6686976 -4588499 -8315701 -12157662 -8548721
37135 -8548721 -823106 3673852 6645241 14049829 22290857 21518754 12044299 5444225
37127 5444225 7384460 10452281 7938808 4451752 6603629 11307290 10957365 5143980
37119 5143980 336968 1169547 7255348 15371805 20169566 16478701 6125946 -903246
37111 -903246 2353379 10385627 12806240 8780490 6729725 10491543 13589039 9530006
37103 9530006 1707079 -1133832 4031601 12117774 17158945 18046441 16880999 15059520
37095 15059520 12974966 11492969 10854306 9019368 4472516 624184 3235041 12011256
37087 12011256 19044497 18317614 12732659 8325794 5993917 3867069 3561632 7341344
37079 7341344 12015604 12973574 12256979 15008068 19482609 18923736 12562662 6045842 1328551
37070 1328551 -4267256 -8659837 -5631569 2964363 6806548 2870161 614410 5905907
37062 5905907 10558774 5679520 -3779605 -6938199 -2439367 3092101 6513194 9232638
37054 9232638 10833600 9547863 6377006 3181862 329164 140407 6229931 14575317
37046 14575317 13726006 1114860 -9655898 -7005011 1971282 4364335 2416991 7074937
37038 7074937 16713907 18979713 11502674 4442470 2361871 -551418 -5322573 -4191783
37030 -4191783 3464992 5722319 -4087891 -15811342 -16759372 -8461853 -1531346 -1402755
37022 -1402755 -6395201 -13344369 -17932999 -14639848 -3083407 9307597 15825657 17567831
37014 17567831 18110370 16633215 11443737 5200461 800288 -3661530 -9905437 -13312800
37006 -13312800 -8471586 1373927 6902965 4189723 -1482900 -3153749 703463 6937203
36998 6937203 12111440 14866058 15458575 14041946 9948733 3592460 -1542322 -1039279
36990 -1039279 5922633 15713003 23488271 25593087 20556173 11290095 4995898 6427079
36982 6427079 11941384 14629682 13771674 13198118 11921442 5115696 -4826815 -7854597
36974 -7854597 -388245 8866533 12123348 13095586 17694139 21840007 17596102 6363217
36966 6363217 -3583117 -9679984 -15622934 -20727715 -18758513 -8919557 547954 3275770
36958 3275770 2942078 6469183 13882387 19636336 20825720 18905614 14637705 6886878
36950 6886878 -2296231 -6168030 -918581 7249957 7601489 -2030967 -12064306 -13088069
36942 -13088069 -6849113 -2078766 -3228396 -8085250 -13454040 -17150434 -16205814 -9761079
36934 -9761079 -3061347 -1870956 -3258315 564271 8852006 11563869 4467651 -3732643
36926 -3732643 -3894390 1594875 4959547 4475046 3251190 1977135 -214538 -1585342
36918 -1585342 -678272 324497 726320 5110031 15175168 22477841 18073249 6442507
36910 6442507 464675 3919532 8550240 8468916 7321603 8658246 8573373 2916537 -5059382
36901 -5059382 -9701569 -10462100 -9084122 -3809272 7104392 18587638 22365792 17445330
36893 17445330 11317138 9278851 7531018 89635 -10985029 -17197685 -14806976 -9703946
36885 -9703946 -9454862 -13948041 -16841407 -14083749 -7490881 -894374 3619081 5605446
36877 5605446 5618228 5265038 5544731 5072568 2388472 -450984 138662 3740678 5863275
36868 5863275 3685654 -1269220 -5901566 -7370994 -3168369 5574671 11529583 8360425
36860 8360425 694784 -590876 5605195 8083908 545468 -7514487 -3574642 10998339
36852 10998339 23921710 26754894 20112559 9296237 1985395 5660837 19295889 30931120
36844 30931120 30975454 24427376 22080667 23659728 19786481 8630188 -473025 -1058253
36836 -1058253 2091672 785015 -7580190 -20310252 -31906236 -35185082 -26921043 -13892876
36828 -13892876 -6898420 -7716985 -8648495 -5387064 -1950849 -1064312 954209 5374627
36820 5374627 5620060 -2999321 -14396685 -19285539 -17101813 -13917310 -12186379 -9601099
36812 -9601099 -6215866 -5650113 -8560806 -10139279 -6145305 1248920 5465136 2586149
36804 2586149 -4411471 -8604539 -6254208 -411617 2817982 125695 -7540295 -16403593
36796 -16403593 -20450130 -14331670 -420047 9899886 8179683 399773 -451324 7891847
36788 7891847 15151035 14817833 12483495 14429966 16986619 13274423 3976936 -4787069
36780 -4787069 -9310829 -8673329 -2480435 6007234 9527973 5966353 3211928 8080905
36772 8080905 15121249 14757300 8673894 7010003 11916761 14768023 10815240 6122737
36764 6122737 6172153 6834995 2956920 -1064991 2470112 11181094 14002241 6287855 -3470873
36755 -3470873 -4985634 676824 4312943 2793947 3336166 11305398 19753061 17735792
36747 17735792 6490079 -1270241 722071 4100940 88706 -6805697 -7543856 -4173816
36739 -4173816 -5229911 -9134659 -5872652 3980497 6150229 -5603265 -16938549 -11873704
36731 -11873704 4445232 13580042 9107109 1322090 -1641425 -3988231 -10311866 -14737703
36723 -14737703 -9408335 2434071 9540133 6595392 -780077 -4561893 -3484428 -2583347
36715 -2583347 -5925192 -11816739 -15943373 -18193257 -22878887 -30236491 -32151923 -22196658
36707 -22196658 -7187447 -458233 -3930911 -6630337 -3225167 -2615472 -11333383 -19097819
36699 -19097819 -12474522 3773014 12350034 7551813 140112 -1995736 -4228815 -12065935
36691 -12065935 -19346138 -16760008 -4690428 8841607 17547223 19239939 14494529 8112333
36683 8112333 6898730 10975201 12007596 4810782 -4387976 -6643943 -2218081 2503277
36675 2503277 5598203 9704335 14262440 15330976 12751347 11495631 15202298 21912820
36667 21912820 25905895 21544509 7590355 -9234286 -17540085 -11803585 1895771 12546550
36659 12546550 13719937 5430505 -7753087 -17409519 -16286004 -7096780 -616233 -923563
36651 -923563 114632 8384293 16674741 16694584 13172078 14805343 18446790 15396840 7927705
36642 7927705 5013328 5104636 -1281947 -12839806 -17016097 -9639587 -330459 4226365
36634 4226365 8128214 13625352 14744664 9330812 5034071 6698501 8531163 5097528
36626 5097528 -13742 -2555135 -4675483 -7516367 -6694636 -1520453 1222826 -723171
36618 -723171 307462 7964586 13349440 9318972 2885767 2879687 4823592 285584 -6415985
36609 -6415985 -4069535 7857650 19812676 26790352 31085285 33299395 31519898 27937881
36601 27937881 26905068 27634400 26438411 23709861 21399963 17293422 9646288 3146324
36593 3146324 1723844 416521 -5947189 -11440627 -8025802 -831153 -626753 -4392941
36585 -4392941 836860 15062796 22551062 15141631 3455893 -512168 1246236 1576025
36577 1576025 472047 130885 -2698222 -10205301 -16611028 -16683988 -15231119 -18925802 -23284199
36568 -23284199 -18004376 -3751345 5985161 1398328 -12277530 -22503514 -23217449 -17445153
36560 -17445153 -10304648 -4837529 -3626491 -8308968 -14876467 -14479133 -4159521 6493866
36552 6493866 6366237 -1450840 -3949931 1907930 5164558 155173 -3191155 3298531
36544 3298531 10421381 6128209 -3447222 -3135782 6699083 11932226 8985674 9411911
36536 9411911 18102879 24060525 18828030 9601626 6039916 5835571 2244114 -3319322
36528 -3319322 -5053497 -2281349 2114219 6561567 8126782 2097904 -9147699 -14015358
36520 -14015358 -6043322 5936678 10001964 7650299 9036716 16228951 21298592 19312777
36512 19312777 13930243 9559238 5246272 -1844189 -11417154 -19909439 -23155694 -19656086
36504 -19656086 -12850573 -8501983 -8560017 -10478593 -13455112 -20132007 -29505608 -34066980
36496 -34066980 -28563885 -16727435 -4818473 5980282 15340811 18372568 12609593 5806505
36488 5806505 7340728 14201156 14784896 5650277 -4596289 -8293037 -6556818 -2454787
36480 -2454787 4898216 15365326 23375661 23391052 16392487 8038485 3512898 5786401
36472 5786401 14450378 23342275 23294492 11227663 -5500429 -16664205 -19223150 -17422365
36464 -17422365 -15208434 -12264219 -7106899 -922390 2881426 1920530 -2951206 -8489981
36456 -8489981 -12137447 -14045685 -15561769 -16361755 -14701288 -10550135 -6472851 -4421398
36448 -4421398 -3319882 -1314890 979443 1695010 1439778 2807144 5400218 4546544 -2172267
36439 -2172267 -9178228 -8185770 657451 7885741 7272905 4412913 7791732 14747885
36431 14747885 14009792 2583021 -7661590 -4469084 9000513 18770407 17812270 12558787
36423 12558787 11456468 13613321 12640044 7522702 3576223 3278216 2546645 -1271744
36415 -1271744 -3225813 1922559 9670561 10566637 4292197 687680 4923808 10139604
36407 10139604 9257496 6070483 7456818 11020050 9549421 3706048 652684 2198396
36399 2198396 3766887 4136906 6534791 9697963 7511268 -420682 -6359160 -5232588
36391 -5232588 -523015 2791883 3880217 2739621 -912082 -3180091 1213720 8763077
36383 8763077 8661814 -1402901 -9674049 -5919932 5236308 12250038 10450918 2089029
36375 2089029 -9594023 -19253290 -19486448 -9940137 -727457 430736 -1499023 1244496
36367 1244496 5904461 5109817 263594 -1557032 -13921 -108057 -1221295 1606217 6953617
36358 6953617 8187471 5146725 4709556 8924615 11692557 8705906 2611199 -3035255
36350 -3035255 -7126829 -7039149 296498 10563768 13020434 3676963 -8023514 -10115076
36342 -10115076 -1963488 6568497 7312747 1808068 -2153842 49607 5030890 6829042
36334 6829042 5697843 7100029 11669233 13108571 9434222 8371562 14707190 19586784
36326 19586784 12500717 -1059790 -5707480 2306951 11493450 12613548 7930721 1903164
36318 1903164 -5159608 -10559878 -7650876 3185473 10795610 7060960 -2193837 -6225258
36310 -6225258 -3776546 -2295580 -6680118 -14356079 -19248933 -16773748 -6846497 5495663
36302 5495663 14239290 17898901 18226770 14539504 5149949 -5280818 -7309883 1274450
36294 1274450 11112834 12650134 6749965 496028 -2348469 -2358330 -434420 2159184 2499366
36285 2499366 -865496 -5036694 -6026991 -3570773 -803507 -636150 -3409079 -6405515
36277 -6405515 -5815607 -1730827 -136581 -5789030 -13981346 -14936635 -6686621 2123335
36269 2123335 3335308 -2078349 -7521200 -7924519 -2727681 3364738 2865729 -5622983
36261 -5622983 -12278963 -7215047 4607622 9199854 3719522 -937609 1022372 2526098
36253 2526098 -980612 -2673595 1364984 2575100 -4419323 -8368002 2650380 20503610
36245 20503610 27203114 20346470 13456829 14004360 16087416 14901849 14436128 17776267
36237 17776267 20893617 20102298 17487774 15719366 14366845 13872123 16785599 22524138
36229 22524138 26299639 25453794 22508038 20701370 20458524 20557159 18934106 13241201 5100804
36220 5100804 1890327 8216319 17391478 18899721 13337609 11143927 16062342 19807650
36212 19807650 16289984 11630243 14162097 21834900 26766085 27340763 28173702 30761978
36204 30761978 31698679 29928387 29360017 32506852 36122826 36188318 34761880 38140174 47996311
36195 47996311 57453008 58491132 51977524 46766582 48307740 52170529 51570825 47893888
36187 47893888 48810006 56768744 64430303 63442310 54831249 47922973 49567766 56849286
36179 56849286 61877161 62204793 62486534 64680518 62377220 50800353 38245873 37859105
36171 37859105 48554823 55048451 49385716 40833592 38777879 37951030 30718305 23605943
36163 23605943 27452405 37422857 38606382 29561698 24854806 32432690 42269762 41904851
36155 41904851 32004181 21097640 14142082 12265097 16407324 24873032 32131858 34841429
36147 34841429 35192843 35288432 32832508 25512668 15538997 7215803 3414124 5351231
36139 5351231 11477890 16402191 16322527 15122708 18258005 21597090 16143887 4516494
36131 4516494 539080 8272797 13969706 6642427 -4623747 -4656854 5325255 12089489
36123 12089489 11779326 13116129 20507274 26495394 23244008 12425076 918110 -6684338
36115 -6684338 -9089846 -7144990 -3369233 1129499 8886293 20575506 28758518 24346349
36107 24346349 9927107 -927180 -356320 4659754 4178724 174208 2581720 13445361
36099 13445361 22890459 22064262 14032484 8201729 7642108 7073857 2524862 -2539212
36091 -2539212 -2847336 1021862 4347479 5290951 6236694 9427098 15070078 22701036 30374900
36082 30374900 33475109 28913923 20018050 12694772 7723795 2363576 -1633453 800968
36074 800968 8510298 13999329 14523961 14696550 15493386 10548753 -1508365 -10563959 -8147622
36065 -8147622 965349 8063728 13444903 20587583 24650398 18576647 6273532 -1830463
36057 -1830463 -3308593 -2772538 112098 8444811 15493155 9236534 -8023171 -18388664
36049 -18388664 -11935954 214084 3105561 -1958244 -3040053 4250364 13630937 19098344
36041 19098344 20508484 19604772 16964386 13313520 10362604 9862509 12425473 15814728
36033 15814728 14992222 7635626 -545689 -1262737 4774216 7902204 3210681 -2470051
36025 -2470051 -1132710 5040878 8432154 7516311 7193721 9885580 12333429 11336505 8668961
36016 8668961 9010578 13963423 18689527 16277666 7357456 2176843 7848329 16408447
36008 16408447 14228597 2441536 -3362104 3518041 10282277 4378028 -7297594 -9455286
36000 -9455286 -358219 9518305 15191380 20263474 24848941 23851782 18247169 16367081
35992 16367081 20847700 23695876 18214546 8465348 3042877 5159938 11897950 18090437
35984 18090437 18402528 10688025 200757 -3677831 2537976 12779952 18795700 17512705
35976 17512705 10782951 2670028 -1926870 -536599 3957006 7721050 12653440 22505022
35968 22505022 32804259 33526205 24373466 18416624 25128253 37143468 40627248 33055076
35960 33055076 23243816 18134078 17882312 21659499 29551095 38123145 41085276 36420387
35952 36420387 28331805 20870063 14024326 7807487 5738282 10453352 17847465 19723920
35944 19723920 13067776 4018268 579667 3027645 4998993 3802265 4378081 10237029
35936 10237029 15888859 14507035 9627994 11021374 19986753 27663643 28905621 28492728
35928 28492728 30430823 30335380 24093295 16389100 13710994 14838632 15163894 15046180 16471024
35919 16471024 16230901 10648262 3565100 1524070 3739458 4593743 3275965 2782186
35911 2782186 2188153 -789687 -1652549 5981891 17767119 21599043 14264046 4692820
35903 4692820 -1143613 -7050072 -14177478 -13650753 27583 16764531 22032250 15449087
35895 15449087 8951361 9126489 10525998 6721130 128017 -2259153 1572057 7114062
35887 7114062 10086157 11629575 15175023 19284617 17302748 6523700 -5237345 -6875447
35879 -6875447 2987165 14523622 17943002 12194728 3211681 -1759241 1430201 10014737
35871 10014737 15451278 13516765 11496593 18308101 29767561 33936491 30444850 31293384
35863 31293384 39488019 41366345 27833895 10204054 3908812 7029796 7903317 5487772
35855 5487772 7173262 11801484 10807468 4306057 998562 2144773 248479 -4850058
35847 -4850058 -3565859 5598539 10085600 2138868 -8697098 -10726386 -7275225 -8180340
35839 -8180340 -12316876 -10931248 -3870724 -65164 -2628427 -4253088 823547 8684185
35831 8684185 12427537 10824143 7308578 4942901 5126472 7753106 10297113 9727823
35823 9727823 7121429 6970026 9741849 9135842 751395 -9520744 -11362551 -3588727
35815 -3588727 3833624 2736172 -3155700 -4043439 3514841 13538799 17752626 12597443
35807 12597443 1369300 -7135591 -4576976 7663348 17099407 13610288 2941597 -35522
35799 -35522 8770285 17787019 16832883 10409963 9047703 14587162 20705017 22802327 20330812
35790 20330812 13291638 3736519 -2049768 -26041 4953268 5702518 3738197 6159307
35782 6159307 13042160 16700899 14014298 10961681 12594506 15979755 16538515 15172921
35774 15172921 15016157 15914749 16279742 16880721 19109805 22102229 24389484 25836374 25597258
35765 25597258 21102115 11843121 1635860 -5609745 -9966982 -12543848 -11148951 -3160044
35757 -3160044 8337856 15817313 15739403 12522413 12470623 16406942 20869515 24211347 26771729
35748 26771729 25507013 15312932 -701465 -8784577 -163275 14664928 17275580 6122866
35740 6122866 -1396877 5969713 18344989 21138973 15360604 11712046 12816345 13093221
35732 13093221 11193754 10675947 10785376 7292014 1423962 -1212730 374533 2612839
35724 2612839 4363798 6005231 4803803 178557 -328303 8991326 19721644 19150534
35716 19150534 9410014 3366790 3831286 2277204 -2476703 -1442853 6536623 10914109
35708 10914109 7740411 5599882 8192948 7565789 1273704 -625203 5614296 8138157
35700 8138157 -392083 -9127647 -7692508 -3581269 -6995447 -12196441 -9641029 -4276970
35692 -4276970 -4626313 -4510924 5677769 18124056 17625698 6630191 1111339 5572129
35684 5572129 10734727 12726020 15275210 14747162 3287366 -12244978 -14400539 -1572807
35676 -1572807 8395738 5961873 2853869 9768836 18455733 17179849 10223381 8953795
35668 8953795 12990501 13267755 8183747 4847910 6565485 8784014 7708015 5999985
35660 5999985 7943233 12477446 13581840 7709830 -685841 -3972662 -1727868 -1088237
35652 -1088237 -4627119 -5237111 1495773 7902049 6262488 3048991 8967792 19764470
35644 19764470 21124371 10691217 894403 -196699 3026373 5781666 9070556 11302389
35636 11302389 7354604 -312680 -2358929 1715858 1318467 -7337365 -14217732 -12162503
35628 -12162503 -7865960 -9026031 -12002220 -9909632 -2956983 5935930 15560750 20476792
35620 20476792 12554991 -4115664 -12210033 -4147879 5862238 2983377 -7097032 -10521175
35612 -10521175 -7579636 -7812153 -11254147 -10425725 -5773234 -4136244 -5093298 -2534512
35604 -2534512 2544143 3737789 2043825 4577006 11108699 13330352 7871640 422737
35596 422737 -2952109 -167134 9452491 22797776 29970887 23851517 11619106 6779522
35588 6779522 10803438 13215364 9198543 5448076 7406733 12057995 16062498 20586968
35580 20586968 24383164 21687846 11911945 3555312 3242856 6952175 6960526 2655495 -109223
35571 -109223 2680252 8703283 11341748 5764255 -4455138 -8320323 176306 12154757
35563 12154757 12988785 929190 -10926029 -12199083 -6835920 -4374724 -6919281 -9529572
35555 -9529572 -8605525 -4895930 -702333 2254201 3292388 2784536 951713 -2781699
35547 -2781699 -7259028 -8175696 -2968328 4308687 7544668 6653150 5658107 4000604 -2961961
35538 -2961961 -13967652 -19864387 -14975601 -4990986 467643 -521109 -1919057 855073
35530 855073 4818724 3325459 -4883891 -12007021 -9071198 2209729 9563353 4444411
35522 4444411 -8093748 -17061125 -18041347 -13359313 -5349989 3512235 8154407 6500464
35514 6500464 4279380 6747926 9595351 6555412 1363999 1397160 3501376 -855428
35506 -855428 -8725892 -8533057 407508 6412862 5277926 5842663 11710450 13621954 7230911
35497 7230911 3147669 9115909 15379297 10025579 -1455047 -5002881 1084796 6725487
35489 6725487 6370643 3088962 -18609 -1922829 270443 7976683 15471529 15221817
35481 15221817 7354043 -1778571 -7242775 -6552646 1804003 14178864 21089842 17837938
35473 17837938 10894827 7007196 2719482 -6376169 -13196321 -8188902 3930183 9734968
35465 9734968 6982882 5517034 8904585 9179400 2356560 -3695418 -1991126 3289367
35457 3289367 5397229 5837646 9772660 15981446 18025311 12981368 4311618 -2890361
35449 -2890361 -6550016 -7778619 -7798195 -5466545 820640 8927482 14061939 15253246
35441 15253246 16394274 18921121 19298353 16946714 17205589 20980014 19762916 9135154
35433 9135154 -1010895 -560657 4094986 1053812 -5529486 -1648214 11559131 17393404
35425 17393404 9586108 1037986 2345663 8228839 11739847 16131342 23487148 25284071
35417 25284071 15206937 878218 -7273655 -9502804 -9859271 -5868223 4025879 11615789
35409 11615789 9550654 3810715 3850708 6720192 3501398 -3771767 -5282378 -567610
35401 -567610 1080523 -3098058 -5134938 -230071 5482568 4367350 -2472243 -7031187
35393 -7031187 -2496670 10388442 21801558 20511894 7162444 -4809833 -6744012 -6391271
35385 -6391271 -13977830 -24503281 -26072950 -19690410 -15748242 -14527213 -7330911 3484960
35377 3484960 4110861 -7540044 -16122113 -12956806 -8599329 -11397422 -9965597 7992406
35369 7992406 31553123 38953638 27512915 14033648 8421273 4062107 -4449663 -10387435
35361 -10387435 -7898357 -3448594 -5176027 -8768291 -4233252 6818062 11230543 3120820
35353 3120820 -6150472 -2856794 9261941 13199032 2939763 -6618195 -354802 14396775
35345 14396775 17263422 3932256 -7669301 -2951197 10107937 14372143 6441386 -3518263
35337 -3518263 -8389178 -9647865 -9010776 -5011778 1095381 3680593 -556516 -8485467
35329 -8485467 -14422212 -15296105 -11942495 -7635800 -4850378 -2318151 2357667 6302024
35321 6302024 2778583 -7800843 -14343329 -8475760 3457028 8829703 5004365 -687015
35313 -687015 -3390941 -3722582 -824767 6765648 13478821 10823163 1224238 -2199317
35305 -2199317 6693713 18355030 21046256 15453714 10430214 10256997 12073307 12044601
35297 12044601 9019700 4402022 1535943 3018817 7274960 10991510 15094860 23032928
35289 23032928 32373413 34771185 26746438 14469962 5385220 1240552 1525158 6146300
35281 6146300 11289598 10767068 6093878 6841935 15296449 19874587 11725179 -903749
35273 -903749 -5008076 -1680208 -154011 750849 9788940 24006482 28541247 18480861
35265 18480861 6899610 5581335 9400095 7180964 -1326178 -8178846 -10368092 -10647746
35257 -10647746 -8719461 -1201806 9392553 13635977 6537288 -4621034 -8138068 -1995008
35249 -1995008 4359526 3208149 -1187928 -102901 5078376 4018501 -5874870 -13187540
35241 -13187540 -8274995 2710755 7834176 7064235 9161297 14767866 15369220 9056315
35233 9056315 4814906 8108582 13211283 14445748 14956517 18035524 18502719 10727771
35225 10727771 -1053037 -8541487 -10986833 -13180261 -15221891 -12457619 -4487731 2911733
35217 2911733 5506505 5213970 6034267 8539809 8986207 2582183 -10978880 -23829728
35209 -23829728 -24642894 -10090300 10291439 23275276 24053978 17293788 9573952 4450845
35201 4450845 2506948 2034136 469611 -2224806 -2832613 720239 6383220 10977553
35193 10977553 13241897 12448839 8229218 3905066 4644286 8916133 7910439 -1375259
35185 -1375259 -8764679 -3939151 8427087 15372744 13445008 9820215 8422695 6346114
35177 6346114 3688260 5071342 9237672 8305463 1156581 -3082389 -205418 845978
35169 845978 -7405292 -17237877 -16670936 -7686855 -2361705 -4557019 -7028314 -5611744
35161 -5611744 -4596756 -5964000 -3828897 5433879 15391621 18024979 14689685 12456531
35153 12456531 13245019 13011317 9697922 5649549 2544523 -327061 -2191078 -753991
35145 -753991 2270579 1033010 -5605940 -9628474 -3514937 8078968 12199130 3093006
35137 3093006 -11158445 -18379654 -14165856 -2671331 9403006 16224272 14319494 5830215
35129 5830215 -1281540 -944464 3611635 4449209 697110 375197 8474186 18231798 18964530
35120 18964530 10033752 1336721 -233845 827762 -3277109 -11573714 -15892177 -13096454
35112 -13096454 -9229183 -9628599 -10873674 -7333009 -1585997 -1315419 -6753031 -8460310
35104 -8460310 195654 13804504 21499591 19003261 10694259 2751537 -1746785 -2612412
35096 -2612412 -1386449 -347299 -524769 -1057500 -1622818 -3855332 -8494022 -12626606 -12018413
35087 -12018413 -5637244 3160230 8902394 7457149 32165 -5657767 -2185713 7833970
35079 7833970 13187635 8019066 -655277 -3637423 -2226998 -3201305 -5517086 -1975595
35071 -1975595 6619283 9597470 2076563 -6146083 -3189600 9196304 19097121 20176009
35063 20176009 17050344 15894940 16234892 14032762 8610776 3293791 924110 1431387
35055 1431387 3343236 5496322 7077004 7895194 9205824 12328791 15578059 15124240
35047 15124240 10840691 8319354 11504438 15983541 14757266 8728335 4686405 3627046
35039 3627046 -399954 -8205406 -11506176 -5570626 2508131 4506828 2824453 4004247
35031 4004247 6797720 5569576 871035 -2827522 -6547994 -14189853 -22492152 -23083796
35023 -23083796 -13831448 -83133 13753495 25364965 29635237 23122197 12726020
35016 12726020 9182120 11660255 9578926 231785 -7341439 -8006345 -7347793 -8651497
35008 -8651497 -5483781 5974118 17504188 19534784 13533330 7207243 4369426 4963435
35000 4963435 7660939 7466633 -895585 -12214456 -13121282 -1176630 9247935 7853831
34992 7853831 3210284 6028422 9754415 2862176 -8792369 -9905609 -1120471 2132151
34984 2132151 -4582302 -8033443 474190 12106620 15594848 12301980 8865192 5295851
34976 5295851 -902174 -6014075 -4544036 1113339 2773150 -2707458 -9643547 -10879072
34968 -10879072 -6191412 -2243212 -4429548 -9990917 -11659537 -7925628 -4912157 -6359762
34960 -6359762 -8157425 -7044494 -7490257 -12611594 -15135376 -7858360 1989177 1622829
34952 1622829 -6617938 -7909104 906388 4868871 -6051091 -20364045 -20167405 -4232402
34944 -4232402 12607021 17619157 10570735 35229 -4755108 -1172904 3955901 1908922
34936 1908922 -5971313 -9697474 -6095995 -4615247 -12602241 -22732240 -22940986 -13178182
34928 -13178182 -3556711 615197 3185392 8114309 14115101 18500601 20055439 17607862
34920 17607862 11060537 4395754 2928088 6637402 9861379 8080014 1903310 -5273421
34912 -5273421 -9755355 -7986293 675157 10342880 12214267 4541916 -3965182 -3679909
34904 -3679909 5029946 13467838 15485876 12554104 8298150 3251288 -2283006 -4558863
34896 -4558863 -896908 4005965 2287311 -6301376 -13549100 -14040922 -11340219 -10307952
34888 -10307952 -9207934 -3754784 5777924 15894332 23689750 25136589 15615203 -1687491
34880 -1687491 -13827672 -12346889 -4307882 -704622 153913 6381858 14611860 12930238
34872 12930238 689372 -9241601 -9767803 -7356051 -7375024 -5333502 1774188 7680517
34864 7680517 7426043 5737724 8225703 12957955 16222314 17683466 15306798 5698363
34856 5698363 -5653328 -6771381 1913975 4728353 -4939924 -12657152 -6999736 75972
34848 75972 -6412818 -17326489 -13734594 787311 5776767 -2302980 -6170139 1333762
34840 1333762 6103847 -1016591 -7833735 -1518130 10378986 12492028 4270662 -2336297
34832 -2336297 -795403 5127496 9866020 10554783 5957665 -1968775 -7171713 -5285484
34824 -5285484 965680 5206368 4352347 274648 -2768280 -1105368 4589383 7622015
34816 7622015 1431569 -11471618 -20864329 -20209090 -12822104 -6319608 -5300134 -9509382
34808 -9509382 -14271051 -12954288 -4529389 1997984 -2720086 -14983997 -22236940 -20191854
34800 -20191854 -16201110 -14942282 -12321466 -7032770 -6108178 -12222529 -15999797 -9635149
34792 -9635149 505927 4498079 4557719 8976304 15688095 14299944 2852702 -8566048
34784 -8566048 -11531639 -7584578 -1937372 2662584 3793600 -1233535 -10125529 -15011875
34776 -15011875 -10800769 -1092225 6336636 7086639 2024731 -4615453 -7024659 -1364501
34768 -1364501 9199257 15179389 9912690 -2735784 -12539757 -14300294 -12135667 -12228329
34760 -12228329 -14945050 -16361947 -14588050 -10676701 -5058268 1771387 5371371 519684
34752 519684 -9823670 -15077934 -10359650 -3344192 -2792633 -6229069 -6152586 -3223102 -3891333
34743 -3891333 -8066840 -9347502 -6396617 -4176648 -4078053 -2773026 -1207351 -4125070
34735 -4125070 -9324686 -8586540 -1923237 616677 -4679092 -8772250 -5273992 -372396
34727 -372396 -65008 904509 7830230 14169476 12142579 6608128 6238798 8031797 3733834
34718 3733834 -3662410 -3630385 4724561 12373273 15560357 18626306 22273811 21481272 15958785
34709 15958785 11264659 8256434 2467299 -4487309 -4436622 3388020 9006478 6626510
34701 6626510 2634431 3382531 4870142 1639853 -2509861 -1310886 2536358 1825411
34693 1825411 -2726785 -3227208 3224296 10435511 11874547 8024111 3578493 1420624
34685 1420624 1574631 3635355 7408737 11318846 12376036 9312625 4787130 2043533
34677 2043533 -330657 -6472221 -14856834 -16954496 -8545919 1639103 1018031 -10562451
34669 -10562451 -19881699 -15893349 -1119144 12925453 17032527 10361081 -466142 -6972719
34661 -6972719 -6238894 -2980614 -2446985 -3407596 -1682209 2149463 3913394 2860153 1861747
34652 1861747 2159799 3612587 7920208 14671140 16650027 8063209 -3842917 -5759310
34644 -5759310 2722988 8382349 4746972 915568 4711985 8862777 2966546 -9480632
34636 -9480632 -16480753 -14700886 -11274659 -11124662 -11322629 -7708528 -786920 5312280
34628 5312280 6387163 1992569 -2151258 895049 9264475 12211143 4176592 -6535655
34620 -6535655 -8978154 -4613386 -3902379 -10948364 -18886952 -19275509 -10275594 3086259
34612 3086259 11900925 9018039 -2926496 -11623746 -8683936 -92555 2937379 -299233
34604 -299233 -1595714 1628827 3239474 -442353 -5817407 -9524697 -11955774 -11355025
34596 -11355025 -3385679 9743198 17742686 14912309 8101311 6831874 10798041 12865474
34588 12865474 10329799 6904206 5551957 4859057 2280669 -2478278 -7208704 -8595447
34580 -8595447 -5014891 900759 4536231 5186927 6752575 11075224 14205714 11793714
34572 11793714 4814630 -2924816 -9507216 -13654746 -12365130 -4731546 3978322 6943196
34564 6943196 3515089 -1415753 -4042534 -3460980 901499 7962057 12219192 8737285
34556 8737285 1201599 -1271452 3515817 8057638 6662636 2873344 1629245 695097
34548 695097 -3969092 -9134976 -8116160 -1494856 3020849 1125277 -3541403 -5564994
34540 -5564994 -3389580 1457807 5865392 5466123 -1527469 -9944676 -11938886 -6741800
34532 -6741800 -1338522 -325295 -688912 1156602 2986236 1247175 -2682499 -4962677
34524 -4962677 -4513730 -1953950 3263789 10598399 16189976 16727242 13096077 7383095
34516 7383095 -3711 -6913960 -7996932 -1764849 5035264 5857800 3458306 4433437
34508 4433437 8399820 9772260 7291222 4136392 1172607 -1746688 -287063 8977341
34500 8977341 19036739 18723544 8741139 1022339 1028017 1724040 -2263775 -6056573 -4955691
34491 -4955691 -2724390 -2722209 -160644 8523581 15837137 11696088 -2725524 -16905929
34483 -16905929 -23154251 -21173178 -14627857 -8796018 -7813495 -9486601 -7056261 148263
34475 148263 4006823 146786 -4399428 -2649474 877753 -1378323 -7017152 -9008515
34467 -9008515 -8260298 -10037978 -12325976 -9149572 -2345828 1285413 1914404 4069059
34459 4069059 4649703 -2840286 -12593775 -9907847 6571389 19608742 16024295 3196205
34451 3196205 -3836540 -2258466 -676101 -5223178 -13846860 -20301847 -18860241 -9026282
34443 -9026282 1121484 1259647 -8431951 -16322002 -14115695 -6529356 -2901583 -5744637
34435 -5744637 -11784592 -17832621 -20598254 -16534051 -7175417 286408 2005763 1448970
34427 1448970 710609 -4222893 -13589826 -17577461 -8806202 5272429 12210983 11815403
34419 11815403 13209273 18592656 21468235 19422799 17243738 16930351 15015864 11110904
34411 11110904 9285944 8951546 3931052 -6341198 -13628132 -12686520 -8164547 -5924918
34403 -5924918 -5753860 -7020355 -12481316 -20082385 -19765567 -7172386 6556614 8571305
34395 8571305 2184112 -91948 3195424 2394604 -4686909 -8730742 -5802986 -4438190
34387 -4438190 -10111308 -14969382 -11457789 -5740471 -6907231 -11103147 -9027393 -3506080
34379 -3506080 -5171765 -12963688 -14350754 -6674457 -3012691 -10709700 -17470166 -8845425
34371 -8845425 10017214 21765001 20081665 13649288 9857735 6655961 1449280 -2210145
34363 -2210145 -496476 4728531 9011656 9756799 5921922 -1756229 -8468481 -8378205 -2464512
34354 -2464512 1163917 -2557924 -9464840 -13179294 -13909509 -15694451 -17932947 -15289571
34346 -15289571 -5720792 5789671 12551335 12536135 8381852 3081489 -2564363 -8701934
34338 -8701934 -14185860 -16562611 -14190396 -7737597 347495 6934532 9026172 5616099
34330 5616099 -240497 -3283184 -1817981 -28778 -2506163 -7994050 -10919392 -7924710
34322 -7924710 -705985 6198648 8242877 3536734 -4402583 -8558301 -6246343 -2664755
34314 -2664755 -2982967 -4287222 -1069827 4403160 5196706 1812312 1833418 6437799 7013531
34305 7013531 -1100032 -10411429 -12311645 -8508882 -4741373 -391850 6660690 10491217
34297 10491217 3780485 -8070755 -11267888 -3553296 1162863 -7153353 -19277172 -19396206
34289 -19396206 -7366505 1434523 -2942473 -13513121 -17970717 -14056493 -8236393 -4325430
34281 -4325430 -691534 2840458 2665098 -2297022 -7352000 -7990359 -5433262 -3488404
34273 -3488404 -2998752 -2249547 -209042 3242742 7569253 9847030 6662313 701061
34265 701061 430207 8221408 13791479 6809682 -7503289 -14153103 -8135777 946120
34257 946120 4307312 4320503 6626590 10592174 12696004 13296614 14476540 14740938 10519456
34248 10519456 1361216 -8769792 -14132117 -11054040 -1793033 5966580 6783388 3329130
34240 3329130 727323 -1797636 -6907380 -9931123 -3493905 9431784 17701733 17753436
34232 17753436 15914074 13904206 5745917 -6769455 -10192306 905507 13268125 14010711
34224 14010711 8810652 9548243 14378819 13914149 9016418 7509855 8887888 7192712
34216 7192712 5028413 9659956 17696241 18811290 13702021 13049496 17971520 17093814
34208 17093814 6191253 -4168501 -6093017 -6002415 -11166924 -15951420 -11104878 929271
34200 929271 9504618 10087408 7148845 5405846 4647548 2344332 -2714179 -8883070 -12036363
34191 -12036363 -9085095 -2067965 3341051 3703922 97729 -4333430 -5987606 -2126056
34183 -2126056 4733186 6220139 -1726062 -10281054 -7361991 5306360 14044965 12471316
34175 12471316 8699126 10827320 15421186 15531893 11918475 10039613 11549799 14149437
34167 14149437 15650815 14460906 10250566 6616778 8103148 12790487 13911564 10371497
34159 10371497 8112960 8939386 7158139 1228417 -1073823 4698377 10860153 9044926
34151 9044926 2603527 -664092 -834902 -1635478 -486020 6301147 12729553 8923900
34143 8923900 -3790600 -13364697 -12245515 -4250531 3130501 6156629 5218704 4059209
34135 4059209 7510151 14740234 17574500 11427185 3636637 3105820 6216219 3351117
34127 3351117 -3839544 -3981517 5772376 15316136 16953831 13714088 9840424 4476254
34119 4476254 -1049569 -546509 6676988 12080268 10389733 7005628 6758419 4548586
34111 4548586 -4621604 -14372479 -15303122 -8541973 -1506505 4328397 11165295 15191162
34103 15191162 11024732 3463259 2874296 9451709 13645506 12557250 13373127 18051806
34095 18051806 17786722 8560185 169411 1051750 4188815 -913002 -9944154 -10579147
34087 -10579147 -3208011 -695459 -7568947 -13010406 -8341235 -31352 1361940 -3055836
34079 -3055836 -3866202 2199416 8731425 9049592 3667114 -1564840 -1854607 1729050 3176951
34070 3176951 -921656 -5450236 -2904345 4817715 7915976 3619111 654180 4333198
34062 4333198 7021123 1544786 -5181581 -3542683 1346047 -1428996 -6832218 880121
34054 880121 20767005 31933743 23449226 10104524 8279844 11563561 4904802 -8595349
34046 -8595349 -13024730 -6071890 -1738573 -6848225 -11483566 -6938580 622826 1575717
34038 1575717 -2241192 -2526608 1995106 5519311 5108918 3130243 1233760 -1296566
34030 -1296566 -2879473 684173 9555312 17151866 17607781 13472900 11850952 13847651
34022 13847651 12911544 5089320 -3979069 -6042737 -568830 6677122 12191272 15533030
34014 15533030 14081961 5678667 -3589632 -3875735 3861506 7572013 2481681 -859141
34006 -859141 5910476 13666696 8957794 -5231253 -14845780 -15856747 -15687027 -15999354
33998 -15999354 -9937074 1564213 5931244 -2646459 -13294165 -14478255 -9824427 -9242934
33990 -9242934 -12508461 -11853481 -5843607 -614019 696422 1483648 5122298 10899637
33982 10899637 16063491 17562992 13231886 5281786 203616 645693 384064 -6830307
33974 -6830307 -16100886 -16334778 -5450068 6649433 10699958 6788181 -580118 -8712134
33966 -8712134 -14996220 -15515086 -10341451 -6038598 -8011416 -13004431 -13456064 -7402278
33958 -7402278 -281909 1687874 -3122629 -11190429 -15557819 -10494870 1474966 9289007
33950 9289007 5040658 -5523869 -9892238 -5070407 316197 583465 500635 4309691
33942 4309691 6277721 273281 -7451909 -5378547 5831619 13188947 8919451 -967770
33934 -967770 -7148191 -7360197 -3712702 1896522 5525565 2008804 -6796534 -11263028
33926 -11263028 -6852841 -984121 -978128 -2633984 608481 3901130 -1976390 -13425745
33918 -13425745 -16553226 -6921466 4662067 8076037 5336450 2800960 1263768 -1032031
33910 -1032031 -2489806 -751626 3227158 7412184 11084592 12805324 10678715 6510682
33902 6510682 4479215 4068168 459879 -6209545 -9164071 -5368158 -112126 2303325
33894 2303325 4524709 8366111 9598257 6461738 4898885 7932782 8227642 297307
33886 297307 -7883753 -6603232 -947048 -2648805 -10425394 -12993099 -9039079 -8428533
33878 -8428533 -13081707 -12662462 -3200938 4826985 3623893 326948 3677899 9462492
33870 9462492 9382583 5813234 6430367 9939821 8715168 2780366 355949 4715816 9475919
33861 9475919 8250859 2068075 -4589227 -9636817 -13014088 -14212205 -12560999 -8449565
33853 -8449565 -3308867 944828 2831488 2331683 186804 -3577817 -8154675 -9517782
33845 -9517782 -3997477 4646133 7003597 -375219 -9932496 -12744626 -8030666 608714
33837 608714 11914547 23481653 27183012 17206326 565268 -8710000 -5564436 2485082
33829 2485082 6954947 6683522 4494912 2277820 716315 -775175 -4187664 -9191689
33821 -9191689 -10956147 -6630594 -1377134 -1314044 -3292885 -495518 3786297 -889197
33813 -889197 -14670362 -24626337 -22880406 -16724743 -15478397 -17291693 -15911643 -11846231
33805 -11846231 -8528181 -4196653 3621433 10386260 9569062 1963517 -6913888 -14906975
33797 -14906975 -21782325 -23832028 -18086627 -9410778 -5673304 -7445675 -9211210 -8703854
33789 -8703854 -7919355 -6685511 -2819424 2193709 4779637 5845325 8965983 12908779
33781 12908779 13243353 10814448 10712453 12534417 10021285 2254666 -2519881 2520926
33773 2520926 14254539 24374467 27421260 22086095 10569421 -127740 -1483779 7983176
33765 7983176 20548259 27856781 28207448 24081998 17494065 10403931 5053967 556260
33757 556260 -6907436 -17072258 -22474956 -16553994 -2624761 9077759 12231728 9418768
33749 9418768 7001059 7571272 8167007 5260468 376171 -1219262 2137054 5786055
33741 5786055 5676786 4168144 4832549 5567867 3158884 1284412 5712141 13338921 15333042
33732 15333042 10872336 7744889 8304472 5957576 -1131992 -4459933 425171 4458387
33724 4458387 -1135496 -9892842 -9599801 -1332084 2251209 -4432942 -13267588 -15128540
33716 -15128540 -10876720 -7170412 -6960243 -7525081 -5595445 -1856505 152141 -698208
33708 -698208 -1097619 945058 860015 -6373108 -16274537 -18842295 -12933967 -7689720 -7613499
33699 -7613499 -6618506 -1319284 919156 -5132433 -11686923 -9846764 -4044138 -3441945
33691 -3441945 -5931663 -3256925 2976599 3731698 -1903613 -6614965 -8769483 -13348197
33683 -13348197 -19018784 -17413155 -7506055 1115446 2792128 3236418 8460896 15505762
33675 15505762 18794963 18071955 15618262 11987587 8266340 7050888 8381827 9679189
33667 9679189 10786469 13076396 13470931 7514867 -648766 -1100975 6094110 8015502
33659 8015502 -2864255 -16498466 -18458910 -8412813 2221875 5989429 4923251 3332478
33651 3332478 2377565 1455301 169627 -1671786 -4249572 -8200249 -14327997 -20569624
33643 -20569624 -21031242 -12856341 -2468163 1752072 1917457 7137907 17645544 23122792
33635 23122792 19262031 14565926 15725431 17311957 12932581 6331127 3111159 1106488
33627 1106488 -1606048 1217033 12381178 20547776 14967641 4042687 3746503 12443204
33619 12443204 14467067 6560794 1803573 5406293 6076137 -1862681 -5985642 3182335
33611 3182335 13665606 9658328 -2985370 -6168540 1325519 2648919 -9066682 -19019963
33603 -19019963 -13086657 1822353 9257536 5970114 2150466 3788376 6163589 4420955
33595 4420955 743854 -1485048 -3003241 -4346710 -2408757 3613426 7469781 3242982
33587 3242982 -5036210 -7468868 -1290203 5917573 6357698 169287 -7573807 -13007161
33579 -13007161 -14550284 -12150247 -8453513 -7866605 -11600716 -15431955 -14456811 -8628303
33571 -8628303 -2219478 706168 -476522 -2447918 -445561 6292750 11713919 9083456
33563 9083456 144584 -6306955 -5992341 -4023717 -5799843 -8559477 -6608984 -1016718
33555 -1016718 1510217 -2134825 -7889154 -9816096 -6158921 -762701 -17860 -6556856
33547 -6556856 -14684422 -15233578 -7070971 -3706 -3078725 -13661447 -21974447 -22862537
33539 -22862537 -18438466 -12491028 -7992431 -7805072 -11872158 -14976376 -12580991 -7391267
33531 -7391267 -4805421 -4187309 -1656498 288851 -4905042 -15195929 -19263440 -12150454
33523 -12150454 -3222696 -3089118 -9614477 -13724078 -13243935 -12302675 -10573711 -3290068
33515 -3290068 7848369 13221147 8071057 -364712 -3050428 -967378 -1156537 -4987360
33507 -4987360 -7218377 -5172721 -1982037 -134178 2123509 6027216 9112853 9435605
33499 9435605 8535551 7312268 3524637 -2707230 -5427713 -421826 6943194 7737270
33491 7737270 1454652 -4379606 -5405384 -4283688 -3306078 -444671 5170272 9911400
33483 9911400 10719366 9012278 7137468 4945594 1951071 -935848 -3623666 -7091006
33475 -7091006 -10142023 -9881057 -6344994 -2227705 2444593 9610119 16236924 15137827
33467 15137827 5406773 -4464879 -7074063 -3528484 2387096 9917416 16917687 17450421
33459 17450421 9844425 799168 -4305454 -8478790 -14337985 -16084286 -8880674 507154
33451 507154 2624730 -163342 1350183 7731423 11531281 10589710 9199229 7600916
33443 7600916 2246479 -3653890 -2092410 5452797 7325980 -1288332 -11113564 -12883697
33435 -12883697 -9143222 -6740949 -6220563 -5068736 -4442286 -5701618 -5439100 -514785
33427 -514785 5889331 9117758 10435106 13539754 16238685 12087897 228085 -11310298
33419 -11310298 -13442364 -4888719 7385366 15278765 16654426 15567014 15870508 16491688
33411 16491688 14579693 10994588 9135998 9678518 10611013 11713280 14345233 16934207
33403 16934207 15646832 10303262 5073877 2345261 246985 -2764828 -5345094 -6544810
33395 -6544810 -7356603 -7633894 -5680565 -2273608 -786541 -1723541 -1404356 2103999 5945117
33386 5945117 7457847 8251356 10793303 14036479 14728021 10939274 3346164 -4573790
33378 -4573790 -7638205 -3646468 2976014 5670650 3274199 -780031 -4780323 -8244087
33370 -8244087 -7074224 2176251 13137607 14362669 5453670 -1021626 2801183 10169232
33362 10169232 12398845 11511347 12763318 13322465 7903715 -499128 -5079802 -5837919
33354 -5837919 -6742928 -6546553 -1965318 3314941 2861919 -1318751 -1813592 1140244 -5963
33345 -5963 -6400259 -9795462 -5440146 1511536 5889839 10101361 16868299 21625835 18696845
33336 18696845 10846631 6723215 10540425 18156012 22117956 18319478 9219345 1838088
33328 1838088 743997 2812137 1848468 -2158447 -3523939 -1051072 -915334 -6400319
33320 -6400319 -11373001 -9078566 -2038392 2961351 5260739 8461840 11573284 10536101
33312 10536101 7133368 7326096 10144507 7387379 -2867931 -11082132 -9423107 -2808557
33304 -2808557 -475952 -2479023 -2320722 1001097 2266829 -66646 -1251663 2061459
33296 2061459 7940994 13437012 16881504 15745795 8500391 -567103 -4529332 -2773229
33288 -2773229 -666403 28650 2540869 5706302 3050092 -4670078 -6031613 4750156
33280 4750156 16538556 15461564 3998654 -4272212 -4490445 -4009539 -7937246 -11892438
33272 -11892438 -10112674 -2550069 7282023 14914332 15034708 5736640 -6363490 -10971806
$$ [...]
##END NTUPLES=NMR SPECTRUM
##END=
