##TITLE=31Pdec_2PBDP-2
 CDCl3, 24 sc
 13.4.2023
##JCAMPDX= 6.0         $$ Bruker NMR JCAMP-DX V2.0
##DATA TYPE= NMR SPECTRUM
##DATA CLASS= NTUPLES
##ORIGIN= UXNMR, Bruker Analytische Messtechnik GmbH
##OWNER= root
$$ XWIN-NMR		Version 3.5
$$ Thu Apr 13 14:28:46 2023 Russian Standard Time (UT+4h)  she@DPX200
##.OBSERVE FREQUENCY= 81.013821
##.OBSERVE NUCLEUS= ^31P
##.ACQUISITION MODE= SIMULTANEOUS
##.ACQUISITION SCHEME= undefined
##.AVERAGES= 24
##.DIGITISER RES= 16
##SPECTROMETER/DATA SYSTEM= spect
##.PULSE SEQUENCE= zgpg30
##.SOLVENT NAME= CDCl3
##.SHIFT REFERENCE= (INTERNAL, CDCl3, 0, 248.564)
##AUDIT TRAIL= $$ (NUMBER, WHEN, WHO, WHERE, WHAT)
$$ ##TITLE= Audit trail, XWIN-NMR		Version 3.5
$$ ##JCAMPDX= 5.01
$$ ##ORIGIN= Bruker BioSpin GmbH
$$ ##OWNER= she
$$ F:/spectra/data/she/nmr/P31/1/pdata/1/auditp.txt
$$ ##AUDIT TRAIL=  $$ (NUMBER, WHEN, WHO, WHERE, WHAT)
(   1,<2023-04-13 14:27:54.87 +0400>,<she>,<DPX200>,
      <created by zg, POWCHK disabled, PULCHK disabled
       configuration hash MD5:
       00 E9 B6 7A A2 85 ED C7 34 08 36 98 17 FE 4E 26
       data hash MD5: 32K
       38 EF FA 1C 66 41 A8 DD 74 0F 5D 4D 93 B7 20 E1>)
(   2,<2023-04-13 14:27:59.03 +0400>,<she>,<DPX200>,
      <Start of raw data processing
       efp BC_mod = 2 LB = 1 FT_mod = 6 PKNL = 1 PHC0 = -10974.87 PHC1 = 75.48538 SI = 64K 
       data hash MD5: 64K
       A2 DF 32 57 A2 83 62 68 5B 2A 1B 30 6E F1 1F 52>)
(   3,<2023-04-13 14:28:12.20 +0400>,<she>,<DPX200>,
      <pk PHC0 = 6.015773 PHC1 = 0 
       data hash MD5: 64K
       D9 B1 68 90 C7 22 9C 04 A1 51 90 1D 7C 7C FC 3C>)
(   4,<2023-04-13 14:28:15.54 +0400>,<she>,<DPX200>,
      <abs ABSG = 5 
       data hash MD5: 64K
       3E 41 DA B3 18 01 D2 7D 9A DE 9F B9 03 8B DB D9>)
$$ ##END=
$$ 
$$ hash MD5
$$ C1 DD F6 36 C0 45 1A 64 51 25 7D 7B E6 76 5D F3
##$RELAX= 
##$RELAX= 
##$RELAX= 
##$RELAX= 
##$RELAX= 
##$RELAX= 
##$RELAX= 
##$RELAX= 
##$RELAX= 
$$ Bruker specific parameters
$$ --------------------------
##$DU= <F:/spectra>
##$EXPNO= 1
##$NAME= <P31>
##$PROCNO= 1
##$TYPE= <nmr>
##$USER= <she>
##$AMP= (0..31)
100 100 100 100 100 100 100 100 100 100 100 100 100 100 100 100 100 100 
100 100 100 100 100 100 100 100 100 100 100 100 100 100 
##$AQSEQ= 0
##$AQ_mod= 1
##$AUNM= <au_zg>
##$AUTOPOS= <>
##$BF1= 81.014009
##$BF2= 200.13
##$BF3= 200.13
##$BF4= 200.13
##$BF5= 200.13
##$BF6= 200.13
##$BF7= 200.13
##$BF8= 200.13
##$BYTORDA= 1
##$CFDGTYP= 0
##$CFRGTYP= 5
##$CHEMSTR= <none>
##$CNST= (0..31)
1 1 145 1 1 1 1 1 1 1 1 1 1 1 1 1 1 1 1 1 1 1 1 1 1 1 1 1 1 1 1 1 
##$CPDPRG= <waltz16>
##$CPDPRG1= <>
##$CPDPRG2= <waltz16>
##$CPDPRG3= <>
##$CPDPRG4= <mlev>
##$CPDPRG5= <mlev>
##$CPDPRG6= <mlev>
##$CPDPRG7= <mlev>
##$CPDPRG8= <mlev>
##$CPDPRGB= <>
##$CPDPRGT= <>
##$D= (0..31)
0 1 0 0 0 0 0 0 0 0 0 0.03 2e-05 3e-06 0 0 0 0 0 0 0 0 0 0 0 0 0 0 0 0 
0 0 
##$DATE= 1681381674
##$DBL= (0..7)
120 120 120 11 120 120 24 19 
##$DBP= (0..7)
150 150 150 150 150 150 150 150 
##$DBP07= 0
##$DBPNAM0= <>
##$DBPNAM1= <>
$$ [...]
##$SUBNAM3= <"">
##$SUBNAM4= <"">
##$SUBNAM5= <"">
##$SUBNAM6= <"">
##$SUBNAM7= <"">
##$SUBNAM8= <"">
##$SUBNAM9= <"">
##$SW= 501.771253377433
##$SWIBOX= (0..15)
0 1 3 0 0 0 0 0 0 0 0 0 0 0 0 0 
##$SW_h= 40650.406504065
##$TD= 32768
##$TD0= 1
##$TE= 0
##$TE2= 300
##$TE3= 300
##$TEG= 300
##$TL= (0..7)
0 120 53 12 22 120 120 120 
##$TP= (0..7)
150 150 150 150 150 150 150 150 
##$TP07= 0
##$TPNAME0= <>
##$TPNAME1= <>
##$TPNAME2= <>
##$TPNAME3= <>
##$TPNAME4= <>
##$TPNAME5= <>
##$TPNAME6= <>
##$TPNAME7= <>
##$TPOAL= (0..7)
0.5 0.5 0.5 0.5 0.5 0.5 0.5 0.5 
##$TPOFFS= (0..7)
0 0 0 0 0 0 0 0 
##$TUNHIN= 0
##$TUNHOUT= 0
##$TUNXOUT= 0
##$USERA1= <user>
##$USERA2= <user>
##$USERA3= <user>
##$USERA4= <user>
##$USERA5= <user>
##$V9= 5
##$VALIST= <valist>
##$VCLIST= <CCCCCCCCCCCCCCC>
##$VD= 0
##$VDLIST= <DDDDDDDDDDDDDDD>
##$VPLIST= <PPPPPPPPPPPPPPP>
##$VTLIST= <TTTTTTTTTTTTTTT>
##$WBST= 1024
##$WBSW= 4
##$XGAIN= (0..3)
0 0 0 0 
##$XL= 0
##$YL= 0
##$YMAX_a= 5821
##$YMIN_a= -6400
##$ZGOPTNS= <>
##$ZL1= 120
##$ZL2= 120
##$ZL3= 120
##$ZL4= 120
##$ABSF1= 248.5645
##$ABSF2= -253.2056
##$ABSG= 5
##$ABSL= 3
##$ALPHA= 0
##$AQORDER= 0
##$ASSFAC= 0
##$ASSFACI= 0
##$ASSFACX= 0
##$ASSWID= 0
##$AUNMP= <proc_1d>
##$AZFE= 0.1
##$AZFW= 0.5
##$BCFW= 0
##$BC_mod= 2
##$BYTORDP= 0
##$COROFFS= 0
##$CY= -3
##$DATMOD= 1
##$DC= 0
##$DFILT= <>
##$DTYPP= 0
##$F1P= 0
##$F2P= 0
##$FCOR= 1
##$FTSIZE= 65536
##$FT_mod= 6
##$GAMMA= 0
##$GB= 0
##$INTBC= 1
##$INTSCL= 6.047779e-11
##$ISEN= 30
##$LB= 1
##$LEV0= 0
##$LPBIN= 0
##$MAXI= 10000
##$MC2= 0
##$MEAN= 0
##$ME_mod= 0
##$MI= 50
##$NCOEF= 0
##$NC_proc= -6
##$NLEV= 6
##$NOISF1= 182.463
##$NOISF2= 159.3651
##$NSP= 0
##$NTH_PI= 0
##$NZP= 0
##$OFFSET= 248.5645
##$PC= 4
##$PHC0= -10968.85
##$PHC1= 75.48538
##$PH_mod= 1
##$PKNL= yes
##$PPARMOD= 0
##$PSCAL= 0
##$PSIGN= 0
##$REVERSE= no
##$SF= 81.0140089999694
##$SI= 65536
##$SIGF1= 159.3651
##$SIGF2= -187.1042
##$SINO= 113.3802
##$SIOLD= 16384
##$SREGLST= <1H.CDCl3>
##$SSB= 0
##$STSI= 65536
##$STSR= 0
##$SW_p= 40650.406504065
##$SYMM= 0
##$S_DEV= 0
##$TDeff= 32768
##$TDoff= 0
##$TI= <>
##$TILT= no
##$TM1= 0
##$TM2= 0
##$TOPLEV= 0
##$USERP1= <user>
##$USERP2= <user>
##$USERP3= <user>
##$USERP4= <user>
##$USERP5= <user>
##$WDW= 1
##$XDIM= 65536
##$YMAX_p= 481248299
##$YMIN_p= -31651510
$$ End of Bruker specific parameters
$$ ---------------------------------
##NTUPLES= NMR SPECTRUM
##VAR_NAME=  FREQUENCY,     SPECTRUM/REAL,   SPECTRUM/IMAG
##SYMBOL=    X,             R,               I
##VAR_TYPE=  INDEPENDENT,   DEPENDENT,       DEPENDENT
##VAR_FORM=  AFFN,          ASDF,            ASDF
##VAR_DIM=   65536,         65536,           65536
##UNITS=     HZ,            ARBITRARY UNITS, ARBITRARY UNITS
##FACTOR=    0.620285442955139, 1,           1
##FIRST=     20137.2065510682, 0,            0
##LAST=      -20513.1999529968, 0,           0
##MIN=       -20513.1999529968, -31651510,   0
##MAX=       20137.2065510682, 481248299,    0
$$ Real data points
##PAGE= N=1
##DATA TABLE= (X++(R..R)), XYDATA
$$ [...]
40488G58852j42926l00275J88646M32481l64944j401201j199909J85241J129800
40479g14235P19596r1296o0655N55260N75195k61478r17377n54182K92578M88605
40469C2011o2466k61127N07972J253573O85752p73350j396105n83080L55116K97182
40459E5478p1011L28189R97823O89673m13629q75591k36996L91509J95026j99340
40449H61131L7370O17230P61633L78314j09992n50027r54754j019323m69674K99303
40439a48789N83102L21644J48385M25074O97003L35441n50916j153347r05120
40430b47523j56109K88699K11365J95489O52385J067863O88365l23371j060146
40421A317017j097135q24224n21062L5180P45832Q84648K34226k59572J63881
$$ y = [758852, 615926, 315651, 504297, 936778, 571834, -829367, -2029276, -1844035, -714235, 5361, -85935, -146590, 408670, 983865, 722387, -194990, -749172, -456594, 32011, -30455, -291582, 216390, 1469963, 2155715, 1382365, -13740, -596820, -241704, 55478, -15533, 312656, 1310479, 2000152, 1586523, 710932, 473936, 865445, 1060471, 861131, 898501, 1515731, 2277364, 2655678, 2545686, 1995659, 1040905, 21582, -448092, -148789, 434313, 755957, 904342, 1329416, 2026419, 2361860, 1810944, 657597, -247523, -403632, -114933, 96432, 291921, 944306, 2012169, 2700534, 2377163, 1317017, 219882, -604342, -1125404, -1090224, -344392, 540256, 774482, 514910, 678791]
40412F78791P03127Q5814j306083j710537m83695R20794R45760j03656p70967
40403a040652l86283M69445R65870P82644J44973l66043k87812Q4632m2926p18550
40393c94702r18084m7911R57271R12821J15135l03544k23131l93474p41334l67745
40383a404698O80702J168002N79584j17413j46606j4523k61203m17374o1425K61320
40373B66366J13124L6009L45489K28316p23185j226516j17278J474721J524391
40364A921437P3951j030067r70462o21792n21691j66817M47156M71510j19941
40355e16716k16813M47408O47870k00105q46724k17881P58801O35782l05992o73424
40345d87794r6216N88336Q09105O92452L25102k87704o86502l81106K53182L67758
$$ y = [678791, 1381918, 1467732, 161649, -1548888, -2032583, -1111789, -166029, -269685, -1040652, -1426935, -957490, 8380, 791024, 935997, 569954, 282142, 366774, 323848, -394702, -1312786, -1360697, -403426, 509395, 624530, 320986, 97855, -295619, -1036953, -1404698, -723996, 444006, 1023590, 906177, 759571, 745048, 483845, 66471, 5046, 266366, 379490, 415499, 760988, 989304, 266119, -960397, -1077675, 397046, 1921437, 1995388, 965321, -5141, -626933, -1148624, -1315441, -868285, -396775, -516716, -733529, -286121, 361749, 161644, -685080, -902961, -144160, 491622, 185630, -487794, -584010, 4326, 813431, 1505883, 1830985, 1543281, 856779, 475673, 728855, 1096613]
40335A096613j16888m62482k84090K2172R4216J02456K38216L19233J63427j07177
40325A065696l59731o39466q47005o41923j716M59956K14166k92193n9024J004564
40315i6676J647956Q47829o08935r95718n2375N73695k48987j358567r67633O38550
40305f20861J451854N67516p40112r80557k60157L56834L30649j14789n36347
40296e45970n17690P4051O72852M35598n48179j113426n37707M34763O43605L9352
40286i62751m65244k72164L86843R64930J107640P78123K48245j03528j46895
40277A535199l9165L8335q9374o14408j277801j166295J50488J463855J114901
40268A115735n58667j379112l96080P27220L23883p42208o18853N38451R47128
$$ y = [1096613, 979725, 517243, 233153, 255325, 349541, 451997, 690213, 1009446, 1172873, 1065696, 705965, 66499, -780506, -1422429, -1424145, -964189, -750023, -1042216, -1101240, -96676, 1551280, 2399109, 1790174, 794456, 742081, 1315776, 1066789, -291778, -1259411, -620861, 830993, 1398509, 658397, -322160, -582317, -225483, 105166, -9623, -545970, -1063660, -989609, -316757, 118841, -429338, -1542764, -2080471, -1645708, -1002103, -962751, -1427995, -1700159, -1313316, -348386, 759254, 1537377, 1785622, 1682094, 1535199, 1496034, 1534369, 1444995, 830587, -447214, -1613509, -1463021, 834, 1115735, 557068, -822044, -1218124, -490904, -167021, -909229, -1528082, -989631, -42503]
40259d2503R2954o15215j63589P14627R46426N84025K33820M31k83116m44681
40249A023179k85813p5458j36656k45675O280M48799M77461o9533o60214p82954
40239c00584m94185p4856M20845Q71008P10315m34540j781145j897202m91873
40230c472217J025249J283461N86381J42880K99844M62283L36737K04764J46092
40221A015474l1833j90233p9246o547l73947p84765o38007l00813m57510o26464
40211b473891J25844J199745J068670l6887j69610J090808J663474K90773j274440
40202A484486r81270L65914N95902m15902q77419Q854J110837J162762J29329
40193B583493j120930j562469p19736O45697J065847J98600o61236n31370q5360
$$ y = [-42503, 50451, -564764, -728353, -13726, 932700, 1516725, 1750545, 1750976, 1467860, 1023179, 737366, 661908, 525252, 279577, 285857, 734656, 1212117, 1142584, 482370, -300584, -794769, -869625, -448780, 422228, 1132543, 698003, -1083142, -2980344, -3472217, -2446968, -1163507, -577126, -434246, -134402, 327881, 664618, 869382, 1015474, 983641, 793408, 714162, 707615, 333668, -451097, -1089104, -1389917, -1847427, -2473891, -2348047, -1148302, -79632, -116519, -286129, 804679, 2468153, 2758926, 1484486, 503216, 869130, 1465032, 1049130, 171711, 180565, 1291402, 2454164, 2583493, 1462563, -99906, -819642, -173945, 891902, 1090502, 429266, -102104, -187464]
40184a87464j75364l11575J48501N35703R3058m28864l4835O36100M40514j56845
40174E58929l196M67678m7270j230470j490827n67208K48886M11745O63686J201177
40164B13130J186673L54543n16532r33592j040584o72464L74107J216843P50907
40155I33031l98724n74056K90315O70448J28725j53559J98151N3603q71032j165333
40145h88431j58857P90049N20080k15145l81648l16110n20872m02806M31992J017167
40135a24581N38493k08973k03026J15795j19190n49977l83678R3190J74023Q4800
40125e83124L29273M56987j29050q07441n85872K33700O06087M69542N17900O43972
40115A151974J12180q63610j185384o24862j93859m69512p08889j19435R02247
$$ y = [-187464, -362828, -674403, -525902, 9801, 102859, -326005, -360840, 275260, 715774, 558929, 555733, 1023411, 976141, -254329, -1745156, -2312364, -2063478, -1651733, -988047, 213130, 1399803, 1754346, 1237814, 304222, -736362, -1408826, -1034719, 182124, 933031, 534307, -39749, 250566, 921014, 1049739, 896180, 1094331, 1147934, 276902, -888431, -1047288, -257239, 262841, 47696, -333952, -650062, -1170934, -1573740, -1141748, -124581, 413912, 204939, 1913, 117708, -1482, -551459, -935137, -841947, -667924, -583124, -253851, 203136, 74086, -733355, -1319227, -1085527, -479440, -9898, 508002, 1151974, 1264154, 400544, -784840, -1409702, -1603561, -2073073, -2781962, -2901397, -1999150]
40106a999150J412646J191665P47312L99174n375m83352n97786j13115L47814
40097H99833l2989r02874q99291L29878J206985L59160j128802j147692J99691
40088a116101P61132j74752p43135L48630J609300J139912l93768r46744j79320
40079C05154M72003J76866n39807j086443j317773r60811R1048J037065R75584
40070h47114L00938P1019K17342j80549r35430p31070O25593J541385R27929k16037
40060G74006m53386L029L6375l60471k28991M94723O53034l51986j512765j502891
40050b449323l50796P66750J000476N03093j29341m49723k42716L48877O66138
40041c36565J13924q60648r93457J70059J446056J412497J99163q16054p82725
$$ y = [-1999150, -586504, 605161, 1352473, 1751647, 1746272, 1262920, 665134, 552019, 899833, 866844, -36030, -935321, -605443, 601542, 960702, -168100, -1315792, -1116101, -354969, -529721, -1272856, -924226, 685074, 1824986, 1431218, 484474, 305154, 777157, 954023, 414216, -672227, -1990000, -2950811, -2859763, -1822698, -847114, -546176, -475157, -257815, -438364, -1373794, -2104864, -1479271, 62114, 990043, 774006, 320620, 323649, 360024, -447, -229438, 265285, 918319, 566333, -946432, -2449323, -2800119, -2033369, -1032893, -529800, -659141, -1108864, -1351580, -1002703, -336565, -222641, -1083289, -2076746, -1906687, -460631, 951866, 1151029, 334975, -447750]
40032d47750j03934M14197L88292p5687m80094k23244N90928R03923K5494j144449
40022a52324j219885l55501Q7578k29516k28988N37255J010185M00312n33106
40013f83990p83302n06986k83784m4585L30534L33489k35812n20653J53898J057699
40003a183492J128537N57749K16552J74848m2887l17591k57338j26510k35886
39994h6018K358R97581J548321K81685j758628k042596k84691R29297J5436j246995
39984a644250o78937P96566P60115p02855j142172L01204J572514R78594l59719
39975a18940n62745J99485N85851N16807P81151R83224N9476j382616j483069
39966d21376j39539O26718l5445m24048O37639J569751O84946q28850q63733J03512
$$ y = [-447750, -551684, -137487, 250805, 175118, -304976, -528220, 62708, 966631, 992125, -152324, -1372209, -1727710, -1640132, -1869648, -2098636, -1561381, -551196, -150884, -683990, -1467292, -1974278, -2258062, -2302647, -1972113, -1638624, -1874436, -2395089, -2241191, -1183492, -54955, 502794, 719346, 894194, 851307, 533716, 276378, 149868, -86018, -83660, 913921, 2462242, 2743927, 985299, -1057297, -1341988, -412691, -397255, -1644250, -2323187, -1526621, -766506, -1469361, -2611533, -2310329, -737815, 240779, -118940, -681685, -482200, 103651, 620458, 1401609, 2384833, 2444309, 1061693, -421376, -560915, 65803, 30358, -393690, 243949, 1813700, 2498646, 1669796, 806063, 909575]
39956I09575O2043r23343r60478K02673P79669J33810l01614K28630O03685J07168
39946H41818l63301k42747l23966q52312o70745N62821J279345M76669n36003
39937A71579l76593J45707k57856q82134k71970J094012J386735J81075j086533
39928A04022j186775l10491O16850Q64486L51428k10569m6703M80984K42017p77466
39918A27783j191270l50679O54927Q65802P62190P82864K53014r44879j340155
39909c80403j07926J196511Q87728k60026n37085j01687k09336p46624o80121
39900i38969j22800Q9968J19279M70719M88495m47777j119210j27712J417503
39891a70504J316352j89047q36472L5049Q44035O51092J96102l4496m12142o66079
$$ y = [909575, 971618, 48275, -912203, -709530, 70139, 203949, -97665, 130965, 734650, 841818, 478517, 235770, -88196, -940508, -1611253, -1048432, 230913, 707582, 171579, -205014, -59307, -317163, -1199297, -1471267, -377255, 1009480, 1190555, 104022, -1082753, -1393244, -776394, 88092, 439520, 228951, 182248, 663232, 905249, 127783, -1063487, -1414166, -759239, 106563, 868753, 1651617, 1904631, 959752, -380403, -488329, 708182, 1595910, 1335884, 798799, 697112, 487776, -258848, -938969, -1061769, -971801, -852522, -381803, 106692, -341085, -1460295, -1588007, -170504, 1145848, 956801, 120329, 155378, 999413, 1650505, 1846607, 1812111, 1399969, 733890]
39881G33890l9473Q64482N97854o09979j078152n37708l66143p69344l76581Q58228
39871g22926J103569j19284q16415J60626J171779O46733l87837l71056J70727
39862H35916k1774n43755k53274N41185O48544j5725n17859l86112J47280P37037
39852A171463Q67432L6848j200900j411431l34202M43176j40427q94927l35064
39843a798032Q72039J040259J45916l76774l0996K36012j78327o69960n47762
39834a307625M345L44909J58366k83958l42258L39847J194109J169909Q8556r97206
39824C68994j131171n34642N539J73260J21073N1623K03710O74240R88884N47619
39814A469129l09904n67033q0764J85252j97303m55455j12870J11459l41726p96731
$$ y = [733890, 694417, 1558899, 2156753, 1546774, 468622, -69086, -435229, -1204573, -1581154, -722926, 380643, 261359, -555056, -394430, 777349, 1424082, 1036245, 665189, 835916, 814142, 270387, 17113, 558298, 1206842, 1191117, 673258, 287146, 434426, 1171463, 2038895, 2075743, 874843, -536588, -870790, -427614, -568041, -1462968, -1798032, -925993, 114266, 260182, -116592, -147588, 88424, -89903, -759863, -1307625, -1303280, -958371, -800005, -1083963, -1426221, -1086374, 107735, 1277644, 1366200, 368994, -762177, -1296819, -1291280, -1118020, -996947, -945324, -741614, -67374, 921510, 1469129, 1159225, 592192, 511428, 696680, 499377, 43922, -68948, 42511, -299215, -1095946]
39804a095946n24928L3670J61502L4209Q9021J36182P591J79110Q21607J147158
39794I89176O40204j989j11470j85798o95706q66440O090R96785Q08850j79827
39784A399875o32202l47308j12245n1893K69286N40013J14910n59232m82344J73197
39774C12057L94714J32152J58655L31740k29639j215976j222223o9985P36065
39765f72440L82569r4312K79243Q96335Q45510L47210o4600n96688j364698j556651
39755a598522o08108N98673Q73883L89322O8919m0868m67036q33041k21304J002157
39745h35925J226024j02201j437536j138513L60772J246172O80385m16144p76058
39736a193024k16296M60179N03065n8682n38970l71102J92085L40117j83029n85460
$$ y = [-1095946, -1620874, -1587204, -1425702, -1391493, -1302472, -1166290, -1158699, -979589, -157982, 989176, 1629380, 1627391, 1515921, 1330123, 634417, -232023, -225933, 770852, 1579702, 1399875, 767673, 420365, 308120, 256227, 525513, 1065526, 1180436, 621204, 138860, 312057, 706771, 838923, 997578, 1329318, 1099679, -116297, -1338520, -1408505, -672440, -289871, -384183, -104940, 791395, 1636905, 1984115, 1919515, 1322827, -41871, -1598522, -2206630, -1607957, -734074, -344752, -275833, -316701, -783737, -1616778, -1838082, -835925, 390099, 287898, -1149638, -2288151, -1927379, -681207, -822, -416966, -1193024, -1409320, -949141, -446076, -504758, -1043728, -1414830, -1222745, -882628, -1065657, -1651117]
39726a651117o7678R51179J301566O40132j97709m85156m20544l83479k22534
39717e35340J69061K92187j94002o57007k67401O98121J121863M98181n39967
39708E85696j082282p82141P0604Q19654Q83508L39960q7881N7123M06960M49035
39698A660236K26740j00777p02421j392369j259645O1368J403786J453347N55617
39689A905882l6627j31509m15546p92545n24850J91436M17138J40177J35280K38794
39679A127630m42290j511904j410121N2355J152325Q31668N6395p3198J57922
39670e9218K45532M84444R04885P30213j73489p57150n37247l55152n88733l67702
39660d73617M41723M18997q91775j581737k36595J531726J426001j04404r31463
$$ y = [-1651117, -1718795, -767616, 533950, 1174082, 976373, 491217, 70673, -312806, -535340, -366279, -74092, -268094, -925101, -1192502, -494381, 627482, 1125663, 585696, -496586, -1278727, -1208123, -388469, 495039, 834999, 747118, 804241, 1211201, 1660236, 1886976, 1786199, 1083778, -308591, -1568236, -1506868, -103082, 1350265, 1905882, 1869255, 1737746, 1322200, 529655, 4805, 196241, 613379, 753556, 888836, 1127630, 685340, -826564, -2236685, -2184330, -1032005, -200337, -143942, -217140, -59218, 186314, 670758, 1575643, 2305856, 2132367, 1375217, 837970, 482818, -105915, -473617, -31894, 387103, -504672, -2086409, -2323004, -791278, 634723, 530319, -401144]
39651d01144n77868k15102k01885P3595M14558O1635n58608l25275N03278N79270
39641f47546k35073o22649N9506R59505J145468N34887n38956j462635j276514
39632b084007K11613J525799J128186l64260j042197m76020L3074j85040l55320
39623a608172L1945L82601K73771J54779L39745M76735L61230K40779J12769k74603
39613D91579o40528m19745J97519N05758M57066M80270L56623l76698j070463
39604a8619n79293P02629J036458j26306j322243j234733k78381M89437P36919
39595e94132N43952j00879q27541q77097j58015M95645N26401K89638J78468J2018
39585e11542l37903n35332l45821P0518N84796J103557J168771M34344m87877
$$ y = [-401144, -979012, -1194114, -1395999, -1322404, -907846, -846211, -1404819, -1730094, -1226816, -647546, -882619, -1505268, -1445762, -486257, 659211, 1194098, 655142, -807493, -2084007, -1872394, -346595, 781591, 417331, -624866, -1100886, -1067812, -1252852, -1608172, -1576227, -1193626, -919855, -765076, -425331, 51404, 412634, 653413, 766182, 491579, -148949, -568694, -371175, 134583, 591649, 1071919, 1428542, 1051844, -18619, -597912, 104717, 1141175, 1014869, -307374, -1542107, -1820488, -1331051, -594132, -50180, -151059, -978600, -1855697, -2013712, -1518067, -991666, -702028, -523560, -511542, -849445, -1384777, -1730598, -1660080, -1075284, 28273, 1197044, 1631388, 1143511]
39576A143511o27828p7530J99851q9576l28996k16130l9284J94766O37915P23025
39566A519724j51935j150463q49579L94453P42053k35567r01705l06104L84846
39557e54277N5757n89405n11313r593K32798L89357O39939L79635n48192j011958
39547a527252j97158R65254J134974M26741j36117j89449k5747K18655M42625
39538A112526L12835j48107l86825k29589j15017r3712K51742N94866P1992q79599
39528D91112p00642O01997J005323k57889j177647j96995J210690J100479J75780
39519B252208R3372M40387n5138q10053o06332k35602j024010j814212o05334
39510b364714J554448J734558j30674j175806l94626J20978o28105p56751P66780
$$ y = [1143511, 515683, 438153, 638004, 548428, 219432, 3302, -35982, 158784, 796699, 1519724, 1367789, 217326, -632253, -237800, 504253, 268686, -633019, -939123, -554277, -498520, -1087925, -1599238, -1608831, -1376033, -986676, -346737, 32898, -515294, -1527252, -1724410, -759156, 375818, 802559, 666442, 476993, 451246, 669901, 1112526, 1425361, 1277254, 890429, 660840, 545823, 452111, 703853, 1298719, 1370711, 491112, -209530, 392467, 1397790, 1139901, -37746, -234741, 975949, 2076428, 2252208, 2345580, 2785967, 2730829, 1920776, 1314444, 1078842, 54832, -1759380, -2364714, -810266, 924292, 793618, -382188, -776814, -655836, -1283941, -2040692, -1273912]
39501a273912J908308R75731n55321p45203l19400p63931j327349n23615Q56124
39492a768568R02528j66839m58357L97093Q56438J66947o45851o85039l16422
39483a718070n7241K14403N32477M91587J4476m26169n84330o31099m81878J82111
39473b463733J085208J430340J018411N01496L00953O6980m77984r12406p82147
39464b32882l15474M502J48373L37861M39336R4630n84919q91286l06816P32543
39454e74132J170565N76190k22769j80148M63694M55542n56449j302907o78501
39445h48915N75614R29066K31855l47822k74079k09177n32163o06308l0058M55851
39435f56136O2691p69682r55254j84555Q48438J316860Q96066j30288r92986j004531
$$ y = [-1273912, 634396, 1610127, 1054806, 309603, -9797, -773728, -2101077, -2624692, -1768568, -866040, -1032879, -1491236, -1094143, -237705, -70758, -716609, -1401648, -1718070, -1775311, -1560908, -1028431, -536844, -522368, -948537, -1532867, -2163966, -2645844, -2463733, -1378525, 51815, 1070226, 1571722, 1872675, 1939655, 1461671, 549265, -232882, -548356, -543854, -395481, -57620, 381716, 476346, -108573, -999859, -1306675, -574132, 596433, 1172623, 949854, 769706, 1233400, 1688942, 1132493, -170414, -848915, -273301, 655765, 887620, 539798, 265719, 56542, -475621, -1081929, -1111987, -656136, -593445, -1363127, -2318381, -2502936, -1654498, -337638, 558428, 428140, -564846, -1569377]
39425a569377l28672K01955K45584L05784O21069N48295l05544j133254r91970
39416b406130j86039L67504N61376P94110Q12506K03602l57865Q0091Q58208M05071
39406A132434j021364j278487K95791J474314M18663j369727j270271M80711J300717
39397A62781K63288p68775k96502O52372M65887n38006q79732k58506K90593K16722
39387f89878J30614N33870Q97860N08734l77447q49129n71805j00974N9947J14917
39377c43291L63277M30173k37026j265951j503248m64035R38527J453174Q77589
39368B49189L9138l06322j93253j89979o26362j054555o44189O03163J402579
39359g20591O93764o49552p54186N54890J402020O90948k63959J1390O98508J09233
$$ y = [-1569377, -1898049, -1696094, -1450510, -1144726, -523657, 24638, -280906, -1414160, -2406130, -2592169, -2224665, -1663289, -869179, -56673, 146929, -210936, -130845, 727363, 1132434, 111070, -1167417, -871626, 602688, 1021351, -348376, -1618647, -1137936, 162781, 426069, -342706, -639208, 13164, 479051, -58955, -938687, -1197193, -906600, -689878, -559264, -25394, 872466, 1381200, 1003753, 154624, -417181, -518155, -458208, -343291, 19986, 450159, 213133, -1052818, -2556066, -3020101, -2081574, -628400, 249189, 288327, -17995, -211248, -401227, -1027589, -2082144, -2726333, -2123170, -720591, -26827, -676379, -1430565, -875675, 526345, 1217293, 953334, 964724, 1663232, 1772465]
39349A772465j409505j916647q33257M14775P27555N75600N94158M78779j10094
39340B93829p12944p72793l49647K40942P31762O91891p0827p97630n43892K50525
39330a038784K57581m72123l48942J052656J865211O77154j085736j163286J80446
39321g5823O84498m60374j563077j005579O65068J763346J522615M88589m57960
39312A561303q28795n97027n4887L86007M44963J23774k73179k64519L77437J159878
39302B034955J166858J32803j069885j411969r43629n65555o87717p05138J5907
39293b033370J083323J436844O69063m19628p90000l94567J910Q0016K96981P56403
39283F86975O72896l01074j016427k81364J098262J191841k18978j264275p84610
$$ y = [1772465, 362960, -1553687, -2386944, -1972169, -1244614, -669014, -74856, 403923, 293829, -419115, -1191908, -1541555, -1300613, -568851, 123040, 52213, -745417, -1289309, -1038784, -781203, -1253326, -1602268, -549612, 1315599, 1992753, 907017, -256269, -75823, 608675, 148301, -1414776, -2420355, -1755287, 8059, 1530674, 2019263, 1561303, 732508, 135481, 80594, 466601, 911564, 1035338, 762159, 497640, 875077, 2034955, 3201813, 3334616, 2264731, 852762, -90867, -656422, -1344139, -2049277, -2033370, -950047, 486797, 1155860, 736232, -53768, -448335, -446425, -366409, -69428, 686975, 1359871, 1058797, 42370, -238994, 859268, 2051109, 1832131, 567856, -216754]
39274b16754R9507k038o32995n81195M4055K61411J0027M260K12814l2878n43459
39263a377245l35584O38950J142438M51003n88635q49627l64064J51018M23481
39254g08265N33611L02462l54312q15926l98822N05768P99581K45186j98902J09614
39244A9995N16305K00367m42935m56069R0385K50686j75847l40126J46283N33359
39234C42403K27380k84065m36501n18234p93157o78869J62308Q12940M41196j36109
39224h60708K77036J062435O49099p48230j236676k32044O35244J81853n51453
39215h23444j43108J000543J402834N37060q61347j794423j623200l99288Q69937
39206a834436J015684J84178l06486J14534N64275L13685j31360j60097m7302
$$ y = [-216754, -117247, -119285, -752280, -1333475, -1289420, -1028009, -1017982, -1013722, -800908, -833786, -1377245, -1712829, -1073879, 68559, 519562, -69073, -918700, -1282764, -1131746, -708265, -174654, 127808, -226504, -1042430, -1441252, -935484, -135903, 109283, -89619, 19995, 536300, 736667, 293732, -162337, -71952, 178734, 2887, -337239, -190956, 342403, 569783, 285718, -150783, -669017, -1462174, -2141043, -1978735, -1165795, -724599, -860708, -583672, 478763, 1127862, 379632, -857044, -1089088, -453844, -271991, -823444, -966552, 33991, 1436825, 1973885, 1112538, -681885, -2305085, -2704373, -1834436, -818752, -634574, -941060, -826526, -262251, 51434, -79926, -240023, -287325]
39197b87325r1071O0961M59262M11161k19759n18597j45158n6549o33870o58091
39187a679036N39730J492337Q35809l06860j67183O73205M10182p60883j056985
39178a9684k83976l1447o90188p72632L33853J202554P70329n296R4379O66749
39168A264641O48460j0401o44220r36249q09156n8171J034153J372534K61988
39159B123579j395603j917996p98056P08362J061586J97397m83720O6734J141150
39150G03433J249932K52719n14114l75390k57747q54334j249276n43213L71040
39141a216950K01775n17235l56455N23020P12009J6835l40029J10470N33731M54971
39131A22142K57239l4761p29655j155489k35336J393048J761639N04081n17725
$$ y = [-287325, -378396, -317435, 141827, 552988, 333229, -185368, -330526, -387075, -1020945, -1679036, -1139306, 353031, 1188840, 881980, 714797, 1388002, 1798184, 1037301, -19684, -303660, -335107, -1025295, -1797927, -1464074, -261520, 508809, 503513, 597892, 1264641, 1913101, 1902700, 1258480, 322231, -486925, -545096, 489057, 1861591, 2123579, 727976, -1190020, -1988076, -1279714, -218128, -20731, -504451, -437717, 703433, 1953365, 2206084, 1691970, 1316580, 1058833, 204499, -1044777, -1587990, -1216950, -1015175, -1532410, -1888865, -1365845, -653836, -637001, -977030, -866560, -332829, 122142, 379381, 344620, -385035, -1540524, -1775860, -382812, 1378827, 1882908, 1365183]
39122A365183j16664O15654M40534j42129k36698j67228n13209q33280n36165
39113a24002L8077L82020O25423P78175L47340n08359p46898j82258Q909n54517
39103F3910m93917Q44704J710121N54889j190593j155401K50127N98286o22176
39094E59950j365949m34619P63586N43462o89114j331645p53177K89740Q12457
39085a605309N78176J57030K20605O84177P82997K09030l63185l26814n2911q1262
39075B02534j08079L11079O76153K44837o33504r83471o44997j95304J69644N43055
39065d18053N12871k49478r33666n34341L76713L70525m39923m75690O08958J169865
39055a2219K13759r17614o13516O14601J127351N57200j74123n62894q10481p45737
$$ y = [1365183, 1248519, 1864173, 2304707, 2162578, 1925880, 1758652, 1245443, 412163, -124002, -85925, 296095, 921518, 1699693, 2047033, 1538674, 791776, 609518, 618427, 63910, -430007, 414697, 2124818, 2679707, 1489114, 333713, 583840, 1182126, 559950, -805999, -1240618, -477032, 66430, -622684, -1954329, -2707506, -2417766, -1605309, -1027133, -870103, -649498, 34679, 817676, 1026706, 663521, 336707, 283796, 202534, 94455, 405534, 1081687, 1326524, 693020, -290451, -935448, -1130752, -961108, -418053, 94818, -154660, -1088326, -1622667, -1245954, -875429, -1315352, -1791042, -1182084, -12219, 201540, -716074, -1329590, -714989, 412362, 969562, 795439, 232545, -577936, -1323673]
39045a323673Q7592J186425J219251j41844j466974j279678J02406J125628R88325
39036D97458K64078l20285p68614j146794r27854J50755J118663P98673l27743
39027f61663n43772N64718J344982N63843o35231m90380O42658R25335p5088q80316
39017G55086n29101J30182M7244m91704o58062l96810j60404l5220J58064L86842
39007g93883N62443P35811P70708L53518l24831n21577j1528M17790O2842o61402
38997E89891q56014l46957K96281N66438L55982j40178m50768j81907L11310J87236
38987C31314n54578p76775J42003J181074J110688L07826k3703J31089k03817
38978A645121j016770j093859k7408R48841O95028l34058r51238p46844j23421
$$ y = [-1323673, -1236081, -49656, 1169595, 1027751, -439223, -1718901, -1616495, -490867, 497458, 761536, 441251, -327363, -1474157, -2402011, -2251256, -1132593, -333920, -661663, -1205435, -640717, 704265, 1268108, 632877, 142497, 785155, 1710490, 1635402, 755086, 225985, 356167, 403411, -88293, -746355, -1143165, -1303569, -1338789, -1180725, -793883, -231440, 504371, 1275079, 1628597, 1303766, 782189, 770661, 1188451, 1251293, 589891, -266123, -613080, -316799, 249639, 605621, 465443, 14675, -167232, 144078, 331314, -223264, -1000039, -858036, 323038, 1433726, 1741552, 1717849, 1848938, 1645121, 628351, -465508, -492916, 455925, 1150953, 816895, -134343, -881187, -1004608]
38969a004608M39646N38866q4349r99016j177280k53276Q20294R70818L41278
38960d07627k03321l48281l26563j26705L61941P09831M36175N767L25091J193801
38950A620109J296923P1774j321534j455991m26252M57416L87154j66151l02084
38941A61364J75106O20271L83915l63968p93272m53000J35754K40659q586J14427
38931B12670O92048R07304K22039q14254j284928r76171l69389N6649J51511K1940
38921a180581l0079K48681O12035M23124m55391j195163q82837K86516J145334
38912a028361Q93595l4778n56274j88810M77479N79199M6126m37380m82564m40187
38902a171955n40956k98524N62218J212652P71187j93474m55057j39568m00299
$$ y = [-1004608, -564962, -26096, -110445, -1109461, -2286741, -2540017, -1719723, -748905, -407627, -610948, -959229, -1285792, -1412497, -1050556, -340725, 95450, 101217, 426308, 1620109, 2917032, 2988806, 1667272, 211281, -214971, 242445, 629599, 463448, 161364, 336470, 956741, 1340656, 976688, 183416, -269584, -133830, 106829, 98243, 212670, 904718, 1812022, 2034061, 1219807, -65121, -1041292, -1410681, -1354032, -1202521, -1180581, -1210660, -961979, -349944, 73180, -382211, -1577374, -2460211, -2173695, -1028361, -134766, -169544, -725818, -914628, -437149, 142050, 188176, -249204, -731768, -1171955, -1712911, -2011435, -1449217, -236565, 534622, 341148, -113909, -253477, -653776]
38893f53776j107222p43292Q71576J716268N50717r85824q23142M27357P01575
38884d5763k23900p84038l97197m4776k16245k63085M1758P9826j91683j5850
38874b060953O32281Q32044L93724J96550M29343J35586q54368j196481j62416
38865a654690J002719R58508J87215j72509j95425m90037o88920j85788L73348
38856h65579k2777q58069p57586J85049M86400k10464m55830N77695J565034J029854
38846F73727k64116l90628P94105J394660L39121j000363r12179N6265M8962j057551
38836c17997j368485k2498J266324P67536o42124r90942k79031o4564n57861l61929
38826b571571Q32100J494992P89984j06369q7661K34978L6717j94650P1536O8855
$$ y = [-653776, -1760998, -2504290, -1632714, 83554, 634271, -351553, -1174695, -747338, -45763, -269663, -1053701, -1450898, -1495674, -1711919, -1975004, -1933246, -1853420, -2045103, -2060953, -1428672, -596628, -202904, -6354, 422989, 558575, -295793, -1492274, -1654690, -651971, 306537, 493752, 321243, 125818, -364219, -1053139, -1238927, -865579, -888356, -1746425, -2504011, -2318962, -1832562, -2043026, -2498856, -1921161, -356127, 673727, 409611, 18983, 813088, 2207748, 2546869, 1546506, 634327, 690592, 739554, -317997, -1686482, -1708980, -442656, 324880, -317244, -1308186, -1587217, -1651781, -2209642, -2571571, -1739471, -244479, 545505, 439136, 351475, 586453, 623170, 428520, 500056, 568911]
38816E68911q22264j506096p21167P63636J217177N29976K0542J53516J89475
38807C93706j38780k87556k13652m78472r42050p73194N6096N96605M62881L13608
38797a010808N36339O49646L59568J05005J47962J01814k47620n40050n71215
38788d69359n44258l53508L91252J322083J368471L26591o50786p09915m54124
38779B26447p28070j158463q52035O7471O07590L32185j43904l6990O91216J269088
38769B74535Q34082n38269j560312j034993N64445J580639J311870O55556L58489
38760B446042q6602j074835j688795j057756K9667K59359j42195R069O61542O22319
38750b2185k27522n65384J59630P52945K22774o65235p28242j71307L6946k08542
$$ y = [568911, -253353, -1759449, -2480616, -1716980, -499803, 30173, 50715, 204231, 393706, 254926, -32630, -246282, -724754, -1666804, -2439998, -2383902, -1787297, -1324416, -1010808, -474469, 175177, 534745, 639750, 787712, 889526, 641906, 101856, -469359, -1013617, -1367125, -975873, 346210, 1714681, 2041272, 1390486, 680571, 226447, -501623, -1660086, -2512121, -2444650, -1837060, -1504875, -1648779, -1685769, -994553, 274535, 1108617, 570348, -989964, -2024957, -1460512, 120127, 1431997, 2087553, 2446042, 2359440, 1284605, -404190, -1461946, -1432279, -1172920, -1315115, -1306046, -644504, -22185, -249707, -815091, -655461, 97484, 320258, -344977, -1073219, -1244526, -1207580, -1416122]
38740a416122k84767o4610R2471K14933N46520P60466L77541k00059j31374M41080
38730C36079N03071k05631p77242n96846j44791L7429J22444K31203l6904o20326
38720a151514n94646L43732R86932L50262n81524k63042Q96297J090063o6210
38711A010350j019686p44785o1314L0282j31521J82164P51301R05586N74854R8836
38701A596067l58434o23187m20179K5055L5596l89444l77232L31795P18926R3665
38691F32628o60769m82202J41492P6070n41788o63840j52046J46697n6045j60945
38681a720748J28259L96118L40734J05254j59904k87795O6702P24393O23511o91543
38671d75019j774051r80399R09403J587955O36730j7313O13642J048502L4633
$$ y = [-1416122, -1700889, -1765499, -1673028, -1458095, -911575, -151109, 226432, 26373, -105001, 336079, 839150, 633519, -143723, -740569, -885360, -847931, -725487, -494284, -531188, -1151514, -1746160, -1402428, -415496, -65234, -646758, -909800, -13503, 1076560, 1010350, -9336, -754121, -815435, -785153, -916674, -734510, 16791, 922377, 1497231, 1596067, 1237633, 614446, 194267, 219322, 254918, -134526, -511758, -179963, 538963, 632628, -28141, -510343, -368851, -292781, -834569, -1498409, -1650455, -1503758, -1559803, -1720748, -1592489, -1196371, -855637, -750383, -910287, -1198082, -1131380, -406987, 216524, -475019, -2249070, -3229469, -2320066, -732111, -95381, -112694, 500948, 1549450, 1584083]
38662A584083j241150j108410l3715M02000M4573n8157K93175L35037o8924k50360
38652a01848l3151Q1680k7033J4988K03191K00323J27281K59857J41510p65635
38642A01163j658876j085121P38151J783581R54109m04511n70235J75602L80811
38633D14674k30741n98356j52798M46509M51187l0122m12991l33759J68515O97918
38623D20036P01224M1991o86469q49421o00418m70309l50145L00191J261811J547277
38613A315768Q62227J55311J94496M27461m085q06268j043702o71685m81484o45403
38603f97364m15661N08724J267537R82196l7584p72463p62334l87897j40088q3753
38593e38687P614K87149O26141O83758K65437l76284p63005o99565l55098P7007
$$ y = [1584083, 342933, -765477, -799192, -397192, -352619, -410776, -117601, 217436, 148512, -101848, -134999, -53319, -80352, -65364, 137827, 338150, 465431, 725288, 866798, 101163, -1557713, -2642834, -1904683, -121102, 833007, 428496, -141739, 33863, 414674, 183933, -414423, -567221, -120712, 330475, 300353, -112638, -446397, -277882, 420036, 1121260, 1163251, 476782, -372639, -973057, -1443366, -1793511, -1493320, -231509, 1315768, 2177995, 2333306, 2527802, 2955263, 2951178, 2144910, 1101208, 429523, -51961, -697364, -1113025, -604301, 663236, 1645432, 1607848, 835385, 73051, -314846, -454934, -538687, -531073, -243924, 382217, 1065975, 1331412, 955128, 192123, -507442, -862540, -785533]
38583g85533M54030M94494J8760n59951n42416N7498L66658j68743r48099r94419
38573b607721j97565O88875J036603Q58195M68693P2269k62312m44679k96960
38564f84602K60249Q55488P60086k32319j204616j056039j0915O04873K07401
38555e00394l45768k18679K24632K80031K3070j84833m79954r01379p72837K75005
38545b601106J280587J095889J01767l89983r1495J39460r3910k93760k14728
38536a067279k05556k86888k1235N17132O75942K97005j12628l57905o67628p96360
38526b025400k11045P02235R13323M39153L43114P26270L63482r92931j669765
38517a411564n59426R68041J075693J37078k37434J25495J15352l95516l43958
$$ y = [-785533, -331503, 162991, 181751, -378200, -920616, -863118, -496460, -665203, -1613302, -2607721, -2805286, -2116411, -1079808, -221613, 247080, 319349, 57037, -387642, -684602, -424353, 431135, 1191221, 958902, -245714, -1301753, -1312668, -707795, -500394, -846162, -1064841, -840209, -560178, -537108, -721941, -1201895, -2103274, -2876111, -2601106, -1320519, -224630, -122863, -512846, -604341, -464881, -558791, -852551, -1067279, -1272835, -1559723, -1580958, -1063826, -387884, -90879, -203507, -561412, -1229040, -2025400, -2236445, -1534210, -620887, -181734, 161380, 887650, 1251132, 258201, -1411564, -1970990, -1002949, 72744, 209822, -27612, 97883, 213235, -182281, -526239]
38508e26239N34139J168057Q27152K7875m68001m97509k09949J01338j04592q99431
38498d7160j233482k04346J199156J135929k67270q95439J37868J119246M80139
38489A424641q43918j141521n27027j44506O0104Q12380J503498Q61086n99571
38480A405166r33073J92297Q40855j56896j405649j266635l74911l34330j013503
38471c046679q97176L34753J250294P91392l12707o28121K83805J547639J859214
38462A182414O35342j254468k028884q50028J028417J659657P56278k39314l18341
38453E71073J016m3951k68564k26134j17235k29554j89280L98218J091278J198686
38443B185553P93310L66840r1756p79959j198584o66871L40450M63892o76477
$$ y = [-526239, 7900, 1175957, 2003109, 2030984, 1562983, 1065474, 855525, 956863, 852271, -47160, -1280642, -1484988, -285832, 850097, 582827, -312612, -174744, 944502, 1424641, 580723, -560798, -1087825, -1232331, -1172227, -359847, 1143651, 2004737, 1405166, 472093, 664390, 1505245, 1348349, -57300, -1323935, -1698846, -2033176, -3046679, -3943855, -3609102, -2358808, -1567416, -1880123, -2508244, -2224439, -676800, 1182414, 1817756, 563288, -1465596, -2315624, -1287207, 372450, 1128728, 889414, 571073, 572089, 528138, 259574, 33440, -83795, -313349, -502629, -104411, 986867, 2185553, 2978863, 3345703, 3253947, 2473988, 1275404, 608533, 948983, 1412875, 736398]
38434G36398j807448j634878m31170N48268O93967M40277L13109K55154o867l56064
38424a249254l48041J71334P33268P41368K72951M9791M20143P62522L73066l58430
38414A568718m06874K88279N78709j89644j082290r13465m6322J80756m35107
38405d57240o48448J97330J007684N77931m81405n91479M30985J112038M93468
38396A640864n93827q77021l36016J12189j8441m28596o25715k76432O52133J575331
38386H24469J562792N02898m99153n44291j93706m55602j080772r85892l9736
38377i08993P70158Q20191L68558k86648r78951j103496j95099R11085Q86797
38368B83602m4743l88071J60105L08903l52324m77208N49664J204860K48384j149238
$$ y = [736398, -1071050, -2705928, -3137098, -2588830, -1894863, -1454586, -1141477, -886323, -893190, -1249254, -1597295, -1425961, -692693, 48675, 321626, 371417, 791560, 1554082, 1927148, 1568718, 1161844, 1450123, 2028832, 1839188, 756898, -156567, -202889, -22133, -457240, -1105688, -908358, 99326, 677257, 195852, -395627, 35358, 1147396, 1640864, 1047037, 170016, -166000, -53811, -72252, -500848, -1126563, -1402995, -750862, 824469, 2387261, 2890159, 2391006, 1846715, 1653009, 1197407, 116635, -869257, -908993, -138835, 681356, 1049914, 763266, -215685, -1319181, -1514280, -603195, 283602, 238859, -149212, 10893, 319796, -32528, -509736, 39928, 1244788, 1493172, 343934]
38358C43934j305568n94867l33317l52127K88327J072739O89808n42499r69927
38349a703497j83264N41534M06210J0525l6661O6999R8760J41960K6070m17506
38339a048870o14984O129O96696K24898j028343j340886j55557J153375J284261
38330h23281M43087m79257q99925n21027M32613Q62517K5026r24433k51578J465484
38320f70774J780977J07388j229488n70801O36871M31552n72272n96619K48196
38311d34970M87457l3721j61246K76403K39578m57782p18318j37886K20735l23703
38301a043453p99355r7499J176014J479386N25676m05472l54738J14224L9936
38292F34719l94980l18993K07035J74041o05566q92522J25320J340405J139846
$$ y = [343934, -961634, -1556501, -1889818, -2241945, -1953618, -880879, -191071, -733570, -1703497, -1886761, -1345227, -939017, -928492, -965153, -898154, -799394, -657434, -631364, -1048870, -1663854, -1657725, -961029, -736131, -1764474, -3105360, -3260917, -2107542, -823281, -380194, -859451, -1759376, -2280403, -1847790, -985273, -960247, -1884680, -2136258, -670774, 1110203, 1217591, -11897, -582698, 54173, 485725, -86547, -683166, -434970, 52487, 18766, -142480, 133923, 373501, -84281, -802599, -940485, -719750, -1043453, -1842808, -1940307, -764293, 715093, 1240769, 835297, 480559, 594783, 634719, 239739, -79254, 127781, 301822, -303744, -1196266, -1070946, 269459, 1409305]
38283A409305l01397j305292r50302P1333P02968O02345N0782l27065P3202R45690
38273I71569J009942j77143j087156l47133Q02601K41267j382268j379722N37108
38264h10935J527892J65816j277678o65710O38329M72731l91894k2322R14262
38255E50491L55855j169942j122422O67010J432325j14695j696781j015269R39326
38246a174102J730206R41034K4968k38036l49202o20359o65455l82979k72621
38237a006546n38739p04731l97609R4920L36977L21540K12867n3782m59840n05416
38227b700359K52262J324061J619504Q33547j14178l58473j86813l24932p05098
38218c60479p29075l60299m4544K28447P89522J289203R23892j57775p45939k90078
$$ y = [1409305, 1107908, -197384, -1147686, -1076353, -373385, 228960, 279742, -47323, 25879, 971569, 1981511, 1804368, 717212, 370079, 1172680, 1413947, 31679, -1348043, -810935, 716957, 882773, -394905, -1060615, -422286, 50445, -341449, -363771, 550491, 906346, -263596, -1386018, -719008, 713317, 598622, -1098159, -2113428, -1174102, 556104, 1497138, 1522106, 1284070, 934868, 314509, -350946, -733925, -1006546, -1545285, -2250016, -2647625, -2552705, -2215728, -1894188, -1681321, -1735103, -2194943, -2700359, -2448097, -1124036, 495468, 1329015, 1214837, 856364, 669551, 344619, -360479, -1089554, -1449853, -1494397, -1265950, -476428, 812775, 1736667, 1578892, 832953, 542875]
38208E42875K27349k31183j166517j236338j33247J016912J098571L00375k43173
38199A75624R7221O84958N58168j25178l14589J68907J58053r34818j807263j043053
38189b381970O39916J360268P18006r5210m11608n81231n57273J45934R91953
38180a71215P54714l96698q88647j80039N20597L99294J26799K47654K28138k05214
38170D35383m08580j52567l0372m9528M24513R20666J85217j198336j005537Q85290
38160F149J668431l0866j740592j081451M96120M50240o40860n75614M70193N84424
38150c93826l41921p16906j92957K08333L52213Q35451J123117L27705o69548
38141E31661l66274O00098M21572o04025n46817O27826R26372j41291p94865k32011
$$ y = [542875, 770224, 539041, -627476, -1863814, -1997061, -980149, 118422, 418797, 175624, 272845, 957803, 1515971, 1390793, 1076204, 1245111, 1403164, 468346, -1338917, -2381970, -1742054, -381786, 336220, 241010, -170598, -751829, -1309102, -1163168, -171215, 583499, 186801, -701846, -881885, -361288, 38006, 164805, 412459, 640597, 435383, 26803, -125764, -156136, -205664, 218849, 1139515, 1324732, 126396, -879141, 6149, 1674580, 1643714, -96878, -1178329, -682209, -231969, -872829, -1448443, -978250, -393826, -735747, -1452653, -1645610, -1437277, -1085064, -249613, 873504, 1201209, 531661, 165387, 765485, 1187057, 583032, 36215, 664041, 1590413, 1449122, 654257, 422246]
38131D22246J32858n13172q86138l3018R40719Q00433L9634l41960l73779l92114
38121b04291j58723L64374N72026K94066J41563K23225j64570j004239j144982
38112a081551j43504Q38989P78697J87489l3091L5933n8619k12303k55571m31111
38102c74642o61087k92989P04770J249443O34590l52701o25042l26941k83555
38093c28154n18125k75669O96167J617826J485655J42927j439806j985354j181718
38084a786251L9662P05366Q22334P78084M19373m10130j009363o29545K25326
38075h45144M68811J15889R3824N98063Q94209O31899J43849m18203j025432j074450
38065d16685j04757R69336P95830l60122r86879o27924j92622n1826L41569Q00678
$$ y = [422246, 555104, 41932, -844206, -877224, 63495, 863928, 903562, 561602, 187823, -204291, -363014, 1360, 573386, 867452, 1009015, 1232240, 1067670, 63431, -1081551, -1225055, -386066, 392631, 580120, 547029, 582962, 524343, 312040, 56469, -374642, -1035729, -1328718, -623948, 625495, 1260085, 907384, 282342, -44599, -328154, -846279, -1121948, -425781, 1192045, 2677700, 2820627, 1380821, -604533, -1786251, -1746589, -1041223, -218889, 559195, 978568, 568438, -440925, -1070470, -845144, -376333, -260444, -166620, 431443, 1325652, 1957551, 2101400, 1683197, 657765, -416685, -521442, 447894, 1243724, 883602, -103277, -731201, -923823, -975649, -634080, 166598]
38055A66598L37718p95447r09555N12979J701833J062132o06463j358388n68007
38046d56600O94224J034223j4093j484003j646683K0990J780385J657750J20858
38037A707051p71004m39410l2565J09570P70761J474180N30190j736894k506703
38028h94824n59935J561336J221338n71963j135462j45918N73966K50351j01897
38019A96992K52755P65626O81532k7269p93418r06537j44276O96491N36431m49659
38009H08668r44459m06638K80585M31921M66477O66670M90681j67812m68830j50554
37999A006709j19270p14241r25372k55683K60475j3414l0743R63594J738393R22623
37989B833071p25186j455151r09746m921N78952N75908j42310r29999o34483N31394
$$ y = [166598, 504316, -291131, -1200686, -687707, 1014126, 2076258, 1469795, 111407, -456600, 237624, 1271847, 1257754, -226249, -1872932, -1851942, -71557, 1586193, 1707051, 936047, 496637, 464072, 573642, 1344403, 2818583, 3348773, 1611879, -894824, -1454759, 106577, 1327915, 755952, -379510, -525428, 48538, 298889, 196992, 449747, 1215373, 1896905, 1869636, 1076218, 169681, 25405, 721896, 1258327, 808668, -135791, -542429, -261844, 170077, 636554, 1303224, 1793905, 1626093, 1157263, 1006709, 887439, 173198, -752174, -1007857, -747382, -760796, -791539, 172055, 1910448, 2833071, 2107885, 652734, -257012, -261933, 317019, 892927, 750617, -179382, -813865, -282471]
37979b82471Q67989n1028m05625P14879J400091J70562j059199L571J846316J272853
37969D477938j366392k548748q88185J225982J577584P38807M8533m21675q48278
37960A995566o89375J00656M25648l57108j339912j341238l49627Q38406J564631
37951H47647J505847P06103k83867q59505r47066o67275Q7459R70301Q40631o54957
37941A545318j867738j096513P73094J409078N01548q842P27607J130841p1284
37932C043109j682016j786726l58784J036516J280263N04054m98014q98149l47549
37923B92704N94804R23611L60131l80015o11815l99301j49227j05468l37475o40327
37913d52378m78042L05962Q74413L65874o57508q24565k1602M36362k8935l18850
$$ y = [-282471, 585518, 534490, 128865, 843744, 2243835, 2414397, 1355198, 1358769, 3205085, 4477938, 3111546, 562798, -325387, 900595, 2478179, 3216986, 3265519, 2843844, 1995566, 1306191, 1406847, 1832495, 1475387, 135475, -1205763, -1555390, -716984, 847647, 2353494, 3059597, 2775730, 1916225, 969159, 301884, 389343, 1359644, 2200275, 1545318, -322420, -1418933, -645839, 763239, 1264787, 1255945, 1983552, 3114393, 3043109, 1361093, -425633, -784417, 252099, 1532362, 2036416, 1538402, 640253, 292704, 887508, 1811119, 2171250, 1791235, 1179420, 780119, 630892, 525424, 187949, -452378, -930420, -624458, 249955, 615829, -41679, -866244, -887846, -451484, -480419, -799269]
37903g99269M13607J167145N89573p55677j026399K20287J327526Q55958m38321
37894A554430p31999L11895J169235O82857l95604p26897l90291m27795q39505
37885B06326n16597P22942J543880J093973K30354o4977k13875q93907j488483
37876F19636j048560L537N26628M13460L37854L05767r5536m42052j2282O79417
37866A287869M63382m82978q27529l20608j36501o67745p22449L51371J303012
37857B47824Q43386k97742m77815M01888Q69882R6510j008003j099005m6047J080365
37847F11243J296327O37101j11023l63092k77832l79754q11661j110910p26127
37838a235728K99978J202813J169193K30185o96942q53015m70686k32132k33022
$$ y = [-799269, -385662, 781483, 1371056, 615379, -411020, -190733, 1136793, 1992751, 1554430, 822431, 1134326, 2303561, 2986418, 2590814, 1863917, 1473626, 1045831, 206326, -310271, 412671, 1956551, 3050524, 3280878, 3215901, 3002026, 2108119, 619636, -428924, -425387, 101241, 514701, 852555, 1158322, 1062786, 620734, 608452, 1287869, 1751251, 1268273, 440744, 120136, -16365, -684110, -1406559, -1055188, 247824, 1091210, 793468, 315653, 717541, 1587423, 1683933, 675930, -423075, -469122, 611243, 1907570, 2544671, 2433648, 2070556, 1792724, 1412970, 601309, -509601, -1235728, -935750, 267063, 1436256, 1666441, 969499, 116484, -354202, -586334, -819356]
37829h19356q5074K04673K51394R1352J03055J53982k10476o70404l40827O79630
37819f42051J156710N67617p6622J20678O16826N54990J49932k0238j80800p10575
37809A536467j050508m55178O12386R80127M64379N6318L83651Q16358M24257
37800C768257n91417r08751K37002J668946J427334m11436j330668J71353K049551
37791F080171J503783p43821j551175k62028N69373l52096j127458l13965N54837
37782D357621j18111j167501q87965M7957J52230j46899L65393J215326J123904
37773D941955L08763q8999K4454K7132j8504J91949L36360L17784P51378J415773
37763H208045Q43215j141953k322597j249503L64772L86269m60939l25785M53256
$$ y = [-819356, -904430, -699757, -448363, -357011, -253956, -99974, -310450, -980854, -1321681, -642051, 514659, 1082276, 1005654, 1126332, 1743158, 2298148, 2448080, 2427842, 2247042, 1536467, 485959, 30781, 643167, 1623294, 2087673, 2143991, 2527642, 3344000, 3768257, 3176840, 2268089, 2505091, 4174037, 5601371, 5189935, 3859267, 4030620, 6080171, 7583954, 6840133, 5288958, 5026930, 5596303, 5244207, 4116749, 3802784, 4357621, 4239510, 3072009, 2184044, 2232001, 2384231, 2237332, 2602725, 3818051, 4941955, 5250718, 5161719, 5186173, 5213305, 5194801, 5386750, 5723110, 6040894, 6792272, 8208045, 9051260, 7909307, 5586710, 4337207, 4701979, 5088248, 4627309, 4301524, 4754780]
37754D754780K90464o92697j107377o80564p6772O08350J296855J135515L0124
37745E558678n40954K7543J06495j191181j935025n71796J188228J330383R42727
37736D915098J658332K145722O14793j381235j342047p1882J38630l77190j36738
37727F163483k2809j282282k088305m34130J582771R80859o69280n6033J633644
37718E807918Q70619j490025j646796J93019N31549n68079J84660K483403K536096
37709H902364J56162p74397N87922R35083m79846n07260J443221J956566m0510
37700A2179305j526563j222598j232443j826344p16424J547139J788541M81137
37692I471750J066729K693887J327139j552542k49009M259708M709491N66633
$$ y = [4754780, 5045244, 4352547, 3245170, 2564606, 2487834, 3096184, 4393039, 5528554, 5558678, 5017724, 5045267, 5151762, 3960581, 2025556, 1453760, 2641988, 3972371, 4915098, 6573430, 8719152, 9333945, 7952710, 6610663, 6538781, 6677411, 6300221, 6163483, 6140674, 4858392, 2770087, 2335957, 3918728, 4899587, 4230307, 4174274, 5807918, 6678537, 5188512, 3541716, 3734735, 4266284, 3698205, 3882865, 6366268, 8902364, 9058526, 8284129, 8872051, 9807134, 9327288, 8820028, 10263249, 12219815, 12179305, 10652742, 9430144, 8197701, 6371357, 5654933, 7202072, 8990613, 9471750, 10538479, 13232366, 14559505, 13006963, 12757954, 17017662, 21727153, 22293786]
37684B2293786k87404M344969P115197N407421O468465J2426788J4226731Q841117
37676H0837070P815805J7392644K5807653K6545564L8284235P6067993J10912469
37669C83663433R0423295P161571p9025752j03001560o3800766j5578489J777989
37662B21619721K915066K4511894O7629475Q8288214M8706743l2482408r4280813
37655C26907892r7510197o1339385l0439359k1867146k0034269j2562380o722840
37648G6432316r512024j3293839r944576m284147l742367n629050m071759j038009
37640B4916545j362262l386535k895044j124481j381524k198299p08501J164658
37632A3024557K68060j635679j207946L18887n6043j288866p10817N87681Q934
$$ y = [22293786, 22006382, 26351351, 33466548, 38873969, 45342434, 57769222, 71995953, 80837070, 88652875, 106045519, 131853172, 158398736, 196682971, 272750964, 383663433, 474086728, 481248299, 402222547, 299220987, 235420221, 219841732, 221619721, 224534787, 249046681, 316676156, 404964370, 453671113, 421188705, 326907892, 229397695, 168058310, 137618951, 115751805, 95717536, 83155156, 76432316, 66920292, 53626453, 43681877, 39397730, 35655363, 30026313, 25954554, 24916545, 23554283, 20167748, 17272704, 16148223, 14766699, 12568400, 11859899, 13024557, 13292617, 11656938, 10448992, 10767879, 10711836, 9422970, 8712153, 9299834, 9308768]
37623I308768j459104j292655k08420l30658r09245j90807P53802J99804n96224
37614E275261J14081R44277J31395p54607J61057J134109P8367j113219K2196
37605E992917J613595P07319j246007j140815N4379m21464j414093n7245K207285
37596F295871J712532o83531r20285J050897J424368m02738r89368N87521J187527
37587I262794l80176j227834K20291J538006P67513o04047q62618n44906j87086
37578G981937Q51547J907390Q86087j887896l129176j500296K70396r0478j061239
37569D228272n75568M48858K92150l74667p4906O04156K10824q88286j236749
37560B634084o96882k69576k84372l00857j86110q2447J40207N13137O46017M14257
$$ y = [9308768, 7849664, 6557009, 6348589, 6017931, 5108686, 4917879, 5671681, 5871485, 5275261, 5389342, 6333619, 6465014, 5710407, 5871464, 7005573, 7083940, 5970721, 5992917, 7606512, 8313831, 7067824, 5927009, 5981388, 5559924, 4145831, 4088586, 6295871, 8008403, 7324872, 6404587, 7455484, 8879852, 8477114, 7487746, 8075267, 9262794, 8882618, 7654784, 7875075, 9413081, 10180594, 9576547, 8713929, 8169023, 7981937, 8833484, 10740874, 11626961, 9739065, 6609889, 5109593, 5379989, 5289511, 4228272, 3652704, 4101562, 4393712, 4019045, 3944139, 4548295, 4759119, 3870833, 2634084, 1937202, 1667626, 1383254, 1082397, 896287, 813840, 954047, 1467184, 2113201, 2527458]
37550B527458K94262N30796O85944L67386k81639r29000j169447n20260P50677
37541B256177J275052L54686n53934J45873J361263P88403j189836j875340o34799
37532A927545J55333p03989j207161K23744J877302J563975N4201n66071k53051
37523C071828l60358q83048o93728J92323O65156M19112R2509j04768l90557m64529
37513A543940j8247K51284l83694j120702o45901N66681P25822m59547j190996
37504g31360k65838J201693J525681O82741j67803m81396n25566l22446M03118
37495A318824J281854J352400L57353p51398j018401o36720l97401m59495l63633
37486F83383k7956P0988k37302m79446k60880K49795P31970J033138R44997L57429
$$ y = [2527458, 2821720, 3352516, 4038460, 4405846, 4124207, 3195207, 2025760, 1505500, 2256177, 3531229, 3885915, 3331981, 3477854, 4839117, 5627520, 4437684, 2562344, 1927545, 2082878, 1378889, 171728, 395472, 2272774, 3836749, 3890950, 3324879, 3071828, 2711470, 1828422, 1134694, 1327017, 1992173, 2411285, 2503794, 2399026, 2008469, 1543940, 1525693, 1776977, 1393283, 272581, -373320, 193361, 919183, 459636, -731360, -997198, 204495, 1730176, 2412917, 2245114, 1763718, 1238152, 915706, 1318824, 2600678, 3953078, 4310431, 3559033, 2540632, 1903912, 1506511, 1047016, 683383, 655427, 726415, 489113, 9667, -251213, -1418, 730552, 1763690, 2708687, 3066116]
37476C066116j73708J47265J023851J113182k8266j026824n69047O77801J107808
37467E338178M70331j18024p1765J9691m00715j057296j364192j025065j25008
37458A666135P95480R59705K51066m13618k38463L46665M72450K10034K13586
37449D263040M08169J44197n31531q15248l26385N03246J136042J286110P87375
37440F855015j38984p56748o88854n37677q79672j196589p53610K2715J48656
37431B074252l92509q16001p65486l44467M74073J371188J390269L70099k76896
37422C084522L08177P00580m75418j750354r57849Q25202P19572j043332j342906
37413F8194M36367J193534n27969j857271m09173J630330J125613r47093j376015
$$ y = [3066116, 2892408, 3039673, 4063524, 5176706, 5148440, 4121616, 3552569, 4230370, 5338178, 5808509, 5690485, 5618720, 5638411, 5237696, 4180400, 2816208, 1791143, 1666135, 2461615, 3421320, 3672386, 3258768, 3020305, 3366970, 3839420, 4049454, 4263040, 4671209, 4815406, 4283875, 3468627, 3142242, 3645488, 4781530, 6067640, 6855015, 6716031, 5959283, 5270429, 4732752, 3853080, 2656491, 1902881, 1925596, 2074252, 1681743, 865742, 100256, -244211, 229862, 1601050, 2991319, 3361418, 3084522, 3392699, 4093279, 3617861, 1867507, 909658, 1734860, 2454432, 1411100, 68194, 504561, 1698095, 1170126, -687145, -1096318, 534012, 1659625, 712532, -663483]
37404f63483J46602J183715Q42180N86198J047115J013025p1619j027116r60963
37395B095654m93895l51572k54934J53192M84392L48699Q0775K09660P25892J138691
37385D136554R40306Q4481o92544m12018Q13922J523993O68716q96574j505161
37376D661675q01476J42623M56956K39979r4222l26074l50132k58685l70125o81426
37366B619093o62387r9034M37227N81606Q79378J642191J933563Q93014n93856
37357G630795r52316k16579K02517j88318m49523k1800M50269M19277K59279L58700
37347G492301M94399N63827R60622J753359K398312K802228L824934N955375P953129
37338C4198486P629273M182351m19082k692751q22170L225556N399363L766519
$$ y = [-663483, -516881, 666834, 1509014, 2095212, 3142327, 4155352, 4083733, 3056617, 2095654, 1601759, 1250187, 995253, 1148445, 1632837, 1981536, 2062311, 2271971, 2997863, 4136554, 5076860, 5161341, 4468797, 4056779, 4870701, 6394694, 7063410, 6166836, 4661675, 3860199, 4002822, 4459778, 4699757, 4605535, 4279461, 3929329, 3670644, 3300519, 2619093, 1956706, 1857672, 2294899, 2876505, 3755883, 5398074, 7331637, 8224651, 7630795, 6678479, 6461900, 6664417, 6476099, 6026576, 6004776, 6455045, 6874322, 7133601, 7492301, 7986700, 8550527, 9511149, 11264508, 13662820, 16465048, 20289982, 26245357, 34198486, 41827759, 46010110, 45591028, 42898277, 42076107, 45301663, 50701026, 54467545]
37330E4467545J94613k678404m727763p109891r043826q400727n348366k779745
37322A4573436k397931k628438j565385J6859K26624q74790j650573j448982r97544
37313C253276p23642l15779K18779M55721M61910O07439N66857k35612j159786
37304C129163p10579J218523K706811K215626P56896N99621K180551L411773K300878
37295A7809263n67736k827132l187527k558065k201305j884012p70212O10942
37287D424216P72106m22173j376650j120986n78810o72462o01861O12074J961461
37278B996915J622923k04597j463138j187331n30532n39882o27796l9157O01966
37269F29371L71000k82546j89970O91879J227352P46912j81254o82302n75411
$$ y = [54467545, 54662158, 51983754, 47255991, 40146100, 31102274, 22701547, 17353181, 14573436, 12175505, 9547067, 7981682, 7998541, 8225165, 7350375, 5699802, 4250820, 3253276, 2529634, 2213855, 2432634, 2888355, 3350265, 3957704, 4524561, 4288949, 3129163, 2418584, 3637107, 6343918, 8559544, 9316440, 9916061, 12096612, 15508385, 17809263, 17241527, 14414395, 11226868, 8668803, 6467498, 4583486, 3813274, 4424216, 5196322, 4774149, 3397499, 2276513, 1697703, 1025241, 423380, 1035454, 2996915, 4619838, 4415241, 2952103, 1764772, 1234240, 694358, 66562, 27405, 629371, 1000371, 717825, 527855, 1219734, 2447086, 3193998, 3012744, 2330442, 1755031]
37260A755031k60629o2598P4563L84956Q65782J108437P17066j08315p15339p85329
37250B973625n96490m16097j41121K31632L41536P0093r1442K15158N34354K51039
37240C372287l97478o09106j48370L96353M14982j21559p54172q58178j05702
37231A189057R78674J256551L10074q20406r02902j53753K39494o3096k78256
37222A755437M2811M56666O98466J132481J728038J709154Q54804J56810L93578
37213H928245Q91061O15685j75128l90617K19289Q36412P94674J75563o57789
37204A1237395j364611j591524j295152r53884r10548q33256m48640k87288p76652
37195B775840j101170k46566J074530J061760m64757j565714r50272K30698L12225
$$ y = [1755031, 1494402, 1431804, 1506367, 1891323, 2757105, 3865542, 4582608, 4474293, 3758954, 2973625, 2377135, 1961038, 1819917, 2051549, 2393085, 2463178, 2371736, 2586894, 3121248, 3372287, 2974809, 2365703, 2217333, 2613686, 3028668, 2907109, 2152937, 1294759, 1189057, 2167731, 3424282, 3734356, 2913950, 2011048, 1857295, 2096789, 2033693, 1755437, 1798248, 2254914, 2953380, 4085861, 5813899, 7523053, 8377857, 8534667, 8928245, 9819306, 10434991, 10259863, 9869246, 10088535, 10924947, 11719621, 11895184, 11237395, 9872784, 8281260, 6986108, 6032224, 5121676, 4288420, 3839780, 3552492, 2775840, 1674670, 1428104, 2502634, 3564394, 3099637, 1533923, 583651, 814349, 1126574]
37186A126574m06994m41640M21634R48156N06017q1269M5816N55068N92861M6073
37176C312296l96982k08553L41181N43879J11478m87678o67733n01280m69246
37167A577362n68668l33558J67346J89252m41263p94364k30823M64523K93763
37158C23570k60515K4049J038141J387136N16236n41442q16450n66825l22849
37149G81051N9227O66760Q44811J57393o74695p37471l07917l26094q39344r58497
37139a334776k61824O43614J050330R32976O31642L02329p1629m39253o55109
37130G98300o04563l55216j84104k46793k33240K18368P29889N00471l48229o42869
37120c67986P2739O33460N8565o99412k04291R80272J043041j04023o04116L06842
$$ y = [1126574, 719580, 277940, 699574, 1647730, 2153747, 2072478, 2118294, 2673362, 3266223, 3312296, 2915314, 2706761, 3047942, 3591821, 3703299, 3215621, 2547888, 2046608, 1577362, 1008694, 675136, 842482, 1031734, 590471, -203893, -434716, 29807, 323570, 63055, 87104, 1125245, 2512381, 3028617, 2487175, 1670725, 1103900, 781051, 840278, 1507038, 2351849, 2509242, 1834547, 1097076, 789159, 463065, -376279, -1334776, -1596600, -952986, 97344, 1030320, 1661962, 1964291, 1892662, 1453409, 798300, 193737, -161479, -345583, -592376, -825616, -607248, 122641, 623112, 274883, -367986, -295247, 338213, 396778, -302634, -506925, 473347, 1516388, 1412365, 808249, 1115091]
37110A115091J024089J88693j130060j138044N1313R01932P37444J67997k22062
37101A696393l43252r4534M83744P80076L21714l20852k75706K61990M16010J40333
37091C065916J79365N50455L05305q57694j784888j284123K75989J375434J066186
37082B891945j24644r26763p30978j48618q4598m61416m13937K34690N62800K7590
37072H26071n71470l65584J89910K09561n8922J90060P01649N10225l40029p91153
37062E00318m24352J31835L94546M16711R2880o31198r78180j96065R03280Q55645
37052A065420o8030k50352M07467K43519j010783j295104L50590J740444P65643
37043A948814j213967j441126R0962R86146K34720p29612o47780j8084K57265
$$ y = [1115091, 2139180, 2327873, 1197813, 59769, 111082, 1013014, 1750458, 1918455, 1696393, 1353141, 1258607, 1742351, 2522427, 2844141, 2523289, 2247583, 2509573, 2925583, 3065916, 3245281, 3795736, 4101041, 3243347, 1458459, 174336, 450325, 1825759, 2891945, 2767301, 1840538, 1109560, 960942, 876344, 414928, 991, 235681, 798481, 826071, 254601, -110983, 78927, 288488, 229566, 419626, 1121275, 1631500, 1291471, 500318, 75966, 207801, 602347, 1019058, 1111938, 480740, -497440, -693505, 209775, 1065420, 997390, 747038, 1154505, 1398024, 387241, -907863, -557273, 1183171, 1948814, 734847, -706279, -615317, 370829, 605549, -124063, -771843, -789927, -532662]
37034e32662J82812J30393J16428L8765q2777k29367k15667L44476J266922J492833
37024B512156M60068p34668o71763L03117O15130j45615p58644l57133M43208
37015A665856P08295L83878q8008n04683q27659r50235q43375n83403k14111J06721
37005a146724Q8260j30709J41779J070693J630000Q96158m81098j132984q76516
36996E8859n94498n45054j45359O27888R73463N83955Q4518n3174k2055M2335
36986A010878K97840N62280M01941j9151r3901J72783K12425l104O2073L97104
36976C001168L70699j63761o97292r75383j040920n50416O84083J639184J058737
36967C326099n36781j385608j025862n57953l41222M47879J573465J406489k39059
$$ y = [-532662, -349850, -219457, -103029, -64264, -147041, -376408, -592075, -247599, 1019323, 2512156, 2972224, 2237556, 1565793, 1868910, 2484040, 2338425, 1579781, 1222648, 1665856, 2374151, 2758029, 2670021, 2165338, 1337679, 387444, -455931, -1039334, -1253445, -1146724, -1058464, -1189173, -1047394, 23299, 1653299, 2549457, 2068359, 935375, 58859, -535639, -1080693, -1226052, -598164, 375299, 959254, 1043772, 990598, 968543, 1010878, 1308718, 1870998, 2272939, 2253788, 2159887, 2332670, 2545095, 2541991, 2604064, 3001168, 3371867, 3208106, 2510814, 1535431, 494511, -55905, 628178, 2267362, 3326099, 2789318, 1403710, 377848, -180105, -521327, -73448, 1500017, 2906506, 2667447]
36958B667447j181343j19683J224721Q43766n04504q96606l80712l53292q73424
36949D26370q12847p3952L81279L84763O23132J040646Q40099N193o31148p63512
36939A420023p47706n29042K04483R13574O33739m55354j136097q83628l31520
36930i11528R005L06602N84920M85770O9038j28110m244J2869j27952J8999N30687
36919H46056R49305R97879O89736j19578j359425k104530j427242J40081J121932
36910b65786J091391R44791J109252Q55259j91479j130952j063532l24019K17650
36901A242575L09060J78194o2765l05487k96756o5707j0660k42977l72770j81818
36891A90889P6251K21716L34241K76293j71831n78989k32548N47372N96542k05271
$$ y = [2667447, 1486104, 1366421, 2591142, 3434908, 2930404, 2033798, 1653086, 1299794, 426370, -386477, -460429, -79150, 305613, 928745, 1969391, 2809490, 2814683, 2183535, 1420023, 672317, 143275, 347758, 1261332, 1895071, 1439717, 303620, -580008, -911528, -902523, -595921, -11001, 474769, 543807, 415697, 411453, 424322, 296370, 315369, 846056, 1795361, 2793240, 3482976, 3363398, 2003973, -100557, -1527799, -1387718, -265786, 825605, 1770396, 2879648, 3734907, 3543428, 2412476, 1348944, 1024925, 1242575, 1551635, 1729829, 1667064, 1361577, 1064821, 999114, 988454, 745477, 372707, 190889, 267140, 488856, 823097, 1099390, 927559, 348570, 116022, 663394, 1259936, 1054665]
36881A054665n24191K61448Q40734M7376j026665n59957J084348J729600M94476
36872C401834j118246j474988p09783J69799Q60030J577439K067273J764167O97226
36863G234751m53053j121401j219772q57929k05711L38259K95852l52722j015662
36854B642612j075113n05932K04864N79683M25320j87144q87257j097761o10770
36845e11498l3214j20514o12860m39759O27428J337141O32507p16563j099058
36836i36390k37377P02799R23773P00115L01659m29532j110843p85861M74609
36827c97048J153497L79081o41326m21452N05843N47350l24931o31144Q5509N91258
36817H46637K05309Q241Q88894J756427J057799p36146j651947r39014J29332
$$ y = [1054665, 530474, 791922, 1632656, 1680032, 653367, 93410, 1177758, 2907358, 3401834, 2283588, 808600, 98817, 268616, 1128646, 2706085, 4773358, 6537525, 7234751, 6781698, 5660297, 4440525, 3582596, 3376885, 3715144, 4010996, 3658274, 2642612, 1567499, 1061567, 1266431, 1846114, 2271434, 2084290, 1197033, 99272, -511498, -544712, -665226, -1278086, -1717845, -1090417, 246724, 879231, 162668, -936390, -1173767, -470968, 452805, 1152920, 1454579, 1025047, -85796, -871657, -397048, 756449, 1135530, 494204, 72752, 578595, 1125945, 801014, 169870, 255379, 846637, 1051946, 1060187, 1949081, 3705508, 4763307, 4027161, 2375214, 1436200, 1565532]
36808A565532K87670j75254l81178k94493l60218m03612J14571R84114J281109
36799B618241N86232m84856j091908r86738m24224J96048M21481M93o94659r34502
36789g94392n55499j60630j65489k05818J32731N73880O67901N38243M96802L79230
36779I06959l3224l57207j87073L4890l41951r43056q20289J3085O28241P23043
36769c76582Q68575J090354O04890n85501j228596o89686j412j13529l29114K81755
36759d78846R99130N64449n44722p00892K93765R29242L62298n12290o90414l35816
36749a14096O4217N18726Q52159L94926p77412j293573k35965J263402J337204
36740B009588o4585j086566m54321R36511J302680K37267q93938p47870K91377
$$ y = [1565532, 1853202, 1677948, 1296770, 1002277, 642059, 238447, 353018, 1337132, 2618241, 3204473, 2719617, 1627709, 640971, 216747, 412795, 834276, 834769, 140110, -794392, -1349891, -1510521, -1676010, -1881828, -1749097, -1175217, -507316, 30927, 527729, 906959, 873735, 516528, 329455, 364345, 22394, -920662, -1740951, -1727866, -1099625, -376582, 491993, 1582347, 2187237, 1601736, 373140, -316546, -317958, -431487, -760601, -478846, 520284, 1084733, 540011, -160881, 132884, 1062126, 1424424, 912134, 221720, -114096, -49879, 468847, 1321006, 1715932, 938520, -355053, -591018, 672384, 2009588, 1945003, 858437, 404116, 1340627, 2643307, 2880574, 1986636, 1238766, 1530143]
36731A530143O55042k26876j045274m99533O30127N31814p59173j175978K31509
36722a28199J633965J046644p35002j430674o16183J03418j15922l65093L5765
36713e71281L86281Q2652k38428R2033N65385M36337P1j4501L18292L66499m7597
36702A375743o03040j012310j015948l86217M87248O75202M2533k54336N36038
36693a55087J367596Q61185n02238j067490m74948J23412J83070L95906R33862
36684A665268P62794n43457j704158j453101l17588L76875M54661O90516J203692
36675A135502J247509M69864n48444j045576p54714P6111P94160O60891l33756
36666A701547j139304p68158L60069Q80879K80572m89287l80385L95769P66640
$$ y = [1530143, 2185185, 1958309, 913035, 413502, 1043629, 1575443, 816270, -359708, -128199, 1505766, 2552410, 1817408, 386734, -229449, -126031, -241953, -607046, -571281, -185000, -102348, -340776, -248743, 316642, 752979, 753050, 738549, 1056841, 1423340, 1375743, 772703, -239607, -1255555, -1641772, -1154524, -479322, -436789, -691125, -155087, 1212509, 2073694, 1571456, 503966, 29018, 152430, 335500, 731406, 1665268, 2428062, 1884605, 180447, -1272654, -1590242, -1213367, -758706, -68190, 1135502, 2383011, 2852875, 2304431, 1258855, 504141, 580252, 1374412, 2035303, 1701547, 562243, -205915, 154154, 1035033, 1315605, 826318, 445933, 841702, 1608342]
36657A608342J91462p59544j141717o87934k5734J22547j94200l12217P8713N40589
36647e79693O19106M97612N37093N65743J84832m50146p56678n50139j81082J20135
36637F783M46561O87785M09793m50566j206750j112933k42318N84459O60169M9741
36627a67276n35925m78161Q3169M10415J13095k97189j31464M01323M14348l29880
36617e17545r37599n44836N01367J071948O17780l27319q80716o43068J73696
36608a486292J044818J421181J010360L0157q75318j140716p45400j56401J58853
36599g38758J36485R6517L73955R05217J139490N34222o66942j346709o58782
36590b25305P34077J163719n335j434796j477858k67624P08889P72550O29828
$$ y = [1608342, 1799804, 1040260, -101457, -789391, -815125, -692578, -886778, -1198995, -1120282, -579693, 39413, 537025, 1074118, 1639861, 1824693, 1374547, 617869, 67730, -113352, 6783, 453344, 1141129, 1550922, 1100356, -106394, -1219327, -1461645, -877186, -217017, -167276, -703201, -1181362, -1098193, -687778, -574683, -871872, -1003336, -602013, -187665, -517545, -1455144, -1999980, -1498613, -426665, 191115, -136204, -1016920, -1659988, -1486292, -441474, 979707, 1990067, 2020224, 1144906, 4190, -741210, -897611, -738758, -602273, -505756, -131801, 773416, 1912906, 2447128, 1780186, 433477, -225305, 508772, 1672491, 1667156, 232360, -1245498, -1513122, -804233, -31683, 598145]
36581E98145P65352N75676l26700j070734p26266K05605N12370j8976o06167q03812
36571h95507p71693m51702L67226J150304R23673k45953j054363o36298L83602
36562a230711R32737Q08873M49640P6974l05274n54446o06031o62344p08824l14000
36552b113406N69904J124508O75965k22006n18272k01129j95121p85510j110216
36543b775283m77243O19928J243918J164984P64724K66018l14211p00311n23251
36534g30727K3688K55022q1254l79723j6387O80533P99242J63447k73802K99992
36524G40031J281990J286429J6648j210584j147070k06489K45966k27552q13949
36515c4580q45558n42206k06047L13023Q76530P39562k44220r03006k60560Q49111
$$ y = [598145, 1363497, 1939173, 1612473, 541739, -184527, 21078, 533448, 514472, -91695, -895507, -1667200, -2118902, -1751676, -601372, 322301, 76348, -978015, -1614313, -1230711, -297974, 510899, 960539, 1037513, 732239, 177793, -428238, -1090582, -1799406, -2113406, -1543502, -418994, 256971, 34965, -483307, -684436, -879557, -1665067, -2775283, -3252526, -2632598, -1388680, -223696, 541028, 807046, 492835, -207476, -730727, -707039, -452017, -533271, -912994, -929381, -248848, 550394, 713841, 440039, 740031, 2022021, 3308450, 3325098, 2114514, 967444, 760955, 1006921, 779369, -34580, -880138, -1422344, -1628391, -1315368, -438838, 300724, 56504, -846502, -1107062, -257951]
36505b57951R23928J22764o5665O07273O67006n36600j526819r56457K80327N72251
36495a69943J18921K80408J089093J218337K57973o71830p61507m89209l93359
36486D78884k03047K41420L32842l05541r83360q24052M3619P19473N78268k39023
36476a60517j003800r24844O1879J006268R67190K07254l00900l14229l18147
36467g79846l17206J30246P12516N89808n5279j58948L25834K99686l87977n62084
36457b03250O509J2217q22518q29775O30249J572050O00913n03669J89354J195846
36447A847926Q8805k027079k035113L7108J086657M5481p39577K22640J351859
36438a21293J131728M13891K08677j21418r17261r48209K10500Q00336k54329
$$ y = [-257951, 665977, 788741, 723076, 1330349, 1997355, 1460755, -66064, -1022521, -742194, -169943, -51022, 229386, 1318479, 2536816, 2794789, 2122959, 1361452, 872243, 478884, 275837, 517257, 850099, 544558, -438802, -1262854, -1219235, -499762, 78506, -160517, -1164317, -2089161, -2027282, -1021014, -53824, 153430, -147470, -461699, -779846, -1097052, -966806, -254290, 335518, 280239, 121291, 447125, 746811, 358834, -203250, -196741, -184524, -1007042, -1836817, -1206568, 365482, 966395, 462726, 652080, 1847926, 1936731, -90348, -2125461, -2088353, -1001696, -956215, -1695792, -1473152, -121293, 1010435, 1424326, 1633003, 1511585, 594324, -353885, -143385, 656951, 402622]
36429D02622j216687l49792J074617R26377k63945n17325J23712Q1365o14725
36420c53781m64075N64239R14360L09374K01574J005343J265302K57669p52050
36411B947955p70888o25644j085078j209596p8872J214215J017421l09259r75666
36402A24588m25241K16750J91019K1575J81949K55309m5519j69798K30236M64767
36392A045635r2116p53207m46182M91169O40707l69012j230733q09259L69121
36383a153877J047744Q42918K21886m32404r08983q45539k05722K92055R2547
36374a049375k02203K81515J112575J010916j84529j172174r79743n5056O76906
36365e61168Q71746N94173K4520l31344j0325N37034L52936m72721p05955J36271
$$ y = [402622, -814065, -1163857, -89240, 837137, 573192, 55867, 179579, 260944, -353781, -817856, -253617, 660743, 970117, 1171691, 2177034, 3442336, 3700005, 2947955, 2177067, 1551423, 466345, -743251, -822123, 392092, 1409513, 1100254, 124588, -300653, -83903, 107116, 128691, 310640, 565949, 520430, 350632, 580868, 1045635, 953519, 200312, -245870, 245299, 886006, 516994, -713739, -1522998, -1153877, -106133, 736785, 958671, 526267, -382716, -1228255, -1433977, -1141922, -1049375, -1251578, -970063, 142512, 1153428, 968899, -203275, -1183018, -1238074, -561168, 310578, 904751, 929271, 597927, 587602, 1124636, 1477572, 1004851, 298896, 435167]
36355D35167Q93630M42015o83365j136446n04555N10362J036432N96816n95942
36346I94114j432974q06120P89312J494616N24758p07172o82283J46581M23400
36337G44232j0101l62632m21469m89899m20070R928L05585N4841j08136L91341
36327c06380P36735J7102q55048l88282P88298O15150j031304j886028o87019
36318b996776J034331J409403P01470K19060K35369K56788K43527K79237j33394
36309A249015j204628j924409j226399L03296J020881L70080n37211m87736M48866
36300a988245J209299R28184k07183j054319o52074N53422J068407K85551n50672
36291d07630J195J456174J918666N98216j188880j755180r53429P1443M08995
$$ y = [435167, 1328797, 1770812, 1087447, -48999, -553554, -43192, 993240, 1590056, 994114, -438860, -1244980, -455668, 1038948, 1563706, 856534, 174251, 320832, 744232, 734131, 371499, -49970, -539869, -959939, -950011, -644426, -589585, -697721, -306380, 430355, 447457, -407591, -795873, -7575, 607575, -423729, -2309757, -2996776, -1962445, -553042, 148428, 367488, 602857, 859645, 1103172, 1382409, 1249015, 44387, -1880022, -3106421, -2803125, -1782244, -1412164, -1949375, -2437111, -1988245, -778946, 149238, -57945, -1112264, -1764338, -1210916, -142509, 143042, -407630, -406435, 1049739, 2968405, 3566621, 2377741, 622561, -330868, -259425, 149570]
36282A49570Q2254m12194o44852m21614J02252M46318L04402L5063K65426R36678
36272H43303J209231N72294l77948o89514k69015J82581K45709J62332J73116
36263B052089J34640n4050k22585l37882o00298q86436o61935J85464R28062Q59072
36253A396141J89982l33672l86427k30888j98630l48932m54309j79079M32407
36244a13407O84056M3767p99560o34716L55053O06641l83420j061048k59772P78225
36234g84181L80749p31264o34995N14785P74997j69998m25024P44977J418896
36225A088942J43546j509010j293924K71485Q93154N6204n91517j79884K08466
36216i12538k63788o88354j10613O72772L97550m44473k75991R31849J380936
$$ y = [149570, 231824, -180370, -825222, -1246836, -1144584, -698266, -393864, -358801, -93375, 843303, 2052534, 2624828, 2246880, 1557366, 1288351, 1470932, 1716641, 1878973, 2052089, 2186729, 2132679, 1910094, 1572212, 971914, 85478, -576457, -390993, 537069, 1396141, 1586123, 1252451, 866024, 635136, 436506, 87574, -366735, -545814, -113407, 570649, 614416, -185144, -819860, -464807, 141834, -241586, -1302634, -1562406, -784181, -403432, -1134696, -1769691, -1254906, -479909, -649907, -1074931, -329954, 1088942, 1232488, -276522, -1570446, -1298961, -405807, -349603, -941120, -1121004, -912538, -1176326, -1864680, -1975293, -1302521, -904971, -1349444, -1625435, -693586, 687350]
36207F87350J83456j163836r93662Q4999L59700k26949k83614M16210N59481k21025
36197e97890n39305K80137Q70873J89674n76838j28820N19347j53507j201771
36188a338100o00147J126926J479826Q3346o64122M24933J434987N82355j029173
36179A500831j448570p74637k59657o686N62781J007321N15677l88005m95331
36170B13724J38691M30701J45747N5053L59095L85144n6002k88473n09K17471
36160A600642p9653m57306l16765K53638O73690N21529j66758r04797j045263
36151G8957m30320K89678L71586q3130l37370n1572L90590N35361L31590n7957
36141A037413m43050n50306k07292L28136N64000L59655K0125j96301l27490m27207
$$ y = [687350, 870806, -293030, -1286692, -1201693, -841993, -1068942, -1352556, -936346, -376865, -597890, -1137195, -857058, 13815, 203489, -373349, -502169, 17178, -136329, -1338100, -1938247, -811321, 668505, 751851, 87729, 512662, 1947649, 2530004, 1500831, 52261, -722376, -982033, -988719, -425938, 581383, 1097060, 709055, 213724, 352415, 783116, 928863, 983916, 1343011, 1728155, 1672153, 1383680, 1383171, 1600642, 1520989, 1063683, 746918, 1000556, 1674246, 2195775, 2029017, 1124220, 78957, -351363, -61685, 309901, 226771, -110599, -162171, 228419, 763780, 1095370, 1037413, 594363, 44057, -163235, 164901, 728901, 1088556, 1108681, 912380, 584890, 157683]
36131A57683l78813j15696K13797M33555N36559N85197N10641J41897n03496j000335
36121E80989q08457J6133O11667K28655p24288j090383m69245L28263N52145N17433
36111b57088Q23857J204807R48608J34298m04538k91171j7294n1314k34604l10787
36101A544774m38494p56855q85183l90890M55304R15388P25339L04128k6897m62366
36091I84248j071117j309944p75141m8373J3312l53069j34180P22837J043012
36082i28415L00138m33345j86258L95032L32826P5031M84884R14121J56544j112763
36072b205r62993O75795J671926R50575k1688J03020M57543j05042p71860k78324
36062A716747O60769M44050p11396j170950n56838o5229k05878j08750O30218
$$ y = [157683, -221130, -336826, -123029, 310526, 847085, 1432282, 1942923, 2084820, 1581324, 580989, -227468, -211335, 400332, 628987, -95301, -1185684, -1654929, -1326666, -774521, -257088, 566769, 1771576, 2720184, 2854482, 2449944, 2158773, 2141479, 2090165, 1855561, 1544774, 1106280, 349425, -535758, -926648, -471344, 444044, 1169383, 1473511, 1446614, 984248, -86869, -1396813, -2171954, -2220327, -2207015, -2560084, -2694264, -1971427, -928415, -628277, -1061622, -1247880, -852848, -520022, -444991, 39893, 954014, 1110558, -2205, -965198, -289403, 1382523, 2333098, 2311410, 2414430, 2871973, 2766931, 1995071, 1716747, 2377516, 2821566, 2110170, 939220, 382382, 317153, 111275, 2525, 632743]
36053F32743J084890N80356j73615k38343K58286O69335Q68060J025888R40425
36044E648025L13524n90254j129730j026758n89003k88004l22433n24186n90910
36035I00271m54926l72961n36721p30989n97153j16402M05335O94626O06973P4762
36025a27185o86131j088526p23453O7383N58925N27322L60764L25821K28872m6976
36015f03184j49620K13286O21840L47472n42915j020786m32827M04657K08600
36006i53477p86446r11386M78837J766440J246188l77968j025420j82307P63126
35997A7587Q64060N87893L90637N2355k50998Q2393N87799j1010j435949j669497
35987g84730p7436J252397O05634q14974j074899m55925k51717k17513M68584
$$ y = [632743, 1717633, 2297989, 2124374, 1886031, 2144317, 2813652, 3681712, 4707600, 5648025, 5961549, 5371295, 4241565, 3214807, 2625804, 2337800, 2015367, 1491181, 900271, 445345, 72384, -464337, -1195326, -1792479, -1908881, -1503546, -808920, -201947, -127185, -813316, -1901842, -2625295, -2557912, -1998987, -1471665, -1110901, -785080, -556208, -603184, -752804, -539518, 82322, 429794, -113121, -1133907, -1566734, -1162077, -953477, -1739923, -2651309, -2172472, -406032, 840156, 462188, -563232, -745539, 17587, 881647, 1469540, 1860177, 1912532, 1661534, 1743927, 2331726, 2320716, 884767, -784730, -862166, 390231, 995865, 180891, -894008, -1349933, -1601650, -1819163, -1350579]
35978a350579R88661J76282r08652l61977J217927J511872L00794l37678K85211
35969A521861M87513n27530j193697l90552O47295N13357k20153l46520P4515
35960E66089L70434M47300K99088l71959j160606r46913K76198J005502N10146
35951I95279o7230J35732J87970o83889j327204n29594P51203Q88182K16426K13146
35941G80021Q45415P40695l83658j292862j148471l56920M40111R48738Q86386
35932A459455K09575m25036m05953j18557k11632l67305O3557O40398L70627n72579
35922F42550r87360m24522L61324O97152O15323K51256l02384o00640l31105n5266
35912a33672m22539q98654m94971M74187P77470L05048J64466O35232O69671j69414
$$ y = [-1350579, -361918, -185636, -1094288, -1456265, -238338, 1273534, 1574328, 1236650, 1521861, 2009374, 1481844, 288147, -102405, 544890, 1058247, 838094, 491574, 566089, 936523, 1383823, 1682911, 1310952, 150346, -796567, -520369, 485133, 995279, 928049, 1063781, 1251751, 567862, -759342, -1288936, -537733, 350449, 566875, 780021, 1625436, 2366131, 1982473, 689611, -458860, -815780, -375669, 573069, 1459455, 1669030, 1243994, 838041, 719484, 507852, 140547, 204104, 844502, 1215129, 642550, -344810, -769332, -408008, 289144, 904467, 1155723, 853339, 252699, -78406, -133672, -556211, -1454865, -1949836, -1475649, -698179, -393131, -228665, 406567, 1076238, 906824]
35902I06824q50759n94921m8728J8992o6503J78482L72142J01828j77865N767
35892a54741K53911J35753O5145L89707M33122m31230j401085j176588Q5233R26151
35882h74622N96068j11611j27577N58638J039540N82387m81869r13633K7804J311574
35872A606699J102050o80060j869977r19246Q75344J251718J67836n25762m6094
35863I62508N45675M39136Q6251j87768q17187j590796j239491N56075K044505
35854G98908J525071k94594j295053p25851J99706K33222m30482o84993R5128
35845e78938J311476J644593N19696r56724j157266q9643N74686p2615r35964
35836B59301p97028j72383j65739n50792m17022J00676K89133M02709J053416
$$ y = [906824, 56065, -538856, -587584, -568592, -635095, -456613, -84471, 17357, -160508, -154741, 99170, 234923, 300068, 689775, 1122897, 691667, -709418, -1886006, -1800773, -874622, -278554, -390165, -517742, 40896, 1080436, 1662823, 1180954, 267321, 295125, 1606699, 2708749, 2028689, 158712, -760534, 114810, 1366528, 1534364, 1008602, 962508, 1508183, 1947319, 2033570, 1845802, 1028615, -562181, -1801672, -1245597, 798908, 2323979, 2029385, 734332, 8481, 208187, 441409, 10927, -674066, -578938, 732538, 2377131, 2896827, 1940103, 782837, 693194, 1267880, 1195265, 259301, -537727, -710110, -875849, -1426641, -1843663, -1742987, -1453854, -1051145, 2271]
35827B271J529243N95933j181287j834624q43651K64822M58127M42833Q20260
35818B53927Q85679J63635n15872n02515m03918o35723l98337O56322J198463
35809G01661K02100j079424q67409L49009O50432k70704q30095j60394P57367
35800e47457P93228J22694l79135k40279L67060Q30937N30842m06178j018674
35791E3038o98598M521L46152M35538N45984K75900m96310p16942L60229J531409
35781A640921J099928n54240j537748j158228l37406L13436R12289J030709Q9775
35772A499436r63411n50689P61822O92398j067137k048183q53883O04365K31451
35763a693831r97547q79365M93647J249705Q30061M03045N54349M92455k93008
$$ y = [2271, 1531514, 2127447, 946160, -888464, -1732115, -1467293, -1009166, -566333, 253927, 1139606, 1303241, 787369, 284854, -119064, -754787, -1153124, -496802, 701661, 903761, -175663, -1043072, -694063, -43631, -314335, -1144430, -1304824, -547457, 245771, 368465, -10670, -250949, 116111, 947048, 1477890, 1071712, 53038, -645560, -641039, -294887, 140651, 686635, 962535, 466225, -250717, 109512, 1640921, 2740849, 2186609, 648861, -509367, -846773, -533337, 378952, 1409661, 1499436, 536025, -14664, 747158, 1439556, 372419, -1675764, -2529647, -1925282, -1693831, -2691378, -3570743, -3077096, -1827391, -997330, -594285, -39936, 452519, 159511]
35754A59511j035318p87241L23350J289037J292677M60854l36871n22775m76436
35745C66788p37710q96180k24821P80444Q25499j07263o05078j29326J46024m80457
35735a062080q54316J00071J450077J616507O31864k71337n05593l67263j48137
35726E89793o4529l91790q15058m94025M51531O61732l22585r81369j26017J076173
35716d16144R61219J1728k03288K76963J99738m98579p31874l14953o2018r0315
35706h67523J81228N53698L25555j23333K10713R99714Q65515l10236j064382
35697G70949n72519L22335N69407R8388o20878j053303o54983M29539R85957K62681
35687E37573o09207k24476O76584L21812j007588j287763p8298Q62871N87185
$$ y = [159511, -875807, -1663048, -1339698, -50661, 1242016, 1702870, 1365999, 843224, 366788, -370922, -1267102, -1491923, -711479, 114020, 6757, -598321, -727647, -581623, -1062080, -1916396, -1816325, -366248, 1250259, 1882123, 1610786, 1105193, 737930, 589793, 525264, 133474, -681584, -1175609, -724078, -62346, -384931, -1366300, -1492317, -416144, 545075, 556803, 353515, 630478, 830216, 331637, -400237, -715190, -777208, -867523, -686295, -132597, 192958, 69625, 280338, 1280052, 2145567, 1835331, 770949, 198430, 520765, 1090172, 1188560, 567682, -485621, -1140604, -711065, 274892, 537573, -71634, -296110, 380474, 702286, -305302, -1593065, -1671363, -808492, -221307]
35678b21307J99140M87324O04574J4053l35885J40473M97215N6889l18146R6166
35668A220496N15222J41241m14669l86737j96040l92777n28802k01419Q968k78578
35658e13095l65453J64530M95815R1317k15061J50543K12229p62439j552244p94286
35648c088144O24762Q83431J07674l3412Q30377J255997L45121r36053j117512
35639a127759M0443J372391J413608j05436j630598j350763L43084J158105J96659
35630C09734o59277K18708J490583R80405q08681j546197o70743J76278L8586
35621d70604k37922O5441M02434J92570k64937n06093m26398L9069P22581Q22832
35611C38973j24327j056779n36546R92422J581266N22700p59814q81396j79950
$$ y = [-221307, -22167, 465157, 1069731, 1083784, 747899, 888372, 1385587, 1442476, 1124330, 1220496, 1735718, 1876959, 1462290, 1075553, 879513, 486736, -42066, -243485, -234517, -513095, -878548, -714018, -218203, -126886, -341947, -191404, 20825, -741614, -2293858, -3088144, -2463382, -1579951, -1472277, -1505689, -675312, 580685, 925806, -10247, -1127759, -1087316, 285075, 1698683, 1593247, -37351, -1388114, -1045030, 113075, 309734, -349543, -130835, 1359748, 2340153, 1531472, -14725, -685468, -509190, -470604, -708526, -643085, -240651, -48081, -313018, -819111, -1245509, -1206440, -483859, 338973, 214646, -842133, -1378679, -386257, 1195009, 1717709, 957895, 76499, -103451]
35602a03451K53252O7635l78693o75295n43080j2949L92316K50568p6276m7907
35592h73880Q3497j61305l72975P4542O11089K10443o85371o60766K84580O69331
35582h20815O6073k29866M09017Q24359K05799m76475l00455O473l47051n21080
35572a184021M24084J474511R95182n85857j263252l61406O87465N26087n21296
35563A91497j247469r35651K60890J475241J564813K04149j366886j504283k15902
35554a573601P89903L91593n03111m17068N15579Q29395j5055p58227j61489J122690
35544B20609J388722K48289q86868q05915O0869O75326Q60565Q80476M01217q71647
35534B171643j976712j554410O9836J002919L07570p71713o57471M65577J162099
$$ y = [-103451, 149801, 217436, -161257, -836552, -1379632, -1392581, -1000265, -749697, -825973, -873880, -790383, -951688, -1324663, -1250121, -639032, -428589, -1113960, -1774726, -1490146, -820815, -754742, -984608, -575591, 248768, 454567, -21908, -322363, -315890, -662941, -1184021, -759937, 714574, 1709756, 1123899, -139353, -500759, 186706, 712793, 191497, -1055972, -1991623, -1730733, -255492, 1309321, 1513470, 146584, -1357699, -1573601, -783698, -392105, -895216, -1312284, -796705, 32690, 17635, -740592, -902081, 220609, 1609331, 1857620, 970752, 164837, 225706, 901032, 1761597, 2642073, 3043290, 2171643, 194931, -1359479, -1289643, -286724, 20846, -750867, -1408338, -942761, 219338]
35525B19338P23681j50348m23258Q5106O22771M62641j67662l93447j5781J10073
35515A073114n08223r90407m07222O01526P90022L11947K29499M49554O733p53495
35505H03048m21242P91215Q92738o36363j710632r08640L05296K01774l92001
35496a074807P2089Q89007M14666p63897n98551R55504J736845O65384r35400
35487A360840j568196j212724l68616P86901J703406J461327K16920n74010r5570
35478A710278O84013M94589m95623j148621r03012j73916L55509L18685j55286
35469F86616n07993k59150L69940O26749J24696p09813j118647p01686K63476
35460a225812R24854N33907o07937j213281n05080P22626J143453O09727O5108
$$ y = [219338, 943019, 792671, 369413, 454519, 1077290, 1539931, 1372269, 978822, 963041, 1073114, 564891, -425516, -832738, -231212, 558810, 870757, 1100256, 1549810, 1556543, 803048, 381806, 1173021, 2065759, 1429396, -281236, -1189876, -884580, -682806, -1074807, -1002718, -113711, 300955, -462942, -1061493, -105989, 1630856, 2296240, 1360840, -207356, -1420080, -1788696, -1001795, 701611, 2162938, 2379858, 1805848, 1710278, 2394291, 2888880, 2393257, 1244636, 341624, 167708, 523217, 841902, 686616, 178623, -80527, 289413, 916162, 1040858, 331045, -787602, -1489288, -1225812, -300958, 232949, -374988, -1588269, -2093349, -1370723, -227270, 382457, 447565]
35451D47565N3396J96049N2084l14596o48734p68535n65183k08540j10500k41251
35441b108245J8805P73607J083455L87648l65382j60040L51349M2023n43714j43444
35431f63938O74720K28353j118983j100895O46343J567124J64633j429233o91534
35422a723410J398247J958341M72102r15302q18829j01192R0624j21205k06512
35413C2864k24259l31789k42424K23778O24927M16327l15632r32910r13457l17279
35403a979854L48549P04882Q50408R65422P85598L01r15531j039386l24039K47874
35393c55776J54029P3875N70858R28244K28244r90886j238796r6321J169155J164743
35383A607369k9033j057209q28704L42921J173786R22182J51023k26933j57026
$$ y = [447565, 500961, 697010, 749094, 434498, -214236, -982771, -1547954, -1756494, -1866994, -2108245, -2089440, -1315833, -232378, 155270, -210112, -370152, -18803, 23220, -520494, -663938, 10782, 239135, -879848, -1980743, -1334400, 232724, 397357, -1031876, -1723410, -325163, 1633178, 2105280, 1189978, 371149, 269957, 360581, 239376, 32864, -191395, -523184, -765608, -541830, 83097, 499424, 183792, -749118, -1662575, -1979854, -1631305, -926423, -76015, 889407, 1675005, 1675306, 759775, -279611, -603650, -355776, -201747, -127872, 442986, 1371230, 1599474, 608588, -630208, -726529, 442626, 1607369, 1578336, 521127, -307577, 35344, 1209130, 2131312, 2282335, 2055402, 1898376]
35374A898376j07724n0231K66245M00876j98004r20656p21836j9725j90729j067940
35364g11348r32821N05340J293228L77837n91884n4631Q88494N57858l89720l19117
35354F23236M77697N52497o0185k81472k03363n47857p02742K45536J192246L93289
35344A688882j292647j393885J18368P93878r0667m82850N65363J142379m6032
35335A002789j277438p00617O85116R23452J56737j96263P7709J83564m5059k66542
35325E43448m96999o51263k37765M94423M11660m84364m99763J017643K154849
35316B251869J287139k81281n16854J15264n5933p74695o53390p3177m71200j358108
35306e30366r42074N11692Q44838l39641j019640k27694N44054K25084j22315
$$ y = [1898376, 1790652, 1740421, 2006666, 2407542, 2209538, 1288882, 567046, 547321, 356592, -711348, -1644169, -1138829, 154399, 532236, -59648, -114279, 774215, 1332073, 942353, 623236, 1100933, 1653430, 1593245, 1311773, 1108410, 560553, -142189, 103347, 1295593, 1688882, 396235, -997650, -879282, -85404, -176071, -658921, -93558, 1048821, 1002789, -274649, -975266, -290150, 633302, 790039, 593776, 671485, 855049, 809990, 543448, 46449, -604814, -842579, -348156, 63504, -420860, -920623, 97020, 2251869, 3539008, 3257727, 2740873, 2856137, 2800204, 2025509, 1372119, 1298942, 827742, -530366, -1472440, -960748, -115910, -455551, -1475191, -1702885, -1158831, -933747, -1056062]
35297a056062L72537O79972p0821q10405m07391L35521K39768j01128M75532J423095
35287A080618J265164J4920q89246p54834k89537k14285m24983n26647l07226
35278a046056K54870Q06267P32122P2934j74200N52467J257581O76103p57819
35269B374269j415478p70492R385j24043p57405q33856m9900R53753J348340Q45828
35259A580401l4275m30812j36296J23769k16094o55313m88147p2207k18457o41535
35249a188966l04002P13929J099242L75638l28317j94199J5721m25426o68237
35240i04617K02203J172263O57845p23232q18663O34211J411549K31085j261874
35231F00770j126660j0278K88666j59871P0879R20867Q06517n50817j425632p87318
$$ y = [-1056062, -683525, -3553, -74374, -884779, -1292170, -956649, -716881, -818009, -342477, 1080618, 2345782, 2360702, 1471456, 716622, 427085, 212800, -212183, -738830, -1046056, -791186, 15081, 747203, 820137, 645937, 1198404, 2455985, 3132088, 2374269, 958791, 188299, 197684, 73641, -683764, -1517620, -1567520, -613767, 734573, 1580401, 1546126, 1115314, 979018, 1102787, 886693, 231380, -256767, -328974, -547431, -1188966, -1492968, -779039, 320203, 695841, 367524, 173325, 189046, -236380, -904617, -702414, 469849, 1127694, 404462, -414201, 220010, 1631559, 1862644, 600770, -525890, -536168, -247502, -407373, -336494, 584373, 1390890, 840073, -585559, -1372877]
35221a372877J91713K39245p5531K43864O67969K03718n58979k62917Q15132R81963
35211A073300k28860j257292p68608N98739J330786R04164o5004p93074q52711
35202e8560k77137L41043K73854m30754q67040m18983M49166Q79309O55604J82480
35192G28982j71590k85522j36434J53251K96050J63724k0728j0951J37096K28016
35182A081894J97611P9810p6548j60071j07897j07203l69104o63544m86486J86816
35172d24722P16220N45399j87121r10612j164678p99640l2650N67159N19498j1430
35162a182577m03864l25432O2105N32477R06810Q42456J77305n43754o11530k08515
35152g54519j03226l04556m6193P51321J173367Q26048M55728N04586K82122o16722
$$ y = [-1372877, -1181164, -941919, -1017450, -773586, -105617, 98101, -460878, -723795, 91337, 1073300, 844440, -412852, -1181460, -582721, 748065, 1652229, 1587225, 794151, -58560, -335697, 5346, 279200, -151554, -1018594, -1437577, -988411, -109102, 546502, 728982, 557392, 271870, 135436, 288687, 584737, 748461, 727733, 716782, 853878, 1081894, 1279505, 1359315, 1282767, 1122696, 1014799, 907596, 538492, -125052, -611538, -424722, 291498, 836897, 649776, -260836, -1425514, -2225154, -2257804, -1690645, -1171147, -1182577, -1586441, -1911873, -1849768, -1317291, -410481, 431975, 609280, 65526, -546004, -754519, -857745, -1162301, -1208494, -457173, 716194, 1542242, 1997970, 2502556, 2784678, 2167956]
35142B167956j237249o82280L26298M64942l07316r75156r77574m68953L28466
35133a360866J013616Q58819j89503r88811p16725j59927l13406n68247J76093
35124b248957J329060J339555J74680p62276r14574q85707o48156M71332J870851
35115b74192J863816K94496r70136p85703j27942o2435k02750q5714k41022p82168
35105a373750o54484M69918J182542N67298j89946N2434K99335o10601j456649
35096a713903m67482J316746J214408q82620k107229p78537J326552J696943L28514
35087f6608q28782n31348O59612J362481P93769n32295j313616q91647L2538M84109
35077h31787M73742M55297K06957n81819j125398m16091R16128J166909N0263
$$ y = [2167956, 930707, 248427, 574725, 1039667, 732351, -242805, -1220379, -1689332, -1360866, -347250, 511569, 322066, -666745, -1383470, -1543397, -1856803, -2425050, -2248957, -919897, 419658, 594338, -167938, -1082512, -1968219, -2616375, -2145043, -274192, 1589624, 1884120, 913984, 128281, 339, -62096, -264846, -350560, -591582, -1373750, -2028234, -1558316, -375774, 191524, 1578, 54012, 353347, -257254, -1713903, -2181385, -864639, 349769, -532851, -2640080, -3418617, -2092065, -395122, -66608, -895390, -1426738, -767126, 595355, 1389124, 856829, -456787, -1348434, -1315896, -831787, -358045, 97252, 304209, -277610, -1403008, -1819099, -902971, 263938, 314201]
35068C14201q94499o48391L1174J65736l7406N813K30892L98124N79481N94026
35058G39151k6451r76657j180996m31951J48264o5467k11716L66982Q22853L80467
35048d35521o7537N39739J366918Q72744o08463j304104o82162R5905K91041L66225
35038D34785N03529J22670o34596n82034N62474J306250M58996j026273j395817
35029b50016m58154N22867P16919L88452K0558j60613N7274O45424R29655K93434
35019B705800p34650j002441m19893j29189o78974j057068k45130J074894J372832
35010H86181M10332n47151n87219j66790l3420j06759o397N1651l19834p85854
35000a205260o57697N597M39058L19375J55443L93768P77583Q54921N98940K26106
$$ y = [314201, -580298, -1228689, -1197515, -1031779, -1069185, -1063372, -832480, -434356, 145125, 739151, 712700, -263957, -1444953, -1876904, -1728640, -1794107, -2005823, -1638841, -815988, -435521, -503058, 36681, 1403599, 2276343, 1667880, 363776, -318386, -222481, 68560, 434785, 938314, 1060984, 426388, -155646, 406828, 1713078, 2172074, 1145801, -250016, -708170, -185303, 531616, 920068, 940626, 780013, 837287, 1482711, 2412366, 2705800, 1971150, 968709, 548816, 419627, -259347, -1316415, -1561545, -486651, 886181, 1296513, 749362, 162143, -4647, -38067, -144826, -151223, -99572, -419406, -1205260, -1862957, -1857360, -1418302, -1098927, -943484, -549716, 227867, 1082788, 1681728, 1907834]
34990A907834j69333n08332o35363n88247n72820m63085J37909J004394J108895
34981A221852r466j218576j049937K44699R24605J69570p81309m58581O88822
34972b68321R44493j67219j118786m83099J018513J414396J58586j105230q05863
34963d12530L96729O14452n34903j414692p82481M71175P69588J74380Q6389R47200
34953C15307J528586P87745o13825j292218r68158n07819m55565l96644J19277
34944a483314P52987R03523O21033M20481L49643j12110j078624j764722j398053
34935b789156k68470O30804P98179N47044K96315J42824J03139J53014j7327o33961
34925a037595j152247p20741M47380J038191M10884m61814m66654Q4815K46964
$$ y = [1907834, 1738501, 1230169, 594806, 6559, -566261, -1029346, -891437, 112957, 1221852, 1212386, -6190, -1056127, -811428, 113177, 282747, -498562, -957143, -268321, 676172, 508953, -609833, -1092932, -74419, 1339977, 1498563, 393333, -412530, -15801, 598651, 63748, -1350944, -2133425, -1662250, -892662, -718282, -631893, 315307, 1843893, 2631638, 2017813, 725595, -242563, -750382, -1205947, -1602591, -1483314, -730327, 173196, 794229, 1214710, 1564353, 1452243, 373619, -1391103, -2789156, -3057626, -2426822, -1628643, -1081599, -785284, -642460, -539321, -386307, -403634, -1037595, -2189842, -2910583, -2463203, -1425012, -1014128, -1475942, -1942596, -1857781, -1610817]
34916a610817M6837J51236M34446J95807l87670l79753K55149M32323k52893p35672
34906a851007j27890Q69648J029339L29358k60417k38571M2408J80317J32547
34897A05732q0085m27035o26451l72058J63369M77180M26214L70420N38953O28903
34887A205142K67972l51110o26848l53685p4827l74090r61417r11060P0782J094861
34877a014280J162395L93052l08040m55330k19492K37094Q19175J012271K99068
$$ y = [-1610817, -1563980, -1412744, -978298, -782491, -1170161, -1549914, -1294765, -862442, -1115335, -1851007, -1978897, -1109249, -79910, 249448, -10969, -249540, -207132, -26815, 105732, 25647, -401388, -1027839, -1399897, -1236528, -759348, -333134, 37286, 576239, 1205142, 1473114, 1122004, 495156, 141471, 66644, -307446, -1268863, -2179923, -2109141, -1014280, 148115, 541167, 233127, -222203, -441695, -204601, 614574, 1626845, 1925913]
$$ [...]
##END NTUPLES=NMR SPECTRUM
##END=
