##TITLE=31Pdec_2PBDP-1
 CDCl3, 24 sc
 13.4.2023
##JCAMPDX= 6.0         $$ Bruker NMR JCAMP-DX V2.0
##DATA TYPE= NMR SPECTRUM
##DATA CLASS= NTUPLES
##ORIGIN= UXNMR, Bruker Analytische Messtechnik GmbH
##OWNER= root
$$ XWIN-NMR		Version 3.5
$$ Thu Apr 13 14:11:52 2023 Russian Standard Time (UT+4h)  she@DPX200
##.OBSERVE FREQUENCY= 81.013821
##.OBSERVE NUCLEUS= ^31P
##.ACQUISITION MODE= SIMULTANEOUS
##.ACQUISITION SCHEME= undefined
##.AVERAGES= 24
##.DIGITISER RES= 16
##SPECTROMETER/DATA SYSTEM= spect
##.PULSE SEQUENCE= zgpg30
##.SOLVENT NAME= CDCl3
##.SHIFT REFERENCE= (INTERNAL, CDCl3, 0, 248.564)
##AUDIT TRAIL= $$ (NUMBER, WHEN, WHO, WHERE, WHAT)
$$ ##TITLE= Audit trail, XWIN-NMR		Version 3.5
$$ ##JCAMPDX= 5.01
$$ ##ORIGIN= Bruker BioSpin GmbH
$$ ##OWNER= she
$$ F:/spectra/data/she/nmr/P31/1/pdata/1/auditp.txt
$$ ##AUDIT TRAIL=  $$ (NUMBER, WHEN, WHO, WHERE, WHAT)
(   1,<2023-04-13 14:09:52.93 +0400>,<she>,<DPX200>,
      <created by zg, POWCHK disabled, PULCHK disabled
       configuration hash MD5:
       00 E9 B6 7A A2 85 ED C7 34 08 36 98 17 FE 4E 26
       data hash MD5: 32K
       1B 96 A9 50 07 FB 12 BD 6C 2A 6F D4 85 84 6D 16>)
(   2,<2023-04-13 14:10:05.81 +0400>,<she>,<DPX200>,
      <Start of raw data processing
       efp BC_mod = 2 LB = 1 FT_mod = 6 PKNL = 1 PHC0 = -10978.52 PHC1 = 75.48538 SI = 64K 
       data hash MD5: 64K
       03 DA B0 E3 8D 40 7C 46 A0 53 5A 97 54 FA D0 75>)
(   3,<2023-04-13 14:10:20.43 +0400>,<she>,<DPX200>,
      <pk PHC0 = 3.930838 PHC1 = 0 
       data hash MD5: 64K
       7A CA 2D 6A 99 95 EB 15 7D 50 4A 96 A4 ED F1 07>)
$$ ##END=
$$ 
$$ hash MD5
$$ 11 8B 59 FD 5D 8C D2 33 5C EA 18 5B 53 74 BB 37
##$RELAX= 
##$RELAX= 
##$RELAX= 
##$RELAX= 
##$RELAX= 
##$RELAX= 
##$RELAX= 
##$RELAX= 
##$RELAX= 
$$ Bruker specific parameters
$$ --------------------------
##$DU= <F:/spectra>
##$EXPNO= 1
##$NAME= <P31>
##$PROCNO= 1
##$TYPE= <nmr>
##$USER= <she>
##$AMP= (0..31)
100 100 100 100 100 100 100 100 100 100 100 100 100 100 100 100 100 100 
100 100 100 100 100 100 100 100 100 100 100 100 100 100 
##$AQSEQ= 0
##$AQ_mod= 1
##$AUNM= <au_zg>
##$AUTOPOS= <>
##$BF1= 81.014009
##$BF2= 200.13
##$BF3= 200.13
##$BF4= 200.13
##$BF5= 200.13
##$BF6= 200.13
##$BF7= 200.13
##$BF8= 200.13
##$BYTORDA= 1
##$CFDGTYP= 0
##$CFRGTYP= 5
##$CHEMSTR= <none>
##$CNST= (0..31)
1 1 145 1 1 1 1 1 1 1 1 1 1 1 1 1 1 1 1 1 1 1 1 1 1 1 1 1 1 1 1 1 
##$CPDPRG= <waltz16>
##$CPDPRG1= <>
##$CPDPRG2= <waltz16>
##$CPDPRG3= <>
##$CPDPRG4= <mlev>
##$CPDPRG5= <mlev>
##$CPDPRG6= <mlev>
##$CPDPRG7= <mlev>
##$CPDPRG8= <mlev>
##$CPDPRGB= <>
##$CPDPRGT= <>
##$D= (0..31)
0 1 0 0 0 0 0 0 0 0 0 0.03 2e-05 3e-06 0 0 0 0 0 0 0 0 0 0 0 0 0 0 0 0 
0 0 
##$DATE= 1681380592
##$DBL= (0..7)
120 120 120 11 120 120 24 19 
##$DBP= (0..7)
150 150 150 150 150 150 150 150 
##$DBP07= 0
##$DBPNAM0= <>
##$DBPNAM1= <>
##$DBPNAM2= <>
##$DBPNAM3= <>
##$DBPNAM4= <>
##$DBPNAM5= <>
##$DBPNAM6= <>
##$DBPNAM7= <>
##$DBPOAL= (0..7)
0.5 0.5 0.5 0.5 0.5 0.5 0.5 0.5 
##$DBPOFFS= (0..7)
$$ [...]
##$SUBNAM2= <"">
##$SUBNAM3= <"">
##$SUBNAM4= <"">
##$SUBNAM5= <"">
##$SUBNAM6= <"">
##$SUBNAM7= <"">
##$SUBNAM8= <"">
##$SUBNAM9= <"">
##$SW= 501.771253377433
##$SWIBOX= (0..15)
0 1 3 0 0 0 0 0 0 0 0 0 0 0 0 0 
##$SW_h= 40650.406504065
##$TD= 32768
##$TD0= 1
##$TE= 0
##$TE2= 300
##$TE3= 300
##$TEG= 300
##$TL= (0..7)
0 120 53 12 22 120 120 120 
##$TP= (0..7)
150 150 150 150 150 150 150 150 
##$TP07= 0
##$TPNAME0= <>
##$TPNAME1= <>
##$TPNAME2= <>
##$TPNAME3= <>
##$TPNAME4= <>
##$TPNAME5= <>
##$TPNAME6= <>
##$TPNAME7= <>
##$TPOAL= (0..7)
0.5 0.5 0.5 0.5 0.5 0.5 0.5 0.5 
##$TPOFFS= (0..7)
0 0 0 0 0 0 0 0 
##$TUNHIN= 0
##$TUNHOUT= 0
##$TUNXOUT= 0
##$USERA1= <user>
##$USERA2= <user>
##$USERA3= <user>
##$USERA4= <user>
##$USERA5= <user>
##$V9= 5
##$VALIST= <valist>
##$VCLIST= <CCCCCCCCCCCCCCC>
##$VD= 0
##$VDLIST= <DDDDDDDDDDDDDDD>
##$VPLIST= <PPPPPPPPPPPPPPP>
##$VTLIST= <TTTTTTTTTTTTTTT>
##$WBST= 1024
##$WBSW= 4
##$XGAIN= (0..3)
0 0 0 0 
##$XL= 0
##$YL= 0
##$YMAX_a= 10691
##$YMIN_a= -11190
##$ZGOPTNS= <>
##$ZL1= 120
##$ZL2= 120
##$ZL3= 120
##$ZL4= 120
##$ABSF1= 0
##$ABSF2= 0
##$ABSG= 0
##$ABSL= 0
##$ALPHA= 0
##$AQORDER= 0
##$ASSFAC= 0
##$ASSFACI= 0
##$ASSFACX= 0
##$ASSWID= 0
##$AUNMP= <proc_1d>
##$AZFE= 0.1
##$AZFW= 0.5
##$BCFW= 0
##$BC_mod= 2
##$BYTORDP= 0
##$COROFFS= 0
##$CY= -3
##$DATMOD= 1
##$DC= 0
##$DFILT= <>
##$DTYPP= 0
##$F1P= 0
##$F2P= 0
##$FCOR= 1
##$FTSIZE= 65536
##$FT_mod= 6
##$GAMMA= 0
##$GB= 0
##$INTBC= 1
##$INTSCL= 6.047779e-11
##$ISEN= 30
##$LB= 1
##$LEV0= 0
##$LPBIN= 0
##$MAXI= 10000
##$MC2= 0
##$MEAN= 0
##$ME_mod= 0
##$MI= 50
##$NCOEF= 0
##$NC_proc= -5
##$NLEV= 6
##$NOISF1= 182.463
##$NOISF2= 159.3651
##$NSP= 0
##$NTH_PI= 0
##$NZP= 0
##$OFFSET= 248.5645
##$PC= 4
##$PHC0= -10974.59
##$PHC1= 75.48538
##$PH_mod= 1
##$PKNL= yes
##$PPARMOD= 0
##$PSCAL= 0
##$PSIGN= 0
##$REVERSE= no
##$SF= 81.0140089999694
##$SI= 65536
##$SIGF1= 159.3651
##$SIGF2= -187.1042
##$SINO= 113.3802
##$SIOLD= 16384
##$SREGLST= <1H.CDCl3>
##$SSB= 0
##$STSI= 65536
##$STSR= 0
##$SW_p= 40650.406504065
##$SYMM= 0
##$S_DEV= 0
##$TDeff= 32768
##$TDoff= 0
##$TI= <>
##$TILT= no
##$TM1= 0
##$TM2= 0
##$TOPLEV= 0
##$USERP1= <user>
##$USERP2= <user>
##$USERP3= <user>
##$USERP4= <user>
##$USERP5= <user>
##$WDW= 1
##$XDIM= 65536
##$YMAX_p= 417157893
##$YMIN_p= -13371923
$$ End of Bruker specific parameters
$$ ---------------------------------
##NTUPLES= NMR SPECTRUM
##VAR_NAME=  FREQUENCY,     SPECTRUM/REAL,   SPECTRUM/IMAG
##SYMBOL=    X,             R,               I
##VAR_TYPE=  INDEPENDENT,   DEPENDENT,       DEPENDENT
##VAR_FORM=  AFFN,          ASDF,            ASDF
##VAR_DIM=   65536,         65536,           65536
##UNITS=     HZ,            ARBITRARY UNITS, ARBITRARY UNITS
##FACTOR=    0.620285442955139, 1,           1
##FIRST=     20137.2065510682, 0,            0
##LAST=      -20513.1999529968, 0,           0
##MIN=       -20513.1999529968, -13371923,   0
##MAX=       20137.2065510682, 417157893,    0
$$ Real data points
##PAGE= N=1
##DATA TABLE= (X++(R..R)), XYDATA
$$ [...]
40597a007763j06605K15373P39758O19816j79863o55229k85452K77147L37350
40588d5468N3679j22684j15525r533J76652K68586P3772j52057q608K56856K8523
40577D04193n49215o19985k091M06342Q759n61728m53240J64987N09341L22405
40567c70232j3596j72887j64466j14064j42645k99891m08961k14095J83890L63725
40557a353222J78002n9681q8956J7950J80794M09508M66599L3520n91124o24951
40547a431561N0783N53089K50101k95185k15573L81112P19149N42937K65351J62497
40537I82700J16925N9403M8232n2147m10833p49562n71301L9099L55825j9923
40527b01582n31176l57366M52887R43527M39387n27730q22820j66378M99440L32429
$$ plain form
40597 -1007763 -1114368 -898995 -159237 460579 280716 -374513 -659965 -382818 -45468
40588 -45468 8211 -114473 -229998 -239531 -62879 205707 279479 127422 118814 375670 404193
40577 404193 -145022 -765007 -767098 -360756 -351997 -913725 -1366965 -1201978 -692637 -370232
40567 -370232 -383828 -556715 -721181 -835245 -977890 -1277781 -1686742 -1900837 -1716947 -1353222
40557 -1353222 -1175220 -1234901 -1323857 -1305907 -1125113 -715605 -249006 -215486 -806610 -1431561
40547 -1431561 -1380778 -827689 -577588 -872773 -1088346 -707234 11915 554852 820203 982700
40537 982700 1099625 1159028 1207260 1155113 744280 -5282 -576583 -537484 -181659 -201582
40527 -201582 -732758 -1090124 -637237 306290 745677 217947 -604873 -771251 -271811 60618
40517F0618k36905k25928L72602O33989K08574j77071J541K01317k02935p94074
40507a58272p41868j04290L04465J42338r9288N0796M23169N50955K46618k60442
40497C54181n41331l30418J74067M70738L31390Q497k40314m66751o40329l98964
40487a279234L61902J012802Q72189J64986k63250q7631J93781R6886k32174l69871
40477D70386j97997N2449J31128J3898j07802q1868m3064k32208n25188m61143
40467i81409Q2864N95334N92023K46887K5360J2984J1751m29K6770q5772m44841
40456H1522p02443m94675o6480Q3849m917P6367L02522K57525n9276j67178Q0240
40445f12944K61947J16969q6819r5149l6742m4436n425R6315N6253j18305j08668
$$ plain form
40517 60618 -176287 -402215 -29613 604376 812950 635879 637420 838737 635802 -158272
40507 -158272 -900140 -1004430 -699965 -557627 -656915 -606119 -182950 368005 614623 354181
40497 354181 -187150 -517568 -343501 127237 458627 467124 226810 -239941 -880270 -1279234
40487 -1279234 -917332 95470 967659 1132645 869395 781764 975545 1072431 840257 470386
40477 470386 272389 324838 455966 469864 362062 280194 237130 4922 -520266 -981409
40467 -981409 -898545 -303211 288812 535699 561059 574043 585794 585365 612135 526363 81522
40456 81522 -620921 -1115596 -1182076 -1098227 -1103144 -1026777 -724255 -466730 -526006 -693184 -612944
40445 -612944 -350997 -234028 -320847 -415996 -452738 -497174 -502599 -406284 -350031 -468336 -577004
40434e77004J60594L24094J79723L6329J69575L64853L30958J62840L0378k02082
40424I80258o15234q32691m84638J42396M21961K33679J5759L1575P5698k6848
40414e8085q6756P7351K62352J59906j58516l18439j63357M9338L6032j31828
40404c32002j95732j30569j47574k84923k76961L8958M17327N13196L32126J42816
40394G6662O8927K5912j8638N86M7824j0990j79898k94433k35212m9056J28891
40383d39425J78984R3894M5858K04973M08347K69741k24808n65452m20124j08930
40373e56942j2615O1112L78880N71108J81605l61142k48441L23143K98411n42768
40363I2351j075998m62400O08235R42160M22118j49856k91017j81052o5129J3248
$$ plain form
40434 -577004 -416410 -92316 87407 123736 293311 658164 989122 1151962 1182340 980258
40424 980258 365024 -467667 -952305 -809909 -387948 -154269 -138510 -106935 -31237 -58085
40414 -58085 -144841 -67490 194862 354768 196252 -122187 -285544 -236206 -200174 -332002
40404 -332002 -527734 -658303 -805877 -1090800 -1367761 -1328803 -911476 -398280 -66154 76662
40394 76662 145589 171501 152863 153449 201273 190283 10385 -284048 -519260 -568316 -439425
40383 -439425 -260441 -166547 -120689 84284 492631 762372 537564 -27888 -448012 -556942
40373 -556942 -569557 -508445 -129565 441543 623148 262006 13565 336708 635119 92351
40363 92351 -983647 -1446047 -837812 104348 526466 376610 85593 -95459 -160588 -147340
40353a47340J7444l8412L1085K85002M39969L05625J58014K66274L47265j610
40343A663316n65936p68221n08273j98088m9482J09418L11466K95187j1907k97165
40333a9685l07613j60370p0938l8397O3528K57402M12924L45432O917l38283l00030
40322a49113J07169L57020J12274k25507q3724L67401M20808r0947n13400l11617
40312i636K07307L86930Q4163k72714k91208q506K51162K49557P2266Q281J44468
40301H22070J86803j26736n43171n46090q8222K93121K12788n5462m6894J87122
40291B95329J89391j74298m49408j73528M78514Q32781M78254k72101p58638o94322
40281b48026l60237j56129j74005k43693j96599l027K05667K17135J478j37185
$$ plain form
40353 -147340 -129896 -168308 -137223 147779 587748 893373 1051387 1317661 1664926 1663316
40343 1663316 1097380 329159 -179114 -377202 -426684 -317266 -5800 289387 277480 -19685
40333 -19685 -327298 -487668 -558606 -597003 -533475 -276073 136851 482283 489200 150917 -149113
40322 -149113 -41944 315076 427350 201843 118119 485520 906328 815381 301981 -9636
40312 -9636 197671 584601 668764 396050 104842 96336 347498 597055 669321 677602 822070
40301 822070 1008873 882137 338966 -207124 -295346 -2225 210563 155101 108207 295329
40291 295329 484720 310422 -138986 -312514 166000 998781 1477035 1204934 446296 -248026
40281 -248026 -608263 -764392 -938397 -1182090 -1378689 -1381716 -1176049 -958914 -957436 -1094621
40271a094621O6899L64219K89112n1872m5000M13662O19634J57646l64055k77655
40261G7969M4240j30672n68554m26732K75758O15660K32282j91304j33507M2358
40251a62502n9836j71309j5465Q8437j40305l19841j7449N04969P15297N51155
40241I73151K43423j32577m26567k51336L61353O55770J70667m42875l90331j8528
40231G42150j81102p15124o90418k8143L29724k4601l83567j92902J55998K32209
40221g55776K81108M79450L84010j86882n29619j22333L75707J10558n41908n76409
40211a082094j293K57983l9826j25138L48025O41233J62945n05521m47798K79442
40201e12042Q01713N82720q6640n86970n73394j67012K16630K87731J79047J56982
$$ plain form
40271 -1094621 -1027722 -663503 -374391 -426263 -471263 -57601 562033 719679 355624 77969
40261 77969 122209 -8463 -577017 -1003749 -727991 -112331 119951 -71353 -204860 -162502
40251 -162502 -222338 -393647 -409112 -320675 -460980 -780821 -798270 -293301 421996 973151
40241 973151 1216574 1083997 657430 406094 767447 1423217 1593884 1151009 760678 742150
40231 742150 561048 -154076 -844494 -872637 -542913 -567514 -951081 -1143983 -987985 -755776
40221 -755776 -474668 4782 388792 201910 -327709 -450042 -74335 36223 -505685 -1082094
40211 -1082094 -1083387 -825404 -865230 -990368 -642343 -1110 161835 -343686 -791484 -512042
40201 -512042 289671 872391 785751 198781 -374613 -541625 -324995 -37264 141783 298765
40191B98765J25999j72855n11056l32555K94579N72560J40754l44055k60301M6269
40181a41896J8763j09429Q9033K49902j18065m63890M2325Q53974O25408n31183
40171E14942r70648r8565O14522M3409p21175k34411Q22387P42123l86760q54299
40161e28475r9437N54148J78819m21732k80667K23723K90970O0166Q5425K26274
40151B89214L0342l15733l24727j01220n1927m4678K69770N50846J43554o97132
40141b51691r27584k31550M72493L92187n7899p7749K49000K43981j63568l44406
40131f96786n3178J49224j88867o58354n99670q9525K36208J81433J95698N14609
40121a009208P09014M09670k1127m1890J86899Q4362l60205n50872k48797R8109
$$ plain form
40191 298765 424764 251909 -259147 -591702 -297123 275437 416191 72136 -188165 -141896
40181 -141896 -123133 -232562 -143529 106373 -11692 -475582 -433257 420717 1046125 514942
40171 514942 -455706 -554271 60251 103660 -617515 -851926 -29539 712584 325824 -528475
40161 -528475 -627912 -73764 105055 -316677 -597344 -373621 -82651 -22485 62940 289214
40151 289214 319556 3823 -320904 -422124 -474051 -518729 -248959 301887 445441 -251691
40141 -251691 -1179275 -1410825 -938332 -546145 -604044 -681793 -432793 -188812 -352380 -696786
40131 -696786 -749964 -600740 -789607 -1447961 -2047631 -2137156 -1900948 -1719515 -1523817 -1009208
40121 -1009208 -300194 109476 88349 46459 233358 317720 -42485 -593357 -842154 -744045
40111g44045J49436J47567K99498L01492n3653l16072l1953M11915K89570l12130
40101A41625n74543j82353K32007Q6569l11478l09929J15465M02519K36947r8233
40091b61404k17789j25383n6297n3712M4452K49106L22831J43841n9522m3817
40081e7694O8648M2392K938K25711N13129L34165l04083p05501m74462r1927r7105
40070e43789k36763q844L91067L94809O5801l852K85690L84239J7385m16286n29451
40059a99994m31889l39841k26358p0557L426J8755J44767K74097R1776k83222
40049a019040k81583K44125O76802M97432k955k51121j80216p2512k0127n414
40039d14609j79910n68621p44241k84503N85364J198409J170672O26733q7619
$$ plain form
40111 -744045 -594609 -447042 -147544 153948 100295 -215777 -247730 164185 453755 141625
40101 141625 -432918 -615271 -383264 -296695 -608173 -918102 -802637 -400118 -163171 -261404
40091 -261404 -479193 -604576 -660873 -714585 -670133 -421027 -98196 45645 -13877 -57694
40081 -57694 10954 53346 56284 281995 795124 1129289 825206 119705 -354757 -446684 -543789
40070 -543789 -780552 -789396 -398329 -3520 62281 58429 344119 728358 745743 329457 -199994
40059 -199994 -631883 -971724 -1198082 -1268639 -1265213 -1246458 -1101691 -827594 -735818 -1019040
40049 -1019040 -1300623 -1056498 -379696 117736 114781 -136340 -316556 -389068 -409195 -414609
40039 -414609 -594519 -1163140 -1907381 -2191884 -1606520 -408111 762561 1389294 1301675
40030A301675n87349n66767j19003K17271O4544k98121l50788m9390K07913J62651
40020a7364p8520k62812j86671J48195L92854J63070l26429l88879J03183L98004
40010e5369K6403l68355n7775N14860M36209j52426l20919P2575K28284j48155
40000A75332l80920m4934L70311L81414K00990R9277j04098m56450n27531j35965
39990d22574K42381K51836J91567L17949L00289r4308m38552l64138k14089l37940
39980e67579l65403P2530M79163K16772l56187m03128M2402J98782j47041l77929
39970a207618j17656K60728L24707J20334j08399k09375o8882K68572M48107K20833
39960f8649r8579q3459Q0895o9770m01121l56398Q5742L93761L93040L98159M19928
$$ plain form
40030 1301675 714326 147559 28556 245827 310371 12250 -338538 -387928 -180015 -17364
40020 -17364 -95884 -358696 -545367 -397172 -4318 158752 -167677 -556556 -453373 -55369
40010 -55369 -28966 -397321 -455096 59764 495973 343547 22628 95203 323487 175332
40000 175332 -205588 -250522 119789 501203 702193 801470 697372 240922 -286609 -422574
39990 -422574 -180193 71643 263210 581159 881448 787140 348588 -15550 -229639 -567579
39980 -567579 -932982 -860452 -381289 -164517 -520704 -923832 -881430 -682648 -829689 -1207618
39970 -1207618 -1325274 -1064546 -739839 -619505 -727904 -937279 -1006161 -737589 -289482 -68649
39960 -68649 -167228 -250687 -169792 -239562 -640683 -997081 -911339 -517578 -124538 273621 693549
39949F93549J08134l83002l69433K44329O60056L62157j75042l53708k66938j90377
39939C29725j0140K91419K80618j71305m23706m4944L58560Q1974m56780l63541
39929a28120K51671M52710l3175m94993m30325j52792m5643m355J11147J29128
39919c44747k2657r2288K0538K6741k36461m64651l39081K8355L39614M62852
39909f21785L36825r1132n73513n96706m0695N24801N56274K33444M5788J1964
39899b14735j48712l02130m2446M68116N15765q9804n92920l49703K12899K66801
39889b76869j49068k52598J97164N15621J83294l58759m26487j10611k1262k92784
39879i92359m35038j22574L69924N92684M17363L2386k71468k59163N4670L44099
$$ plain form
39949 693549 801683 418681 49248 293577 953633 1315790 1140748 787040 520102 329725
39939 329725 319585 611004 891622 720317 296611 251667 610227 692201 235421 -128120
39929 -128120 123551 576261 543086 48093 -382232 -535024 -580667 -585022 -473875 -344747
39919 -344747 -367404 -459692 -439154 -412413 -648874 -1113525 -1452606 -1424251 -1084637 -621785
39909 -621785 -284960 -376092 -949605 -1546311 -1587006 -1062205 -505931 -272487 -226699 -214735
39899 -214735 -363447 -665577 -708023 -239907 275858 186054 -406866 -756569 -543670 -276869
39889 -276869 -425937 -678535 -481371 34250 217544 -141215 -567702 -678313 -699575 -992359
39879 -992359 -1427397 -1549971 -1180047 -587363 -170000 -137614 -409082 -668245 -613575 -269476
39869b69476L22070J09510J0223L0410k9415j16337k1344J11755q4752n06954
39859d44310n83362j32357L45084M49511L83171L68264J74486l16017o13861k81242
39849f50633L05365M60178J74376j12J51494L12056K18849p4425m27568o52884
39839a83304m73638P8796M05235L0646n89734n81815R8901O09232M57748J06189
39829d1744J18294L32033K58929j16358l55957j95731J55820K97914Q1807k23228
39819C11779k45179p950R7707m9498o0925K76270N04592J87325l02414l50448
39809C61259j29142k36963n41887l58906K71307N38769K37681J00491M34873N13302
39799A190784j26886p67132o23806n7335J42652n468k423J36628Q8036k6850O5412
$$ plain form
39869 -269476 52594 162104 172327 202737 173322 56985 35641 147396 62644 -444310
39859 -444310 -1027672 -1160029 -814945 -365434 17737 386001 560487 244470 -369391 -650633
39849 -650633 -345268 114910 289286 289174 440668 752724 971573 897148 469580 -183304
39839 -183304 -656942 -578146 -172911 -142265 -731999 -1313814 -1214913 -605681 -147933 -41744
39829 -41744 76550 408583 667512 551154 195197 -534 155286 453200 535007 311779
39819 311779 66600 58650 156357 106859 45934 322204 826796 1014121 711707 361259
39809 361259 232117 -4846 -546733 -905639 -634332 -95563 142118 242609 677482 1190784
39799 1190784 1063898 296766 -327040 -384375 -241723 -247191 -249614 -112986 -24950 -51800 13612
39788A3612J36924r4149k74794k9954J69410k60840p96513m71857M47513P26227
39778d34421R9810l52622j6026L73885J48019j90457j7302K68535O3265k66949
39768c24263m2421M51105L96628j53608l50356O6280M14892K13997j65674k43831
39758B62749j29298j19962j44186j9751J05760L068j81372j25201J23623J82170
39748d2400p8799l19265k32680m573j8486k34165k04968K16781N45111L11930
39738f1514j98129k98670J09574M17288K40754p4186j19705n7262j72096k69659
39728d83605p3565J39321l7855l39598j98632K21233K09670k53700l69525J49285
39718a036971N55197L18304p747J61389L52836r0389p04245n67399J45552M54467
$$ plain form
39788 13612 150536 56387 -218407 -248361 -78951 -339791 -1136304 -1608161 -1160648 -434421
39778 -434421 -334611 -687233 -703259 -329374 -181355 -371812 -389114 -120579 -57314 -324263
39768 -324263 -366684 84421 481049 327441 -22915 43365 458257 672254 506580 262749
39758 262749 133451 13489 -130697 -150448 -44688 -41620 -222992 -348193 -224570 -42400
39748 -42400 -121199 -440464 -673144 -677717 -696203 -930368 -1135336 -918555 -373444 -61514
39738 -61514 -259643 -558313 -448739 -31451 209303 135117 15412 -41850 -213946 -483605
39728 -483605 -557170 -417849 -455704 -795302 -993934 -772701 -563031 -816731 -1186256 -1036971
39718 -1036971 -481774 -163470 -171217 -9828 343008 252619 -451626 -1019025 -873473 -419006
39708d19006K03078J40240L80971J48528o37989q77496m6343P61429M74599k82234
39698a54223k89695K72767K69664l97269o56390p1818N31301M77647J43496M5972
39688A71452M226k40560l47312L3255N25291N16887M7575l21529k94555o5257
39678B9473P1901j2402k63013m28287k28713K53074N42466L33341j13096l11673
39668a26929j09910K43457L89964J21199m14698o96514l25771L83340O74917L11163
39658D50218j65989k68938j49004j01272k5698K21452L94698K37633o1844k20065
39648C11191l05886m12886k85459J99035N44364K63492k73652k93931K35231N93591
39638E75090L82520m7280k83593l52135l84992l10809r2241R3929J01194n194
$$ plain form
39708 -419006 -215928 -75688 305283 453811 -184178 -1061674 -1108017 -346588 128011 -154223
39698 -154223 -443918 -171151 98513 -298756 -955146 -1026964 -495663 -18016 125480 171452
39688 171452 175678 -64882 -412194 -378939 146352 663239 710814 389285 94730 29473
39678 29473 101374 88972 -174041 -602328 -831041 -577967 -35501 297840 184744 -126929
39668 -126929 -236839 6618 396582 517781 103083 -593431 -919202 -535862 139055 450218
39658 450218 284229 15291 -133713 -234985 -260683 -39231 355467 593100 531256 311191
39648 311191 5305 -407581 -693040 -494005 50359 313851 40199 -253732 -18501 575090
39638 575090 957610 910330 626737 274602 -110390 -421199 -513440 -419511 -318317 -323511
39628c23511r8216j19007n8180K44r6430k89526k34668J97926N68235M06413q3101
39617a29821l08431j26169R1566J04540K0915m6479o0466J07116M50107N79276
39607F82154K08701k93315m07561k76446l25293l49434J20000P15469N71538k17389
39597D28424o02971k20763J29857n8195k71666j64741k21140n72273m31014L98502
39587a585980P12878j95991j011459k88583J062750J038343k75917q34779J07740
39578a270998R49060M31337m95853m48642K51351M23430k5309k71750o3755J37596
39568c83533J52990K04374K29946l0237l49111k10239K95198M73537M0625m63956
39558d0406m59295n8842K03615P1460k31079l30191r1138K69409M27766L13259
$$ plain form
39628 -323511 -421727 -540734 -598914 -598670 -695100 -984626 -1219294 -1021368 -453133 -46720 -129821
39617 -129821 -438252 -564421 -472855 -368315 -347400 -393879 -454345 -347229 102878 682154
39607 682154 890855 597540 189979 -86467 -411760 -761194 -641194 74275 645813 428424
39597 428424 -174547 -395310 -265453 -323648 -595314 -760055 -981195 -1553468 -1984482 -1585980
39587 -1585980 -873102 -1069093 -2080552 -2369135 -1306385 -268042 -543959 -1378738 -1270998
39578 -1270998 -321938 109399 -386454 -835096 -583745 -160315 -185624 -457374 -521129 -383533
39568 -383533 -230543 -26169 203777 173540 -175571 -385810 -90612 382925 423550 -40406
39558 -40406 -499701 -558543 -354928 -283468 -514547 -844738 -935876 -666467 -238701 74558
39548G4558J23895k7776k41868m90869m66628l4637M23302M67479K07487Q2637
39538A17580J92753K52462J16211o2342j57502j82852j10816N7321J05431j12712
39528B15534k85889l4107L66119K54152l47785o26194j86476L12496J83113k31474
39518c80511j57821L65064N84186J95538l08428m65340l80444k86156j02581K70234
39508f66259N72752M39886q8396n46246n35201j44306J63111R8312r2283J5693
39498g82937L53857L98154j2719l33858j05788L15067K95117j18339l53868k21810
39488e67124k8629R8641L15968M93956K58296k69428m43139l7531L70621K36901
39478D28532k63281o50230p37761n41425q3747M12956N86338M35454L13355K64900
$$ plain form
39548 74558 198453 170677 -71191 -562060 -1028688 -1063325 -640023 -172544 34943 117580
39538 117580 310333 562795 679006 616664 459162 276310 165494 222815 328246 215534
39528 215534 -70355 -104462 261657 515809 168024 -458170 -644646 -332150 -149037 -380511
39518 -380511 -538332 -173268 410918 606456 298028 -167312 -547756 -833912 -936493 -666259
39508 -666259 -93507 346379 257983 -288263 -823464 -967770 -804659 -706347 -798630 -782937
39498 -782937 -429080 -30926 -43645 -377503 -483291 -168224 126893 8554 -345314 -567124
39488 -567124 -595753 -497112 -181144 312812 571108 301680 -141459 -178990 191631 428532
39478 428532 165251 -484979 -1222740 -1764165 -1847912 -1434956 -848618 -413164 -99809 165091
39468A65091l4619n02934n64324j44737Q8103p6347J00587R12887J295816L32675
39458A572198j090385j357398l59504N76375O62453K88810j18972n56817p36416
39449a119656k06262O19557P20692K2347m27003j24102K07399L5321p2996L65212
39439B0509P25896L15638m00432n43473j76823k020j62050k42429j56733j81285
39429h03202k60975l7157M46530O66155L14448l10769o51211m15045J59982M64475
39419d26769J48193l65594l62726J43421M38633K45209P6339J81902K7677o20798
39409e14513r60020l15339O44727Q11097K34637j69530j12025n4412j02278R9697
39399d37959M16587K53831l37939n69539j44157L01004K53707O003n2733n4250
$$ plain form
39468 165091 130472 -372462 -936786 -1081523 -993420 -1069767 -969180 -56293 1239523 1572198
39458 1572198 481813 -875585 -1235089 -658714 3739 292549 173577 -383240 -1119656
39449 -1119656 -1325918 -706361 14331 36678 -390325 -514427 -307028 -271707 -344703 20509
39439 20509 746405 1062043 661611 118138 -58685 -60705 -222755 -465184 -621917 -803202
39429 -803202 -1064177 -1101334 -654804 11351 325799 15030 -636181 -1051226 -891244 -426769
39419 -426769 -278576 -644170 -1006896 -863475 -424842 -179633 -103294 78608 106285 -514513
39409 -514513 -1474533 -1789872 -1145145 -334048 -99411 -268941 -380966 -435378 -537656 -437959
39399 -437959 -21372 232459 -105480 -675019 -819176 -518172 -264465 -258462 -311195 -365445
39389c65445j57749j20531J67237K88539n7037m62113l57547J76869N80857N37546
39379B30626J68227k59852m92613l65082j0446J87656P9947k8282J35935L61453
39369G569K76688p8387l20384k49651l5114P4406J9302o4960Q41K30716L88543
39358B49569K56952l83j755K58834L19066n9663m59068l99041p9385n9315l43725
39347c17914l46155J65833O15868L93032k90504o98982n20273j08968J23512J38709
39337h45842O3474l8788n6851J45061M11857L62829l277j71934R1233K60650j20033
39326I8379n58709l06386L59847M68524r7988m07803j3640L61381J14680k38972
39316b20687m1447L69274L35172L5683K6978J14190k87708r37872r47585j36943
$$ plain form
39389 -365445 -523194 -643725 -476488 -187949 -244986 -707099 -1064646 -887777 -306920 230626
39379 230626 398853 139001 -353612 -718694 -729140 -541484 -461537 -489819 -353884 7569
39369 7569 284257 205870 -114514 -364165 -399279 -324873 -305571 -370531 -369690 -138974 249569
39358 249569 506521 506138 504383 763217 1082283 1022620 563552 164511 85126 25811 -317914
39347 -317914 -664069 -498236 117632 510664 220160 -478822 -999095 -1108063 -984551 -845842
39337 -845842 -782368 -821156 -878007 -732946 -321089 41740 38463 -133471 -42238 218412 98379
39326 98379 -460330 -766716 -406869 61655 -36333 -444136 -457776 -96395 18285 -220687
39316 -220687 -262134 107140 442312 477995 504973 619163 331455 -606417 -1554002 -1690945
39306a690945O81971Q39172M61423n4824m76843n46937r1961M96186N36213J4957
39296A68412l27007p7624K78402J79280j61161j53427K49348M85383J60816m09942
39286C92480n47042l9171N23721M66605l6729k21905N3182Q2003m10838o42777
39276c80471q4815M62912J13620n06630k01251P27024Q52063p6909p77307n32214
39266d03978j16561k07577l17361K8165L21583R3666j76125j0333J58222j06367
39256g36666l04123R9849N92862M10575j90882m09272j49327R2620J68164K50134
39246a76066K35735l6722l07921l17647l04243m41731l10968L20603P76276M25741
39236a36943j80311j53111K38908R2795m48876l63620M55184Q77934K67358n87959
$$ plain form
39306 -1690945 -1008974 -169802 291621 236797 -240046 -786983 -878944 -382758 153455 168412
39296 168412 -158595 -236219 42183 221463 60302 -93125 156223 641606 802422 392480
39286 392480 -154562 -193733 329988 796593 759864 537959 591141 673144 262306 -380471
39276 -380471 -465286 -2374 111246 -395384 -596635 130389 982452 905543 128236 -403978
39266 -403978 -520539 -728116 -1045477 -1017312 -695729 -602063 -778188 -788521 -630299 -736666
39256 -736666 -1040789 -940940 -348078 62497 -128385 -537657 -686984 -594364 -426200 -176066
39246 -176066 59669 22947 -284974 -602621 -906864 -1348595 -1659563 -1338960 -562684 -136943
39236 -136943 -317254 -470365 -231457 -138662 -587538 -951158 -495974 381960 649318 61359
39226F1359o92005j27050L43004L16810k0790k88764k28866Q4246K67279J12056
39216a72721r1303n1063R983j62675k45721Q6752L71631M1178m35347j87344M96908
39205c39722N22688j22970k64323M26338P80287J15741n61658k63820L28055J12284
39195G32900n21950m30547K81520M71392j01342m74241j71753R7716k39188o75031
39185a030524n09018J06735N60900O56240N60828L10323j11534m53874m33419
39176c43343j61837K1959M3647R7104K34992K78059J32118p2136j88301j89826
39166a47564q3429Q7668J35924j03573m28340m02592J3399L14709J95283N8402
39156c60113L32987O29856K84374m22581m89940K08532N23230k60384j172534
$$ plain form
39226 61359 -630646 -757696 -414692 -97882 -118672 -407436 -636302 -552056 -284777 -172721
39216 -172721 -264024 -315087 -305104 -467779 -713500 -626748 -255117 -213939 -649286 -836630 -339722
39205 -339722 182966 59996 -204327 222011 1002298 1118039 556381 292561 620616 732900
39195 732900 210950 -219597 61923 533315 431973 -42268 -214021 -116305 -355493 -1030524
39185 -1030524 -1539542 -1432807 -871907 -215667 345161 655484 543950 90076 -343343
39176 -343343 -505180 -483221 -439574 -342470 -107478 170581 302699 230563 42262 -147564
39166 -147564 -230993 -143325 -7401 -110974 -539314 -941906 -928507 -613798 -418515 -360113
39156 -360113 -27126 602730 887104 464523 -25417 183115 706345 445961 -726573
39147g26573q69166M01264J166284P78503K4610k98052l39512m39821l61452J47720
39137e16195O66758O17871J11272k63452k53155q8917M075J0470p2951k56646
39127d0870l86808k56567O9005K59302J21922j39627j67531R4770K92322Q8879
39117f5203l43618m71939j06774L10156L37275J63400K24333M15525K32692l55527
39107C40320p63052o23502k32770K8958J86082L05486J80129k00422l17057J83487
39097i12341P72896O64700P988k49200K28590N97606O2124q74998j030310j95175
39087i28120N49232L12656m52749p13699k92893J15650J38136J27409L09945L39863
39077d94570M9614p9601K55439M93596N8326n78732n27843J13104M04327L0357
$$ plain form
39147 -726573 -1595739 -1194475 -28191 750312 774922 476870 137358 -302463 -663915 -516195
39137 -516195 150563 768434 879706 616254 363099 274182 278257 288727 215776 -40870
39127 -40870 -427678 -684245 -615240 -355938 -234016 -373643 -541174 -446404 -154082 -65203
39117 -65203 -408821 -880760 -987534 -677378 -340103 -176703 47630 463155 695847 340320
39107 340320 -422732 -1046234 -1279004 -1250046 -1063964 -758478 -578349 -778771 -1095828 -912341
39097 -912341 -139445 525255 533243 284043 512633 1110239 1172363 297365 -732945 -928120
39087 -928120 -378888 -66232 -518981 -1232680 -1525573 -1409923 -1271787 -1144378 -834433 -494570
39077 -494570 -444956 -524557 -269118 224478 282804 -295928 -823771 -710667 -306340 -275983
39067b75983l12139j11052K44958K35350l7126k22917k61151j78440J22367N12561
39057b83572N54127J36432k26399j00526K47367L01057K8806j99915j67374L7398
39047C27401K02500J17351k45489n37108l49587J49831L20165m7970m03671k60864
39037g27441J27302K45449M2322j69435j84217K3306L53714M93867J79397k85351
39027I8913k95438R3121J54266k85373m51291O8048N03718J42060m32818k90138
39017f94932L05653M06598k1331j92180N4528R2249k43619l64744k1631K94362
39007c85047K45678R5372O2750J1630n0124P8566K01401j14130o25803n31855
38997a011562K48128P82886M84151q5737k07918j3921L5601m3730p3452j96701
$$ plain form
39067 -275983 -588122 -699174 -454216 -218866 -255992 -478909 -740060 -918500 -796133 -283572
39057 -283572 270555 406987 180588 80062 327429 628486 657292 457377 290003 327401
39047 327401 529901 647252 401763 -135345 -484932 -335101 -14936 -62906 -466577 -727441
39037 -727441 -600139 -354690 -312368 -481803 -666020 -642714 -289000 204867 384264 98913
39027 98913 -196525 -103404 50862 -234511 -685802 -617754 -114036 28024 -404794 -694932
39017 -694932 -389279 17319 -4012 -196192 -141664 -49415 -293034 -657778 -679409 -385047
39007 -385047 -139369 -43997 18753 30383 -19741 58825 260226 146096 -479707 -1011562
38997 -1011562 -763434 19452 503603 417866 209948 196027 231628 187898 114446 -82255
38987h2255m35246l52598J91290N12035N7616o01281n55337N0780L03471k0456
38977i31981k12462J42308N59743M93858J05422j22011p1561J3456n3593k23877
38967c00698l03460j32728K09139M18043L33519J65313J36900J01263j49051l79901
38957I8339j96209K57060L95296L7477l45521l45740j20816K907J6086P0875J65151
38946C4905K20746K22887J14870j64430m03148k41674K32576M26712N9387l81404
38936A21427l60839n1247J05738J58154L26064K97674l08115r55567o58023M73111
38926h51623J138438O43204j69016l12061p2380k15509n41184l15529L00716M39947
38916D5003J6438j20942L53531O93865L21241k97082m52255j37330K52841M97761
$$ plain form
38987 -82255 -517501 -870099 -678809 -166774 -109158 -710439 -1265776 -1214996 -911525 -931981
38977 -931981 -1144443 -1002135 -442392 51466 156888 34877 -36684 -23228 -76821 -300698
38967 -300698 -604158 -736886 -527747 -109704 223815 389128 526028 627291 478240 98339
38957 98339 -97870 159190 554486 591963 246442 -99298 -220114 -217207 -201121 -130246 34905
38946 34905 255651 478538 593408 428978 25830 -215844 16732 443444 502831 121427
38936 121427 -239412 -290659 -184921 -26767 299297 596971 288856 -666711 -1324734 -851623
38926 -851623 286815 930019 761003 448942 376562 161053 -380131 -695660 -394944 45003
38916 45003 61441 -59501 294030 987895 1309136 1012054 559799 422469 675310 1173071
38906A173071M11269j87090r03908q97834j13088L82820k8312m38969J30639R68400
38896D96998O68000n62841j096755l48775M55394K93577k63105l10695n9638j20816
38886h48656k60699P8035O00799N66805N4175j68227R7702K67372N1256j18734
38876C19828M4181J35365k25692o70860n61654R1611O30783N74103J10352k30458
38866B17559j74392Q8554J86096q469k36468j67474J70486L84930J91293k24112
38856D28003m32967k85594l3935O1377L8465M5649M7416n1847j16120P0801L74026
38845A45274L82723J6356k98233k48818q9673j76000l60119k60112Q1516K63088
38835e43998J43738l2570q1240m5039M0873J64062J68267k8524j33080J43116
$$ plain form
38906 1173071 1584340 1397250 493342 -404492 -517580 -134760 -163072 -602041 -471402 496998
38896 496998 1164998 602157 -494598 -843373 -387979 -94402 -357507 -668202 -727840 -848656
38886 -848656 -1109355 -1031320 -430521 136284 190459 22232 119934 387306 438562 319828
38876 319828 364009 499374 273682 -397178 -958832 -867221 -236438 337665 448017 217559
38866 217559 43167 131721 317817 309348 72880 -94594 75892 460822 652115 428003
38856 428003 -4964 -290558 -324493 -263116 -224651 -179002 -131586 -183433 -299553 -228752 145274
38845 145274 527997 544353 246120 -2698 -92371 -268371 -628490 -888602 -807086 -543998
38835 -543998 -400260 -432830 -514070 -559109 -518236 -354174 -185907 -214431 -347511 -204395
38825b04395M90412L48072j88654m49832k27757k5072j10505q9162K67752N06472
38815C17331K67731p7422j09515q1823l45715n91221l61589J01028K47539J10927
38805e22729P8051R3464j25954l40239j02689L21917K40185k92781m62320L2092
38795a081003N28999M55990Q3335p2636K9156J44683J45024k5078l33958m63011
38785e88499j23243L44868K99324j81028l33143N9131L11089L5482k03843M6217
38775c33645K89828K0420k86341k361M59861K87278l35809n15396q6841K60652
38765b42354K06822J61225L43057L93968Q8638k92599m66503m25488j70061K25843
38755a77452L31445j42111o25811l21853M75952O80221J08995k45577Q6122L22622
$$ plain form
38825 -204395 286017 634089 445435 -4397 -232154 -257226 -367731 -456893 -189141 317331
38815 317331 585062 507640 398125 316302 -29413 -620634 -982223 -881195 -633656 -522729
38805 -522729 -444678 -351214 -477168 -817407 -920096 -598179 -357994 -650775 -1113095 -1081003
38795 -1081003 -552004 -96014 -12679 -85315 -56159 88524 233548 208470 -125488 -588499
38785 -588499 -711742 -366874 -67550 -248578 -581721 -522590 -211501 -176019 -379862 -333645
38775 -333645 -43817 -23397 -309738 -312099 147762 435040 99231 -416165 -503006 -242354
38765 -242354 -35532 125693 468750 862718 951356 658757 192254 -233234 -403295 -177452
38755 -177452 153993 11882 -613929 -935782 -459830 220391 329386 83809 169931 492553
38745D92553o6893l75147N021L92277L1348m82087k47945K70293O7197m97105
38735d10488k33174O96519Q48618j20751q02749k53368O02102N40791j89692n92571
38725H5237m76089l04781j74142J02571L37676K58642J15735K43882L35737r2935
38715D31533p59599q92650l30257L20053N46257L85863R7049j03590n9069J25351
38705b39059O2504l01983l65972K54386Q74188N68300l71522p58078k57556K09615
38695c25177J7682k52789N6570N39399M41364j00736l37947p3393K00963J59224
38685C25160l1693j91529l53684m65580l43964l5468J65555J76207K49092M76501
38675b9403N12838Q8394m25220l76281K46261O68546L23242l46943m83782k1520
$$ plain form
38745 492553 425660 50513 55534 447811 479159 -2928 -250873 19420 86617 -410488
38735 -410488 -643662 52857 901475 780724 -22025 -275393 326709 867500 677808 85237
38725 85237 -390852 -695633 -869775 -767204 -429528 -170886 -55151 188731 524468 431533
38715 431533 -328066 -1220716 -1550973 -1230920 -684663 -298800 -201751 -305341 -364410 -239059
38705 -239059 -176555 -478538 -844510 -590124 284064 852364 480842 -277236 -534792 -325177
38695 -325177 -307495 -560284 -503714 35685 477049 376313 38366 -35027 165936 325160
38685 325160 293467 101938 -251746 -717326 -1061290 -1096758 -931203 -754996 -505904 -29403
38675 -29403 483435 571829 146609 -229672 16589 685135 1008377 661434 177652 156132
38665A56132K74025R102k65053j1217L90195K97193j02784j44419J32568M6206
38655G81948n00723p62819l33334K35390L49674J88671J45811J08186j30202k60577
38645a77975P0162N21659M45226j74000p17284p60148m25431q361L10773M29959
38635d85420L62751K75658K48238J39554q3868j50615P3592K40265J3825l59085
38625B74895m28856k37975j28468q5637J35070L78365K33039k20130m19022j38203
38615f36922K46758L82366L07032J25020j59277l62926j98658K04437L30155Q560
38605B46545l28941l18610j40420r2506j08558J5758K42551L97070L99140K29967
38595E41996m7903j43655K06597P14732P21494J01632m77179m65717j34379k1894
$$ plain form
38665 156132 430157 439259 174206 162989 553184 850377 747593 603174 735742 781948
38655 781948 281225 -481594 -814928 -579538 -229864 -41193 104618 212804 82602 -177975
38645 -177975 -107813 413846 859072 685072 -32212 -792360 -1217791 -1226152 -915379 -485420
38635 -485420 -122669 152989 401227 540781 456913 306298 379890 620155 633980 274895
38625 274895 -153961 -391936 -520404 -606041 -470971 -92606 140433 -79697 -498719 -636922
38615 -636922 -390164 -7798 299234 424254 264977 -97949 -296607 -92170 237985 246545
38605 246545 -82396 -401006 -541426 -633932 -742490 -726732 -484181 -87111 312029 541996
38595 541996 494093 350438 557035 1271767 1993261 2094893 1617714 1151997 1017618 995724
38585I95724j41634j89127j70192k98837m92804m60735j78888J04114K37586K40199
38575c54594J43046L6752R6138K92881L05572j0570l33135l49592k00848r9216
38565d73566R8887M60090N32976M76n55569l43209L64361N20639j36472p24214
38555b55601n79575j03837Q8316N0552O3763K6389j39049p4936L69222N99945
38545D5189J20053n03601l55123L81637O01997q7159q00037o77446O965M64410
38535h03115N00998M37852L21503j03863p14867r05590l58745M43257P40393L57512
38525h4665j93430l99523k73105j23522m8467Q8332K59999K07364j06712k74656
38515i48385L5266N07793N01904o7560n37011l21947L44469P28744M84981l4636
$$ plain form
38585 995724 854090 664963 494771 195934 -296870 -757605 -936493 -832379 -594793 -354594
38575 -354594 -211548 -174796 -78658 214223 519795 509225 176090 -173502 -374350 -473566
38565 -473566 -374679 85411 618387 618863 63294 -279915 84446 605085 468613 -255601
38555 -255601 -835176 -939013 -850697 -800145 -736382 -709993 -849042 -923978 -554756 45189
38545 45189 165242 -338359 -693482 -311845 290152 202993 -597044 -1274490 -1267525 -803115
38535 -803115 -302117 135735 457238 353375 -361492 -1267082 -1625827 -1182570 -442177 -84665
38525 -84665 -278095 -677618 -950723 -1074245 -1122712 -1034380 -774381 -567017 -673729 -948385
38515 -948385 -913119 -405326 96578 29018 -507993 -829940 -485471 243273 728254 693618
38505F93618l06511k19594m7986n027j2142P3740J61529K4177l22814n43182l85717
38494h89909m810K83353M04641M52587L67025N7248k11945l2794M34438M65733
38484A325567k07873q41342o28355J17744L86887o0248m09577j13062K84504R8481
38474d7274l42620k39737L10436L88437k55327o58606m0030R28367R58453o4386
38464I37713r30079p51191o958L42054J48683l5193L6759P4365p7553j44440P7067
38453c28773L61388L89259J52290j29451k65405j72508P2189J93410O6k49538
38443B2927j07458L65543N87985L00761o2833j17495j07321l19969m38570r5865
38433B7705L39162K87462o449J60494O62605N96108k42183q89650o27144j4629
$$ plain form
38505 693618 387107 167513 119527 114500 102358 176098 337627 361804 38990 -504192 -889909
38494 -889909 -894719 -611366 -206725 245862 612887 670135 458190 425396 859834 1325567
38484 1325567 1117694 276352 -352003 -234259 152628 92380 -317197 -430259 -145755 -47274
38474 -47274 -389894 -629631 -319195 69242 -186085 -844691 -884721 43646 1002099 937713
38464 937713 7634 -743557 -750515 -408461 -259778 -294971 -258212 -183847 -261400 -405840 -328773
38453 -328773 32615 421874 574164 444713 179308 6800 78989 272399 272465 22927
38443 22927 -84531 281012 868997 1169758 1106925 989430 882109 562140 123570 27705
38433 27705 366867 654329 647880 808374 1470979 2067087 1824904 935254 308110 293481
38423B93481N7978l20541m26965q8808K22325K34024J25911L7784r7482k46614
38413b08907k62183j71739j16756n4196J44006L80708M61162M22041L87764K41397
38403A223297j59328n64765n79672k50309L0243J19214J64173J46423o7127k65910
38393b03761j03111K23146J71761j65872o8448N73186Q47235J82224o24110n07069
38383C25181K64833N13134q8400o45324m67544L8431J90249R601p9941k0579m7314
38372g673j33921k9629K48021L77621J98615r5896k61682k60864j88407j42462
38362b96277j88335k70484j75979J85969M86125K87090k65534m53696O7658O95671
38352G2208O42154k516m72288m20843k01160p6826J39226M62559M56379r631l23210
$$ plain form
38423 293481 351459 30918 -396047 -484855 -262530 -28506 97405 135189 37707 -208907
38413 -208907 -471090 -642829 -759585 -813781 -669775 -289067 172095 594136 981900 1223297
38403 1223297 1063969 499204 -80468 -330777 -300534 -181320 -17147 129276 62149 -203761
38393 -203761 -306872 -83726 88035 -77837 -146285 426901 1274136 1456360 832250 325181
38383 325181 590014 1103148 1014748 369424 -98120 -59689 130560 140161 60220 39641 -7673
38372 -7673 -141594 -171223 76798 454419 653034 557138 295456 34592 -153815 -296277
38362 -296277 -484612 -755096 -931075 -745106 -258981 28109 -237425 -691121 -623463 72208
38352 72208 714362 711846 239558 -181285 -382445 -459271 -320045 142514 598893 589262 266052
38341B66052k5725L49925N8519n83338n64124K66098Q80142N00941l90305q16928
38331e8743n18513R573K96769K94572J96935J85063K68555K50636j7735l34399
38321E72713l46375o6999J32392Q2814j0317j9201q0691k04905j54445R7893K35031
38310B37910J25232L2129Q4686M7054j26684q6446K13536K34458k34994n16046
38300A0835n4635N57578M03218l27508o50292l06424J982j26951k42470N5187
38290f79480M47443M49316O2938l85144o19919m73116J3187M39587M25954J64245
38280a54989J37151L24703K71339o6840k28319q4069m2661k41379k73367J2774
38270c45657J77440m604j28000M9743J35063q1295p2795N01071R85863O30245
$$ plain form
38341 266052 240327 590252 648771 65433 -498691 -232593 647549 1148490 758185 -58743
38331 -58743 -577256 -567683 -270914 23658 220593 405656 674211 924847 907112 572713
38321 572713 226338 159339 291731 374545 364228 345027 264336 59431 -95014 2879 237910
38310 237910 363142 395271 479957 527011 400327 313881 527417 761875 526881 10835
38300 10835 -43800 513778 916996 589488 -60804 -367228 -365246 -492197 -734667 -679480
38290 -679480 -232037 217279 280217 -104927 -724846 -1197962 -1184775 -745188 -319234 -154989
38280 -154989 -17838 306865 578204 511364 283045 198976 156315 -85064 -358431 -345657
38270 -345657 -168217 -172821 -300821 -251078 -116015 -197310 -270105 230966 1216829 1847074
38260A847074k18867o38521m49523j85507o6681J12821K61924M6064l69909m35743
38250i6868j17330L4890k06405m32712k97445O4970L96006N36289K87389l28581
38240a59797o81411j52710P65354Q25661k42891j176281q14955L87478J076774
38231a72778O91617j70907p02050n86565O86N71614O35880K18817j06316R056
38221C89054K06452P0494j56564o0078J12937j64694o71335o05297J69042Q17007
38211A07018P13112K56042J31537L05839K50565j73938n72574o00557k84288J61687
38201B94443N04131N33393K25613j70858m28228o07534p81954o83222o3605O72353
38191e05468P57681J01585n04719m71328j63387j67381l18121q8224M01050N30252
$$ plain form
38260 1847074 1628207 989686 540163 354656 287975 400796 662720 708784 338875 -96868
38250 -96868 -214198 -179308 -385713 -818425 -1115870 -1050900 -654894 -118605 168784 -159797
38240 -159797 -841208 -993918 -228564 597097 354206 -822075 -1637030 -1249552 -172778
38231 -172778 518839 347932 -354118 -940683 -939997 -368383 267497 486314 379998 389054
38221 389054 595506 666000 509436 449358 562295 397601 -273734 -879031 -709989 107018
38211 107018 820130 1076172 1207709 1513548 1764113 1590175 1017601 417044 132756 294443
38201 294443 798574 1331967 1557580 1386722 958494 350960 -430994 -1114216 -1177821 -505468
38191 -505468 252213 353798 -150921 -622249 -785636 -953017 -1271138 -1359362 -958312 -428060
38181d28060K13695q251O8120N6825j56382j37844J89176K10361k96168n51202
38171h39730L4307P67691O68861o336k67230q917K1381l24778m12839j23041r4608
38160e85239m27569l47000L84253Q51660M29714j77823j26546K28006J08059k86187
38150E1328j98747L28089N45968J91531k97524n60348n33414j35854M89516O97072
38140E77617J41321m23522j00706O45609N83693k90506o71691n8816M30969n6672
38130G77296o89002l55938M75154N23741k52601o53774j37471M68634L67725q5460
38120D38304j57377Q1425K6073l67817m87103o1949L62446K40447j33478q7832
38110a46861L42170M21832j21281n82165k83886M10568O32950K24016k08978k77897
$$ plain form
38181 -428060 -214365 -222616 -154496 -97671 -254053 -391897 -202721 7640 -288528 -839730
38171 -839730 -805423 -37732 631129 624793 357563 348646 370027 45249 -367590 -490631 -585239
38160 -585239 -1012808 -1359808 -975555 -123895 305819 127996 1450 229456 337515 51328
38150 51328 -147419 180670 726638 918169 620645 60297 -473117 -608971 -119455 577617
38140 577617 718938 295416 194710 840319 1424012 1133506 461815 402999 833968 777296
38130 777296 88294 -267644 207510 731251 478650 -175124 -312595 156039 523764 438304
38120 438304 280927 362352 388425 20608 -466495 -528444 -165998 74449 -59029 -146861
38110 -146861 195309 617141 495860 -86305 -370191 40377 673327 897343 688365 410468
38100D10468k05500k41457k91781k38698j35760K2950K87522M47677K19995j99993
38090G5423k98470m8542K6518k43734l44279O0233N32315N48316K67226J42825
38080G17831J88928J27786n7761k03059l27763m75645m31225m2508L74461L83889
38070B54934K7476k96941l77682k59725R223L12975L57621M5150k37754j30520
38060b95243J17733O7681j23072M2057M56082M50905j06241m69119j03152M59798
38050D97429L74724k72015n92704j88473L05945J87664k73399k40934M19947Q80309
38040A098493N12829k22347m83751k32682q4814k08752j55986J88726L10733j8005
38030G04444k84147j14229Q3549r2416k50983P6058M63782K08496m26053n23543
$$ plain form
38100 410468 204968 -36489 -328270 -566968 -702728 -679778 -392256 55421 275416 75423
38090 75423 -223047 -271589 -245071 -488805 -833084 -772851 -240536 307780 575006 717831
38080 717831 906759 1034545 976784 773725 445962 -29683 -460908 -503416 -128955 254934
38070 254934 282410 -14531 -392213 -651938 -642715 -329740 27881 73031 -164723 -295243
38060 -295243 -177510 -109829 -232901 -190844 265238 716143 609902 140783 37631 497429
38050 497429 872153 600138 7434 -181039 124906 312570 39171 -201763 218184 1098493
38040 1098493 1611322 1388975 905224 672542 587728 378976 222990 411716 722449 704444
38030 704444 420297 306068 389617 297201 46218 122276 586058 794554 368501 -155042
38020a55042M3816M35362J90075j38776Q860L18173J92820k98502n80965l82453
38010c66632M9311L72882M46836K82009j0299k12347j36824J51096L23438J06630
38000A006100l52248n50647k23832K25185J90880k70608m79004j29095K77513
37991c05756K69297J12277K20659L80922K03426o0375Q1899M12640K96204j92002
37981A419191l17567P0935K46520j82905n83220k88089L38368M22077j88228p58540
37971A78542o28097N3149N63312M10496j48706m30445j82282J19833L9088j09881
37961a34991J97121P14137O94323P6170l67024j94272J25902P8612j41482j39432
37951I09064r107l5061j45673j37073r3730j41984r5574K01995M44131K42621
$$ plain form
38020 -155042 -111226 324136 514211 375435 384295 702468 895288 596786 15821 -366632
38010 -366632 -317321 55561 502397 784406 774107 561760 424936 576032 899470 1006100
38000 1006100 653852 103205 -120627 104558 295438 24830 -454174 -583269 -305756
37991 -305756 -36459 75818 296477 677399 880825 820450 902349 1314989 1611193 1419191
37981 1419191 1101624 1172559 1419079 1236174 652954 364865 703233 1125310 937082 178542
37971 178542 -449555 -396406 166906 577402 428696 -1749 -184031 -64198 -25110 -134991
37961 -134991 62130 776267 1470590 1546760 1179736 985464 1111366 1189978 1048496 909064
37951 909064 899957 864896 719223 582150 488420 346436 250862 452857 896988 1139609
37941A139609k31385m41740k34220J8901K235j69857k23790j10894m668l0406
37931b86215r7410j8776K18775L98788L63842K32850J77477J36366n437j07278
37921A012982K3262K32682K12811O827r6548r7995k23402l60783j33216M00789
37911I77409O99097N25007K21105L3686k28250o07979o91588k63664K44363L68157
37901A277343K23854J17633K368k22588k94192k357K93002J14378l62019n03278
37891F44144q6969M67812O85583M81856M6419l98594o68164o44922l45639M1366
37881B22892K01005p5892n57811o69240j97495L32096L85364K25348L89587O66404
37871I22258M59715p109M3060M43973J54163q45524j141622j10712Q26869L24882
$$ plain form
37941 1139609 908224 466484 232264 251165 253400 83543 -140247 -251141 -255809 -286215
37931 -286215 -383625 -402401 -183626 215162 579004 811854 989331 1125697 1120260 1012982
37921 1012982 1036244 1268926 1481737 1488564 1392016 1294021 1070619 709836 576620 977409
37911 977409 1676506 2201513 2422618 2456304 2228054 1620075 928487 664823 909186 1277343
37901 1277343 1501197 1618830 1621198 1398610 1104418 1102061 1395063 1509441 1147422 644144
37891 644144 557175 1024987 1710570 2192426 2238845 1840251 1172087 527165 181526 222892
37881 222892 423897 348005 -209806 -879046 -1076541 -744445 -359081 -133733 255854 922258
37871 922258 1381973 1374864 1417924 1861897 2016060 1170536 28914 -81798 745071 1069953
37861A069953p01079n24949N86086Q21027k41712j006795m03212N96264O63806
37852H59389L8012j79173J93919L64983o6719n87172o15308k48220M2632J07112
37842i0545K04919M72125O11753L21641j59444l03336m1146J84499J51454R8215
37832A450135Q7681k15271p87792r31652k50177O14169Q35012N00651J90124n1242
37822A441638m83876q01391m45136L45012O93100L17791j69583k47052n9045P1499
37812F62957P7418j0461j31597o7416K78986N34125L02122j46897k16733J02847
37802A385351L02177K18355J28925O1941k00723m39913j71991L85768L98479k80795
37792A787574p24959k58652N49252P30369K09115k87312k60819Q5867K34956p7398
$$ plain form
37861 1069953 368874 -156075 430011 1251038 1009326 2531 -400681 195583 859389
37852 859389 897401 718228 912147 1277130 1210411 623239 7931 -240289 -197657 -90545
37842 -90545 114374 586499 1198252 1519893 1360449 1057113 1015967 1200466 1351920 1450135
37832 1450135 1537816 1322545 534753 -396899 -647076 -32907 802105 1302756 1492880 1441638
37822 1441638 957762 156371 -288765 56247 749347 1067138 897555 650503 591458 662957
37812 662957 740375 729914 598317 530901 809887 1344012 1646134 1499237 1282504 1385351
37802 1385351 1687528 1905883 2034808 2096749 1896026 1456113 1284122 1669890 2068369 1787574
37792 1787574 1062615 803963 1353215 2083584 2292699 2005387 1744568 1830435 2065391 1987993
37782A987993n67454o19223q874O54352O04271k3966l47142J7530M64981L42461
37772B504929j98996n81528n52367k38391J68451M60285M28205R8653k28369l17313
37762A543559j91695K7213K16540K14642J6358m2022L15435P73552P63908L03961
37752C941451l1771j143K3904k25864m90099m62125k07228Q6584L26742L52728
37742C313179M0388l02602j81264K84624L81614j45438o63058n89979j71366J18601
37732B084699L80547Q91368J307679R97947O3956o11700m40627K19328O62639
37723E555836P02939O32771N64361K88410j59879k86365J53214N86374L29239
37714H366900l28722m49199J54136O38216M32436k9675k35346l73573o43212o27270
$$ plain form
37782 1987993 1420539 801316 792442 1446794 2051065 2027099 1679957 1697487 2162468 2504929
37772 2504929 2305933 1724405 1172038 933647 1102098 1562383 1990588 2089241 1860872 1543559
37762 1543559 1351864 1379077 1595617 1810259 1826617 1784595 2100030 2873582 3637490 3941451
37752 3941451 3909680 3908537 3932441 3706577 3216478 2754353 2547125 2633709 2960451 3313179
37742 3313179 3353567 3050965 2869701 3154325 3535939 3390501 2727443 2137464 1966098 2084699
37732 2084699 2465246 3356614 4664293 5662240 5726196 5114496 4673869 4893197 5555836
37723 5555836 6258775 6891546 7455907 7744317 7584438 7298073 7451287 8037661 8366900
37714 8366900 8038178 7588979 7743115 8381331 8813767 8784092 8548746 8175173 7531961 6904691
37704F904691q7982L57201J68664j81630o7161J78637l0790l56030j42579L36612
37694G079633L82013J31299J67090L19655P2464k59805k1694M96785N45306K91731
37684I204477L83001N58433J61934l65612r4148O27290O76025J49960J13864N93870
37674A2009094O72055M09821P35940J498827J620373J167185J249422J883230
37666B1245947K041109J776366K110830K922803L281616L664068N248309P308666
37658D9599714Q228058Q692247J0520371J2878028J3739559J4592963J8779247
37651A37030187K5679284L2644774M1850744N5841894O4682429M9954592R473989
37644D17157893l1773460m6357251l3574060j2880298M590438K1517969L3974278
$$ plain form
37704 6904691 6816709 7173910 7342574 7160944 7093783 7272420 7241630 6885600 6743021 7079633
37694 7079633 7461646 7592945 7760035 8079690 8152154 7892349 7870655 8367440 8912746 9204477
37684 9204477 9587478 10145911 10307845 9942233 9848085 10475375 11151400 11301360 11415224 12009094
37674 12009094 12681149 13090970 13826910 15325737 16946110 18113295 19362717 21245947
37666 21245947 23287056 25063422 27174252 30097055 33378671 37042739 42291048 49599714
37658 49599714 57827772 66520019 77040390 89918418 103657977 118250940 137030187
37651 137030187 162709471 195354245 237204989 293046883 357729312 407683904 417157893
37644 417157893 385384433 339027182 305453122 292572824 297163262 318681231 352655509
37637C52655509K6038927p058650m4770847o1833814n5213700m0865535l0615908
37630A38335982k3635483j7070376j2776290j1929090j1570907r483418p192696
37623D4677722o146596n206587l572536k522062k710096k802593k089184j729731
37615A7898337k250485k332295j272709l79443o92126j297121j112497o17909
37607G943752o14206p45724m34773p5569k04598m55406k94469J5669J1831j25082
37597E021425n9941k5810l66560q14251q14827k84165L57834O73933N08885N0668
37587D247191k83190k41175j8066P4100N6817J09182J75716J27493O5392P6245
37577D389705m65j59278p711N38848Q32607M02689j98926k13025J27901Q5004
$$ plain form
37637 352655509 378694436 371635786 326864939 265031125 209817425 168951890 138335982
37630 138335982 114700499 97630123 84853833 72924743 61353836 51870418 44677722
37623 44677722 38531126 33324539 29752003 27229941 24519845 21717252 19628068 17898337
37615 17898337 15647852 13315557 12042848 11663405 10971279 9674158 8561661 7943752
37607 7943752 7329546 6583822 6149049 6073480 5868882 5413476 5119007 5134676 5146507 5021425
37597 5021425 4961484 4935674 4569114 3754863 2940036 2655871 3013705 3687638 4196523 4247191
37587 4247191 3964001 3722826 3704760 3778860 3835677 3944859 4120575 4248068 4313460 4389705
37577 4389705 4389240 4229962 4222251 4761099 5593706 5996395 5797469 5584444 5712345 5797349
37567E797349k94559l37215O4692L88402M38134M34678L05830j53239n37986k75704
37557E830382K28816m0897j087276j686544j093956n1959L01146j88544q03025
37548A408143r11911m82241K4053J05071j91594k62933J52509M55115J22861l11970
37538A07103p7639M70707L97769j74509k55637K55800L94862j14721l57403R2858
37528G39190L80495p0447m94018j66690K88307M6707m21199k15457L54290L07725
37518G48903k76216m03115J30680M49419R8214l21246k97705j82291l58284m82926
37508h94567j67716K16088J22763j82580K708O20541Q27416K93238k22742j6697
37498E98452M38206K17468n38818p39472j9919O23515L01686m55208n56395L9619
$$ plain form
37567 5797349 5502790 5165575 5230267 5618669 6056803 6491481 6797311 6644072 6106086 5830382
37557 5830382 6059198 6018301 4931025 3244481 2150525 2098566 2399712 2211168 1408143
37548 1408143 496232 13991 38044 143115 -48479 -311412 -158903 296212 419073 107103
37538 107103 29464 500171 897940 723431 467794 723594 1118456 1003735 646332 739190
37528 739190 1119685 1049238 555220 388530 676837 723544 302345 86888 441178 748903
37518 748903 472687 69572 200252 649671 747885 426639 128934 -53357 -411641 -894567
37508 -894567 -1062283 -846195 -723432 -906012 -903304 -282763 544653 837891 615149 598452
37498 598452 1036658 1254126 715308 -24164 -44083 579432 881118 425910 -130485 -90866
37488i0866M32388J90248k35658m11847l97705k85620l2023J63601K1397k10141
37478h56226m9282K81616J11164l72442j60420Q53048J352777N15652o33534p57945
37468B84408j77631p9825m69376l71151K67849M34535j34674m55825J8435N12861
37458a70394L12786q2477N7881M70833N06364K43736J14322j5302m45994p70294
37448B21461l91404L40712N05768J1723l54441k53160j59027k80583j63759K95049
37438b27661M53546O8953j01945M31013Q64801K86101p53935r55715k04959L73480
37428B33679K05848n5708J48244L75412J00796k90286j19869M68852O99206K59705
37418B025879l22464l92042P0645M49369J74134n79553r81082n31761K16983L41220
$$ plain form
37488 -90866 341522 531770 296112 -115735 -513440 -799060 -831083 -667482 -646085 -856226
37478 -856226 -905508 -623892 -512728 -885170 -1045590 -192542 1160235 1675887 1042353 284408
37468 284408 106777 26952 -442424 -813575 -545726 -111191 -245865 -701690 -683255 -170394
37458 -170394 142392 59915 117796 588629 1094993 1338729 1453051 1437749 991755 221461
37448 221461 -169943 170769 676537 688260 333819 80659 -78368 -358951 -522710 -227661
37438 -227661 225885 294838 192893 623906 1488707 1774808 1020873 65158 -139801 233679
37428 233679 439527 383819 532063 907475 1008271 717985 598116 1066968 1766174 2025879
37418 2025879 1703415 1311373 1382018 1831387 2005521 1425968 444886 -86875 130108 471328
37408D71328j91311n29811k30144J72617J20739j26157n3929K47236L26663J07185
37398C14416j31317k31146j83043O3752L98835M21606m6021n48141n38780j39849
37388f19688Q5345n2669k29858j74330M9247K68211L70941K93962J02340p854
37378H5647J2024l0767j77687j15177L36234Q10952Q35767M42524R369k45772
37368A963114k72794r389L99704N21175K18602o201K50032N67482L15417l22567
37358C624575o29591m46971k54205k80069k76249j58249j61008k86241k23399
37349I08593P7274K87275K20824P863k24098l67405j65774M03934P57721M04272
37339B310479j48850j9097O28601P70009J80653j89075K13793O89081N39104K08406
$$ plain form
37408 471328 280017 -249794 -479938 -307321 -186582 -312739 -366668 -119432 207231 314416
37398 314416 183099 -48047 -231090 -167338 231497 653103 607082 58941 -479839 -619688
37388 -619688 -534343 -587012 -816870 -991200 -941953 -673742 -302801 -8839 93501 85647
37378 85647 97671 66904 -110783 -225960 110274 921226 1756993 2199517 2208886 1963114
37368 1963114 1690320 1680931 2080635 2601810 2820412 2814211 3064243 3631725 3947142 3624575
37358 3624575 2994984 2548013 2293808 2013739 1737490 1579241 1418233 1131992 908593
37349 908593 985867 1273142 1493966 1501829 1277731 910326 744552 1148486 1906207 2310479
37339 2310479 2161629 2142532 2771133 3541142 3721795 3532720 3746513 4435594 4974698 5183104
37329E183104M26928R72744J136062R14451R19888J383143J979933K509815L119510
37320A8545578L803943M071741L258216J228291j070070j989576p55868J313341
37312B8405596J923105L96622j556039j955188o21365J271621K703841L059822
37304C3628015J761007j120609m193193n737573n344201l937766k495043j478911
37296A1081726j138023j370046j454728q58816j69882k85292q58348p17529J85012
37287D414074N84623m4626o25730l11827J06914l47237j026597o50503M96082
37278B595173Q55154j5581p65917l00291O98366R78397N77122N18255J065486
37269F206164J288570M68417q39393j534584j306425p67437m93990m68978m83080
$$ plain form
37329 5183104 5610032 6582776 7718838 8633289 9553177 10936320 12916253 15426068 18545578
37320 18545578 22349521 26421262 29679478 30907769 29837699 27848123 27092255 28405596
37312 28405596 30328701 30725323 29169284 27214096 26592731 27864352 30568193 33628015
37304 33628015 35389022 34268413 30075220 24337647 18993446 15055680 12560637 11081726
37296 11081726 9943703 8573657 7118929 6260113 6090231 5804939 4946591 4229062 4414074
37287 4414074 4998697 4954071 4328341 4016514 4123428 3776191 2749594 2099091 2595173
37278 2595173 3450327 3434746 2668829 2368538 3066904 4045301 4622423 5140678 6206164
37269 6206164 7494734 7963151 7123758 5589174 4282749 3515312 3021322 2552344 2069264
37260B069264n60294p12393o37504q5669O18081Q29992L81243k14361m11253k06923
37250A070183L2336O5806n1496j21756j61K49853L54836J34925j92961k44950
37240A296615j4952J15696k1713j44727m5320L9949j30049l43905k90662p8768
37230C82164J3161N0059K32689L90817K28797o5391n5635J64300P7828l44611
37220A074178n34717k62464K3161L1800Q6652L69541M32473Q0l88501k06147J45169
37209G71225R169l82831l11008J94155M26669J73377r1832j45593k61627m55798
37199g4094l45157P5110L04431J78405Q2020J37033k0883m07189m71599o8120
37189f10043J81264p5187l21576j18530J54673J01323P1440M04942O24305K21769
$$ plain form
37260 2069264 1508970 796577 159073 73404 691485 1521477 1902720 1688359 1277106 1070183
37250 1070183 1102519 1168325 1116829 995073 994912 1244765 1599601 1734526 1541565 1296615
37240 1296615 1281663 1397359 1375646 1230919 1185599 1225548 1095499 751594 460932 382164
37230 382164 395325 445384 678073 1068890 1297687 1232296 1176661 1340961 1418789 1074178
37220 1074178 539461 276997 300158 331958 418610 788151 1220624 1220704 832203 626056 771225
37209 771225 780394 397563 86555 280710 707379 880756 788924 643331 381704 -74094
37199 -74094 -419251 -344141 -39710 138695 220715 357748 336865 -70324 -541923 -610043
37189 -610043 -428779 -503966 -825542 -944072 -789399 -688076 -616636 -211694 412611 634380
37179F34380l31001k52946L06683N63394K80924j48073m68532o25013m07756J56299
37169b91641M17570m0734n29043j65695O79844Q90693K79602l34911n24899n55051
37159a74265m20527J42161O71264L36048n56777p48830l948M81651P1945l46079
37149e47357o0238K34934j38235m79105J7038O85888M71166k29654k62139K97766
37139i936L79595j40766k80117K41090M91639k9188n20075k23007L79285M34692
37129G23212O0222K4127N06901R04010P27149J65607k57646k62636j8789N4645
37119B626802k86209p99207r54394n15899J77958N78619M55955J4185l68755m28589
37109E00466j84513N2276n0427m26917n70852j19793N67136P17368J33962m54553
$$ plain form
37179 634380 303379 50433 357116 920510 1201434 1053361 584829 -40184 -447940 -291641
37169 -291641 125929 85195 -443848 -609543 70301 960994 1240596 905685 380786 -174265
37159 -174265 -594792 -452631 218633 554681 -2096 -750926 -754874 -273223 -201278 -547357
37149 -547357 -607595 -372661 -510896 -990001 -972963 -287075 184091 -45563 -307702 -9936
37139 -9936 369659 228893 -51224 189866 681505 652317 132242 -90765 288520 723212
37129 723212 783434 807561 1314462 2218472 2945621 3111228 2853582 2590946 2572157 2626802
37119 2626802 2340593 1541386 586992 71093 249051 827670 1283625 1297810 929055 500466
37109 500466 315953 368229 317802 -109115 -679967 -799760 -232624 484744 618706 164153
37099A64153l39520J57781J73224l12019l54057M30728J062193N93161l52245
37090A223399m42877L10328N77554j80022q76973n36174K57596M32398J10569
37081H75798J85802P05673P91549R9948o16344o31692k03205l9880k97075n17899
37071C52675l54927J0567J64415k4118k73456k50450K9260K55573K35368Q7764
37061B32671J1060L0293M0297l8460j91133k85332j54577J42846K66265N1307
37051A05237j32149J11268M67536K66984m26737p70944l76497J21942J00033j27701
37041f61028J9388L43353K34815k35620l70883P6231N56495N50729K14577O009
37031G34066L7324M7198j45604l74410l44730n3114J56722N7757j14881l8049
$$ plain form
37099 164153 -175367 -17586 155638 -156381 -510438 -79710 982483 1575644 1223399
37090 1223399 780522 1090850 1668404 1488382 611409 75235 332831 765229 875798
37081 875798 1061600 1767273 2558822 2658770 2042426 1410734 1207529 1167649 870574 352675
37071 352675 -2252 8315 172730 148612 -124844 -375294 -346034 -90461 144907 232671
37061 232671 243731 274024 314321 275861 84728 -200604 -355181 -212335 53930 105237
37051 105237 -26912 84356 551892 818876 392139 -378805 -755302 -633360 -533327 -661028
37041 -661028 -641640 -298287 -63472 -299092 -669975 -593744 -37249 513480 728057 734066
37031 734066 771390 818588 672984 298574 -46156 -99270 57452 115209 328 -37721
37021c7721J50489Q9538j37105j21532J02675P4921k22752k57731O5726J31582
37011a61910k71512m13066J69046P17899L72003m06181n23796M9178L62858N4667
37001e0814k57070j59080K010m5837j1608K64379L61822l7434n50206o02632j81039
36990a267509K71791M35517L05870L2643j82563j64094P4902L11484L36915J53206
36980C08162n1326o6794J40029L42272K81322Q285j96278k53021l12575l20739
36970a20663l9593L47446K67195k68041l94472L17627R53317M54509p31577j182960
36960c97212m59452M63040O85269L54865K306k19591l36777k86964j66336k09779
36950e70631l15662j20054L00569M03317O3526j50286J03177L57241J10806l38245
$$ plain form
37021 -37721 112768 202306 65201 -56331 46344 121265 -101487 -359218 -293492 -161910
37011 -161910 -433422 -846488 -677442 40457 412460 6279 -517517 -468339 -105481 -50814
37001 -50814 -307884 -466964 -464954 -510791 -522399 -258020 103802 66368 -483838 -1086470 -1267509
36990 -1267509 -995718 -560201 -254331 -221688 -404251 -568345 -493443 -181959 154956 308162
36980 308162 256836 190042 330071 672343 953665 961950 765672 512651 200076 -120663
36970 -120663 -160256 187190 454385 186344 -208128 109499 1062816 1517325 785748 -397212
36960 -397212 -856664 -393624 291645 646510 648816 429225 92448 -194516 -360852 -570631
36950 -570631 -886293 -1006347 -705778 -302461 -238935 -389221 -286044 71197 182003 -156242
36940a56242l68431J1663K40905O0868j99972j64476J45688M45131N17041L39676
36930H71851K5552k84851m96310n54518m07974l7369M53013P96444O81378M6405
36920A093621o75324q25519k87052K29154P4983l59373j96557N02992P44514J74632
36910D76071l47519j88364P3798j85876m55387n3307N32090M44011l1064l7736
36900B26717K43702j8156o07705m77831L57554O76885K9260n85886m33404q4690
36890f73554j59186k49988J40963N98773N27957J16755j37587k07479k42262j40258
36880d25866M9848n3839m54122n53421j15480K80881K33113J53854L59195L87059
36870a38778o4507l67042R030M51878J67704m54685m95416k7997J20168j81086
$$ plain form
36940 -156242 -524673 -513010 -272105 -211237 -411209 -575685 -429997 15134 532175 871851
36930 871851 897403 612552 116242 -438276 -846250 -883619 -430606 365838 1047216 1093621
36920 1093621 418297 -407222 -694274 -465120 -390137 -749510 -946067 -443075 301439 476071
36910 476071 128552 -59812 13986 -171890 -627277 -680584 -148494 295517 264453 226717
36900 226717 470419 452263 -155442 -633273 -275719 401166 430426 -155460 -588864 -673554
36890 -673554 -832740 -1082728 -941765 -342992 184965 301720 164133 -43346 -285608 -425866
36880 -425866 -376018 -429857 -883979 -1437400 -1552880 -1271999 -1038886 -885032 -525837 -138778
36870 -138778 -203285 -570327 -561297 -109419 58285 -396400 -891816 -919813 -799645 -980731
36860i80731k71222N1610K29471k2824k49571j4758M91242P68524N20980j45501
36850C77220p05983n82071J09067M96430J04579l83455j51893M45394M98994P8711
36840B86993L0213L75112J85819p14647j168530m02069O81120P75237L4974l17639
36830b33417J33448N53427K78244k59242l57783r4074R970p7039K6864K72947
36820B53345J62438l03514l89630K37569P73050L59612n33666p10920l7013L90968
36810B02239k6153n22103k73136L22054L78879q3273l03669n204L06038J84908
36800A80580j88823l32276j3341N09310O57275J20003o39871q12511k92393J76902
36790f35145J05131j06218K0661K46678J75290j701K9110L7250k17466l06888
$$ plain form
36860 -980731 -1251953 -1200343 -970872 -993696 -1243267 -1258025 -766783 1741 522721 377220
36850 377220 -328763 -910834 -801767 -305337 -200758 -584213 -736106 -290712 208282 286993
36840 286993 317206 692318 878137 163490 -1005040 -1407109 -725989 49248 84222 -233417
36830 -233417 -99969 453458 731702 472460 114677 20603 30573 -46466 -19602 253345
36820 253345 415783 112269 -277361 -39792 733258 1092870 559204 -151716 -188729 202239
36810 202239 176086 -346017 -619153 -297099 81780 -1493 -305162 -310366 -4328 180580
36800 180580 -8243 -340519 -353860 155450 812725 932728 292857 -519654 -812047 -635145
36790 -635145 -530014 -636232 -615571 -368893 -193603 -195304 -166194 -128944 -346410 -653298
36780f53298J55273N92759K61338l87729k96297M08031M91922l72290r70643m07105
36770a178039N37897O61320O7807k68466p5518P7762o6706j29368O8978J64075
36760a40258m4813j96811p778K02940M9943k28732j37046K44641L71826J17530
36750B31442q4583o0904j70918m81113m03003K90351P59483K29241o78666p43706
36740a112376L4178N37096L27261J05585K65175K81099q4094k11062J73388L84217
36730G00467M6440j57260J98968L72509j62986n58761m5476M98360o7816j027316
36720b02871p98567M63061J068402M24190l18189l38308j61227k40895j09646
36711b14050M52016P27413K65131k95134k83530J4794O2739n4000n4415m1915
$$ plain form
36780 -653298 -498025 94734 356072 -31657 -327954 80077 571999 199709 -770934 -1178039
36770 -1178039 -640142 21178 88985 -179481 -254999 -177237 -243943 -373311 -304333 -140258
36760 -140258 -185071 -381882 -389660 -186720 -136777 -365509 -502555 -257914 113912 231442
36750 231442 146859 85955 -84963 -566076 -969079 -678728 80755 309996 -368670 -1112376
36740 -1112376 -1078198 -541102 -213841 -108256 156919 438018 353924 142862 316250 700467
36730 700467 746907 589647 788615 1161124 998138 439377 393901 892261 824445 -202871
36720 -202871 -1001438 -538377 530025 954215 636026 297718 136491 -104404 -214050
36711 -214050 237966 965379 1230510 935376 651846 666640 729379 675379 620964 579049
36701E79049j14305n8912J03144m2141m81122n30502R7471P17436O92864L34922
36691A297904K06952K03369l5975l68669m53790l42732k12570J0807K60976J17348
36681F83620m63530p82539l92554J11637J1755l64124k24923L51330N85380K60088
36671b23860p9020j06392p9369j77889j94370j4570J49973J46781Q1422O2373
36661d34921R0412J89744L29881L10175O1114j05341M3027J53041k17449p46178
36651c26495o52526J24817P31486N68854N9374q0758J59422K50277k7234l61538
36641D45679m30983k64292p2617J4459l4k1002P4762K77406L52438R5239k95642
36630A75413l52451J1076K60555l5906m80766l53711K47840M63059J6372k71820
$$ plain form
36701 579049 464744 405832 508976 466835 -14287 -544789 -447318 270118 962982 1297904
36691 1297904 1504856 1708225 1672250 1303581 849791 507059 294489 305296 566272 683620
36681 683620 220090 -562449 -955003 -843366 -831611 -1195735 -1420658 -1069328 -483948 -223860
36671 -223860 -302880 -409272 -488641 -666530 -860900 -875470 -725497 -578716 -497294 -434921
36661 -434921 -344509 -154765 175116 485291 546405 441064 484091 637132 419683 -326495
36651 -326495 -979021 -854204 -122718 446136 505510 424752 584174 834451 807217 445679
36641 445679 14696 -249596 -322213 -307754 -307788 -328790 -254028 23378 375816 471055 175413
36630 175413 -177038 -165962 94593 58687 -422079 -775790 -527950 -64891 -48519 -320339
36620c20339K03290P55529M43037l84669o12300j26782J16863k20309l44356K04199
36610b85837P22824N46081Q2930m3485m2017l28011n63611k39207L03538L51589
36600E04794m4687k87763k63507k63511j50187M12138J008424P84952j90509q28648
36590F81496n26480O5220J30430k04842l28562j25490M2350j1575j41907j80468
36580e99828o9815J68120L76440L32932L6574k40841k98154k10001j19701n8667
36570f82941l1664k5951R5618L98460N67768K30373l48465m42105N3001L28942
36560A43036j23994o32547l29094M55059O62640J31057k62950j03133q893l64760
36550d33579n15223O6814O62588L40526m77783o34315r8714P0131l89206m79894
$$ plain form
36620 -320339 -117049 638480 1081517 696848 84548 -42234 74629 -145680 -490036 -285837
36610 -285837 436987 983068 1065998 1022513 980496 652485 88874 -150333 153205 504794
36600 504794 460107 172344 -91163 -354674 -504861 -92723 915701 1700653 1510144 681496
36590 681496 155016 220236 350666 145824 -182738 -308228 -265878 -277453 -419360 -599828
36580 -599828 -669643 -501523 -125083 207849 244423 3582 -294572 -504573 -624274 -682941
36570 -682941 -714605 -740556 -644938 -246478 321290 551663 203198 -238907 -185906 143036
36560 143036 19042 -613505 -942599 -487540 175100 306157 43207 -59926 -68819 -433579
36550 -433579 -948802 -881988 -219400 121126 -356657 -990972 -1089686 -1019555 -1408761 -1888655
36540a888655K54263Q21593M28018j64163J8313M49721Q2943o76154n45540M10097
36530h09564P89939J42379l88112q3197K30702j94947o57726k60233N22493O58384
36520d9882J72154j71624k14566l23631l89805j3648N46261O22809K11651r2559
36510B97160r3471p0872j6960K92929N57893K31685m39871o03092j27054J66454
36500A94801j91317o47260n63809o4742L80603N55313L97300n4469l72605p0024
36490d36209N45217N73320j35881o45882l39642J63926P3267l50203l57262Q2015
36480h27334M08454M00743K59434Q4808r4803p7021J52522J55321k80574n99224
36470d17674k81389K26368J78752k36080k47582J64998L03035J8141j02148J07576
$$ plain form
36540 -1888655 -1634392 -812799 -384781 -548944 -530631 -80910 2033 -674121 -1219661 -809564
36530 -809564 -19625 122754 -265358 -348555 -117853 -312800 -970526 -1230759 -708266 -49882
36520 -49882 122272 -49352 -263918 -587549 -977354 -991002 -444741 178068 389719 297160
36510 297160 203689 132817 115857 408786 966679 1198364 758493 155401 28347 194801
36500 194801 3484 -643776 -1207585 -1272327 -891724 -336411 60889 6420 -366185 -436209
36490 -436209 109008 682328 546447 -99435 -439077 -275151 -201884 -552087 -909349 -827334
36480 -827334 -418880 -18137 241297 326105 231302 154281 306803 462124 181550 -417674
36470 -417674 -699063 -472695 -293943 -530023 -777605 -612607 -309572 -291431 -393579 -286003
36460b86003J02394k59338l33534J63878N55393K91181j68190j84405M6966J2109
36450e9549j89193j71910m1490q0971p6105K49574M80522P6220n41508m31969
36440g86379L82404Q51926M62765o9698j9543K60796K5917o56422j003043n60425
36430a111702K93596P69793L81951n63567j113004o30653L37198O51581J11283
36421h73524k91696R2984O00211L85812k15707l26887K4766J11738j51373j66641
36411h10317J18578N8375m40174n73225M4288O41475M38473k14841m85680k40479
36401a463527R5333L61172O13682O23233J78923l20902l03253Q8438K26633K0154
36391A19886l9197J56679J27961k42627l43111J70844O59205L57102m74672q89557
$$ plain form
36460 -286003 -183609 -442947 -776481 -612603 -57210 233971 65781 -118624 -71658 -59549
36450 -59549 -248742 -420652 -462142 -543113 -619218 -369644 110878 187098 -354410 -786379
36440 -786379 -403975 447951 910716 841018 821475 1082271 1108188 451766 -551277 -1111702
36430 -1111702 -818106 -48313 333638 -229929 -1342933 -1973586 -1636388 -984807 -873524
36421 -873524 -1165220 -1072236 -472025 -86213 -301920 -628807 -604041 -492303 -643676 -810317
36411 -810317 -691739 -633364 -1073538 -1646763 -1602475 -961000 -522527 -737368 -1223048 -1463527
36401 -1463527 -1368194 -1007022 -393340 229893 408816 87914 -215339 -126901 99732 119886
36391 119886 80689 237368 365329 122702 -220409 -49565 609640 966742 492070 -397487
36381c97487n28100N5796K83125J91861Q5221L1355k3155K2208K44317M14501
36371C79642K38120j60856l14014m0626K73973K01698j50195l34091j76619J16374
36361C3406L66404N27947M05143k03388q95875p98701K29383J031596N13736p39237
36351D70414j123495k55352N04635J08628o50662m62303M59849P89383J52358
36342f545m63919l79608r5017j47118j82996J86706M98109K30021j76645l0587
36332e67599L66645K23706l02739l18022K31706L92689j76666n93412k27466K87984
36322f83174K16640o3242J02498L75312P4180m63980l67833K34790M01068j277
36312a75018j18282K99254M08876j88954o32115k33318K94298J7074n95857m01455
$$ plain form
36381 -397487 -925587 -869791 -586666 -394805 -309584 -278229 -301384 -279176 -34859 379642
36371 379642 617762 456906 142892 102266 376239 577937 427742 93651 -82968 33406
36361 33406 399810 927757 1332900 1129512 233637 -565064 -335681 695915 1209651 470414
36351 470414 -653081 -908433 -403798 -295170 -945832 -1408135 -948286 -158903 -6545
36342 -6545 -470464 -850072 -945089 -1092207 -1275203 -1088497 -590388 -360367 -537012 -567599
36332 -567599 -200954 22752 -279987 -598009 -366303 26386 -150280 -743692 -971158 -683174
36322 -683174 -466534 -529776 -427278 -51966 22214 -441766 -809599 -574809 -173741 -175018
36312 -175018 -293300 5954 414830 225876 -406239 -639557 -345259 -328185 -924042 -1325497
36302a325497M98120Q21062O5246p51933o26085R5394M46218K44724P7499K18131
36292b37121K62875j36005o73833p45530j87705N06646O80901J70389n22057p16777
36282a598217k44408M02057O38521M25346K11021K88386M09820J52490m61921
36273B23095r09199p47750j27516L72297L63924K5533j60423J6180K81317K94567
36263c67975J44825J94307M54402M84946R1699k65145j41616J41490p976m16845
36253C12112l39207L07884P02639L44588k41495m13863l01543k61497j35896K59080
36243B32802M79999R8691m37023m28789o5610m5942l41325l17732N5373J52963
36233f16593j30090j76885K03366L88738J1274m37306m30533j13637J57099L19151
$$ plain form
36302 -1325497 -827377 -6315 58931 -693002 -1319087 -1223693 -777475 -532751 -455252 -237121
36292 -237121 25754 -110251 -784084 -1529614 -1717319 -1210673 -529772 -359383 -881440 -1598217
36282 -1598217 -1842625 -1440568 -802047 -376701 -165680 122706 532526 685016 223095
36273 223095 -686104 -1433854 -1561370 -1189073 -825149 -799616 -960039 -943859 -662542 -367975
36263 -367975 -223150 -28843 425559 910505 1002204 737059 595443 736933 728957 312112
36253 312112 -27095 280789 983428 1328016 1086521 672658 371115 109618 -26278 232802
36243 232802 712801 811492 374469 -54320 -119930 -165872 -507197 -824929 -769556 -616593
36233 -616593 -746683 -923568 -720202 -331464 -320190 -757496 -1188029 -1301666 -1144567 -825416
36223h25416L38521P9665k69836k62008Q5881K68027J66738K05675M41361L74017
36213F02625n3288k12645O2084Q7036l97251o09465p9689M10911J22360l58764
36203d26086j66896L29585K35571k91834m03802m2901J48249P2783J51140K89649
36193a04542N4129k76075j702O82832Q04412J22991n07604m27334J07484N93438
36183A048029P81768M48683m09464j074213p57466J37396M01787k01734o44159
36174b69373l46500J0093j37652k36124K53987P35066M21411l24082n76430k64360
36164g33964n4983j53719j33955J62898L66177K55762P7992P6456J62703J58155
36154A83522L7902j33222k65466k26317L2640L18241L34457J0549l89914m94482
$$ plain form
36223 -825416 -486895 -407230 -677066 -939074 -853193 -585166 -418428 -212753 228608 602625
36213 602625 549337 336692 398776 485812 88561 -520904 -600593 -189682 -67322 -426086
36203 -426086 -592982 -263397 -27826 -319660 -723462 -766363 -618114 -545331 -394191 -104542
36193 -104542 -50413 -326488 -328190 354642 1159054 1282045 774441 347107 454591 1048029
36183 1048029 1829797 2278480 1869016 794803 37337 174733 576520 374786 -269373
36174 -269373 -615873 -605780 -743432 -979556 -725569 9497 430908 106826 -469604 -733964
36164 -733964 -788947 -942666 -1076621 -913723 -547546 -291784 -213792 -137336 25367 183522
36154 183522 221424 88202 -177264 -403581 -370941 -52700 281757 292306 -97608 -592090
36144e92090j65009L16912M62595J22847k50613j28998L57173N33472Q3095n03588
36134B35796n42961J6266N67202N31247m0979n22266l84734J54492L48733j05418
36124B57378o21521n32066n216L04593K37201J56701J74691L7369k26206k32437
36114d49513O9168K56991J40999K8074J08960J44084k2832j66806j33918r9945
36104a24738j48078p7475J26324J29577j51310k66035R8256N46602M55664k14133
36094C74654q64547q71053j49401P10646R26635L97031r8000L0477K56257j95971
36084E16728q93468o91823L68628R30772L58073l72762l42123M468p915k9309
36074a58731L96229O75072J55957n19780l81695J76819Q2095m89120l99561M00816
$$ plain form
36144 -592090 -757099 -440187 22408 145255 -105358 -234356 122817 656289 739384 235796
36134 235796 -307165 -290899 276303 807550 766571 244305 -140429 14063 362796 257378
36124 257378 -364143 -896209 -901425 -596832 -359631 -202930 -28239 9130 -217076 -449513
36114 -449513 -380345 -123354 17645 45719 154679 298763 275931 109125 -24793 -124738
36104 -124738 -272816 -350291 -223967 -94390 -245700 -511735 -413479 133123 588787 374654
36094 374654 -489893 -1360946 -1510347 -799701 126934 523965 425965 456442 712699 516728
36084 516728 -376740 -1068563 -699935 230837 588910 216148 -125975 -121507 -129422 -158731
36074 -158731 237498 912570 1068527 548747 167052 343871 425966 -63154 -462715 -61899
36064f1899P01911O3145m85837k13776J88316o4847n21081l58632K26850M34794
36054i1056J52173m3636Q5865J71951n9228l97109n10618l30412k4604J80740
36044h65934J60751P070o7164J0496J41175K89749M86675N55144K13169l90862
36034E40269o52885l15633Q4561j4131l14792j17847N09687P07906P1369p00910
36024b02406p26940n7264N49416O45639M00952P1629k81246n27482m31454n2542
36014f11698K04849J42839L5173J21514J81535p0085m40075m86007j26879L13137
36004g35697N45799N08955K60533k3711j04886j4652j11282m87426o45605k28820
35994a036792K65071J46449l46516l88477Q7593K90656r5917m11480j49816K60289
$$ plain form
36064 -61899 640012 703157 217320 3544 191860 127013 -394068 -752700 -525850 -91056
36054 -91056 61117 17481 103346 275297 216069 -181040 -691658 -1022070 -1046674 -865934
36044 -865934 -705183 -698113 -765277 -754781 -613606 -323857 162818 717962 931131 540269
36034 540269 -112616 -428249 -343688 -357819 -672611 -790458 -280771 427135 498504 -202406
36024 -202406 -929346 -986610 -437194 208445 609397 681026 399780 -127702 -559156 -611698
36014 -611698 -406849 -264010 -228837 -107323 74212 4127 -435948 -921955 -1048834 -735697
36004 -735697 -189898 319057 579590 555879 450993 436341 325059 -162367 -807972 -1036792
35994 -1036792 -771721 -625272 -971788 -1360265 -1272672 -982016 -1077933 -1489413 -1639229 -1378940
35984a378940K68546O6289P7050J82997P4031q4511N3607L67556M55546K35680
35974C17851p2160l25639m51944l34646n6405M2596j31170k17330k1130J08523
35964a141454o3875j21751L10300P66611N43977j66755n00070j66731K17592J02215
35954b19941l02223m66227k49681N1047J54186J37358L25853P77158R80423M26022
35944A613975n16540q38534k23861M50502L25478l09715o14032l80823Q797L52653
35934a32100O17473N23587p6582o40363n19537N4968K98864M3692j67849p2068
35924f9915J506j54309k85462j67564J00900L47195M23638J51363l62702n58015
35914e73365j37017L25140J83397j89588k5302M09217J70077o20375p16790K61316
$$ plain form
35984 -1378940 -1110394 -1044105 -967055 -784058 -710027 -794538 -740931 -373375 82171 317851
35974 317851 245691 -79948 -531892 -866538 -922943 -880347 -1011517 -1228847 -1249977 -1141454
35964 -1141454 -1205329 -1327080 -1016780 -250169 293808 127053 -373017 -539748 -322156 -219941
35954 -219941 -522164 -988391 -1238072 -1187025 -1032839 -895481 -569628 207530 1187953 1613975
35944 1613975 1097435 258901 35040 485542 811020 501305 -112727 -493550 -484753 -132100
35934 -132100 485373 1008960 932378 292015 -227522 -172554 126310 170002 2153 -69915
35924 -69915 -68409 -222718 -508180 -675744 -574844 -227649 195989 347352 -15350 -573365
35914 -573365 -710382 -385242 -201845 -391433 -416735 -7518 162559 -457816 -1174606 -913290
35904i13290J074190O98737k08350m89342j78677m9253j89029j12243J41361Q6949
35894a38947k07683j76384K05801L19639k4475k05564J99580O67956M65381k62474
35884H42830o60545l01983L00815M07889m1741m51657l54819P5986L25440J41131
35874B83346k63904m88979l16875J09370M04437L17155J3908j46584j04163j16903
35864c09192k76906l59791k59655j67464j37357O3864M08056M26823k0061l32152
35854i63835o0169L12654J63148j82717j2822M78130M57683j37712m88947k09033
35844f43620K02950L40275L70929L44155l1961o01142o60980q5687K91907o8249
35834e41423n48280l53366L07714O79710N69587L36962J76211L0208o2696n6852
$$ plain form
35904 -913290 160900 859637 651287 161945 -16732 -65985 -255014 -367257 -225896 -138947
35894 -138947 -346630 -523014 -317213 2426 -22049 -227613 -28033 639923 1105304 842830
35884 842830 182285 -119698 181117 589006 547265 95608 -259211 -183225 142215 283346
35874 283346 19442 -469537 -786412 -677042 -272605 44550 58458 -88126 -192289 -309192
35864 -309192 -586098 -945889 -1205544 -1373008 -1510365 -1446501 -1038445 -611622 -631683 -963835
35854 -963835 -1024004 -711350 -548202 -730919 -743741 -265611 192072 54360 -434587 -643620
35844 -643620 -440670 -100395 270534 614689 582728 -18414 -679394 -765081 -473174 -541423
35834 -541423 -1089703 -1443069 -1135355 -455645 113942 450904 627115 657323 594627 537775
35824E37775r7932k32084k07148O6788K06057q4549m65851m17519K4110L74146
35814b96207L23454m8713m35745m50188N6555O25374N78405k2052l68838j19484
35804a57439J14544q8923j75670L07761O52603L9386r20634r19609L9189O40619
35794d68173K79368j78820L0019L97111J69881l49336l57022J47835M46364K29843
35784C47070r8403j99554k29289l58464l73212m0708M25135N87408L49525N159
35774D14667k25803l93512m96989l28469J26796M38225K50713j38756j68662J40166
35764c81624K41550n2255l20215k72506j51810j70077j17656J29331K39302r885
35754h65845k52705j02057K00661K19584O3604J18239L04682K24448j02736k47822
$$ plain form
35824 537775 439843 207759 611 67399 273456 188907 -276944 -694463 -670353 -296207
35814 -296207 27247 -21466 -457211 -907399 -850844 -225470 352935 330883 -37955 -157439
35804 -157439 -42895 -131818 -307488 273 652876 692262 -228372 -1147981 -1108792 -468173
35794 -468173 -188805 -367625 -337606 59505 229386 -119950 -476972 -329137 117227 347070
35784 347070 248667 49113 -180176 -538640 -911852 -952560 -527425 59983 409508 414667
35774 414667 188864 -204648 -701637 -1030106 -903310 -465085 -214372 -353128 -521790 -381624
35764 -381624 -140074 -192329 -512544 -785050 -936860 -1106937 -1224593 -1095262 -855960 -865845
35754 -865845 -1118550 -1220607 -1019946 -800362 -736758 -618519 -313837 -89389 -192125 -439947
35744d39947q0836O5637k9117j90072k01358q2691N2105J43041J67666J63853
35734d31719K04003K09463q414l49466l85514Q314L58636K98952J41464K41394
35724B87113K54417k44305p61228m32930N36813R55238L00965n57919o12631L5020
35714b39447N59612M97977M7020l42108l56312p4381M6580k56337n38745k14589
35704h70730M18379M48918k41771o87288k81671L25000L25682j1385L4844L62943
35694a77079K91840k22344m86013j34422M08169N92790L43156o4393l13386k28667
35684I651M4096J19022j06384k30205J8387K46864m051m39601m22725P105K41215
35673e16626J18958P8328K84659L76212J95317M2618K5233j40466m56410m82977
$$ plain form
35744 -439947 -520783 -455146 -484263 -674335 -875693 -958384 -906279 -763238 -595572 -431719
35734 -431719 -227716 -18253 -26667 -376133 -761647 -753333 -394697 -95745 45719 287113
35724 287113 541530 297225 -464003 -896933 -360120 595118 896083 338164 -274467 -239447
35714 -239447 320165 818142 865162 523054 166742 92361 138941 -117396 -656141 -870730
35704 -870730 -452351 -3433 -245204 -932492 -1214163 -889163 -563481 -574866 -540022 -177079
35694 -177079 114761 -107583 -593596 -728018 -319849 272941 616097 551704 238318 9651
35684 9651 53747 172769 66385 -163820 -145433 101431 97380 -342221 -764946 -757841 -516626
35673 -516626 -397668 -319340 -34681 341531 536848 579466 604699 464233 7823 -475154
35663d75154j26330J13892o528r8154M3846K8732k70748k89496J87901M12409
35653d79630r4449n12403K7631Q54395O80668l26806p81154k12633M15507M04276
35643b4598J90125K22557K05213o9873j93504K2024R9846j89581l48984j00533
35633a87308O4764j62504k89294L0235K88451N1881k48979j87932j36975l79603
35623a157264l36236L48537Q32366L55754l04037r860P63803O61114k90657p78734
35613H4786l92634o4619k44896k46493K56752N54004K30183j08060j558J21913
35603A89378n0259q5831J87842J29973n09803q24253p8347R90036J141443L32321
35593A422500m37232n49090k40800N3795J44221K1782j57008j60125k427P7771
$$ plain form
35663 -475154 -601484 -487592 -494120 -592274 -548428 -519696 -790444 -1079940 -892039 -479630
35653 -479630 -574079 -1086482 -1058851 -204456 476212 149406 -631748 -844381 -428874 -24598
35643 -24598 165527 388084 593297 523424 329920 351944 451790 262209 -86775 -187308
35633 -187308 -122544 -285048 -574342 -544107 -255656 -203775 -452754 -640686 -777661 -1157264
35623 -1157264 -1493500 -1144963 -312597 43157 -260880 -270740 493063 1154177 863520 84786
35613 84786 -307848 -372467 -617363 -863856 -607104 -53100 177083 69023 67465 189378
35603 189378 139119 53288 241130 371103 -138700 -962953 -1041300 -51264 1090179 1422500
35593 1422500 985268 436178 195378 249173 393394 415176 258168 98043 95616 173387
35583A73387O1074J20968J14930k46314o46509m21435K54862M29909p1424k79120
35573e09672K29061N05502j02109o94657l29139L20495J60292l78802j63796N14265
35563d48560L72805n66947q60230N4288R90426Q63357J05879k98788j57009J34673
35553A89894L13087K39697j90886o93601o89177j09580L93411L29017l1973j83837
35543d33948k6686K57860N05300N14136J37802l52238m19771J5159M11665L42177
35533I51456k0527l21246m84962n34350l60774L4054L84970N10882N44965N94309
35523A298777M49212q7067p66010j078310q17326k70765J41343K90560L43467
35514d96119L95846K73814j43903n46774m79470k843L39318K91222J49397J05670
$$ plain form
35583 173387 234461 355429 470359 224045 -422464 -843899 -589037 -159128 -230552 -509672
35573 -509672 -280611 224891 122782 -571875 -901014 -580519 -420227 -799029 -962825 -448560
35563 -448560 -75755 -642702 -1502932 -1448644 -458218 405139 511018 212230 55221 189894
35553 189894 502981 742678 551792 -141809 -830986 -940566 -547155 -218138 -250111 -433948
35543 -433948 -460634 -202774 302526 816662 954464 602226 182455 197614 609279 951456
35533 951456 930929 609683 124721 -409629 -770403 -736349 -351379 159503 704468 1298777
35523 1298777 1747989 1660922 894912 -183398 -1000724 -1271489 -1130146 -839586 -496119
35514 -496119 -100273 173541 29638 -517136 -996606 -999449 -660131 -368909 -219512 -113842
35504a13842r4772n19084o68988k39198K56746K14493j27469j22599K59186N05691
35494f49836L98102J38647j28042l30761k58858R2621K61500j3012k31037R9690
35484f20986N57932M52877l2364k24119j10972j38877j93982J22488M67219J83712
35474D62928m10175m08781R7844J63977k73455k51625M11058O70446O8647m65429
35464F5435k67360q665l01254n09345M1246P48621P23486K18377j1623j6611k23577
35453D58730l59367M7951N81352M81567n5851j96972J56994L31032O7014k11271
35443A301179k75389l43670m24622k21496J95863L27219J2098l10463k74860n1395
35433f5536J5920j37479l34732l86105k17411M9816J80997J32170J30944L01963
$$ plain form
35504 -113842 -208614 -727698 -1396686 -1635884 -1379138 -1164645 -1292114 -1414713 -1155527 -649836
35494 -649836 -251734 -113087 -241129 -571890 -830748 -738127 -476627 -489639 -720676 -620986
35484 -620986 -63054 389823 357459 133340 22368 -116509 -310491 -188003 279216 462928
35474 462928 52753 -356028 -258184 -94207 -367662 -619287 -208229 462217 530864 65435
35464 65435 -201925 -210590 -511844 -1021189 -979943 -231322 492164 710541 698918 682307 458730
35453 458730 99363 147314 728666 1210233 1154382 957410 1114404 1445436 1512450 1301179
35443 1301179 1025790 682120 257498 36002 231865 559084 571182 260719 -14141 -65536
35433 -65536 -49616 -187095 -521827 -907932 -1125343 -1075527 -894530 -762360 -631416 -329453
35423c29453M34737L25205R4305o1279j58976k29124j37191J13267K21398L7232
35413C10121j54686j11258l8766j77143l37048k47797l7720L4534J5667M1549
35403g02547K0436q4519l1451K30903K92339m3727k68507O1561M92989L25664
35393B93141k32770l55270J28967N25068L21954k21778n90482n55930j71647K97864
35383e60883M33132O7665l98432m70950k11908o212R5804K62582L20524j7459
35373d86137m51999l45967K66438N98199K17984l46417l77358J12994N24562M36496
35363A48795q750l36341k39704Q6305J87811j193m0169K71714M45437N1722m70834
35352I4793m12167P5307K18668j15860k54163J21065M66476K90073j50119l93433
$$ plain form
35423 -329453 105284 430489 524794 463515 304539 75415 -61776 51491 272889 310121
35413 310121 155435 44177 5411 -171732 -508780 -756577 -794297 -759763 -744096 -702547
35403 -702547 -682111 -766630 -798081 -567178 -274839 -318566 -587073 -525512 -32523 293141
35393 293141 60371 -294899 -165932 359136 681090 459312 -131170 -687100 -858747 -560883
35383 -560883 -127751 -60086 -458518 -929468 -1141376 -1147588 -1051784 -789202 -468678 -486137
35373 -486137 -938136 -1284103 -1017665 -419466 -201482 -547899 -925257 -812263 -287701 148795
35363 148795 140045 -196296 -436000 -349695 -161884 -163077 -203246 68468 513905 565627 94793
35352 94793 -317374 -242067 -23399 -139259 -393422 -272357 194119 484192 334073 -59360
35342e9360m11693l33641p9278L22555N02935K51289j18991k58096k62181l18437
35332g64898k83041n7105J0861l33049o03558j58959O98287R55368L26187k82237
35322d92144r0767M08040K42718n17400q45979k87286M34869N71645L52705L38814
35312A15215M03680R9833l64881l87230m3311p573l73577m61106j533L72057J92045
35301d56381j07686k9015J53080K129k58308k04357K3740Q1330Q0698K37954L13279
35290a63537P9084j07947Q5643K64107r560l09765n6110L18256o481p32470p53221
35279a392001J07709Q22101P00868J44322k88485n25544m98762k8385N30477M71111
35269D3411j39038m25560p2125K49703J30489M4780K61220K14364l72993p39806
$$ plain form
35342 -59360 -471053 -804694 -883972 -561417 -58482 192807 73816 -184280 -446461 -764898
35332 -764898 -1047939 -1105044 -1094183 -1427232 -2030790 -2189749 -1491462 -536094 -209907 -492144
35322 -492144 -582911 -174871 67847 -449553 -1295532 -1582818 -1147949 -576304 -223599 115215
35312 115215 518895 618728 253847 -133383 -176694 -184267 -557844 -1018950 -1020483 -648426 -456381
35301 -456381 -564067 -593082 -440002 -437873 -696181 -900538 -876798 -795468 -714770 -476816 -163537
35290 -163537 -84453 -192400 -106757 157350 147790 -161975 -218085 100171 93690 -638780 -1392001
35279 -1392001 -1284292 -462191 238677 382999 94514 -431030 -929792 -958177 -427700 43411
35269 43411 -95627 -521187 -593312 -343609 -213120 -168340 92880 307244 -65749 -805555
35259h05555k82423L48257K53854l01808m36561n2083K63920L23565L86024L96529
35249I3719O6515m28198n85013l13421O5579L73958N65421M43881K3548j45311
35239A60678K75248O54247K16269o38930q10762j78994K48198l4596l25713K896
35229d31459M88495M16990o0707l10121j90738j4014R7998K03932J67967j19143
35219B49200l28047p3047L85810L83141j91464o89981n79569o9687L19167M12407
35209a82070L33550J27606j94790m17986l14631k9672O7335p9488j43397N6072
35199g77471K72359K18519k7885j78277r0741J64502L92314L23270j39786n94280
35189d37476m33277K96514P58234M09517k23851l71506j63690k21849m58310k44611
$$ plain form
35259 -805555 -1087978 -739721 -485867 -787675 -1224236 -1276319 -1012399 -688834 -302810 93719
35249 93719 160234 -267964 -852977 -1166398 -1100819 -726861 -161440 282441 305989 160678
35239 160678 435926 1090173 1306442 667512 -143250 -322244 -74046 -108642 -434355 -431459
35229 -431459 57036 474026 413319 103198 -87540 -101554 -3556 200376 368343 249200
35219 249200 -78847 -151894 233916 617057 425593 -264388 -843957 -913644 -594477 -182070
35209 -182070 151480 279086 84296 -333690 -648321 -677993 -610658 -690146 -833543 -777471
35199 -777471 -505112 -286593 -314478 -492755 -583496 -418994 -26680 296590 156804 -437476
35189 -437476 -870753 -574239 183995 593512 369661 -1845 -165535 -387384 -845694 -1090305
35179a090305L28445M23670j31856m51301k1312M37869J86027l01018j55422M35126
35169c40077N66878P0595l25769j86203J23606J75744K9879r9390j73187j75163
35159c33087o3233K0808j17479l20722k01614K53920N86820M71321Q7045k08398
35149A75381k69808j44930L9945Q9108j07129l65375l92277j77946M8210K00648
35139i04173L44963L84079J64024j16024q9808J29367M8991l15574l08697K76510
35129c86342O45799J37054o23921n13110M15188R45855M28933l76304m84047J7217
35119B06322L50137K10930p3089k52838l88030m64142l52861j76065j98845k91596
35109a430077k1717N63107P95824L47705j85925j30535K54728K30730k22585m03819
$$ plain form
35179 -1090305 -761860 -338190 -470046 -921347 -942659 -504790 -318763 -619781 -775203 -340077
35169 -340077 226801 297396 -28373 -214576 -90970 84774 114653 15263 -157924 -333087
35159 -333087 -396320 -375512 -492991 -813713 -1015327 -761407 -174587 296734 383779 175381
35149 175381 -94427 -239357 -199412 -110304 -217433 -582808 -975085 -1153031 -1104821 -904173
35139 -904173 -559210 -175131 -11107 -127131 -216939 -87572 -38581 -354155 -662852 -386342
35129 -386342 259457 396511 -227410 -740520 -325332 620523 1049456 673152 189105 206322
35119 206322 556459 767389 694300 441462 53432 -410710 -763571 -939636 -1138481 -1430077
35109 -1430077 -1451794 -888687 -92863 254842 68917 -61618 193110 423840 201255 -202564
35099b02564m5701K91229J68199q1273j5702J80587J27109l5873M2216J90058
35089F18285l6887m85683m77627J42389O48298M10455k46855n51546l13209K327
35079b90053M6701l9637k7502N0270Q3377J12653J91375K35461J89940J51401
35069G03986J36095n6960m79819p39461m64640N0783J67565j30131j62893L58226
35059f17249P72415M14234l69789p18950m34863k2514K16536M05647M79639J37345
35049B62451m40531n51200K8311N95300M81025m2085k83574j57419j16219k99680
35039e23621l41763j8159L79961M39829J21873k46740l25997n6042L20628N04135
35029B54104M05717J38478j73327m06301l53078N5372M44842L11095k51068n41214
$$ plain form
35099 -202564 -248265 42964 211163 129890 114188 294775 421884 386011 428227 618285
35089 618285 581398 95715 -381912 -239523 408775 819230 572375 20829 -292380 -290053
35079 -290053 -243352 -282989 -310491 -260221 -176844 -64191 127184 362645 552585 703986
35069 703986 840081 783121 303302 -436159 -900799 -850016 -682451 -812582 -975475 -617249
35059 -617249 155166 569400 199611 -519339 -954202 -976716 -760180 -354533 125106 262451
35049 262451 -178080 -729280 -700969 -105669 375356 333271 49697 -107722 -223941 -523621
35039 -523621 -865384 -883543 -503582 -63753 58120 -188620 -514617 -570659 -250031 254104
35029 254104 659821 798299 624972 218671 -134407 -79035 365807 676902 425834 -115380
35019a15380j76764L82139N16848K69486Q8157P5598k4768k71944m33450l92148
35009h2226k53612o9306J99977M32789L65808n9174n45458o91037l41958K21854
34999h22343M37315J5006n90488n86673J37869P89273P02059J60501j70582j74581
34989a02644j27191k9376K29909L32779q3771o43411o13827n3161K22074r3784
34979i62403l69267j18668K68285K83231J14806J86358L91877L52942P6488j65411
34969E8238l28632m80502m40267m5315L98540M39961J59320M4643K33110L44805
34959C83901J09655k66328m61458m03201j52739K34985N58465M74748q1529o57651
34949b61152p21918k78969J55264J69497j25646l18068j91056Q3941K04193J08366
$$ plain form
35019 -115380 -292144 89995 606843 876329 964486 1040084 1015316 743372 309922 -82226
35009 -82226 -335838 -405144 -205167 227622 593430 534256 -11202 -702239 -1044197 -822343
34999 -822343 -385028 -370022 -960510 -1547183 -1409314 -620041 82018 242519 71937 -102644
34989 -102644 -229835 -259211 -29302 303477 219706 -423705 -1037532 -1090693 -868619 -962403
34979 -962403 -1331670 -1450338 -1182053 -898822 -784016 -597658 -205781 147161 223649 58238
34969 58238 -270394 -750896 -1191163 -1236478 -837938 -397977 -238657 -194014 39096 383901
34959 383901 493556 227228 -234230 -637431 -790170 -555185 3280 478028 396499 -261152
34949 -261152 -983070 -1262039 -1106775 -937278 -1062924 -1380992 -1572048 -1488107 -1283914 -1175548
34939a175548M1331K21168M95928M74685N7877l29884k30401K21435M46508K07242
34929D30341r8671q0498O6868n1566l53569m46855l02581k15988j55351K02528
34919a005342O80088N65883k60748q35122l41386O43014Q76744J49893n47396
34910g4372m81631m830K28283J74433J81445L24359L61481J35099k42436m92213
34900A09618l89135l1064J69578J5655r5149K57912P08379M98839l00288p29490
34890B14855l29240J90597J11126k15325j13673K14390J16851k82651k68439J94270
34880a67239L46727j07114n24661l68633N3984K60909L03097L45673J70508l22229
34870h978o28273l23783J49214J09470k31457r0696N44027Q01989K96249k78525
$$ plain form
34939 -1175548 -1134217 -913049 -417121 57564 115441 -214443 -444844 -223409 223099 430341
34929 430341 331670 251172 318040 266474 -87095 -533950 -836531 -1052519 -1207870 -1005342
34919 -1005342 -325254 240629 -20119 -855241 -1196627 -553613 323131 473024 -74372
34910 -74372 -556003 -560833 -332550 -158117 23328 347687 709168 844267 601831 109618
34900 109618 -279517 -310581 -141003 -125348 -220497 37415 745794 1244633 944345 214855
34890 214855 -114385 76212 187338 -27987 -141660 72730 189581 -93070 -361509 -167239
34880 -167239 179488 72374 -452287 -820920 -766936 -506027 -202930 142743 313251 -8978
34870 -8978 -637251 -961034 -811820 -702350 -933807 -1024503 -480476 321513 617762 339237
34860C39237k81530o1836j83125l84942j14599L41664K00552m66857o62898P7393
34850a196941R51513R90468K86443l43366m67107k90459q7580P8879J60024Q0504
34840A62378q2799j55532q8272O3606K84059N03935M87176Q5456m51768o77073
34830A31166m41401o181K91231L11996J26634p2941j26741q4228j17388j94461
34820a82314r0425J56858J67246j51846l13427r16L01304J8558m96732m05098
34810i96792L13166P97163N72675Q4688j86165l52551n68686n76381k40122M5887
34800a107118m7067k48477j80701N3602J92490K77459L57663J99225k05339l12914
34790a021177J69802O00739K65344m17301m35087K33425N52870M9140m67621j96242
$$ plain form
34860 339237 57707 -4129 -187254 -572196 -686795 -345131 -144579 -611436 -1274334 -1196941
34850 -1196941 -245428 745040 1031483 688117 221010 -69449 -157029 -78150 81874 162378
34840 162378 79579 -75953 -164225 -100619 183440 687375 1174551 1260007 808239 131166
34830 131166 -310235 -316416 -25185 286811 413445 340504 213763 129535 12147 -182314
34820 -182314 -272739 -115881 51365 -100481 -413908 -414824 -113520 -94962 -591694 -996792
34810 -996792 -683626 113537 686212 770900 584735 232184 -336502 -912883 -1153005 -1107118
34800 -1107118 -1154185 -1402662 -1583363 -1529761 -1337271 -1059812 -702149 -502924 -708263 -1021177
34790 -1021177 -851375 -250636 14708 -402593 -837680 -604255 -51385 -2245 -469866 -666108
34780f66108M29212M36273k52544p80411n67043N8937M74677N15049M01706K50580
34770C00328q783l10525l91082j69439N8747K4269j11019n5782P3791l1880k05805
34759h27180M3789O04392O74224m2799p18313n37482J06296K76819q4061k64309
34749g68624m2817J12663M9341J61930M83339M67587j2568k94970K334K83625
34739D41840q3042p17119p68909j30935N05083N87803K12884j68857j94106J23646
34729a91712L29726j1950o51171q39185l66803J24483J68405J55392M78009O73290
34719a31516K01496m47639l91440K11720L99086l2787k76508M9059K69515j37339
$$ plain form
34780 -666108 -236896 199377 -53167 -833578 -1400621 -1341684 -867007 -351958 49748 300328
34770 300328 291545 -18980 -410062 -579501 -520754 -496485 -607504 -663286 -589495 -621375 -827180
34759 -827180 -783391 -178999 495225 452426 -265887 -803369 -697073 -420254 -504315 -768624
34749 -768624 -811441 -698778 -649437 -487507 -4168 463419 450851 155881 158215 441840
34739 441840 358798 -358321 -1127230 -1258165 -753082 -165279 47605 -121252 -315358 -191712
34729 -191712 138014 126064 -525107 -1364292 -1731095 -1606612 -1438207 -1282815 -804806 -131516
34719 -131516 69980 -377659 -769099 -557379 -158293 -191080 -467588 -418529 -149014 -286353
$$ [...]
##END NTUPLES=NMR SPECTRUM
##END=
