##TITLE=31Pdec_2PBDE1114
 CDCl3, 24 sc
 30.7.2019
##JCAMPDX= 6.0         $$ Bruker NMR JCAMP-DX V2.0
##DATA TYPE= NMR SPECTRUM
##DATA CLASS= NTUPLES
##ORIGIN= UXNMR, Bruker Analytische Messtechnik GmbH
##OWNER= root
$$ XWIN-NMR		Version 3.5
$$ Tue Jul 30 14:00:09 2019 Russian Standard Time (UT+4h)  she@DPX200
##.OBSERVE FREQUENCY= 81.013821
##.OBSERVE NUCLEUS= ^31P
##.ACQUISITION MODE= SIMULTANEOUS
##.ACQUISITION SCHEME= undefined
##.AVERAGES= 24
##.DIGITISER RES= 17
##SPECTROMETER/DATA SYSTEM= spect
##.PULSE SEQUENCE= zgpg30
##.SOLVENT NAME= CDCl3
##.SHIFT REFERENCE= (INTERNAL, CDCl3, 0, 182.463)
##AUDIT TRAIL= $$ (NUMBER, WHEN, WHO, WHERE, WHAT)
$$ ##TITLE= Audit trail, XWIN-NMR		Version 3.5
$$ ##JCAMPDX= 5.01
$$ ##ORIGIN= Bruker BioSpin GmbH
$$ ##OWNER= she
$$ F:/spectra/data/she/nmr/P31/1/pdata/1/auditp.txt
$$ ##AUDIT TRAIL=  $$ (NUMBER, WHEN, WHO, WHERE, WHAT)
(   1,<2019-07-30 13:59:29.60 +0400>,<she>,<DPX200>,
      <created by zg, POWCHK disabled, PULCHK disabled
       configuration hash MD5:
       00 E9 B6 7A A2 85 ED C7 34 08 36 98 17 FE 4E 26
       data hash MD5: 32K
       2E 49 B8 9A 6B 05 B1 AE BE 38 1C 6D C2 DE E1 5C>)
(   2,<2019-07-30 13:59:32.18 +0400>,<she>,<DPX200>,
      <Start of raw data processing
       efp BC_mod = 2 LB = 1 FT_mod = 6 PKNL = 1 PHC0 = -392.0295 PHC1 = 101.2 SI = 64K 
       data hash MD5: 64K
       86 47 0A 41 82 23 58 94 B8 ED 3A 5C 35 F9 7A C5>)
(   3,<2019-07-30 13:59:45.14 +0400>,<she>,<DPX200>,
      <pk PHC0 = 0.08618204 PHC1 = 0 
       data hash MD5: 64K
       0D 1A 98 62 9D 2E E4 C3 DA 2E 69 26 79 0B 04 8F>)
$$ ##END=
$$ 
$$ hash MD5
$$ 2F DC B6 B2 0C E1 00 86 70 34 BF 7A EE 84 C1 78
##$RELAX= 
##$RELAX= 
##$RELAX= 
##$RELAX= 
##$RELAX= 
##$RELAX= 
##$RELAX= 
##$RELAX= 
$$ Bruker specific parameters
$$ --------------------------
##$DU= <F:/spectra>
##$EXPNO= 1
##$NAME= <P31>
##$PROCNO= 1
##$TYPE= <nmr>
##$USER= <she>
##$AMP= (0..31)
100 100 100 100 100 100 100 100 100 100 100 100 100 100 100 100 100 100 
100 100 100 100 100 100 100 100 100 100 100 100 100 100 
##$AQSEQ= 0
##$AQ_mod= 1
##$AUNM= <au_zg>
##$AUTOPOS= <>
##$BF1= 81.014009
##$BF2= 200.13
##$BF3= 200.13
##$BF4= 200.13
##$BF5= 200.13
##$BF6= 200.13
##$BF7= 200.13
##$BF8= 200.13
##$BYTORDA= 1
##$CFDGTYP= 0
##$CFRGTYP= 5
##$CHEMSTR= <none>
##$CNST= (0..31)
1 1 145 1 1 1 1 1 1 1 1 1 1 1 1 1 1 1 1 1 1 1 1 1 1 1 1 1 1 1 1 1 
##$CPDPRG= <waltz16>
##$CPDPRG1= <>
##$CPDPRG2= <waltz16>
##$CPDPRG3= <>
##$CPDPRG4= <mlev>
##$CPDPRG5= <mlev>
##$CPDPRG6= <mlev>
##$CPDPRG7= <mlev>
##$CPDPRG8= <mlev>
##$CPDPRGB= <>
##$CPDPRGT= <>
##$D= (0..31)
0 1 0 0 0 0 0 0 0 0 0 0.03 2e-05 3e-06 0 0 0 0 0 0 0 0 0 0 0 0 0 0 0 0 
0 0 
##$DATE= 1564480769
##$DBL= (0..7)
120 120 120 11 120 120 24 19 
##$DBP= (0..7)
150 150 150 150 150 150 150 150 
##$DBP07= 0
##$DBPNAM0= <>
##$DBPNAM1= <>
##$DBPNAM2= <>
##$DBPNAM3= <>
##$DBPNAM4= <>
##$DBPNAM5= <>
##$DBPNAM6= <>
##$DBPNAM7= <>
##$DBPOAL= (0..7)
0.5 0.5 0.5 0.5 0.5 0.5 0.5 0.5 
##$DBPOFFS= (0..7)
0 0 0 0 0 0 0 0 
$$ [...]
##$SUBNAM2= <"">
##$SUBNAM3= <"">
##$SUBNAM4= <"">
##$SUBNAM5= <"">
##$SUBNAM6= <"">
##$SUBNAM7= <"">
##$SUBNAM8= <"">
##$SUBNAM9= <"">
##$SW= 369.568048894756
##$SWIBOX= (0..15)
0 1 3 0 0 0 0 0 0 0 0 0 0 0 0 0 
##$SW_h= 29940.119760479
##$TD= 32768
##$TD0= 1
##$TE= 0
##$TE2= 300
##$TE3= 300
##$TEG= 300
##$TL= (0..7)
0 120 53 12 22 120 120 120 
##$TP= (0..7)
150 150 150 150 150 150 150 150 
##$TP07= 0
##$TPNAME0= <>
##$TPNAME1= <>
##$TPNAME2= <>
##$TPNAME3= <>
##$TPNAME4= <>
##$TPNAME5= <>
##$TPNAME6= <>
##$TPNAME7= <>
##$TPOAL= (0..7)
0.5 0.5 0.5 0.5 0.5 0.5 0.5 0.5 
##$TPOFFS= (0..7)
0 0 0 0 0 0 0 0 
##$TUNHIN= 0
##$TUNHOUT= 0
##$TUNXOUT= 0
##$USERA1= <user>
##$USERA2= <user>
##$USERA3= <user>
##$USERA4= <user>
##$USERA5= <user>
##$V9= 5
##$VALIST= <valist>
##$VCLIST= <CCCCCCCCCCCCCCC>
##$VD= 0
##$VDLIST= <DDDDDDDDDDDDDDD>
##$VPLIST= <PPPPPPPPPPPPPPP>
##$VTLIST= <TTTTTTTTTTTTTTT>
##$WBST= 1024
##$WBSW= 4
##$XGAIN= (0..3)
0 0 0 0 
##$XL= 0
##$YL= 0
##$YMAX_a= 10398
##$YMIN_a= -11061
##$ZGOPTNS= <>
##$ZL1= 120
##$ZL2= 120
##$ZL3= 120
##$ZL4= 120
##$ABSF1= 0
##$ABSF2= 0
##$ABSG= 0
##$ABSL= 0
##$ALPHA= 0
##$AQORDER= 0
##$ASSFAC= 0
##$ASSFACI= 0
##$ASSFACX= 0
##$ASSWID= 0
##$AUNMP= <proc_1d>
##$AZFE= 0.1
##$AZFW= 0.5
##$BCFW= 0
##$BC_mod= 2
##$BYTORDP= 0
##$COROFFS= 0
##$CY= -3
##$DATMOD= 1
##$DC= 0
##$DFILT= <>
##$DTYPP= 0
##$F1P= 0
##$F2P= 0
##$FCOR= 1
##$FTSIZE= 65536
##$FT_mod= 6
##$GAMMA= 0
##$GB= 0
##$INTBC= 1
##$INTSCL= 5.30512e-09
##$ISEN= 30
##$LB= 1
##$LEV0= 0
##$LPBIN= 0
##$MAXI= 10000
##$MC2= 0
##$MEAN= 0
##$ME_mod= 0
##$MI= 50
##$NCOEF= 0
##$NC_proc= -8
##$NLEV= 6
##$NOISF1= 182.463
##$NOISF2= 159.3651
##$NSP= 0
##$NTH_PI= 0
##$NZP= 0
##$OFFSET= 182.463
##$PC= 4
##$PHC0= -391.9433
##$PHC1= 101.2
##$PH_mod= 1
##$PKNL= yes
##$PPARMOD= 0
##$PSCAL= 0
##$PSIGN= 0
##$REVERSE= no
##$SF= 81.0140089999434
##$SI= 65536
##$SIGF1= 159.3651
##$SIGF2= -187.1042
##$SINO= 113.3802
##$SIOLD= 16384
##$SREGLST= <1H.CDCl3>
##$SSB= 0
##$STSI= 65536
##$STSR= 0
##$SW_p= 29940.119760479
##$SYMM= 0
##$S_DEV= 0
##$TDeff= 32768
##$TDoff= 0
##$TI= <>
##$TILT= no
##$TM1= 0
##$TM2= 0
##$TOPLEV= 0
##$USERP1= <user>
##$USERP2= <user>
##$USERP3= <user>
##$USERP4= <user>
##$USERP5= <user>
##$WDW= 1
##$XDIM= 65536
##$YMAX_p= 445647775
##$YMIN_p= -47968148
$$ End of Bruker specific parameters
$$ ---------------------------------
##NTUPLES= NMR SPECTRUM
##VAR_NAME=  FREQUENCY,     SPECTRUM/REAL,   SPECTRUM/IMAG
##SYMBOL=    X,             R,               I
##VAR_TYPE=  INDEPENDENT,   DEPENDENT,       DEPENDENT
##VAR_FORM=  AFFN,          ASDF,            ASDF
##VAR_DIM=   65536,         65536,           65536
##UNITS=     HZ,            ARBITRARY UNITS, ARBITRARY UNITS
##FACTOR=    0.456856943014862, 1,           1
##FIRST=     14782.0589164792, 0,            0
##LAST=      -15158.0608439998, 0,           0
##MIN=       -15158.0608439998, -47968148,   0
##MAX=       14782.0589164792, 445647775,    0
$$ Real data points
##PAGE= N=1
##DATA TABLE= (X++(R..R)), XYDATA
$$ [...]
$$ plain form
40412 6771568 4768391 4461092 6843070 7765988 3366469 -5255277 -12625699 -13749357
40404 -13749357 -9076061 -4363418 -4059297 -5422375 -2159985 5999468 11564815 9029440
40396 9029440 2246704 -1375437 -491301 1078657 2020475 4036288 5680914 2581532
40388 2581532 -4909370 -10244996 -9109413 -4221554 427963 4446533 7009870 4290754
40380 4290754 -3651037 -8710108 -4521113 3263636 4228944 -1749661 -5354245 -2751286
40372 -2751286 -54286 -1440035 -2505134 330555 2320445 -1253773 -5615778 -3110978
40364 -3110978 4530715 8235979 4099564 -3104941 -8232583 -10883696 -11489344 -8443105
40356 -8443105 -1793385 4176483 5008799 904520 -4072789 -6093596 -3864607 1538932
$$ packed form
40412F771568k003177l07299K381978R22918m399519q621746p370422j123658
40404a3749357M673296M712643L04121j363078L262390Q159453N565347k535375
40396I029440o782736l622141Q84136J569958R41818K015813J644626l099382
40388B581532p490902n335626J135583M887859M649517M018570K563337k719116
40380D290754p941791n059071M188995P784749R65308n978605l604584K602959
40372b751286K697000j385749j065099K835689J989890l574218m362005K504800
40364c110978P641693L705264m136415p204505n127642k651113o05648L046239
40356h443105O649720N969868Q32316m104279m977309k020807K228989N403539
$$ plain form
40348 1538932 7662194 11833300 12115704 7990632 1555686 -1923447 2613739 14114855
40340 14114855 24733550 27349728 22540342 16385938 13377433 13738063 15385643 15370265
40332 15370265 11332478 4967113 2159115 5971505 11517853 12121048 8528287 6796611
40324 6796611 8771829 10978608 12107814 14363633 16677755 13959681 5423276 -2802348
40316 -2802348 -6175605 -6837934 -7224660 -5019750 1085152 6296427 5921254 2559546 1873401
40307 1873401 4591525 7543886 9217058 9307118 6218904 563015 -1992816 2466973
40299 2466973 8837742 8927353 2909985 -1688398 -1221054 815729 1456586 2040927 3197332
40290 3197332 2530779 -612478 -3332913 -4048451 -4383518 -4532989 -1830729 3785277 7777362
$$ packed form
40348A538932O123262M171106K82404m125072o434946l479133M537186J1501116
40340A4114855J0618695K616178m809386o154404l008505L60630J647580j5378
40332A5370265m037787o365365k807998L812390N546348O03195l592761j731676
40324F796611J975218K206779J129206K255819K314122k718074q536405q225624
40316b802348l373257o62329l86726K204910O104902N211275l75173l361708o86145
40307A873401K718124K952361J673172R0060l088214n655889k555831M459789
40299B466973O370769Q9611o017368m598383M67344K036783O40857N84341J156405
40290C197332o66553l143257k720435p15538l35067j49471K702260N616006L992085
$$ plain form
40281 7777362 7393377 5720303 6126809 6608274 3530065 -2046200 -5899878 -6585753 -6056537
40272 -6056537 -5472012 -3695221 340404 6061237 11836140 15708166 16189880 13532536
40264 13532536 9559711 5628628 1887138 -1159647 -2360763 -2102405 -2720724 -5361740
40256 -5361740 -8073104 -8359543 -6320703 -4231498 -4192865 -6712470 -10207169 -11792423 -10303365
40247 -10303365 -8168930 -7869874 -7399725 -3203798 2628822 3471899 -2038862 -6684744
40239 -6684744 -4055092 3422506 9307231 11564531 11919578 10741959 7646119 4458620
40231 4458620 2850748 1416465 -546545 545289 6996840 13623534 13694207 9222775
40223 9222775 8124944 11821778 13372940 8844038 2959765 850530 869728 -402901
$$ packed form
40281G777362l83985j673074M06506M81465l078209n576265l853678o85875N29216
40272f056537N84525J776791M035625N720833N774903L872026M81714k657344
40264A3532536l972825l931083l741490l046785j201116K58358o18319k641016
40256e361740k711364k86439K038840K089205L8633k519605l494699j585254J489058
40247a0303365K134435K99056M70149M195927N832620Q43077n510761m645882
40239f684744K629652P477598N884725K257300L55047j177619l095840l187499
40231D458620j607872j434283j963010J091834O451551O626694P0673m471432
40223I222775j097831L696834J551162m528902n884273k109235J9198j272629
$$ plain form
40215 -402901 -1290657 1891778 7940039 11525395 9777407 5208191 2589939 4253235
40207 4253235 7713494 7853112 3010129 -1857009 -916726 4520208 7881812 6703052
40199 6703052 4620507 3572226 867109 -3372907 -2988797 4697670 11711550 8693688
40191 8693688 -1881089 -8803098 -7012148 -2627092 -2924416 -7380682 -10588464 -9802139
40183 -9802139 -7048195 -5789661 -7099119 -8496502 -6879419 -3444988 -3795784 -10724844
40175 -10724844 -18835453 -20101965 -13703912 -6025928 -1272763 2773806 8365472 12244637
40167 12244637 10013329 3069331 -2776725 -4587567 -4909148 -7036193 -10372920 -11752965
40159 -11752965 -9959233 -7176434 -5813112 -5185168 -2556024 2867575 8403641 10768715
$$ packed form
40215d02901q87756L182435O048261L585356j747988m569216k618252J663296
40207D253235L460259J39618m842983m867138R40283N436934L361604j178760
40199F703052k082545j048281k705117m240016L84110P686467P013880l017862
40191H693688j0574777o922009J790950M385056k97324m456266l207782P86325
40183i802139K753944J258534j309458j397383J617083L434431l50796o929060
40175a0724844q110609j266512O398053P677984M753165M046569N591666L879165
40167A2244637k231308o943998n846056j810842l21581k127045l336727j380045
40159a1752965J793732K782799J363322O27944K629144N423599N536066K365074
$$ plain form
40151 10768715 9374100 6256300 3863462 3565232 5173347 6978094 7050222 5204379
40143 5204379 3122450 2691775 5384272 12342893 22195899 29106579 27287606 18812090
40135 18812090 12652151 13639150 16667619 14891774 8914964 3310191 -1309124 -6310911
40127 -6310911 -8679396 -4529191 2498066 4419572 616401 -1377303 2128444 5973130
40119 5973130 5566636 3832229 4673277 5704653 2450486 -4721486 -12400722 -18953025
40111 -18953025 -23187203 -21927013 -13776208 -2741838 6010208 11453558 14102240 11713016
40103 11713016 2929837 -7149580 -10950821 -7391857 -2162606 431560 1339949 2651990
40095 2651990 4256661 5581997 7058394 8444520 8042051 4703960 -602540 -5376378
$$ packed form
40151A0768715j394615l117800k392838k98230J608115J804747P2128j845843
40143E204379k081929m30675K692497O958621R853006O910680j818973q475516
40135A8812090o159939R86999L028469j775845n976810n604773m619315n001787
40127f310911k368485M150205P027257J921506l803171j993704L505747L844686
40119E973130m06494j734407Q41048J031376l254167p171972p679236o552303
40111a8953025m234178J260190Q150805J1034370Q752046N443350K648682k389224
40103A1713016q783179j0079417l801241L558964N229251K594166R08389J312041
40095B651990J604671J325336J476397J386126m02469l338091n306500m773838
$$ plain form
40087 -5376378 -6928750 -4198209 532350 3232871 2891657 2695857 4880806 7390853
40079 7390853 8198169 9310741 12424193 14052697 10529203 5194399 3950895 5298569
40071 5298569 2567649 -3910498 -5378536 2084862 10610919 11329082 5985047 2333908
40063 2333908 2575248 2578515 -113880 -3669627 -6409733 -8627203 -9803180 -8138957 -3621116
40054 -3621116 1274355 4390553 5318615 4351027 2462580 2024765 4676175 8203421 8362109
40045 8362109 4606550 1247224 1346266 1999645 -1434937 -7564970 -8949919 -901453 12198300
40036 12198300 21483902 23088067 20376207 17416485 14097900 9244013 4973520 4263038
40028 4263038 5779336 5128061 1111406 -2782224 -3653362 -2759057 -2809063 -4514045 -7050928
$$ packed form
40087e376378j552372K730541M730559K700521l41214j95800K184949K510047
40079G390853Q07316J112572L113452J628504l523494n334804j243504J347674
40071E298569k730920o478147j468038P463398Q526057P18163n344035l651139
40063B333908K41340L267k692395l555747k740106k217470j175977J664223M517841
40054c621116M895471L116198R28062r67588j888447m37815K651410L527246J58688
40045H362109l755559l359326R9042O53379l434582o130033j384949Q048466J3099753
40036A2198300R285602J604165k711860k959722l318585m853887m270493p10482
40028D263038J516298o51275m016655l893630q71138Q94305n0006j704982k536883
$$ plain form
40019 -7050928 -9389156 -9818772 -6707206 -1315319 2602221 3774045 5400992 9873403
40011 9873403 14003354 12641026 5415857 -3142137 -8806620 -9908475 -5998320 1529797
40003 1529797 7914175 8587258 5100043 3561254 5852544 6466144 667788 -7687153
39995 -7687153 -10381195 -5025385 2893161 7376988 7516195 5645154 3766434 3252483
39987 3252483 5120048 8367506 9706723 6882692 1333646 -3492422 -5082921 -2406241
39979 -2406241 3907566 10056588 10503795 4112128 -3208769 -5597558 -4963561 -7003281
39971 -7003281 -11348257 -12196428 -8614149 -6550334 -8331316 -7878664 -1095834 5839224
39963 5839224 5378660 646177 415756 5200225 7191651 3087337 -1827512 -3422180
$$ packed form
40019g050928k338228m29616L111566N391887L917540J171824J626947M472411
40011I873403M129951j362328p225169q557994n664483j101855L910155P528117
40003A529797O384378O73083l487215j538789K291290O13600n798356q354941
39995g687153k694042N355810P918546M483827J39207j871041j878720n13951
39987C252483J867565L247458J339217k824031n549046m826068j590499K676680
39979b406241O313807O149022M47207o391667p320897k388789O33997k039720
39971g003281m344976q48171L582279K063815j780982M52652O782830O935058
39963E839224m60564m732483k30421M784469J991426m104314m914849j594668
$$ plain form
39955 -3422180 -4447009 -7845733 -11173242 -11447651 -10375783 -10843504 -12165074 -12442592 -12393221
39946 -12393221 -13360322 -14063129 -12522766 -9459592 -7310882 -7215285 -8424900 -9137278 -7238538
39937 -7238538 -2382860 2438233 4187154 4390103 6560186 9336582 7744524 2188651
39929 2188651 -238481 3961846 9185086 9009693 4225677 -1481657 -7873042 -14772377
39921 -14772377 -17795063 -14162824 -8873664 -8440149 -11654973 -13036323 -12299949 -13245229
39913 -13245229 -15545004 -15026105 -10797762 -5391438 664617 7546609 11246476 7866981
39905 7866981 1699289 646513 4062702 4057921 -929104 -3760520 -1388600 357845 -1882909
39896 -1882909 -3200967 -960504 -938109 -5832883 -7258742 1128211 10266056 7192750
$$ packed form
39955c422180j024829l398724l327509k74409J071868m67721j321570k77518M9371
39946a2393221r67101p02807J540363L063174K148710R5597j209615p12378J898740
39937g238538M855678M821093J748921K02949K170083K776396j592058n555873
39929B188651k427132M200327N223240j75393m784016n707334o391385o899335
39921a4772377l022686L632239N289160M33515l214824j381350P36374r45280
39913a3245229k299775N18899M228343N406324O056055O881992L699867l379495
39905G866981o167692j052776L416189m781m987025k831416K371920J746445k240754
39896a882909j318058K240463K2395m894774j425859Q386953R137845l073306
$$ plain form
39888 7192750 -4972564 -11179527 -6586659 -1695381 -4307245 -8752280 -7528621 -3193589
39880 -3193589 -1694065 -1513215 2353703 8460001 11345254 11389618 14018440 19528856 21531205
39871 21531205 17107796 11616750 10199416 10400263 7867694 4639690 5505312 8862059
39863 8862059 8261137 2587532 -2175566 -2525750 -2194732 -4594010 -6639872 -4549726 -829496
39854 -829496 67739 -631037 1039191 3706794 2434499 -2232106 -3850624 364009 5454072
39845 5454072 5953895 2367268 -1547327 -3772795 -4187682 -3172578 -1956456 -1532380 -239243
39836 -239243 4265484 9920343 11270467 6818963 1149573 -1651022 -1932531 -137957
39828 -137957 5624023 14089656 18330845 13818002 5027073 -1160913 -5057667 -11304501
$$ packed form
39888G192750j2165314o206963M592868M891278k611864m445035J223659M335032
39880c193589J499524J80850L866918O106298K885253M4364K628822N510416K002349
39871B1531205m423409n491046j417334K00847k532569l228004Q65622L356747
39863H862059o00922n673605m763098l50184L31018k399278k045862K090146L720230
39854h29496Q97235o98776J670228K667603j272295m666605j618518M214633N090063
39845E454072M99823l586627l914595k225468m14887J015104J216122M24076J293137
39836b39243M504727N654859J350124m451504n669390k800595k81509J794574
39828a37957N761980Q465633M241189m512843q790929o187986l896754o246834
$$ plain form
39820 -11304501 -19384266 -23964102 -23504814 -21539972 -19122681 -12864001 -2530270 5378627
39812 5378627 5366240 372575 -2428576 -865529 1021159 -162338 -2914022 -4038479
39804 -4038479 -3288206 -2923146 -3713656 -3450443 70453 5845652 10366436 10724777 6275063
39795 6275063 -1293061 -7731824 -7765692 -441754 7325789 6870993 -1175554 -6094829 -176447
39786 -176447 10794353 14194106 5722096 -6557552 -12788315 -11432631 -7540842 -4542507
39778 -4542507 -1059916 4761742 10792760 12971135 11214007 10321736 13195613 15694987
39770 15694987 12059270 4273940 949837 6031840 13667170 16607200 14991533 13169919
39762 13169919 11951380 9236971 6081328 6457309 10886631 14429998 11921938 2930735
$$ packed form
39820a1304501q079765m579836M59288J964842K417291O258680J0333731P908897
39812E378627j2387m993665k801151J563047J886688j183497k751684j124457
39804d038479P50273L65060p90510K63213L520896N775199M520784L58341m449714
39795F275063p568124o438763l3868P323938P767543m54796q046547m919275N918382
39786a76447J0970800L399753q472010j2279648o230763J355684L891789K998335
39778d542507L482591N821658O031018K178375j757128q92271K873877K499374
39770A5694987l635717p785330l324103N082003P635330K940030j615667j821614
39762A3169919j218539k714409l155643L75981M429322L543367k508060q991203
$$ plain form
39754 2930735 -8429175 -16528243 -17556484 -12277805 -5674537 -2431066 -2979663 -4664233
39746 -4664233 -5255116 -3903424 -417494 4219097 7615082 7938571 5358684 1034076
39738 1034076 -3326855 -4451305 535380 9421001 15521427 15197689 11660855 9434900
39730 9434900 9105501 10028753 13293988 18051582 19581652 15822068 11601922 11430003 12655292
39721 12655292 11391456 9993476 11438543 11487615 5601475 -648005 1014252 6527114
39713 6527114 4217443 -5941957 -10822048 -3972697 5690789 9262412 9896004 13095174
39705 13095174 15687553 12944975 8436421 7723606 8333895 4848017 -640268 -1758413
39697 -1758413 1604062 3904970 3053603 1917998 2121739 2390312 2098168 1553842 42705
$$ packed form
39754B930735j1359910q099068j028241N278679O603268L243471n48597j684570
39746d664233n90883J351692L485930M636591L395985L23489k579887m324608
39738A034076m360931j124450M986685Q885621O100426l23738l536834k225955
39730I434900l29399R23252L265235M757594J530070l759584m220146j71919J225289
39721A2655292j263836j397980J445067M9072n886140o249480J662257N512862
39713F527114k309671j0159400m880091O849351R663486L571623O33592L199170
39705A3095174K592379k742578m508554p12815O10289l485878n488285j118145
39697a758413L362475K300908q51367j135605K03741K68573k92144n44326j511137
$$ plain form
39688 42705 -2315025 -2876125 -654658 728216 -1206866 -2481489 1450937 7675698 9894395
39679 9894395 7868467 6065769 5105650 2134741 -1337437 -22672 6062486 10399684
39671 10399684 9611320 8107316 10943299 17262548 23024572 25776045 24747461 20257678
39663 20257678 14834977 11457917 9644685 6937013 4443971 5735331 9214922 7782839
39655 7782839 -918825 -9490076 -10390379 -6325419 -5936813 -11866582 -18317752 -19277342 -14521211
39646 -14521211 -7566750 -1480591 2593843 5329280 8351963 11973892 13905588 11863955
39638 11863955 7110349 3330861 1898743 446149 -2949406 -6023063 -4713613 1131725
39630 1131725 6387370 6015751 902935 -3200568 -2629339 -45155 -660878 -5425923 -9866210
$$ packed form
39688D2705k357730n61100K221467J382874j935082j274623L932426O224761K218697
39679I894395k025928j802698r60119k970909l472178J314765O085158M337198
39671A0399684p88364j504004K835983O319249N762024K751473j028584m489783
39663B0257678n422701l377060j813232k707672k493042J291360L479591j432083
39655G782839q701664q571251r00303M064960L88606n929769o451170r59590M756131
39646a4521211O954461O086159M074434K735437L022683L621929J931696k041633
39638A1863955m753606l779488j432118j452594l395555l073657J309450N845338
39630A131725N255645l71619n112816m103503N71229K584184o15723m765045m440287
$$ plain form
39621 -9866210 -9701762 -5973816 -3676153 -5937661 -10577639 -12829322 -10971596 -7953115
39613 -7953115 -6798751 -6191053 -3037483 1694813 3704628 2456058 2901150 7556327
39605 7556327 11214680 8030743 753451 -2829385 -1227199 -833000 -5838145 -12502864
39597 -12502864 -15426466 -14528076 -12925167 -11850395 -10993005 -10770862 -10636075 -7385357 1012044
39588 1012044 11068134 16650631 15711926 11502294 7835205 6078591 6371476 8384555
39580 8384555 10211581 9517175 7179069 7408474 12436797 18868757 21429252 19129988
39572 19129988 15385898 12736728 10304700 6858317 3520494 1709062 335669 -2648733
39564 -2648733 -6864218 -9849984 -10347334 -9144579 -6880659 -3307088 929997 3915650
$$ packed form
39621i866210J64448L727946K297663k261508m639978k251683J857726L018481
39613g953115J154364O07698L153570M732296K009815j248570M45092M655177
39605G556327L658353l183937p277292l582836J602186L94199n005145o664719
39597a2502864k923602Q98390J602909J074772Q57390K22143J34787L250718Q397401
39588A012044J0056090N582497r38705m209632l667089j756614K92885K013079
39580H384555J827026o94406k338106K29405N028323O431960K560495k299264
39572A9129988l744090k649170k432028l446383l337823j811432j373393k984402
39564b648733m215485k985766m97350J202755K263920L573571M237085K985653
$$ plain form
39556 3915650 4635673 3883101 2496842 478141 -1567353 -2016514 -47444 3820944 9339640
39547 9339640 16211290 21436294 20219507 11817846 2272539 -1222996 2516822 8717403
39539 8717403 12136951 10876281 6721651 3756146 4955078 8428329 9070743 5559876
39531 5559876 2788235 4859924 8890037 9381399 5975412 2463522 240570 -2288056
39523 -2288056 -4923828 -5210503 -2502103 1489661 5502743 8090878 5627644 -3640949
39515 -3640949 -14028893 -16859866 -11315743 -5335084 -4418470 -5170831 -2232977 3747292
39507 3747292 8552252 10625961 11002415 9982317 7664593 5894997 6389519 7986051
39499 7986051 8175221 6456559 4327729 2809613 1557781 -16473 -1601084 -1773818
$$ packed form
39556C915650P20023p52572j386259k018701k045494m49161J969070L868388N518696
39547I339640O871650N225004j216787q401661r545307l495535L739818O200581
39539H717403L419548j260670m154630k965505J198932L473251O42414l510867
39531E559876k771641K071689M030113M91362l405987l511890k222952k528626
39523b288056k635772k86675K708400L991764M013082K588135k463234r268593
39515c640949j0387944k830973N544123N980659R16614p52361K937854N980269
39507C747292M804960K073709L76454j020098k317724j769596M94522J596532
39499G986051J89170j718662k128830j518116j251832j574254j584611j72734
$$ plain form
39491 -1773818 704322 4644544 6708455 5627895 4580467 6777538 10403799 11432391
39483 11432391 9768772 8167193 6632088 3539260 1275837 3717468 7672059 4695063
39475 4695063 -6030963 -14042791 -11090214 -2258371 1338132 -3775812 -12117143 -17850703
39467 -17850703 -19680780 -19457034 -19705712 -20883856 -19510808 -12373652 -3433253 -802146
39459 -802146 -4886334 -6845736 -2641292 -320792 -6841473 -15510843 -15694846 -9123066
39451 -9123066 -6072448 -9182085 -12025675 -11705243 -11634582 -11960102 -8160201 -836203 3066648
39442 3066648 1538349 969306 4976342 8292707 6144288 1926202 187514 -1271928
39434 -1271928 -6011715 -10923376 -10403426 -5258444 -1204934 -540449 -842791 -569348 -603404
$$ packed form
39491a773818K478140L940222K063911j080560j047428K197071L626261J028592
39483A1432391j663619j601579j535105l092828k263423K441631L954591k976996
39475D695063j0726026q011828K952577Q831843L596503n113944q341331n733560
39467a7850703j830077K23746k48678j178144J373048P137156Q940399K631107
39459h02146m084188j959402M204444K320500o520681q669370j84003O571780
39451i123066L050618l109637k843590L20432P0661l25520L799901P323998L902851
39442C066648j528299n69043M007036L316365k148419m218086j738688j459442
39434a271928m739787m911661N19950N144982M053510O64485l02342K73443l4056
$$ plain form
39425 -603404 -491477 2055482 6815967 9573115 6749819 42736 -4889372 -4059480 1140010
39416 1140010 6122437 8579466 10333103 13202464 15505508 15172705 14224551 16054824
39408 16054824 19105089 18022304 11748866 5951100 5728534 9613751 12661759 12191563
39400 12191563 8593412 3717097 707851 2446609 7537267 10264878 7161469 1640830
39392 1640830 -375839 2301794 5791004 6647260 5076409 3204121 2362193 2336399 2178798
39383 2178798 1472900 969143 1868090 4726527 9116022 13205614 13477791 7508229 -1399483
39374 -1399483 -5650794 -2460683 1950243 1507903 -434494 2413025 7113174 5322791
39366 5322791 -1943363 -4387035 1097281 5396232 2958822 1399139 7937236 15897711
$$ packed form
39425f03404J11927K546959M760485K757148k823296o707083m932108Q29892N199490
39416A140010M982427K457029J753637K869361K303044l32803r48154J830273
39408A6054824L050265j082785o273438n797766k22566L885217L048008m70196
39400A2191563l598151m876315l009246J738758N090658K727611l103409n520639
39392A640830k016669K677633L489210Q56256j570851j872288q41928k5794j57601
39383B178798p05898n03757Q98947K858437M389495M089592K72177n969562q907712
39374a399483m251311L190111M410926m42340j942397K847519M700149j790383
39366E322791p266154k443672N484316M298951k437410j559683O538097P960475
$$ plain form
39358 15897711 14527817 5273111 -2197078 -5018942 -7227245 -8446310 -4283625 3013963
39350 3013963 5528087 2167937 118936 2147955 2396738 -1958199 -4290191 881737
39342 881737 8264241 9038349 2639264 -4681769 -9307341 -12354515 -14598806 -14893545 -13230457
39333 -13230457 -11292599 -9635549 -6962336 -2707319 1084365 1049544 -3992781 -10223710
39325 -10223710 -10757047 -2843135 7501554 11366734 7386356 2338391 745668 -1033050
39317 -1033050 -7519447 -15312296 -16434313 -8863636 617549 4280961 1280369 -3084530
39309 -3084530 -4119264 -2488043 -2284992 -5104321 -7614843 -6213868 -2606735 -2198800
39301 -2198800 -7417747 -15215311 -20865376 -21443390 -16080283 -6635800 1459942 3052533
$$ packed form
39358A5897711j369894r254706p470189k821864k208303j219065M162685P297588
39350C013963K514124l360150k049001K029019K48783m354937k331992N171928
39342H81737P382504P74108o399085p321033m625572l047174k244291k94739J663088
39333a3230457J937858J657050K673213M255017L791684l4821n042325o230929
39325a0223710n33337P913912J0344689L865180l980378n047965j592723j778718
39317a033050o486397p792849j122017P570677R481185L663412l000592m364899
39309c084530j034734J631221K03051k819329k510522J400975L607133M07935
39301b198800n218947p797564n650065n78014N363107R444483Q095742J592591
$$ plain form
39293 3052533 -781278 -3957557 -3301415 -1242695 217085 2939563 7531872 9869244
39285 9869244 6699821 976788 -2297489 -2222587 -247785 4020641 10517831 15258886
39277 15258886 14412144 9846329 6041370 3841025 2155027 2925035 7823240 11854948
39269 11854948 7841354 -2641736 -9935133 -9004165 -4807431 -3176747 -2913473 -166385
39261 -166385 4663522 8140075 8218744 4787847 -619718 -3780034 -966973 4521754 4125330
39252 4125330 -4515250 -13041673 -13357919 -7885817 -3687697 -1497243 2366701 6956269
39244 6956269 7945971 6273405 6957414 9098144 5658638 -4332770 -11134434 -6576429
39236 -6576429 4500943 10687843 8571671 5081188 6440382 10309450 10494564 6029581
$$ packed form
39293C052533l833811l176279O56142K058720J459780K722478M592309K337372
39285I869244l169423n723033l274277P4902J974802M268426O497190M741055
39277A5258886q46742m565815l804959k200345j685998P70008M898205M031708
39269A1854948m013594j0483090p293397R30968M196734J630684K63274K747088
39261a66385M829907L476553P8669l430897n407565l160316K813061N488727l96424
39252D125330q640580q526423l16246N472102M198120K190454L863944M589568
39244F956269R89702j672566O84009K140730l439506r991408o801664M558005
39236f576429J1077372O186900k116172l490483J359194L869068J85114m464983
$$ plain form
39228 6029581 2433928 4209746 8592437 8839774 2977752 -3903886 -7045255 -7843238
39220 -7843238 -9150501 -8583237 -2517676 5033246 5192573 -2889791 -9252020 -6739139
39212 -6739139 -997737 -1454001 -7265258 -9399087 -4411251 1249179 1198149 -2498363 -2898863
39203 -2898863 3602510 14484458 24011232 27647264 25463660 21862320 20352889 18883637
39195 18883637 12811902 2331905 -6403572 -8565867 -6061409 -4069903 -4763276 -6591660
39187 -6591660 -7716539 -7308390 -4337448 1978156 9923401 15431639 15783945 12500138
39179 12500138 9475287 8435155 7520885 4922661 2319853 2600901 4950189 5577625
39171 5577625 4169323 5682454 12662706 18900434 15665509 3271651 -8597500 -12473127
$$ packed form
39228F029581l595653J775818M382691K47337n862022o881638l141369p97983
39220g843238j307263N67264O065561P550922J59327q082364o362229K512881
39212f739139N741402m56264n811257k133829M987836N660430n1030l696512m00500
39203b898863O501373J0881948R526774L636032k183604l601340j509431j469252
39195A8883637o071735j0479997q735477k162295K504458J991506o93373j828384
39187f591660j124879M08149K970942O315604P945245N508238L52306l283807
39179A2500138l024851j040132r14270k598224k602808K81048K349288O27436
39171E577625j408302J513131O980252O237728l234925j2393858j1869151l875627
$$ plain form
39163 -12473127 -10134307 -6787413 -3625917 122622 1847822 -2131357 -9987385 -15007102
39155 -15007102 -13368050 -7649757 -1747526 4032947 10609821 15705133 15365968 9282162
39147 9282162 1592451 -3984026 -7370698 -9790204 -10926640 -10395737 -9937162 -11292195
39139 -11292195 -13032062 -12442075 -9660882 -6508351 -2075595 5623485 13324532 13989178
39131 13989178 7180858 1931034 4688062 9764182 8074645 1038565 -2221003 1078175
39123 1078175 5213902 7216115 10526838 15522238 15949466 9500605 4142725 7638172
39115 7638172 16253613 20238710 16503440 9801685 4646402 2248071 3039884 5993509
39107 5993509 6863515 3012212 -852542 2513600 12473185 20299816 19905952 13799166
$$ packed form
39163a2473127K338820L346894L161496L748539J725200l979179p856028n019717
39155a5007102J639052N718293N902231N780473O576874N095312l39165o083806
39147I282162p689711n576477l386672k419506j136436N30903M58575j355033
39139a1292195j739867N89987K781193L152531M432756P699080P701047O64646
39131A3989178o808320n249824K757028N076120j689537p036080l259568L299178
39123A078175M135727K002213L310723M995400M27228o448861n357880L495447
39115G638172Q615441L985097l735270o701755n155283k398331P91813K953625
39107E993509Q70006l851303l864754L366142R959585P826631l93864o106786
$$ plain form
39099 13799166 7335102 1926590 -3683190 -8897740 -10989496 -8182673 -1766637 4058861
39091 4058861 4724106 -380747 -6126042 -6373273 -908117 4139309 3250110 -2432175 -6273600
39082 -6273600 -2706796 6860985 14349081 13030003 6157754 4593196 13453916 24434781
39074 24434781 25581724 16220467 6756091 4749176 7301264 8092878 6255751 5414540
39066 5414540 7523111 10715545 11856180 9790520 6955186 7428059 11652715 14416404
39058 14416404 11235743 5408601 4118761 8098319 10814186 8643009 5622308 5709983
39050 5709983 6507166 5004279 4442688 9444800 17200883 19798630 14611981 6955280
39042 6955280 1992358 -1090757 -5025552 -8483627 -7610077 -2195902 2942630 3516799
$$ packed form
39099A3799166o464064n408512n609780n214550k091756K806823O416036N825498
39091D058861O65245n104853n745295k47231N465156N047426q89199n682285l841425
39082f273600L566804R567781P488096j319078o872249j564558Q860720J0980865
39074B4434781J146943r361257r464376k006915K552088P91614j837127q41211
39066E414540K108571L192434J140635k065660k835334M72873M224656K763689
39058A4416404l180661n827142j289840L979558K715867k171177l020701Q7675
39050E709983P97183j502887n61591N002112P756083K597747n186649p656701
39042F955280m962922l083115l934795l458075Q73550N414175N138532N74169
$$ plain form
39034 3516799 635560 -1668287 -2668720 -5773164 -12482325 -18573619 -18611868 -12153082
39026 -12153082 -2875949 6267473 13564788 16338629 13198180 7829384 5492475 5665544
39018 5665544 3274640 -2409885 -6043118 -4919447 -3249203 -4688893 -6259040 -3995596
39010 -3995596 -67810 683261 -2008799 -4793054 -6237457 -6897128 -6264823 -4292328 -3950658
39001 -3950658 -7438330 -11124378 -8925243 -117315 10127949 17145954 19801322 18154156
38993 18154156 12834429 6987700 4644863 5961659 6883102 4434247 324378 -1219755
38985 -1219755 2011496 7475469 8979321 2399954 -8390365 -14162028 -11097837 -5434187
38977 -5434187 -4100871 -4984981 -1885301 4525045 7976776 6870984 5294048 4303745
$$ packed form
39034C516799k881239k303847j000433l104444o709161o091294l8249O458786
39026a2153082R277133R143422P297315K773841l140449n368796k336909J73069
39018E665544k390904n684525l633233J123671J670244j439690j570147K263444
39010c995596L927786P51071k692060k784255j444403o59671O32305J972495L41670
39001c950658l487672l686048K199135Q807928J0245264P018005K655368j647166
38993A8154156n319727n846729k342837J316796R21443k448855m109869j544133
38985a219755L231251N463973J503852o579367j0790319n771663L064191N663650
38977e434187J333316q84110L099680O410346L451731j105792j576936r90303
$$ plain form
38969 4303745 676113 -4612485 -5415595 -902622 1246846 -3257088 -7696091 -4738583
38961 -4738583 1983437 4380366 3213180 5830460 12779579 16066159 11520657 4675201
38953 4675201 1666928 1163682 -557193 -2006189 302226 4080419 3048371 -3633959
38945 -3633959 -9007732 -7184184 -768268 3400615 3328593 2829811 4423170 5982538 5930936
38936 5930936 7466314 13679978 20805939 21364600 13992843 5500347 1973472 2352373
38928 2352373 3216565 5255708 10177751 14216651 11198900 1995716 -5111702 -5322108
38920 -5322108 -3275331 -4836567 -7612190 -5096051 2405559 7730501 7826100 8044670 12625596
38911 12625596 16360755 10995302 -2708819 -14798434 -17707612 -13674310 -10142455 -11489108
$$ packed form
38969D303745l627632n288598q03110M512973K149468m503934m439003K957508
38961d738583O722020K396929j167186K617280O949119L286580m545502o845456
38953D675201l008273n03246j720875j448996K308415L778193j032048o682330
38945c633959n373773J823548O415916M168883p2022m98782J593359J559368n1602
38936E930936J535378O213664P125961N58661p371757q492496l526875L78901
38928B352373Q64192K039143M922043M038900l017751r203184p107418k10406
38920e322108K046777j561236k775623K516139P501610N324942R5599K18570M580926
38911A2625596L735159n365453j3704121j2089615k909178M033302L531855j346653
$$ plain form
38903 -11489108 -16414855 -20528508 -20042031 -14950906 -9543001 -8063937 -9741862 -10426397
38895 -10426397 -8904750 -7930174 -8345145 -6666095 -932568 4787441 5136274 359167
38887 359167 -4447135 -4973193 -302702 7334735 12482146 9111921 -2616732 -14343307
38879 -14343307 -18219544 -15685099 -13324996 -12170041 -6970267 4172727 15204145 18770460
38871 18770460 13744650 4898288 -1958444 -3752723 -1757356 -62467 -705723 -1200659
38863 -1200659 894911 3183264 2099713 -830937 -1736140 -1704925 -4761619 -9304257 -9367788
38854 -9367788 -5246790 -4390596 -8977561 -11134118 -5357675 2162930 3345822 673660
38846 673660 1449524 4456814 2260867 -5108458 -8771759 -4326065 1984850 3202248
$$ packed form
38903a1489108m925747m113653M86477N091125N407905J479064j677925o84535
38895a0426397J521647R74576m14971J679050N733527N720009L48833m777107
38887C59167m806302n26058M670491P637437N147411l370225j1728653j1726575
38879a4343307l876237K534445K360103J154955N199774J1142994J1031418L566315
38871A8770460n025810q846362o856732j794279J995367J694889o43256m94936
38863a200659K095570K288353j083551k930650r05203L1215l056694m542638o3531
38854i367788M120998Q56194m586965k156557N776443P520605J182892k672162
38846F73660P75864L007290k195947p369325l663301M445694O310915J217398
$$ plain form
38838 3202248 774649 -207797 504874 -398037 -3200408 -4844471 -4146641 -3372268 -4483135
38829 -4483135 -6632825 -8020301 -8259808 -8008912 -7592969 -7144417 -7247847 -7870939 -6784154
38820 -6784154 -1055358 8709485 17241433 19886462 18220650 17846806 20801849 23252286
38812 23252286 21568117 17466455 14914601 14243395 12275300 7376443 1771429 -1233370
38804 -1233370 -692199 1472401 2456813 1102607 -1052056 -1454787 704861 4006982 6610303
38795 6610303 7255650 5222360 1739678 1055032 6426035 14151492 15771734 8819517
38787 8819517 1727500 4028544 14084755 21328129 19796632 14392033 12632522 14501074
38779 14501074 13526107 6053556 -3770263 -8701797 -6269135 -599014 3001387 3357700
$$ packed form
38838C202248k427599r82446P12671r02911k802371j644063O97830P74373j110867
38829d483135k149690j387476k39507K50896M15943M48552j03430o23092J086785
38820f784154N728796R764843Q531948K645029j665812l73844K955043K450437
38812B3252286j684169m101662k551854o71206j968095m898857n605014l004799
38804a233370N41171K164600R84412j354206k154663m02731K159648L302121K603321
38795F610303O45347k033290l482682o84646N371003P725457J620242o952217
38787H819517p092017K301044J0056211P243374j531497n404599j759511J868552
38779A4501074r74967p472551r823819m931534K432662N670121L600401L56313
$$ plain form
38771 3357700 2543104 1693471 173472 -1825333 -2630906 -1290907 1650731 5347146 8249666
38762 8249666 7333778 1442616 -4843129 -5364604 -1125291 395147 -3655818 -7048391
38754 -7048391 -4390439 656664 2378269 2655810 6059739 9010971 3286389 -9725060
38746 -9725060 -17121874 -9925917 5747455 16692392 17349729 12459522 8082301 5016329
38738 5016329 1150912 -3336883 -5383997 -2894450 2712257 8608369 13738810 18035963
38730 18035963 19820323 17521502 13787532 13301820 15215824 12755479 3217201 -6456972
38722 -6456972 -8262450 -3141284 2466656 6200597 9860538 12870893 12618444 9989155
38714 9989155 8019842 5774538 47125 -7154146 -9673519 -6576946 -4062569 -6380866
$$ packed form
38771C357700q14596q49633j519999j998805q05573J339999K941638L696415K902520
38762H249666r15888n891162o285745n21475M239313J520438m050965l392573
38754g048391K657952N047103J721605K77541L403929K951232n724582j3011449
38746i725060p396814P195957J5673372J0944937O57337m890207m377221l065972
38738E016329l865417m487795k047114K489547N606707N896112N130441M297153
38730A8035963J784360k298821l733970m85712J914004k460345r538278r674173
38722f456972j805478N121166N607940L733941L659941L010355k52449k629289
38714I989155j969313k245304n727413p201271k519373L096573K514377k318297
$$ plain form
38706 -6380866 -10426965 -11314397 -8585262 -5091384 -3665130 -5775120 -9466157 -8819262
38698 -8819262 -703345 8199436 7789653 -1309880 -7453693 -3750842 3660720 6347760
38690 6347760 4554569 2400442 -364015 -4717509 -6213446 -683049 7106217 8187008
38682 8187008 1285790 -6463889 -9522479 -8567359 -5853924 -2177713 819010 486103
38674 486103 -2963070 -5602213 -3919311 2121201 9658751 14185032 11446685 1827647
38666 1827647 -7353194 -7691038 1210394 11116198 14340801 11167878 7303220 6338769
38658 6338769 6687550 5202325 1963906 325897 2254568 5108985 4664656 521181
38650 521181 -3909128 -6525658 -8488674 -10396749 -9992260 -5584825 871249 6074210
$$ packed form
38706f380866m046099q87432K729135L493878J426254k109990l691037O46895
38698h819262Q115917Q902781m09783r099533o143813L702851P411562K687040
38690F347760j793191k154127k764457m353494j495937N530397P789266J080791
38682H187008o901218p749679l058590R55120K713435L676211K996723l32907
38674D86103l449173k639143J682902O040512P537550M526281k738347r619038
38666A827647r180841l37844Q901432R905804L224603l172923l864658r64451
38658F338769L48781j485225l238419j638009J928671K854417m44329m143475
38650E21181m430309k616530j963016j908075M04489M407435O456074N202961
$$ plain form
38642 6074210 8532294 7960752 4470560 570550 1019361 7453936 14990795 17188718
38634 17188718 13244313 7876591 5238431 5186278 4786996 1867340 -2366403 -3844527
38626 -3844527 -258957 5078484 6850595 5015239 4264001 5797125 5234463 717700
38618 717700 -2946818 -1867816 910984 1770333 3603400 10397082 18789575 21792377
38610 21792377 18369870 13149812 8893878 5399518 3841554 5787621 9153345 10921412
38602 10921412 12361434 15770113 18091143 14619325 7612596 3954661 5097228 6799821
38594 6799821 8249786 12948565 19676393 21172624 14465135 5359081 -145392 -2415040
38586 -2415040 -3505605 -2499023 1007312 4366506 6244932 8672937 12118639 13665937
$$ packed form
38642F074210K458084n71542l490192l900010M48811O434575P536859K197923
38634A7188718l944405n367722k638160n2153l99282k919656m233743j478124
38626c844527L585570N337441J772111j835356p51238J533124n62662m516763
38618G17700l664518J079002K778800Q59349J833067O793682Q392493L002802
38610B1792377l422507n220058m255934l494360j557964J946067L365724J768067
38602A0921412J440022L408679K321030l471818p006729l657935J142567J702593
38594F799821J449965M698779O727828J496231o707489r106054n504473k269648
38586b415040j090565J006582L506335L359194J878426K428005L445702J547298
$$ plain form
38578 13665937 12519900 11738152 12052781 10285193 6805186 7293439 12683374 14766737
38570 14766737 8057299 -452002 -905917 5161570 8413026 5825653 2622372 2377134
38562 2377134 3919206 7305731 14173103 21077641 20460702 11229552 2363179 2307432 8815898
38553 8815898 12751359 9296445 2298379 -1210723 1427203 6217569 7137748 3107301
38545 3107301 -673715 451357 4088533 3893039 -1659665 -7085128 -6919852 -1798561
38537 -1798561 3787509 7231874 9160609 10401143 10205775 8148597 6274717 7448313
38529 7448313 11241989 13346165 10684092 5574425 2264012 749336 -1953009 -4968731
38521 -4968731 -3466461 3153038 8531107 8130433 6047905 8709458 15441227 20059696
$$ packed form
38578A3665937j146037p81748L14629j767588l480007M88253N389935K083363
38570A4766737o709438q509301m53915O067487L251456k587373l203281k45238
38562B377134J542072L386525O867372O904538o16939r231150q866373n5747O508466
38553H815898L935461l454914o998066l509102K637926M790366R20179m030447
38545C107301l781016J125072L637176j95494n552704n425463J65276N121291
38537a798561N586070L444365J928735J240534j95368k057178j873880J173596
38529G448313L793676K104176k662073n109667l310413j514676k702345l015722
38521d968731J502270O619499N378069m00674k082528K661553O731769M618469
$$ plain form
38513 20059696 18964973 13027413 4365878 -3566786 -5543297 -381569 4854326 3078704
38505 3078704 -2002764 -760114 7535027 13462305 12047888 9326653 10797456 12077706
38497 12077706 7274326 67092 -1174050 4488796 10477607 12483147 11796990 10249159
38489 10249159 8191650 7325058 9764674 13590265 14135071 10505759 6403471 3694633
38481 3694633 -40861 -5895207 -10219559 -9649002 -5960438 -2833821 -707030 1833413
38473 1833413 4073161 4488041 4418805 6355604 9262364 9512595 6364071 2737335 340620
38464 340620 -1882890 -3467105 -1010001 6429897 14078956 16874007 15519130 13696710
38456 13696710 11707821 7374295 1850487 -734490 147566 -31081 -4092676 -8784123
$$ packed form
38513B0059696j094723n937560q661535p932664j976511N161728N235895j775622
38505C078704n081468J242650Q295141N927278j414417k721235J470803J280250
38497A2077706m803380p207234j241142N662846N988811K005540o86157j547831
38489A0249159k057509q66592K439616L825591N44806l629312m102288k708838
38481C694633l735494n854346m324352N70557L688564L126617K126791K540443
38473A833413K239748M14880o9236J936799K906760K50231l148524l626736k396715
38464C40620k223510j584215K457104P439898P649059K795051j354877j822420
38456A3696710j988889m333526n523808k584977Q82056j78647m061595m691447
$$ plain form
38448 -8784123 -9388795 -5680502 -825064 3174263 6136182 7574381 6980441 5689824
38440 5689824 6084975 8823950 12120630 13554083 11886924 7888125 4028312 2256193
38432 2256193 1550422 -620601 -3742933 -3719039 1473804 8266036 12176156 13401219 14149263
38423 14149263 12748838 5831534 -3909098 -8028581 -2718479 5436661 7402327 2516244
38415 2516244 -2242241 -1926705 1507505 3584391 2591090 -610447 -4923467 -8967225
38407 -8967225 -10404471 -7711374 -2272967 2740159 5191008 4600717 1096793 -4125258
38399 -4125258 -7909340 -7511179 -4228191 -2005967 -1838059 -761739 2227801 3169083 -748838
38390 -748838 -5218248 -3566395 4017278 10647504 11742754 9555946 8440328 9506695
$$ packed form
38448h784123o04672L708293M855438L999327K961919J438199n93940j290617
38440E689824L95151K738975L296680J433453j667159l998799l859813j772119
38432B256193p05771k171023l122332K3894N192843O792232L910120J225063P48044
38423A4149263j400425o917304r740632m119483N310102Q155140J965666m886083
38415B516244m758485L15536L434210K076886r93301l201537m313020m043758
38407h967225j437246K693097N438407N013126K450849n90291l503924n222051
38399d125258l784082L98161L282988K222224J67908J076320K989540R41282l917921
38390g48838m469410J651853P583673O630226J095250k186808j115618J066367
$$ plain form
38382 9506695 10856772 10138996 6316264 1208913 -1306419 -253797 136344 -2890022
38374 -2890022 -4169189 2638609 13365218 16792179 10405033 3687371 3244004 4036952
38366 4036952 94589 -5075246 -5642615 -3551250 -3567204 -4274623 -2297517 -441532 -2943034
38357 -2943034 -6669064 -5764129 -1606673 488110 905035 2701755 2506130 -4586965 -13246535
38348 -13246535 -12991147 -4567074 900782 -107988 857131 7895820 13026663 10175725
38340 10175725 5408060 6245417 10554349 13538194 16818757 22019309 23108953 14904727
38332 14904727 3607634 -787633 1388772 2079413 -926546 -2388750 -233898 954705
38324 954705 -2384070 -8179823 -12373413 -12171309 -6066460 4421396 13443781 15917325
$$ packed form
38382I506695J350077p17776l822732n107351k515332J052622L90141l026366
38374b890022j279167O807798J0726609L426961o387146o717662m43367P92948
38366D036952l942363n169835n67369K091365j5954p07419J977106J855985k501502
38357b943034l726030R04935M157456K094783M16925J796720j95625p093095q659570
38348a3246535K55388Q424073N467856j008770R65119P038689N130843k850938
38340A0175725m767665Q37357M308932K983845L280563N200552J089644q204226
38332A4904727j1297093m395267K176405O90641l005959j462204K154852J188603
38324I54705l338775n795753m193590K02104O104849J0487856R022385K473544
$$ plain form
38316 15917325 13543589 11827737 12456105 13155030 13514146 15338857 17772260 17739357 15674975
38307 15674975 15588356 18247788 18899975 13815809 5910325 1630973 3629540 7665796
38299 7665796 6601306 -1843739 -11186402 -12497899 -5628631 -304538 -3447328 -9902284
38291 -9902284 -10547352 -5688993 -3512651 -7005555 -9945723 -6673148 452096 5437267
38283 5437267 5872601 3443569 479788 -1786338 -3158643 -3796780 -3020516 336270 5321664
38274 5321664 8736176 9499271 10301642 12335031 12301971 8812888 7346985 12505465 18892028
38265 18892028 17659805 10035200 5560600 7665466 10473205 10749636 12917347 18959326
38257 18959326 22749003 19782841 14936220 14234297 14826307 9934384 -213003 -8709269
$$ packed form
38316A5917325k373736j715852O28368O98925L59116J824711K433403l2903k064382
38307A5674975q6619K659432O52187n084166p905484m279352J998567M036256
38299G665796j064490q445045r342663j311497O869268N324093l142790o454956
38291i902284o45068M858359K176342l492904k940168L272575P125244M985171
38283E437267M35334k429032k963781k266126j372305o38137P76264L356786M985394
38274E321664L414512P63095Q02371K033389l3060l489083j465903N158480O386563
38265A8892028j232223p624605m474600K104866K807739K76431K167711O041979
38257A8959326L789677k966162m846621p01923N92010m891923j0147387q496266
$$ plain form
38249 -8709269 -10685843 -6525044 1470529 10861975 18820200 23648020 25519259 23931957
38241 23931957 17225189 6909771 -850720 -1075660 5269114 14018584 21303271 22601845
38233 22601845 14494581 1561677 -4458317 1554518 10086854 9565656 2339054 -418051
38225 -418051 3553287 5368229 399722 -4397630 -1727308 5612677 10245251 10440258
38217 10440258 9737845 9956690 9412117 6649780 2678471 39535 1010695 5370262 9076518
38208 9076518 7294263 134472 -6413404 -6686291 -1143210 4992279 7488781 6616230
38200 6616230 6018287 8648503 13087863 14360254 9752291 2831542 -587039 501567
38192 501567 2335681 2705607 3118070 4447820 5029098 4534540 5377699 7957140 8676785
$$ packed form
38249h709269j976574M160799P995573R391446P958225M827820J871239j587302
38241B3931957o706768j0315418p760491k24940O344774Q749470P284687J298574
38233B2601845q107264j2932904o019994O012835Q532336n21198p226602k757105
38225d18051L971338J814942m968507m797352K670322P339985M632574J95007
38217A0440258p02413K18845n44573k762337l971309k638936R71160M359567L706256
38208I076518j782255p159791o547876k72887N543081O135489K496502q72551
38200F616230n97943K630216M439360J272391m607963o920749l418581J088606
38192E01567J834114L69926M12463J329750N81278m94558Q43159K579441P19645
$$ plain form
38183 8676785 5937255 4388152 8963852 17327044 22880607 23521366 22430468 21120680
38175 21120680 17395832 11174091 7099531 8593435 12871033 15090086 15140270 16895096
38167 16895096 21770591 26261664 26170794 21197213 14809771 10813195 10221849 10439325 7446827
38158 7446827 -94281 -8650181 -12576989 -9435713 -2205367 3599847 4532442 1565320
38150 1565320 -1043964 493925 5913271 11444013 14681016 17464838 22054759 26273457
38142 26273457 26165777 22598770 20233699 19460099 15446645 7842218 4858439 11992833
38134 11992833 21743471 22302099 13672196 6545952 6123800 6559367 3066477 -91047
38126 -91047 1690311 4742275 3849505 1706743 4168550 9886276 12347509 10140629 7744224
$$ packed form
38183H676785k739530j549103M575700Q363192N553563O40759j090898j309788
38175B1120680l724848o221741m074560J493904M277598K219053N0184J754826
38167A6895096M875495M491073r0870m973581o387442l996576n91346K17476k992498
38158G446827p541108q555900l926808L141276P230346N805214R32595k967122
38150A565320k609284J537889N419346N530742L237003K783822M589921M218698
38142B6273457j07680l567007k365071p73600m013454p604427k983779P134394
38134A1992833R750638N58628q629903p126244m22152M35567l492890l157524
38126i1047J781358L051964q92770k142762K461807N717726K461233k206880k396405
$$ plain form
38117 7744224 6889975 4455576 -314920 -3231527 -1973829 28555 -518298 -1443178 655884
38108 655884 3968253 3593363 -888648 -3735224 193564 9060932 15862692 15904974 11027644
38099 11027644 6239177 4071040 3946709 5373947 8257901 10481355 9453812 6804938
38091 6804938 6886565 9193873 8036693 2747574 1478881 8972047 16662177 13599966
38083 13599966 3176688 -1350216 3595110 8101602 5762499 3133563 7567579 15070935
38075 15070935 17118026 12932049 7986203 5092836 3761355 4843819 9127259 13395524
38067 13395524 13684901 11135994 9923243 10841331 11221998 9634854 6658762 2850515
38059 2850515 -15924 2008134 9995814 18094628 19676739 16032250 13673472 14483796
$$ packed form
38117G744224q54249k434399m770496k916607J257698K002384n46853r24880K099062
38108F55884L312369l74890m482011k846576L928788Q867368O801760M2282m877330
38099A1027644m788467k168137j24331J427238K883954K223454j027543k648874
38091F804938Q1627K307308j157180n289119j268693P493166P690130l062211
38083A3599966j0423278m526904M945326M506492k339103k628936M434016P503356
38075A5070935K047091m185977m945846k893367j331481J082464M283440M268265
38067A3395524K89377k548907j212751R18088L80667j587144k976092l808247
38059B850515k866439K024058P987680Q098814J582111l644489k358778Q10324
$$ plain form
38051 14483796 14701384 13028019 12808784 15011710 15466992 11652879 7109777 6067244
38043 6067244 7593878 8017437 6070221 3009379 242407 -775305 1493040 6602041
38035 6602041 11656031 14316305 14661664 13542793 11597480 10410476 11397439 12653977
38027 12653977 10709961 6766317 6664104 12137354 16821554 14953817 9860354 8533388
38019 8533388 11010199 11589086 8979769 8177797 11762997 15929558 17354209 18478572
38011 18478572 22644997 28195798 31222295 31120235 29480710 25802739 18774445 10858093
38003 10858093 7343022 10496228 17716596 25523984 32127825 35878981 35339323 32703364
37995 32703364 33434266 39358103 44812207 43610142 38183115 36998965 42892506 49034438
$$ packed form
38051A4483796K17588j673365k19235K202926M55282l814113m543102j042533
38043F067244J526634M23559j947216l060842k766972j017712K268345N109001
38035F602041N053990K660274L45359j118871j945313j187004R86963J256538
38027A2653977j944016l943644j02213N473250M684200j867737n093463j326966
38019H533388K476811N78887k609317q01972L585200M166561J424651J124363
38011A8478572M166425N550801L026497j02060j639525l677971p028294p916352
38003A0858093l515071L153206P220368P807388O603841L751156n39658k635959
37995C2703364P30902N923837N454104j202065n427027j184150N893541O141932
$$ plain form
37987 49034438 48561882 43895685 42597054 46503262 49695082 46847757 39322534 31962444
37979 31962444 27414236 25709928 26819717 30574972 35081121 38101632 40219787 44399025
37971 44399025 51636053 58840840 62442672 63049192 64771868 70163880 77668231 84670849
37963 84670849 91307365 99605560 109960145 120923640 132678874 148275737 170011667
37956 170011667 196139534 222828618 248334906 273336586 297621452 318405488 332286655
37949 332286655 337753660 335717627 328558120 318567600 306525420 292322596 277912907
37942 277912907 268198352 266390077 268995226 268862499 264391567 262826829 272256737 292345305
37934 292345305 315480162 335659018 353054351 369760577 383915251 389649224 382060102
$$ packed form
37987D9034438m72556m666197j298631L906208L191820k847325p525223p360090
37979C1962444m548208j704308J109789L755255M506149L020511K118155M179238
37971D4399025P237028P204787L601832O06520J722676N392012P504351P002618
37963H4670849O636516Q298195J0354585J0963495J1755234J5596863K1735930
37956A70011667K6127867K6689084K5506288K5001680K4284866K0784036J3881167
37949C32286655N467005k036033p159507r990520j2042180j4202824j4409689
37942B77912907r714555j808275K605149j32727m470932j564738R429908K0088568
37934B92345305K3134857K0178856J7395333J6706226J4154674N733973p589122
$$ plain form
37927 382060102 361586382 333997392 306141679 280871647 255946582 228477173 199932777
37920 199932777 175124673 156113793 139555682 122024047 106313202 98958859 100868555
37913 100868555 103679434 98102576 84266608 70604344 63068949 59295142 54403604 48524718
37905 48524718 45359212 45785983 46973928 47010637 46570283 45925422 43949242 40856308 38587918
37896 38587918 37300313 34774790 30994771 29836406 33382620 37437580 36471570 31280753
37888 31280753 27643623 28090602 29260794 27934778 25722313 25953653 28768708 31552461
37880 31552461 32377089 30754724 26433534 20372819 16700786 20489989 31639984 42598391
37872 42598391 45003309 38931228 33135459 34700457 40696672 42902762 39230459 35954744
$$ packed form
37927C82060102k0473720k7588990k7855713k5270032k4925065k7469409k8544396
37920A99932777k4808104j9010880j6558111j7531635j5710845p354343J909696
37913A00868555K810879n576858j3835968j3662264p535395l773807m891538n878886
37905D8524718l165506M26771J187945L6709m40354o44861j976180l092934k268390
37896C8587918j287605k525523l780019j158365L546214M054960r66010n190817
37888C1280753l637130M46979J170192j326016k212465K31340K815055K783753
37880C1552461Q24628j622365m321190o060715l672033L789203J1149995J0958407
37872D2598391K404918o072081n795769J564998N996215K206090l672303l275715
$$ plain form
37864 35954744 38123461 42779370 44603827 44052806 44946836 46304215 42510701 31884177
37856 31884177 20109025 13652707 13486693 16832125 21528494 26477945 30721756 34641106
37848 34641106 39884257 45780067 48087700 44282638 38527259 38076184 45141992 55009282
37840 55009282 62145122 65796770 69251712 75700443 85846271 98568132 113048926 130135841
37832 130135841 151296878 176334862 203460160 232394869 265966701 306947234 353587458
37825 353587458 398806384 432686872 445647775 432623449 397726311 353730322 313272743
37818 313272743 279772619 248643534 216509025 185909596 160694519 140563338 122519086
37811 122519086 105876191 93446869 87934415 88244031 89665176 88077869 84354404 83534757
$$ packed form
37864C5954744K168717M655909J824457n51021Q94030J357379l793514j0626524
37856C1884177j1775152o456318j66014L345432M696369M949451M243811L919350
37848C4641106N243151N895810K307633l805062n755379m51075P065808R867290
37840E5009282P135840L651648L454942O448731J0145828J2721861J4480794J7086915
37832A30135841K1161037K5037984K7125298K8934709L3571832M0980533M6640224
37825C53587458M5218926L3880488J2960903j3024326l4897138m3995989m0457579
37818C13272743l3500124l1129085l2134509l0599429k5215077k0131181j8044252
37811A22519086j6642895j2429322n512454L09616J421145j587307l723465q19647
$$ plain form
37803 83534757 88499492 96039859 101599288 106539425 117052099 136214691 161244961 189064341
37795 189064341 219799269 252845058 284042143 309934183 330882803 346040496 349054144
37788 349054144 334583278 307340692 278581634 253496625 227478097 195987683 162988327
37781 162988327 136742223 120495588 110333366 100587292 89041771 77550535 68960962
37774 68960962 63447993 58334721 52397278 48505840 48905478 49385383 43331621 31847867
37766 31847867 23729140 23149948 23925837 20595549 18738738 26195994 37946230 40133674
37758 40133674 29500413 18850858 19497876 26664145 28414867 22686149 17304319 16459777
37750 16459777 16023985 12414519 8522097 8490215 12104675 17197646 23317490 29852040
$$ packed form
37803H3534757M964735P540367N559429M940137J0512674J9162592K5030270K7819380
37795A89064341L0734928L3045789L1197085K5892040K0948620J5157693L013648
37788C49054144j4470866k7242586k8759058k5085009k6018528l1490414l2999356
37781A62988327k6246104j6246635j0162222r746074j1545521j1491236q589573
37774F8960962n512969n113272n937443l891438L99638M79905o053762j1483754
37766C1847867q118727n79192P75889l330288j856811P457256J1750236K187444
37758D0133674j0633261j0649555O47018P166269J750722n728718n381830q44542
37750A6459777m35792l609466l892422l1882L614460N092971O119844O534550
$$ plain form
37742 29852040 33908800 33547051 30788785 28282112 25125578 19455087 13385623 11222523
37734 11222523 13271939 15306152 14510303 12605413 12340556 13959185 16412602 19561760
37726 19561760 23577538 27905136 32261229 37464020 44215392 51825217 58408647 61466397
37718 61466397 58955255 51766933 44490739 40866631 38789106 33296299 24412255 17426187
37710 17426187 14517867 11573173 5788552 861288 546606 2141566 1698732 1264323
37702 1264323 4519703 9036233 10512702 11822297 18754182 27965094 29315148 21320187
37694 21320187 14033145 13292622 12219760 4184964 -4865623 -5448450 621553 3977006
37686 3977006 2438425 2300855 6182086 8710822 5673581 561864 -359719 4761711
$$ packed form
37742B9852040M056760l61749k758266k506673l156534n670491o069464k163100
37734A1222523K049416K034213p95849j904890k64857J618629K453417L149158
37726A9561760M015778M327598M356093N202791O751372P609825O583430L057750
37718F1466397k511142p188322p276194l624108k077525n492807q884044o986068
37710A7426187k908320k944694n784621m927264l14682J594960m42834m34409
37702A264323L255380M516530J476469J309595O931885R210912J350054p994961
37694B1320187p287042p40523j072862q034796r050587n82827O070003L355453
37686C977006j538581j37570L881231K528736l037241n111717r21583N121430
$$ plain form
37678 4761711 12398731 16574001 12723360 2249186 -6866236 -7470517 -937683 5646961
37670 5646961 8481958 9018737 8647268 7089276 5652013 6404681 7907798 7147520 5751353
37661 5751353 8343970 14495309 19139545 22050148 29177479 41776469 51798725 52602363
37653 52602363 47774147 44139768 41849095 37496331 32294870 30277539 31243661 31439714
37645 31439714 28995825 23826695 15203977 4732073 -1564237 -257405 3215868 1796087
37637 1796087 -2369947 -1637250 4727533 10078503 11408110 12145334 13496886 11776877
37629 11776877 6472099 3018892 4475343 7174771 7475639 6165999 3480681 -2648016
37621 -2648016 -9446319 -8372070 2748599 13527033 13963373 7845942 5573597 8713521
$$ packed form
37678D761711P637020M175270l850641j0474174r115422o04281O532834O584644
37670E646961K834997N36779l71469j557992j437263P52668J503117p60278j396167
37661E751353K592617O151339M644236K910603P127331J2598990J0022256Q03638
37653E2602363m828216l634379k290673m352764n201461k017331R66122J96053
37645C1439714k443889n169130q622718j0471904o296310J306832L473273j419781
37637A796087m166034P32697O364783N350970J329607P37224J351552j720009
37629A1776877n304778l453207J456451K699428L00868j309640k685318o128697
37621b648016o798303J074249J1120669J0778434M36340o117431k272345L139924
$$ plain form
37613 8713521 10697457 9292573 8287131 8012184 4300142 -2039797 -3934340 831120
37605 831120 4848310 1466620 -5892152 -8998851 -5045120 2191498 7885744 9395395
37597 9395395 6825682 3441709 3230642 5844451 6552568 3012054 -1293952 -2664966
37589 -2664966 -2500151 -3813963 -5828302 -5953212 -4530143 -3453083 -1968430 2057396
37581 2057396 7893054 12476221 14029933 12220495 6735118 -673025 -4889579 -2714847
37573 -2714847 2091988 3624689 2070244 1973413 4026941 5240729 6505653 12048649
37565 12048649 20208947 22935231 17526345 11349601 10823608 13121715 14083932 16597835
37557 16597835 23153998 26528312 18393461 3948953 -2857482 2074400 9430559 11969956
$$ packed form
37613H713521J983936j404884j005442k74947l712042o339939j894543M765460
37605H31120M017190l381690p358772l106699L953731P236618N694246J509651
37597I395395k569713l383973k11067K613809P08117l540514m306006j371014
37589b664966J64815j313812k014339j24910J423069J077060J484653M025826
37581B057396N835658M583167J553712j809438n485377p408143m216554K174732
37573b714847M806835J532701j554445r6831K053528J213788J264924N542996
37565A2048649Q160298K726284n408886o176744n25993K298107R62217K513903
37557A6597835O556163L374314q134851j4444508o806435M931882P356159K539397
$$ plain form
37549 11969956 12874833 15856783 17347381 14195416 10858572 12093494 14809286 14152887
37541 14152887 12176511 12750477 12569728 6338249 -1899438 -2520500 4901522 10132281
37533 10132281 7310266 2601243 3235833 6716840 6514727 2711436 278086 108574
37525 108574 -1483609 -5354929 -7365850 -4241653 2339666 8305634 11072674 10525203
37517 10525203 8650807 8615078 11996013 16462672 17982578 15558661 12074355 10409261
37509 10409261 10612372 11120569 10903884 10040380 9743114 11779968 15985930 18681031 16344505
37500 16344505 11017695 8543573 10383540 11305527 7794794 4592375 8120415 16141310
37492 16141310 20109404 17216054 13574913 13881598 14203223 9100058 1401465 -592294
$$ packed form
37549A1969956R04877K981950J490598l151965l336844J234922K715792o56399
37541A4152887j976376N73966j80749o231479q237687o21062P422022N230759
37533A0132281k822015m709023O34590L481007k02113l803291k433350j69512
37525A08574j592183l871320k010921L124197O581319N965968K767040n47471
37517A0525203j874396l5729L380935M466659J519906k423917l484306j665094
37509A0409261K03111N08197k16685q63504k97266K036854M205962K695101k336526
37500A6344505n326810k474122J839967R21987l510733l202419L528040Q020895
37492A6141310L968094k893350l641141L06685L21625n103165p698593j993759
$$ plain form
37484 -592294 6200443 16471186 23268601 23952154 20000899 14948362 12588032 13434881
37476 13434881 12574987 4787855 -7521316 -15474264 -14057298 -7282005 -1258002 3287198
37468 3287198 8139347 11399309 9618831 4413594 1509386 2972841 4721498 2734450
37460 2734450 -1752835 -4682136 -4142529 -1280607 1965681 4499910 6283072 7723060
37452 7723060 8474888 7325896 4489357 3149752 6276461 11806930 13560983 7968545
37444 7968545 -1782671 -8994874 -9412801 -3917585 2445263 3726861 -1812615 -8553804
37436 -8553804 -8170139 629843 9504362 10240808 4850782 2116950 5270581 8116439
37428 8116439 4836990 -785272 -79992 8124179 14548397 10584470 -688959 -7963173
$$ packed form
37484e92294O792737J0270743O797415O83553l951255n052537k360330Q46849
37476A3434881q59894p787132j2309171p952948J416966O775293O024003M545200
37468C287198M852149L259962j780478n205237k904208J463455J748657j987048
37460B734450m487285k929301N39607K861922L246288K534229J783162J439988
37452G723060P51828j148992k836539j339605L126709N530469J754053n592438
37444G968545r751216p212203m17927N495216O362848J281598n539476o741189
37436h553804L83665Q799982Q874519P36446n390026k733832L153631K845858
37428H116439l279449n622262P05280Q204171O424218l963927j1273429p274214
$$ plain form
37420 -7963173 -5218235 2216367 6407184 7681796 12529907 22267461 29527386 28112086
37412 28112086 21972703 20020843 23871701 25806961 19672734 9330765 3270187 3595132
37404 3595132 4708240 2320420 -1078190 -1627785 -854588 -2900171 -7086494 -8115322
37396 -8115322 -3455950 4120937 11974498 20403213 27943296 29093787 20915234 8295528
37388 8295528 -1733386 -7801380 -11630112 -11115735 -2791798 10112168 18989452 19695540
37380 19695540 15578438 10892941 7337781 7051455 11579713 16425313 14289490 6395868
37372 6395868 2898256 8257536 14105299 12049258 5981906 4419134 7174424 8495301
37364 8495301 8485874 11433985 15663683 15291938 11105333 9803979 12083060 11208924 5268640
$$ packed form
37420g963173K744938P434602M190817J274612M848111R737554P259925j415300
37412B8112086o139383j951860L850858J935260o134227j0341969o060578L24945
37404C595132J113108k387820l398610n49595P73197k045583m186323j028828
37396h115322M659372P576887P853561Q428715P540083J150491q178553j2619706
37388H295528j0028914o067994l828732N14377Q323937J2903966Q877284P06088
37380A9695540m117102m685497l555160k86326M528258M845600k135823p893622
37372F395868l497612N359280N847763k056041o067352j562772K755290J320877
37364H495301r427K948111M229698l71745m186605j301354K279081q74136n940284
$$ plain form
37355 5268640 1332994 3647518 5968877 1057293 -8344596 -13759823 -12025970 -6924094
37347 -6924094 -2687038 -417759 790828 2501180 5467408 7888711 7223516 4589415
37339 4589415 3935479 5762058 6081277 3348625 1193080 1414346 43641 -5054339 -8188169
37330 -8188169 -4051213 2010284 -175003 -10953119 -19554235 -17798588 -8533614 806816
37322 806816 6832227 9716121 9279701 5832619 2433582 2615123 6554652 11613785 15918938
37313 15918938 19515387 22260512 22364005 17968109 9831367 1517852 -3735034 -5813396
37305 -5813396 -6430103 -5935584 -3701205 -1295254 -1715120 -4390704 -4806244 -1367623 1367265
37296 1367265 27840 -782208 5333559 15660199 19972454 12940676 -547910 -12653155
$$ packed form
37355E268640l935646K314524K321359m911584r401889n415227J733853N101876
37347f924094M237056K269279J208587J710352K966228K421303o65195k634101
37339D589415o53936J826579L19219k732652k155545K21266j370705n097980l133830
37330h188169M136956O061497k185287j0778116q601116J755647R264974R340430
37322H06816O025411K883894m36420l447082l399037J81541L939529N059133M305153
37313A5918938L596449K745125J03493m395896q136742q313515n252886k078362
37305e813396o16707M94519K234379K405951m19866k675584m15540L438621K734888
37296A367265j339425q10048O115767J0326640M312255p031778j3488586j2105245
$$ plain form
37288 -12653155 -19472673 -19966126 -14547985 -7505382 -5144134 -7713860 -7892121 -1466608
37280 -1466608 5181248 3912703 -2575507 -4246758 1600873 6830005 4854407 -253634
37272 -253634 -468561 5140116 10393085 10378536 5741208 -151057 -4644141 -6438674 -5610610
37263 -5610610 -3761329 -2766334 -3061175 -3847881 -4382240 -4052760 -2238665 305972 1027839
37254 1027839 -1247697 -3678511 -2898550 -544065 -1315184 -5041629 -5490649 452269 6927253
37245 6927253 6779019 1831689 -144648 2830388 4522839 214186 -7133797 -12481237
37237 -12481237 -15259863 -17108894 -17334631 -14816013 -11561003 -9929999 -8010341 -2109975
37229 -2109975 6813785 13236400 13801254 10726259 7997175 7001726 6784682 6248995 4831685
$$ packed form
37288a2653155o819518m93453N418141P042603K361248k569726j78261O425513
37280a466608O647856j268545o488210j671251N847631N229132j975598n108041
37272b53634k14927N608677N252969j4549m637328n892265m493084j794533Q28064
37263e610610J849281R94995k94841p86706n34359L29480J814095K544637P21867
37254A027839k275536k430814P79961K354485p71119l726445m49020N942918O474984
37245F927253j48234m947330j976337K975036J692451m308653p347983n347440
37237a2481237k778626j849031k25737K518618L255010J631004J919658N900366
37229b109975Q923760O422615N64854l074995k729084r95449k17044n35687j417310
$$ plain form
37220 4831685 2480969 67454 -940179 210463 2911025 5696098 6943931 5814409
37212 5814409 3434435 2418311 4098026 6968845 8974499 10191288 11549978 11884341
37204 11884341 8645895 1795426 -4556343 -5034323 2336437 13313166 19303064 14575975
37196 14575975 3000316 -4863435 -3164345 3599976 8457530 11049766 14063215 14673031
37188 14673031 7578799 -4214295 -10158865 -5976705 410024 409354 -3903104 -4996465
37180 -4996465 -1712468 367898 -1842702 -5138858 -5152472 -1023087 5188169 10516496
37172 10516496 12355537 10261964 6687168 4227108 2788752 1276375 737915 2868323
37164 2868323 5888836 5196906 -1076094 -9416164 -14763068 -15395699 -13235055 -10786441
$$ packed form
37220D831685k350716k413515j007633J150642K700562K785073J247833j129522
37212E814409k379974j016124J679715K870819K005654J216789J358690L34363
37204A1884341l238446o850469o351769m77980P370760J0976729N989898m727089
37196A4575975j1575659p863751J699090O764321M857554K592236L013449O09816
37188A4673031p094232j1793094n944570M182160O386729o70m312458j093361
37180d996465L283997K080366k210600l296156j3614M129385O211256N328327
37172A0516496J839041k093573l574796k460060j438356j512377n38460K130408
37164B868323L020513o91930o273000q340070n346904o32631K160644K448614
$$ plain form
37156 -10786441 -9053075 -7849253 -6869008 -5891619 -4317371 -1486295 1936874 3727199
37148 3727199 2483084 -257048 -1686043 -912986 1264108 4715209 9148391 11638742
37140 11638742 9237577 4498551 3422264 6078329 4808802 -4335594 -13458221 -12198278
37132 -12198278 -2083330 5500463 4526483 381285 7959 2811835 4146100 2554681
37124 2554681 -278674 -3288190 -5861293 -6072352 -2604035 2633315 6464158 8146556
37116 8146556 8866705 8611208 6335084 3029947 1830814 4155190 7709823 9686235
37108 9686235 10498268 12340198 14582215 13258111 6312454 -2697055 -8315745 -9270082
37100 -9270082 -8108128 -5937966 -1748332 2767692 2883247 -2111680 -6026483 -3866656
$$ packed form
37156a0786441J733366J203822R80245R77389J574248K831076L423169J790325
37148C727199j244115k740132j428995P73057K177094L451101M433182K490351
37140A1638742k401165m739026j076287K656065j269527r144396r122627J259943
37132a2198278J0114948P583793r73980m145198l73326K803876J334265j591419
37124B554681k833355l009516k573103k11059L468317N237350L830843J682398
37116H146556P20149k55497k276124l305137j199133K324376L554633J976412
37108I686235Q12033J841930K242017j324104o945657r009509n618690r54337
37100i270082J161954K170162M189634M516024J15555m994927l914803K159827
$$ plain form
37092 -3866656 871360 1907494 162918 1806445 7759023 11939182 10377820 5789525
37084 5789525 1723408 -1734429 -4070331 -2068420 4756143 11099603 12524364 11478487
37076 11478487 12280804 13467000 10475338 3888758 -762947 -1120663 -790807 -3098606
37068 -3098606 -6240613 -6622750 -4309630 -2801733 -4272184 -6600620 -5517839 395179
37060 395179 7392916 10398945 9033247 7814860 9837028 12855906 13137273 10472513
37052 10472513 7049558 3851601 1165850 490256 2399386 4230003 3690151 3227780
37044 3227780 6443606 11388017 12663789 9871361 8048960 8662297 6378956 -2129996
37036 -2129996 -11406941 -13658019 -8516534 -1891437 2411783 5233354 7711869 9222056
$$ packed form
37092c866656M738016J036134j744576J643527N952578M180159j561362m588295
37084E789525m066117l457837k335902K001911O824563O343460J424761j045877
37076A1478487Q02317J186196k991662o586580m651705l57716L29856k307799
37068c098606l142007l82137K313120J507897j470451k328436J082781N913018
37060C95179O997737L006029j365698j218387K022168L018878K81367k664760
37052A0472513l422955l197957k685751o75594J909130J830617n39852m62371
37044C227780L215826M944411J275772k792428j822401O13337k283341q508952
37036b129996r276945k251078N141485O625097M303220K821571K478515J510187
$$ plain form
37028 9222056 9739040 10481299 11498486 11257730 9078179 5876239 2501100 -526478 -1868029
37019 -1868029 -476934 2139422 3339687 3126768 3678393 4869855 3842891 327164
37011 327164 -1435310 1051132 3439275 -14461 -7290652 -9781241 -3505985 4891964
37003 4891964 5844711 -1901620 -10698300 -13403962 -10075600 -5082781 -929628 2785963
36995 2785963 6064418 7290251 5600784 2302909 -819424 -2937345 -3178289 -214165
36987 -214165 5513177 10704171 12436420 11533023 10736006 10655296 10005579 8712528 7412200
36978 7412200 4587962 -1415710 -7247670 -6619118 513970 5968020 3986562 -816896
36970 -816896 -889706 3208075 5700397 6442672 10481956 17121731 18122804 9500356 -1849172
$$ packed form
37028I222056N16984P42259J017187k40756k179551l201940l375139l027578j341551
37019a868029J391095K616356J200265k12919N51625J191462j026964l515727
37011C27164j762474K486442K388143l453736p276191k490589O275256Q397949
37003D891964R52747p746331q796680k705662L328362M992819M153153L715591
36995B785963L278455J225833j689467l297875l122333k117921k40944K964124
36987b14165N727342N190994J732249r03397p97017q0710o49717j293051j300328
36978G412200k824238o003672n831960O28552P133088N454050j981458m803458
36970h16896p2810M097781K492322P42275M039284O639775J001073q622448j1349528
$$ plain form
36961 -1849172 -7147496 -5961413 -3556294 -2965039 -4151987 -6840156 -9302414 -7872441
36953 -7872441 -2569518 230791 -3816497 -9314450 -8316581 -2541544 -700761 -5048792
36945 -5048792 -9281880 -10212647 -12185736 -17015336 -18633681 -13389168 -8164331 -10502156
36937 -10502156 -15766761 -13090334 -1791888 7269621 7115479 2890201 1824437 2346455
36929 2346455 -1201454 -7647475 -9878780 -5585876 -667321 -390913 -2406025 -2016291
36921 -2016291 -552144 -3063427 -8987013 -11340142 -6773145 -762210 1022313 1859626
36913 1859626 8506767 19181125 24341697 19774116 12002751 8355606 7696515 4966887
36905 4966887 182580 -2199808 -121720 4617890 9880628 13738338 13093157 6768980
$$ packed form
36961a849172n298324J186083K405119N91255j186948k688169k462258J429973
36953g872441N302923K800309m047288n497953R97869N775037J840783m348031
36945e048792m233088r30767j973089m829600j618345N244513N224837k337825
36937a0502156n264605K676427J1298446R061509j54142m225278j065764N22018
36929B346455l547909o446021k231305M292904M918555K76408k015112L89734
36921b016291J464147k511283n923586k353129M566997O010935J784523Q37313
36913A859626O647141J0674358N160572m567581p771365l647145o59091k729628
36905D966887m784307k382388K078088M739610N262738L857710o45181o324177
$$ plain form
36897 6768980 -282012 -622813 6783419 14870563 16767053 12827230 8238321 6480068
36889 6480068 7067925 7946132 8011518 7667286 7952098 9202159 10644464 11536522 11991419
36880 11991419 12063450 11241554 9999407 10199039 11931793 11674635 6757751 648944 -156626
36871 -156626 5312608 10980256 11757471 9270185 7647802 7236158 5782359 3492221 2939337
36862 2939337 4513390 5354585 3453580 543044 -91472 2604838 6722155 9732091
36854 9732091 10822314 11000565 11307476 11400716 10344188 8547821 7925636 9581821 11898151
36845 11898151 11692195 7512596 1744772 -918878 1955040 7126394 8253435 3383607
36837 3383607 -1341545 1901543 12729528 22190012 23248076 18607318 15994759 18270605
$$ packed form
36897F768980p050992l40801P406232Q087144J896490l939823m588909j758253
36889F480068N87857Q78207O5386l44232K84812J250061J442305Q92058M54897
36880A1991419P2031q21896j242147J99632J732754k57158m916884o108807q05570
36871a56626N469234N667648P77215k487286j622383m11644j453799k290138n52884
36862B939337J574053Q41195j901005k910536o34516K696310M117317L009936
36854I732091J090223J78251L06911R3240j056528j796367o22185J656185K316330
36845A1898151k05956m179599n767824k663650K873918N171354J127041m869828
36837C383607m725152L243088J0827985R460484J058064m640758k612559K275846
$$ plain form
36829 18270605 21612142 22294661 21248571 20972642 20925028 18252431 12193880 5963802 3739640
36820 3739640 6026178 8430982 5931283 -1168051 -6750595 -5772854 -539076 2254933
36812 2254933 110895 -3087589 -4053716 -4949238 -8375712 -11193186 -8343198 -1183523
36804 -1183523 3644227 3687831 3124981 4317690 3482753 -1205546 -3166786 4090338 15546399
36795 15546399 19856172 15079466 10923541 13775346 17596005 14049849 5311912 499947
36787 499947 3035417 8179924 11758279 14953725 19370892 22199922 19249509 11026306
36779 11026306 3464338 2292955 7270525 12706220 13980493 12214417 11063728 10977878
36771 10977878 10273000 10322496 13801350 17501979 14113639 3930246 -2556500 1135836
$$ packed form
36829A8270605L341537O82519j046090k75929m7614k672597o058551o230078k224162
36820C739640K286538K404804k499699p099334n582544R77741N233778K794009
36812B254933k144038l198484r66127q95522l426474k817474K849988P159675
36804a183523M827750M3604n62850J192709q34937m688299j961240P257124J1456061
36795A5546399M309773m776706m155925K851805L820659l546156q737937m811965
36787D99947K535470N144507L578355L195446M417167K829030k950413q223203
36779A1026306p561968j171383M977570N435695J274273j766076j150689q5850
36771A0977878p04878M9496L478854L700629l388340j0183393o486746L692336
$$ plain form
36763 1135836 7336313 5303935 -3184860 -8204110 -7634012 -8258656 -12242208 -13353572
36755 -13353572 -8231314 -1809201 1631096 4579451 9505072 13036254 11571960 7137562
36747 7137562 3305146 77702 -3205482 -4461445 -2394377 563461 2292089 3768984
36739 3768984 4662370 1312076 -6459259 -11280835 -6430908 5166592 14880951 18181449
36731 18181449 16178455 11136426 5776851 4059271 7194768 11072808 12221120 13213279
36723 13213279 16848562 18479425 11321550 -2313862 -12331365 -13146304 -8425145 -3721582
36715 -3721582 -770668 190080 -1443974 -4255753 -5148118 -3788430 -3092411 -4323662 -5340292
36706 -5340292 -4551911 -3130188 -2432417 -2257015 -2143056 -1718328 3553 2886646 4269224
$$ packed form
36763A135836O200477k032378q488795n019250N70098o24644l983552j111364
36755a3353572N122258O422113L440297K948355M925621L531182j464294m434398
36747G137562l832416l227444l283184j255963K067068K957838J728628J476895
36739C768984Q93386l350294p771335m821576M849927J1597500R714359L300498
36731A8181449k002994n042029n359575j717580L135497L878040J148312R92159
36723A3213279L635283J630863p157875j3635412j0017503q14939M721159M703563
36715c721582K950914R60748j634054k811779q92365J359688O96019j231251j016630
36706e340292P88381J421723O97771J75402J13959M24728J721881K883093J382578
$$ plain form
36697 4269224 2725018 1729859 5183520 10729694 12857195 11561961 11758781 14596566
36689 14596566 16442459 17060448 21021483 28711241 33462876 31352800 27103959 25637891
36681 25637891 23942560 17156237 7699260 1553343 -1263381 -5511529 -11614096 -14493853
36673 -14493853 -11863943 -8090270 -8027452 -10795150 -12006787 -10261618 -9071307 -12005224
36665 -12005224 -16961787 -17234515 -9708733 -166455 2972490 -597620 -3152628 -205576
36657 -205576 3795124 3339360 1799 -1519675 -1279010 -2630566 -5505561 -6749892 -6108244
36648 -6108244 -6620210 -8820937 -8937877 -4017021 4165120 11411879 15278657 16232864 16264641
36639 16264641 16949159 17917859 17042989 12719949 5888774 -252040 -2009290 2552165
$$ packed form
36697D269224j544206r95159L453661N546174K127501j295234J96820K837785
36689A4596566J845893O17989L961035P689758M751635k110076m248841j466068
36681B5637891j695331o786323r456977o145917k816724m248148o102567k879757
36673a4493853K629910L773673O2818k767698j211637J745169J190311k933917
36665a2005224m956563k72728P525782R542278L138945l570110k555008K947052
36657b05576M000700m55764l337561j521474K40665j351556k874995j244331O41648
36648f108244n11966k200727j16940M920856Q182141P246759L866778R54207L1777
36639A6264641O84518R68700q74870m323040o831175o140814j757250M561455
$$ plain form
36631 2552165 11169776 17675544 17592680 13453274 11200144 11436772 9191125 3257156 -693891
36622 -693891 440678 1202422 -3365100 -8241051 -5614892 2114662 5122635 424498
36614 424498 -5168727 -6289647 -4614626 -1761800 4657472 13863423 18019584 11369323
36606 11369323 -1193106 -10015558 -11825933 -10004310 -6875043 -1975019 3022559 3819134
36598 3819134 -722842 -6466912 -9284752 -9290108 -8229285 -5789425 -1226717 3379004 4899393
36589 4899393 3655745 2946104 3693738 2823242 -1380662 -5219472 -3987653 1089080 3720132
36580 3720132 8927 -7744824 -14264981 -15466099 -10281379 -2285893 942566 -4954437
36572 -4954437 -14064632 -15990730 -9922728 -6123167 -10405971 -14993179 -11061161 -3446682
$$ packed form
36631B552165Q617611O505768q2864m139406k253130K36628k245647n933969l951047
36622f93891J134569P61744m567522m875951K626159P729554L007973m698137
36614D24498n593225j120920J675021K852826O419272R205951M156161o650261
36606A1369323j2562429q822452j810375J821623L129267M900024M997578P96575
36598C819134m541976n744070k817840n356J060823K439860M562708M605721J520389
36589D899393j243648p09641P47634q70496m203904l838810J231819N076733K631052
36580C720132l711205p753751o520157j201118N184720P995486L228459n897003
36572d954437r110195j926098O068002L799561m282804m587208L932018P614479
$$ plain form
36564 -3446682 -3477464 -11089507 -14650968 -8000272 2141010 7217643 6662502 4120395
36556 4120395 1685164 1491573 6097956 12801825 13531062 5489024 -3135255 -3670915 1124633
36547 1124633 2135884 -2149950 -4240009 281844 6301099 6790540 1760877 -3504613
36539 -3504613 -5954852 -6997443 -8579129 -10413950 -11582931 -12448665 -13304982 -12320061 -7060817
36530 -7060817 1797918 10174435 14551915 14533618 11092347 5026475 -1454168 -4716812
36522 -4716812 -3964805 -2953989 -4420745 -5470261 -2339185 2944788 5635467 5821006
36514 5821006 6938783 8102966 4829510 -2472351 -7722371 -8150395 -7422845 -7995357 -7145880
36505 -7145880 -3458759 -690828 -1309223 -1966282 323214 2697494 1480810 -2300101
$$ packed form
36564c446682l0782p612043l561461O650696J0141282N076633n55141k542107
36556D120395k435231j93591M606383O703869P29237q042038q624279n35660M795548
36547A124633J011251m285834k090059M521853O019255M89441n029663n265490
36539c504613k450239j042591j581686j834821j168981q65734q56317R84921N259244
36530g060817Q858735Q376517M377480j8297l441271o065872o480643l262644
36522d716812P52007J010816j466756j049516L131076N283973K690679J85539
36514E821006J117777J164183l273456p301861n250020m28024P27550n72512Q49477
36505g145880L687121K767931o18395o57059K289496K374280j216684l780911
$$ plain form
36497 -2300101 -6847800 -13638273 -22073142 -25284158 -18266735 -6759368 -1121999 -3685162
36489 -3685162 -8387629 -10576744 -10499287 -8815439 -5622989 -3405243 -4763638 -7486903
36481 -7486903 -7399271 -5305274 -5067544 -5475379 -1024003 8470499 15748148 15528710 10492664
36472 10492664 5845911 3087845 1612803 1843719 3577234 4279102 1744709 -3164657
36464 -3164657 -7360478 -7395196 -1248979 8597058 14921541 12979047 7190294 5443500
36456 5443500 7540179 6256759 310311 -2291865 2949528 9142127 8617910 4616353
36448 4616353 4891483 8500650 7702264 960159 -4542695 -3829975 -251924 1216757 644824
36439 644824 -19686 -1888469 -6433746 -10564231 -9224411 -2549857 3469623 4307538 1670708
$$ packed form
36497b300101m547699o790473q434869l211016P017423J1507367N637369k563163
36489c685162m702467k189115P7457J683848L192450K217746j358395k723265
36481g486903Q7632K093997K37730m07835M451376R494502P277649k19438n036046
36472A0492664m646753k758066j475042K30916J733515P01868k534393m909366
36464c164657m195821l4718O146217R846037O324483j942494n788753j746794
36456E443500K096679j283420n946448k602176N241393O192599n24217m001557
36448D616353K75130L609167p98386o742105n502854P12720L578051J468681n71933
36439F44824o64510j868783m545277m130485J339820O674554O019480Q37915k636830
$$ plain form
36430 1670708 -642098 -2273330 -4077438 -2974737 4641262 14058530 14380876 3585249
36422 3585249 -5409380 -1024004 9739068 10368104 -1215001 -9916410 -6298823 505313
36414 505313 -1085947 -7047999 -5896431 2459788 7864649 6471296 4328525 4706387
36406 4706387 2965891 -3207557 -7695127 -4838340 1999085 5657979 4341966 1020126
36398 1020126 -2551656 -6383559 -9160887 -9117441 -7106483 -5619015 -5556358 -6396499 -8217411
36389 -8217411 -10757384 -11580133 -8374973 -2867471 360147 -806887 -4161745 -6883988
36381 -6883988 -8757398 -10915843 -13422358 -15498667 -17082214 -18873023 -21005444 -21993071
36373 -21993071 -18889013 -9509483 3754483 13004050 11013920 -294896 -10392873 -11433583
$$ packed form
36430A670708k312806j631232j804108J102701P615999R417268L22346j0795627
36422C585249q994629M385376J0763072O29036j1583105q701409L617587O804136
36414E05313j591260n962052J151568Q356219N404861j393353k142771L77862
36406D706387j740496o173448m487570K856787O837425L658894j316013l321840
36398A020126l571782l831903k777328M3446K010958J487468O2657q40141j820912
36389h217411k539973q22749L205160N507502L227618j167034l354858k722243
36381f883988j873410k158445k506515k076309j583547j790809k132421r87627
36373b1993071L104058R379530J3263966R249567j990130j1308816j0097977j040710
$$ plain form
36365 -11433583 -6511158 -3613050 -4071888 -2370504 3412397 7579451 5420002 331399
36357 331399 -1461692 755346 3409256 4888075 5676855 4693755 819528 -3359143 -4511640
36348 -4511640 -4141332 -5936603 -8815457 -8897440 -7568557 -9718291 -13088227 -8344495 6447657
36339 6447657 19586108 19998140 11437875 5552327 5919079 7082940 6115877 6049510 8251045
36330 8251045 9495036 8153821 7003632 7690549 7208612 2246919 -6180030 -13949350
36322 -13949350 -17178867 -14080145 -6496828 283643 2413527 1978791 3160046 4784045
36314 4784045 1784090 -5817862 -11447371 -11332111 -9465688 -10007894 -10162942 -5570232 1074720
36305 1074720 2636242 -2885493 -10469000 -14923949 -14891531 -10330610 -1296896 9088136
$$ packed form
36365a1433583M922425K898108m58838J701384N782901M167054k159449n088603
36357C31399j793091K217038K653910J478819P88780r83100l874227m178671j152497
36348d511640L70308j795271k878854q1983J328883k149734l369936M743732J4792152
36339F447657J3138451M12032q560265n885548L66752J163861r67063o6367K201535
36330H251045J243991j341215j150189O86917m81937m961693q426949p769320
36322a3949350l229517L098722P583317O780471K129884m34736J181255J623999
36314D784045k999955p601952n629509J15260J866423n42206j55048M592710O644952
36305A074720J561522n521735p583507m454949L2418M560921R033714J0385032
$$ plain form
36297 9088136 14662487 12310710 5946984 1882897 1775272 2777868 3324358 4945387
36289 4945387 7958280 9320427 7208097 4871599 6339238 9915441 10226195 6299423
36281 6299423 2951481 3460293 5804397 7965131 11573544 16690463 18001365 11771422
36273 11771422 3184830 511375 3974975 6753900 5749750 4347904 4338378 2311752
36265 2311752 -3768677 -10253014 -12891704 -11969554 -10248905 -9691325 -11621734 -15774050
36257 -15774050 -17993212 -14142638 -7869217 -8127987 -15925716 -20181911 -11836441 3491692
36249 3491692 13055154 12880962 9510497 9063411 11733160 15591602 18886717 18543928 12287148
36240 12287148 3066761 -3153901 -4586322 -4764025 -6460916 -8349443 -7916802 -4197782
$$ packed form
36297I088136N574351k351777o363726m064087j07625J002596N46490J621029
36289D945387L012893J362147k112330k336498J467639L576203L10754l926772
36281F299423l347942N08812K344104K160734L608413N116919J310902o229943
36273A1771422q586592k673455L463600K778925j004150j401846r526k026626
36265B311752o080429o484337k638690R22150J720649N57580j930409m152316
36257a5774050k219162L850574O273421k58770p797729m256195Q345470J5328133
36249C491692R563462j74192l370465m47086K669749L858442L295115l42789o256780
36240A2287148r220387o220662j432421j77703j696891j888527M32641L719020
$$ plain form
36232 -4197782 2345238 9253006 11787035 7025525 -1835620 -8684151 -11278319 -10996002
36224 -10996002 -7293998 1658849 12644465 18142896 15605404 10687702 8599098 7226320
36216 7226320 2473405 -3807323 -5963242 -2421032 2664365 4604333 2152409 -2573361
36208 -2573361 -5618943 -3746459 2139710 6895605 6378960 1916710 -2068793 -3595975
36200 -3595975 -4244029 -5776759 -7977886 -9579325 -9454326 -6808881 -1655379 4373211
36192 4373211 8230065 7096764 836250 -6319393 -7848380 -1300598 7607980 10261714
36184 10261714 5029461 -1351011 -3152458 -2178731 -2396650 -2537075 852746 5498281
36176 5498281 4858874 -2157031 -8330659 -7062256 -363176 4613109 4251077 718360
$$ packed form
36232d197782O543020O907768K534029m761510q861145o848531k594168K82317
36224a0996002L702004Q952847J0985616N498431k537492m917702k088604j372778
36216G226320m752915o280728k155919L542210N085397J939968k451924m725770
36208b573361l045582J872484N886169M755895n16645m462250l985503j527182
36200c595975o48054j532730k201127j601439J24999K645445N153502O028590
36192D373211L856854j133301o260514p155643j528987O547782Q908578K653734
36184A0261714n232253o380472j801447R73727k17919j40425L389821M645535
36176E498281o39407p015905o173628J268403O699080M976285l62032l532717
$$ plain form
36168 718360 -2793744 -5732240 -8929633 -11985062 -12978431 -10120129 -3278074 5672053
36160 5672053 13742975 18440524 19016102 16580907 13212950 10642433 9131252 7349222
36152 7349222 3663862 -2181086 -8698201 -13715863 -15298564 -12006871 -3920553 5505938
36144 5505938 10053728 5887111 -3419166 -9262171 -6819463 209841 5179593 6509543
36136 6509543 6946256 6492454 1275288 -9309998 -18892946 -20696652 -15167503 -8198905
36128 -8198905 -4035890 -3003170 -4163777 -6374786 -7669293 -7123910 -6899616 -9490387
36120 -9490387 -13714386 -16436450 -17082525 -16745926 -14061175 -6961810 1454128 4123823
36112 4123823 -1399873 -9778996 -14760571 -15241044 -13185821 -10092182 -7816865 -8726116
$$ packed form
36168G18360l512104k938496l197393l055429r93369K858302O842055Q950127
36160E672053Q070922M697549N75578k435195l367957k570517j511181j782030
36152G349222l685360n844948o517115n017662j582701L291693Q086318R426491
36144E505938M547790m166617r306277n843005K442708P029304M969752J329950
36136F509543M36713m53802n217166j0585286r582948j803706N529149O968598
36128h198905M163015J032720j160607k211009j294507N45383K24294k590771
36120i490387m223999k722064o46075L36599K684751P099365Q415938K669695
36112D123823n523696q379123m981575m80473K055223L093639K275317r09251
$$ plain form
36104 -8726116 -12062349 -13384083 -10089980 -4396279 942612 5658421 8490781 6095348
36096 6095348 -421848 -2934749 3859820 13522589 15046327 6601426 -4047651 -10878605
36088 -10878605 -14376377 -15586388 -12799833 -5953205 1269929 6126841 9760814 13808454
36080 13808454 17389134 18711647 16803987 11216051 3209854 -2775480 -2860113 694757
36072 694757 1833634 -930139 -3251664 -2804418 -2657509 -4636940 -5210246 -1927830 1047295
36063 1047295 -948514 -5077576 -5018405 -897955 979774 -2050470 -5490269 -5477539 -4968650
36054 -4968650 -8642392 -14591924 -15509727 -8159256 1606248 5004532 5474 -7135390
36046 -7135390 -9474187 -6198046 -1524850 503434 -1531409 -6795572 -12278647 -13980976
$$ packed form
36104h726116l336233j321734L294103N693701N338891M715809K832360k395433
36096F095348o517196k512901O794569R662769J523738q444901j0649077o830954
36088a0878605l497772j210011K786555O846628P223134M856912L633973M047640
36080A3808454L580680J322513j907660n587936q006197n985334q4633L554870
36072F94757J138877k763773k321525M47246J46909j979431n73306L282416K975125
36063A047295j995809m129062N9171M120450J877729l030244l439799J2730N08889
36054d968650l673742n949532r17803P350471R765504L398284m999058p140864
36046g135390k338797L276141M673196K028284k034843n264163n483075j702329
$$ plain form
36038 -13980976 -10998990 -7489242 -7701165 -10139344 -9988283 -6228220 -2192380 272222
36030 272222 2269055 3346067 971163 -4145913 -7370975 -6711250 -5082499 -3939264
36022 -3939264 -368158 6081188 9476747 5541377 -1010315 -2974435 -794722 100322
36014 100322 -902167 289594 3917924 5272903 2512067 -884925 -2712182 -5318158
36006 -5318158 -10241313 -14336273 -13863217 -9255949 -4006319 -1399117 -3067562 -7550236
35998 -7550236 -9702977 -5430160 2029541 4826878 1053133 -2115414 1502485 8414009
35990 8414009 10918292 7741406 4247099 4052992 5634403 6808391 7774648 8754866 8362067
35981 8362067 5975365 3235602 1673546 776359 -217602 -375389 1369473 3957949 5348297
$$ packed form
36038a3980976K981986L509748k11923k438179J51061L760063M035840K464602
36030B72222J996833J077012k374904n117076l225062O59725J628751J143235
36022c939264L571106O449346L395559l935370o551692j964120K179713Q95044
36014A00322j002489J191761L628330J354979k760836l396992j827257k605976
36006e318158m923155m094960M73056M607268N249630K607202j668445m482674
35998g550236k152741M272817P459701K797337l773745l168547L617899O911524
35990H414009K504283l176886l494307j94107J581411J173988R66257R80218l92799
35981H362067k386702k739763j562056q97187r93961j57787J744862K588476J390348
$$ plain form
35972 5348297 5252690 5054999 5455706 5964034 6486214 7326508 7358899 4562636 -600214
35963 -600214 -4599154 -5197894 -4243603 -4141334 -4065809 -2683704 -2042297 -4188631 -5778601
35954 -5778601 -1980374 4806073 6974274 3385591 1507380 5186866 8200659 4912944
35946 4912944 -264607 -1256160 -1468862 -7055156 -13787714 -11956661 -2533498 3149733
35938 3149733 564859 -2312835 837718 5368467 5279842 2986754 3164607 4081938 1947837
35929 1947837 -1497612 -2271495 -793194 496382 2089873 4542368 4921819 1948136
35921 1948136 516694 4800781 10729897 12078017 10367527 11322290 14805055 16523122
35913 16523122 17007234 19696791 21857776 17570951 9533755 7231213 11923818 14294945
$$ packed form
35972E348297r5607j97691M00707N08328N22180Q40294L2391k796263n162850
35963f00214l998940n98740R54291J02269P5525J382105O41407k146334j589970
35954e778601L798227O786447K168201l588683j878211L679486L013793l287715
35946D912944n177551r91553k12702n586294o732558J831053R423163N683231
35938C149733k584874k877694L150553M530749q8625k293088J77853R17331k134101
35929A947837l445449p73883J478301J289576J593491K452495L79451k973683
35921A948136j431442M284087N929116J348120j710490R54763L482765J718067
35913A6523122M84112K689557K160985m286825q037196k302542M692605K371127
$$ plain form
35905 14294945 10098940 6899969 9595835 10055449 175843 -12925088 -15725575 -7719654
35897 -7719654 -1169668 -3273787 -8645143 -9934994 -7059507 -3678853 -1531372 -1222733
35889 -1222733 -3446980 -6663976 -7594465 -6146601 -6020050 -8448446 -9335676 -5271268 965809
35880 965809 3916465 2055093 -1673829 -3798100 -2500281 1894307 6054998 5286389
35872 5286389 -1230055 -8479991 -11446575 -10976937 -10781796 -10609228 -6771709 1163711 8715638
35863 8715638 12184801 12229623 10733720 7821874 3932678 1815908 3798934 8636671
35855 8636671 12887021 13951089 10613190 3070570 -5368711 -8947198 -5153823 1162113
35847 1162113 2464644 -2696957 -7958245 -6422044 2045478 10923431 13216825 7816276
$$ packed form
35905A4294945m196005l198971K695866M59614r879606j3100931k800487Q005921
35897g719654O549986k104119n371356j289851K875487L380654K147481L08639
35889a222733k224247l216996r30489J447864J26551k428396q87230M064408O237077
35880I65809K950656j861372l728922k124271J297819M394588M160691p68609
35872E286389o516444p249936k966584M69638J95141J72568L837519P935420P551927
35863H715638L469163M4822j495903k911846l889196k116770J983026M837737
35855H636671M250350J064068l337899p542620q439281l578487L793375O315936
35847A162113J302531n161601n261288J536201Q467522Q877953K293394n400549
$$ plain form
35839 7816276 722207 -804223 3780653 7722959 5746282 982546 259175 4598337
35831 4598337 8638800 8611143 6197349 4031671 1770163 -1787255 -5830149 -8234987
35823 -8234987 -7007833 -1119503 7083586 11105504 6797581 -274980 26447 8418635
35815 8418635 13985501 9166432 234677 -2352073 1959523 6288154 8129765 10260852
35807 10260852 12479071 11555838 9261582 11850803 19767566 25259357 23188148 18040619
35799 18040619 16503238 18116878 17683932 13468188 8585893 6172464 6841301 9900070
35791 9900070 14072767 17181861 17080001 13346556 7823016 3712148 3406445 5884568
35783 5884568 7078669 4588571 803956 -1065224 -2228304 -5698328 -9969447 -10621039
$$ packed form
35839G816276p094069j526430M584876L942306j976677m763736p23371M339162
35831D598337M040463k7657k413794k165678k261508l557418m042894k404838
35823h234987J227154N888330Q203089M021918m307923p072561L01427Q392188
35815H418635N566866m819069q931755k586750M311596M328631J841611K131087
35807A0260852K218219r23233k294256K589221P916763N491791k071209n147529
35799A8040619j537381J613640m32946m215744m882295k413429O68837L058769
35791I900070M172697L109094j01860l733445n523540m110868l05703K478123
35783E884568J194101k490098l784615j869180j163080l470024m271119o51592
$$ plain form
35775 -10621039 -7825696 -6228279 -6681394 -4734375 657657 3894340 1836538 -462571
35767 -462571 1844558 5365957 5279947 4856054 9970616 17572499 18868294 13018939 8570676
35758 8570676 10148189 12090260 8146442 261085 -6420065 -11355607 -16236332 -19047250
35750 -19047250 -16272041 -8984289 -1766113 3437771 8067109 12174867 13493985 12070096
35742 12070096 11766571 14861131 17725589 14788310 5800972 -3542782 -8273929 -8975609
35734 -8975609 -9045962 -9460928 -8504681 -5445531 -1593203 2215175 6295983 9674173 10060804
35725 10060804 7911570 7481871 10901784 13410567 8445162 -3151131 -12852168 -14058667
35717 -14058667 -9027794 -5179556 -7032259 -13318884 -20029773 -23930815 -23559453 -18859349
$$ packed form
35775a0621039K795343J597417m53115J947019N392032L236683k057802k299109
35767d62571K307129L521399q6010m23893N114562P601883J295795n849355m448263
35758H570676J577513J942071l943818p885357o681150m935542m880725k810918
35750a9047250K775209P287752P218176N203884M629338M107758J319118j423889
35742A2070096l03525L094560K864458k937279q987338r343754m731147p01680
35734h975609p0353m14966R56247L059150L852328L808378M080808L378190L86631
35725A0060804k149234m29699L419913K508783m965405j1596293r701037j206499
35717a4058667N030873L848238j852703o286625o710889l901042L71362M700104
$$ plain form
35709 -18859349 -11110671 -3137169 1511234 1053426 -2506726 -5061553 -4577544 -2211978
35701 -2211978 1017321 5956911 12063721 15498108 13865327 10663200 10707450 12505066
35693 12505066 10311871 3534820 -1697282 -1763092 -720761 -3237493 -7124781 -7148890 -2907842
35684 -2907842 1571265 3707719 3476867 756948 -3501167 -4796335 771103 9944180
35676 9944180 15143136 14459770 13443719 15511608 16637872 13160538 9332731 11040594
35668 11040594 15215561 12765574 1941802 -7737868 -7071920 1948297 9602543 9507968
35660 9507968 3471972 -2131573 -1925544 4696634 12613816 15144425 11429651 7877416
35652 7877416 9645625 12960635 9970967 -144267 -9875155 -13230783 -11892442 -10294225
$$ packed form
35709a8859349P748678P973502M648403m57808l560152k554827M84009K365566
35701b211978L229299M939590O106810L434387j632781l202127M4250J797616
35693A2505066k193195o777051n232102o5810J042331k516732l887288k4109M241048
35684b907842M479107K136454k30852k719919m258115j295168N567438R173077
35676I944180N198956o83366j016051K067889J126264l477334l827807J707863
35668A1040594M174967k449987j0823772r679670O65948R020217P654246r4575
35660I507968o035996n603545K06029O622178P917182K530609l714774l552235
35652G877416J768209L315010k989668j0115234r730888l355628J338341J598217
$$ plain form
35644 -10294225 -9447326 -8357394 -7652597 -8171927 -8375914 -6499023 -3574994 -1520791 -45785
35635 -45785 1574950 1588519 -1645535 -5408974 -5157916 -1123427 1677581 722070 -618028
35626 -618028 1172630 3775950 2072509 -3984465 -7934981 -4476258 3505143 8331369
35618 8331369 7787938 8062986 13599701 17720870 10074800 -7085201 -18498268 -15309588
35610 -15309588 -7014000 -7158834 -13535095 -12735431 -1357882 9169425 10119440 6661165
35602 6661165 6944110 9385000 8146355 4770844 5610503 10632175 12920416 8974744
35594 8974744 3043886 447631 1697431 4576666 7892985 11135130 13169298 13351671
35586 13351671 12496746 11364212 9225643 5160246 352953 -1948848 611418 6492710
$$ packed form
35644a0294225Q46899J089932P04797n19330k03987J876891K924029K054203J475006
35635d5785J620735J3569l234054l763439K51058M034489K801008r55511j340098
35626f18028J790658K603320j703441o056974l950516L458723P981401M826226
35618H331369n43431K75048N536715M121169p646070j7160001j1413067L188680
35610a5309588Q295588j44834o376261P99664J1377549J0527307R50015l458275
35602F661165K82945K440890j238645l375511Q39659N021672K288241l945672
35594H974744n930858k596255J249800K879235L316319L242145K034168J82373
35586A3351671q54925j132534k138569m065397m807293k301801K560266N881292
$$ plain form
35578 6492710 10882403 10278343 6128345 2731692 1990012 2068021 921593 -1455256 -4553844
35569 -4553844 -8028866 -9789987 -6621993 1268184 8899886 11857691 10702342 8148596
35561 8148596 4790889 504756 -2684749 -3001452 -2323605 -3152366 -3525554 548485 7984268
35552 7984268 12649430 11537849 8988451 10707208 16239570 19899846 18195974 14246392
35544 14246392 14131549 19280984 23823492 21253913 13157811 7871362 9344955 11597279
35536 11597279 7618043 -57161 -3127142 297390 3721060 2222930 -1964803 -4981143
35528 -4981143 -6302555 -5724589 -1136625 6602909 10977970 7023519 -1329915 -5742817
35520 -5742817 -3557076 995630 4207110 6331710 7553148 5676599 -77207 -6433810
$$ packed form
35578F492710M389693o04060m149998l396653p41680P8009j146428k376849l098588
35569d553844l475022j761121L167994P890177P631702K957805j155349k553746
35561H148596l357707m286133l189505l16703O77847q28761l73188M074039P435783
35552G984268M665162j111581k549398J718757N532362L660276j703872l949582
35544A4246392j14843N149435M542508k569579q096102n286449J473593K252324
35536A1597279l979236p675204l069981L424532L423670j498130m187733l016340
35528d981143j321412N77966M587964P739534M375061l954451q353434m412902
35520e742817K185741M552706L211480K124600J221438j876549n753806o356603
$$ plain form
35512 -6433810 -9623990 -9280333 -6690796 -1499656 6793634 15326746 19397774 17699662
35504 17699662 13116655 7770926 596490 -8443819 -15102793 -15310595 -10795171 -6108510
35496 -6108510 -1467472 6107965 14604905 16543585 9362931 463426 -2475856 -1247631
35488 -1247631 -1545697 -2138362 2359378 9987074 11891044 5327983 -2127565 -4259128
35480 -4259128 -4464162 -7698006 -10856228 -8005448 -993978 2709249 1178958 56957
35472 56957 3077512 6486210 4788375 -2034839 -9226751 -12553258 -11139168 -6847136
35464 -6847136 -2373391 808281 3048198 4528159 3663248 -638626 -6017263 -8749706
35456 -8749706 -8576268 -8320807 -8459965 -5915494 72688 4537449 2563053 -3593692 -6685200
$$ packed form
35512f433810l190180L43657K589537N191140Q293290Q533112M071028j698112
35504A7699662m583007n345729p174436r040309o658974k07802M515424M686661
35496f108510M641038P575437Q496940J938680p180654q899505k939282J228225
35488a247631k98066n92665M497740P627696J903970o563061p455548k131563
35480d259128k05034l233844l158222K850780P011470L703227j530291j122001
35472E6957L020555L408698j697835o823214p191912l326507J414090M292032
35464f847136M473745L181672K239917J479961q64911m301874n378637k732443
35456h749706J73438K55461j39158K544471N988182M464761j974396o156745l091508
$$ plain form
35447 -6685200 -2943075 4689476 11225075 14163280 13168919 8948989 4290530 3497754
35439 3497754 8015696 13650058 14316146 8118668 -1638592 -10363195 -15144773 -14957365
$$ packed form
35447f685200L742125P632551O535599K938205r94361m219930m658459p92776
35439C497754M517942N634362O66088o197478r757260q724603m781578J87408
$$ [...]
##END NTUPLES=NMR SPECTRUM
##END=
