##TITLE=31Pdec_2MTBDP2212
 CDCl3, 24 sc
 23.12.2022
##JCAMPDX= 6.0         $$ Bruker NMR JCAMP-DX V2.0
##DATA TYPE= NMR SPECTRUM
##DATA CLASS= NTUPLES
##ORIGIN= UXNMR, Bruker Analytische Messtechnik GmbH
##OWNER= root
$$ XWIN-NMR		Version 3.5
$$ Fri Dec 23 14:30:22 2022 Russian Standard Time (UT+4h)  she@DPX200
##.OBSERVE FREQUENCY= 81.013821
##.OBSERVE NUCLEUS= ^31P
##.ACQUISITION MODE= SIMULTANEOUS
##.ACQUISITION SCHEME= undefined
##.AVERAGES= 24
##.DIGITISER RES= 16
##SPECTROMETER/DATA SYSTEM= spect
##.PULSE SEQUENCE= zgpg30
##.SOLVENT NAME= DMSO
##.SHIFT REFERENCE= (INTERNAL, DMSO, 0, 248.564)
##AUDIT TRAIL= $$ (NUMBER, WHEN, WHO, WHERE, WHAT)
$$ ##TITLE= Audit trail, XWIN-NMR		Version 3.5
$$ ##JCAMPDX= 5.01
$$ ##ORIGIN= Bruker BioSpin GmbH
$$ ##OWNER= she
$$ F:/spectra/data/she/nmr/P31/1/pdata/1/auditp.txt
$$ ##AUDIT TRAIL=  $$ (NUMBER, WHEN, WHO, WHERE, WHAT)
(   1,<2022-12-23 14:29:20.84 +0400>,<she>,<DPX200>,
      <created by zg, POWCHK disabled, PULCHK disabled
       configuration hash MD5:
       00 E9 B6 7A A2 85 ED C7 34 08 36 98 17 FE 4E 26
       data hash MD5: 32K
       A7 80 D1 A7 C3 4F 13 AF A5 E2 51 30 79 E9 C7 EA>)
(   2,<2022-12-23 14:29:23.43 +0400>,<she>,<DPX200>,
      <Start of raw data processing
       efp BC_mod = 2 LB = 1 FT_mod = 6 PKNL = 1 PHC0 = -10855.86 PHC1 = 661.0566 SI = 64K 
       data hash MD5: 64K
       63 B6 6A F0 37 09 04 65 D9 64 53 7E 96 0A BE 98>)
(   3,<2022-12-23 14:29:37.56 +0400>,<she>,<DPX200>,
      <pk PHC0 = -0.6945505 PHC1 = 0 
       data hash MD5: 64K
       08 00 09 49 D6 EF 76 7C BF C6 BB 32 F9 1F 44 19>)
(   4,<2022-12-23 14:29:41.20 +0400>,<she>,<DPX200>,
      <abs ABSG = 5 
       data hash MD5: 64K
       C3 DC F8 F4 D8 CA 7A 6E E3 2A E4 98 62 82 80 06>)
$$ ##END=
$$ 
$$ hash MD5
$$ C4 56 95 4F C4 C0 AC C7 71 A0 9B 79 EA A0 55 64
##$RELAX= 
##$RELAX= 
##$RELAX= 
##$RELAX= 
##$RELAX= 
##$RELAX= 
##$RELAX= 
##$RELAX= 
##$RELAX= 
$$ Bruker specific parameters
$$ --------------------------
##$DU= <F:/spectra>
##$EXPNO= 1
##$NAME= <P31>
##$PROCNO= 1
##$TYPE= <nmr>
##$USER= <she>
##$AMP= (0..31)
100 100 100 100 100 100 100 100 100 100 100 100 100 100 100 100 100 100 
100 100 100 100 100 100 100 100 100 100 100 100 100 100 
##$AQSEQ= 0
##$AQ_mod= 1
##$AUNM= <au_zg>
##$AUTOPOS= <>
##$BF1= 81.014009
##$BF2= 200.13
##$BF3= 200.13
##$BF4= 200.13
##$BF5= 200.13
##$BF6= 200.13
##$BF7= 200.13
##$BF8= 200.13
##$BYTORDA= 1
##$CFDGTYP= 0
##$CFRGTYP= 5
##$CHEMSTR= <none>
##$CNST= (0..31)
1 1 145 1 1 1 1 1 1 1 1 1 1 1 1 1 1 1 1 1 1 1 1 1 1 1 1 1 1 1 1 1 
##$CPDPRG= <waltz16>
##$CPDPRG1= <>
##$CPDPRG2= <waltz16>
##$CPDPRG3= <>
##$CPDPRG4= <mlev>
##$CPDPRG5= <mlev>
##$CPDPRG6= <mlev>
##$CPDPRG7= <mlev>
##$CPDPRG8= <mlev>
##$CPDPRGB= <>
##$CPDPRGT= <>
##$D= (0..31)
0 1 0 0 0 0 0 0 0 0 0 0.03 2e-05 3e-06 0 0 0 0 0 0 0 0 0 0 0 0 0 0 0 0 
0 0 
##$DATE= 1671791360
##$DBL= (0..7)
120 120 120 11 120 120 24 19 
##$DBP= (0..7)
150 150 150 150 150 150 150 150 
##$DBP07= 0
##$DBPNAM0= <>
##$DBPNAM1= <>
$$ [...]
##$SUBNAM3= <"">
##$SUBNAM4= <"">
##$SUBNAM5= <"">
##$SUBNAM6= <"">
##$SUBNAM7= <"">
##$SUBNAM8= <"">
##$SUBNAM9= <"">
##$SW= 501.771253377433
##$SWIBOX= (0..15)
0 1 3 0 0 0 0 0 0 0 0 0 0 0 0 0 
##$SW_h= 40650.406504065
##$TD= 32768
##$TD0= 1
##$TE= 0
##$TE2= 300
##$TE3= 300
##$TEG= 300
##$TL= (0..7)
0 120 53 12 22 120 120 120 
##$TP= (0..7)
150 150 150 150 150 150 150 150 
##$TP07= 0
##$TPNAME0= <>
##$TPNAME1= <>
##$TPNAME2= <>
##$TPNAME3= <>
##$TPNAME4= <>
##$TPNAME5= <>
##$TPNAME6= <>
##$TPNAME7= <>
##$TPOAL= (0..7)
0.5 0.5 0.5 0.5 0.5 0.5 0.5 0.5 
##$TPOFFS= (0..7)
0 0 0 0 0 0 0 0 
##$TUNHIN= 0
##$TUNHOUT= 0
##$TUNXOUT= 0
##$USERA1= <user>
##$USERA2= <user>
##$USERA3= <user>
##$USERA4= <user>
##$USERA5= <user>
##$V9= 5
##$VALIST= <valist>
##$VCLIST= <CCCCCCCCCCCCCCC>
##$VD= 0
##$VDLIST= <DDDDDDDDDDDDDDD>
##$VPLIST= <PPPPPPPPPPPPPPP>
##$VTLIST= <TTTTTTTTTTTTTTT>
##$WBST= 1024
##$WBSW= 4
##$XGAIN= (0..3)
0 0 0 0 
##$XL= 0
##$YL= 0
##$YMAX_a= 5899
##$YMIN_a= -6143
##$ZGOPTNS= <>
##$ZL1= 120
##$ZL2= 120
##$ZL3= 120
##$ZL4= 120
##$ABSF1= 248.5645
##$ABSF2= -253.2056
##$ABSG= 5
##$ABSL= 3
##$ALPHA= 0
##$AQORDER= 0
##$ASSFAC= 0
##$ASSFACI= 0
##$ASSFACX= 0
##$ASSWID= 0
##$AUNMP= <proc_1d>
##$AZFE= 0.1
##$AZFW= 0.5
##$BCFW= 0
##$BC_mod= 2
##$BYTORDP= 0
##$COROFFS= 0
##$CY= -3
##$DATMOD= 1
##$DC= 0
##$DFILT= <>
##$DTYPP= 0
##$F1P= 0
##$F2P= 0
##$FCOR= 1
##$FTSIZE= 65536
##$FT_mod= 6
##$GAMMA= 0
##$GB= 0
##$INTBC= 1
##$INTSCL= 6.047779e-11
##$ISEN= 30
##$LB= 1
##$LEV0= 0
##$LPBIN= 0
##$MAXI= 10000
##$MC2= 0
##$MEAN= 0
##$ME_mod= 0
##$MI= 50
##$NCOEF= 0
##$NC_proc= -9
##$NLEV= 6
##$NOISF1= 182.463
##$NOISF2= 159.3651
##$NSP= 0
##$NTH_PI= 0
##$NZP= 0
##$OFFSET= 248.5645
##$PC= 4
##$PHC0= -10856.55
##$PHC1= 661.0566
##$PH_mod= 1
##$PKNL= yes
##$PPARMOD= 0
##$PSCAL= 0
##$PSIGN= 0
##$REVERSE= no
##$SF= 81.0140089999694
##$SI= 65536
##$SIGF1= 159.3651
##$SIGF2= -187.1042
##$SINO= 113.3802
##$SIOLD= 16384
##$SREGLST= <1H.CDCl3>
##$SSB= 0
##$STSI= 65536
##$STSR= 0
##$SW_p= 40650.406504065
##$SYMM= 0
##$S_DEV= 0
##$TDeff= 32768
##$TDoff= 0
##$TI= <>
##$TILT= no
##$TM1= 0
##$TM2= 0
##$TOPLEV= 0
##$USERP1= <user>
##$USERP2= <user>
##$USERP3= <user>
##$USERP4= <user>
##$USERP5= <user>
##$WDW= 1
##$XDIM= 65536
##$YMAX_p= 349186511
##$YMIN_p= -76963384
$$ End of Bruker specific parameters
$$ ---------------------------------
##NTUPLES= NMR SPECTRUM
##VAR_NAME=  FREQUENCY,     SPECTRUM/REAL,   SPECTRUM/IMAG
##SYMBOL=    X,             R,               I
##VAR_TYPE=  INDEPENDENT,   DEPENDENT,       DEPENDENT
##VAR_FORM=  AFFN,          ASDF,            ASDF
##VAR_DIM=   65536,         65536,           65536
##UNITS=     HZ,            ARBITRARY UNITS, ARBITRARY UNITS
##FACTOR=    0.620285442955139, 1,           1
##FIRST=     20137.2065510682, 0,            0
##LAST=      -20513.1999529968, 0,           0
##MIN=       -20513.1999529968, -76963384,   0
##MAX=       20137.2065510682, 349186511,    0
$$ Real data points
##PAGE= N=1
##DATA TABLE= (X++(R..R)), XYDATA
$$ [...]
42113 9375976 5538737 632079 1324467 805562 -8434645 -18918092 -17855091 -5877613
42105 -5877613 5433490 9951073 10609223 10700756 11374229 14647751 20150875 22079861 17520977
42096 17520977 13470970 16216374 18411016 8889447 -6986845 -10721581 3626790 19904120
42088 19904120 21417779 11943074 7538553 14078104 21867759 20472295 11070206 2332817
42080 2332817 -1082917 -1841805 -2869868 -1915799 3381012 8047350 4126994 -6893500
42072 -6893500 -13148486 -7179955 4844211 13194561 16931666 19570851 19306610 13367054
42064 13367054 7532497 9936478 17236280 18252517 11027481 4818934 4291812 3854040
42056 3854040 271711 -1844944 -1972476 -7948076 -20330002 -24882056 -12286898 4366283
42048 4366283 5687824 -6927221 -15146917 -10784510 -3194606 -252456 1709912 5590999
42040 5590999 6153130 1365481 -1696074 -76014 -2325123 -13103777 -21290069 -15802089
42032 -15802089 -4673100 -3862032 -12789387 -16928289 -12029217 -8608517 -11103807 -9771022
42024 -9771022 980097 11213013 10991209 5291863 4050575 7409233 10602741 14283819
42016 14283819 19182094 18632713 8362034 -2855055 -4567383 -929139 -2785444 -8822864
42008 -8822864 -9041291 -3089928 548245 1317697 5715233 10392407 4550498 -8704681
42000 -8704681 -12579953 -3285339 2791259 -3327294 -8089812 -358675 6898121 -2593722
41992 -2593722 -19843142 -22984804 -9648852 2990327 5728313 5692475 8683128 10981128
41984 10981128 10375126 10436521 11265816 8573789 4156600 5455504 12208497 14586569 7492361
41975 7492361 -3200511 -11073690 -16048750 -18394609 -15613678 -8551773 -2145098 2281810
41967 2281810 7059863 9462701 3425213 -7816181 -12386383 -7197978 -3123877 -7093226
41959 -7093226 -10843511 -5768278 1854849 1405588 -4539266 -5569979 -1147137 -94240
41951 -94240 -4393327 -5945256 -872768 3767262 1768798 -1963036 737805 7988461
41943 7988461 9837225 2968061 -3348779 569456 11076027 15870045 11267271 6827602
41935 6827602 9893240 13704587 8175889 -3525296 -9297867 -6169386 -2897671 -4404567
41927 -4404567 -4894047 218476 5274655 2748294 -6141488 -14286980 -17107435 -14208993
41919 -14208993 -7374344 -402619 2948506 3094522 3059478 2812687 783158 194423 5562640
41910 5562640 12614326 11782449 3621307 -509451 3163670 3941510 -5491456 -16228438
41902 -16228438 -17175479 -11624418 -9241816 -10207830 -9219738 -8681559 -15116279 -25859651
41894 -25859651 -30710260 -25444968 -15226159 -6805002 -4474698 -9851250 -18009324 -18404914
41886 -18404914 -7901139 2087424 224783 -8723118 -12623724 -10497863 -9702697 -9762331
41878 -9762331 -3969984 5155812 7361073 1860461 -1311149 1599199 3799388 3071862
41870 3071862 6557414 15946491 21692923 18361753 13447822 13616633 13543704 7091898 -433041
41861 -433041 -1284440 1156157 -1670220 -9215903 -13534886 -11997077 -9109491 -7431683
41853 -7431683 -5055352 -1877502 -1154418 -3646609 -5674933 -4755505 -3111829 -3208082 -2500632
41844 -2500632 3722653 14123116 19698785 14237665 4684896 4530814 15211225 21718648
41836 21718648 12033157 -6088548 -15795368 -12845673 -6467106 -2865274 -230912 1380867
41828 1380867 -1847712 -8365925 -11754307 -11691412 -13105166 -13803948 -6604962 4079374
41820 4079374 3475043 -10312461 -20063034 -14789735 -6124569 -8210805 -15244873 -13176751
41812 -13176751 -2323408 7372084 14431322 22217280 24162469 11222888 -8839637 -17571091
41804 -17571091 -11323104 -4418949 -5656403 -7986673 -5422703 -4427153 -10796382 -17623700
41796 -17623700 -15767639 -7835496 -2675841 -1834379 -215123 3135391 3151719 -2287059
41788 -2287059 -7184268 -3646764 8254617 19047421 20080949 14460687 13592835 21581423
41780 21581423 29247038 27948877 22331375 21272721 22131464 15528953 2991951 -3082259
41772 -3082259 2284809 10512785 14049918 15532585 18312502 18754105 13848960 7431249
41764 7431249 2830448 -2424575 -8849213 -10707758 -6322094 -4048306 -9641396 -15555147
41756 -15555147 -12493256 -4563482 -1548072 -1593408 5034222 17205979 21799664 12956691
41748 12956691 566852 -4301115 -2626709 -1102452 -787478 1330431 4813213 6577148
41740 6577148 6649414 7578785 9058438 7530494 1611468 -4818255 -6213932 -1447540 4561550
41731 4561550 6146562 3649415 2764564 6183684 9079570 5976816 -665301 -3479889
41723 -3479889 -422241 3264825 3182290 766726 -558246 511994 4096863 9881473
41715 9881473 15585157 18402092 18623534 17804056 13749040 3625051 -7338670 -8620555
41707 -8620555 496434 6793420 335222 -11138848 -13325434 -5697138 -721918 -4941878
41699 -4941878 -11034137 -9648425 -627446 9902345 16776504 17365886 11613870 3734949
41691 3734949 -112230 1734429 5383985 7527819 8487295 8446970 5823009 1289444 -1220459
41682 -1220459 200419 2951436 4156909 3284648 -188789 -6357380 -10976809 -8375588
41674 -8375588 -570382 3070953 -1637386 -7887411 -7735662 -868562 9497323 20588552
41666 20588552 25375933 14840977 -6555019 -18009304 -6914388 11896721 15110187
41659 15110187 2375613 -7323428 -6183935 -5216202 -10729736 -12690445 -2984781 10466852
41651 10466852 16428826 14997305 11404099 6176829 -93517 -2234378 327660 -1083034
41643 -1083034 -10806790 -19298225 -16894561 -8881760 -5942919 -6930293 -3372135 4452975
41635 4452975 8824978 8403882 8258299 8365850 4321382 -1629974 -2312549 1618051 2247630
41626 2247630 -1386900 -1212990 5445043 10271056 6660603 -1106922 -5370629 -3916710
41618 -3916710 1966078 10370058 16302270 14152657 6329218 1827515 2631337 100432
41610 100432 -10199047 -19076406 -16625412 -7384101 -3763486 -8973660 -15147844 -15774387
41602 -15774387 -12115230 -8440778 -7262492 -8500515 -8486213 -1712992 11148331 19425024
41594 19425024 13443071 -1607115 -9928146 -4030107 7001650 10052594 3092122 -5457404
41586 -5457404 -8003168 -3965240 3130699 9982299 14203968 13763882 8273750 748137
41578 748137 -3651936 -1870644 4476787 11453345 16547501 18702266 16477331 9529491
41570 9529491 1182019 -4498566 -8205647 -13406920 -18400107 -16393488 -6048757 4246634
41562 4246634 7198530 6186433 7930303 10479906 6975819 -1119294 -4258581 859495
41554 859495 5999929 3659703 -2534595 -4444988 -1263475 826619 -1882223 -6468240
41546 -6468240 -7889173 -4335965 1610517 5334885 4267631 187072 -4112021 -9955967
41538 -9955967 -20433792 -32047756 -34788239 -24763735 -11669435 -7329408 -10232708 -9100492
41530 -9100492 -111904 8348973 9167540 5803321 4248697 3300605 -1033840 -6772782
41522 -6772782 -8609070 -6189097 -3079745 322461 5861296 10790525 9617074 3665545
41514 3665545 1326259 5770128 8761844 1555173 -12097977 -19185435 -12296687 2673402
41506 2673402 13399427 13276825 6689815 3225238 6733589 11276661 9696696 3830153
41498 3830153 1054071 1629459 -2797571 -15623712 -27890031 -29666003 -22659627 -15178216
41490 -15178216 -10106286 -5855390 -4733160 -10189196 -17168682 -15401042 -3624209 7922622
41482 7922622 11169009 8799211 6976190 6954338 7037233 6129836 1996837 -7542377 -18241430
41473 -18241430 -21098553 -14588974 -8138322 -8183340 -8338950 -800337 9515744 12206382
41465 12206382 8070116 7340596 13231158 18523644 18705802 17309883 15950058 10011570
41457 10011570 -1039821 -8792542 -7865014 -4515064 -5506929 -5688122 3279410 16748643
41449 16748643 21313354 13677799 3989364 -267374 -2287506 -5033123 -4218241 1133657
41441 1133657 1585895 -9056643 -20305193 -17350806 -2995981 5590456 1148674 -5742812
41433 -5742812 -5060779 -544060 1092632 2342288 7421392 11640755 8945591 4050805
41425 4050805 5832895 12130249 12342689 3900891 -4431086 -5926081 -2670492 2177271
41417 2177271 8903571 14883443 12851498 944979 -11650616 -14199071 -5732293 6079334
41409 6079334 13172615 11919510 4413140 -2525969 -3568747 -1257004 -1596840 -3817579
41401 -3817579 -2085702 2355822 1270873 -5104955 -4250311 9962018 24969452 25234805
41393 25234805 12051545 -2248270 -11959188 -17993175 -17045257 -5505878 8741070 12924483
41385 12924483 7494646 4520143 7947337 9373364 5216829 3273561 7190804 8212775
41377 8212775 106136 -9148804 -9351022 -2328094 4474361 9655836 13489663 10465422
41369 10465422 -2019476 -13817373 -13409753 -4863729 -826383 -1947718 2457554 13986539
41361 13986539 20761687 16688887 10759337 10688413 10094803 1720809 -6711628 -2666959
41353 -2666959 10416073 15659427 5650587 -8224953 -11689758 -4034525 5424982 10640935
41345 10640935 12623692 13238496 11424285 6217509 -86842 -3739929 -3312086 -95601
41337 -95601 4849828 11826576 19407351 22564836 17626214 8610600 4036011 6190165
41329 6190165 8396555 5548567 2069577 4425735 10076474 10869749 5292835 -48686
41321 -48686 -788379 411565 109166 -1458742 -3403480 -5402272 -4542705 2458049 12095906
41312 12095906 16139516 13199694 10722125 12431393 12442727 6772684 1736440 3636664
41304 3636664 8068228 8098639 5932148 6621439 6731211 767081 -6292333 -5578067 256741
41295 256741 1632827 -614290 2652358 10295970 10762435 2624408 -1164131 5502612
41287 5502612 12066436 9805941 5250559 5892982 6389578 512188 -5142099 -2382837
41279 -2382837 3537293 3591557 970753 3030430 4959673 -2279296 -12997696 -13057163 -2773088
41270 -2773088 3567688 1050059 -37622 5819782 10355389 8289803 7938709 16045254
41262 16045254 23874003 19336038 5516962 -3215967 405190 10355915 17189885 17405505
41254 17405505 13665228 10177014 8270378 5536302 419270 -3461565 -1488221 4108130
41246 4108130 5911084 1143402 -5628621 -9819889 -10701510 -7820418 -1031931 4838084
41238 4838084 3539572 -2461377 -3992891 371033 2001442 -1761428 -1145341 8795988
41230 8795988 15721410 6442513 -12225337 -22269772 -19057034 -13319204 -11375544 -8344549
41222 -8344549 -2103245 634751 -2625632 -3137904 5305148 14660904 13826310 5312966
41214 5312966 842641 3708839 5958232 2968503 473645 3310605 5803097 772641
41206 772641 -6919051 -5269927 7059158 17219030 15742222 9596852 11059961 19153111
41198 19153111 21463775 12967126 3455392 3652650 11242903 15262487 9946015 -254187
41190 -254187 -6905081 -5221770 3042603 11579891 14907946 12824989 8943740 5763763
41182 5763763 3653186 3453803 5817807 8151028 6861138 2925448 474194 -124578
41174 -124578 -1937466 -4032785 -1650440 4701564 8314215 7330834 8313052 14230650 17357436
41165 17357436 10827612 196269 -4178615 -741881 4679877 8737034 11371083 11545175
41157 11545175 9938631 11344765 16603025 17373383 7935932 -3248338 -4719645 -187049
41149 -187049 -2570650 -12407415 -16532498 -8987418 544314 2298636 -1844677 -6368783
41141 -6368783 -10495830 -13211966 -10098412 -1478093 4677348 4035833 2420609 5204361
41133 5204361 7991540 4833369 -1014986 -2274100 1261514 3828398 2217983 -2508218
41125 -2508218 -7995280 -10196932 -4395734 7914796 17236994 16377757 8529131 617874
41117 617874 -5663837 -10269627 -8764012 1242277 11895212 12961735 5796994 516744
41109 516744 686808 280710 -3934515 -6589364 -3148836 2453810 3890240 1300375 142068
41100 142068 3827605 10088585 13257806 9402141 644141 -6101157 -6518767 -3455315
41092 -3455315 -1419260 923863 7844691 17375486 20966469 13601771 193359 -9563495
41084 -9563495 -10103471 -3380977 4076427 7294751 7792764 11385895 19476230 25584983
41076 25584983 23988581 18212495 15377338 14917731 10090178 -426052 -10007640 -13538586
41068 -13538586 -12291081 -8481325 -2318218 3509619 3684147 -1890978 -6059929 -3968124
41060 -3968124 550414 1799818 311739 -299326 -247530 -2334300 -6416094 -9213095 -7966548
41051 -7966548 -2072293 6073255 10086014 4069619 -8526229 -15164275 -8317934 4105783
41043 4105783 7947293 106153 -9113143 -9999098 -3974048 876537 392996 -1958882
41035 -1958882 -138413 7688101 17537974 24064814 25175681 21232507 12070463 -1227540
41027 -1227540 -12524616 -14128744 -5671092 4909889 10812477 12304860 11928557 9792682
41019 9792682 6666677 5733631 6859883 4667994 -2337258 -5998428 1281479 14356819
41011 14356819 20818099 16549747 8836435 5164739 5689367 6798902 6265961 3951441
41003 3951441 1483979 1516955 4292828 5973769 3509942 -615159 -1975981 -467125
40995 -467125 587238 -757946 -4451801 -9466478 -12243698 -8809813 -2353505 -2322639 -10325480
40986 -10325480 -14695602 -7505819 1377677 -640120 -7156540 -2241968 12502025 19173896
40978 19173896 12347557 7244571 14044189 22270841 20065572 13477259 14269697 20066097
40970 20066097 19819876 11438619 1972866 -4400638 -8132904 -8356428 -4554963 -840513
40962 -840513 -674376 -603584 3819581 9402261 9159108 1752836 -8048517 -14774388 -14435679
40953 -14435679 -6737325 1314945 980827 -5363310 -5726957 2973694 9231593 5920457
40945 5920457 1454351 2684309 1537627 -7601885 -11936301 -327479 12994603 7440794
40937 7440794 -9764785 -13740800 -2052814 2449055 -10026173 -21984212 -19006639 -9621687
40929 -9621687 -5216466 -2422903 2418926 1384781 -8237085 -12838669 -3689252 6010000
40921 6010000 1638966 -8788652 -8812681 -391148 2684450 17493 3230811 13641042
40913 13641042 20269421 19055024 17212679 17778285 14804912 5942993 -3036891 -8517036
40905 -8517036 -12614027 -14725929 -10433368 -1295375 4261145 2790255 -104937 -57164
40897 -57164 105392 -2458945 -5154453 -4940418 -2558262 552691 3743042 4208356 -984169
40888 -984169 -8496474 -11101188 -8062257 -5926592 -6828045 -4102163 6101447 16044644
40880 16044644 15710343 6493934 -1088356 -1619382 -700172 -5699802 -14758393 -18575548
40872 -18575548 -12867258 -4997482 -4300896 -8319949 -6080693 4528003 12555000 11507042
40864 11507042 9923530 15275894 18065879 6747514 -8868892 -7991735 9270598 20286137
40856 20286137 13199192 2443461 3679448 11521188 13950679 13287858 17351865 21069287
40848 21069287 14180230 867018 -4848828 -263245 4444832 4405586 5233703 9094375
40840 9094375 9366862 3037120 -2702931 -1213048 4672589 9054669 11159002 12549385
40832 12549385 12126086 8661456 4129694 727344 -2086753 -4927759 -6303958 -5465184
40824 -5465184 -4270919 -4290722 -5002635 -6125231 -8371984 -10723013 -10433355 -6775494 -1369092
40815 -1369092 5340150 13387024 19085614 17770420 12094405 10625045 15243074 17148722
40807 17148722 10133408 855757 -1018979 2683860 2750602 -2098524 -3805516 1100828
40799 1100828 5419965 2414574 -3614619 -2900651 6722786 16702169 17340072 8249584
40791 8249584 -1227841 -1646241 6906677 15594235 16813516 10964370 2955269 -3918091
40783 -3918091 -8136556 -8204782 -5076742 -3191495 -4353576 -3807044 1710866 5288321 -2551939
40774 -2551939 -18839999 -29958957 -29398586 -24549946 -23170065 -22475894 -17081621 -9878848
40766 -9878848 -7527646 -9884393 -10872637 -7091433 -350557 5505764 6050187 -1543127
40758 -1543127 -12963552 -17647117 -10845057 -865442 1837393 -1262549 -880171 5326738
40750 5326738 10634366 10198877 5804187 321643 -4607950 -5456577 578761 8767745
40742 8767745 9821518 1308872 -9634185 -15557052 -14924268 -9618487 -3260877 -1866454
40734 -1866454 -8388183 -16110113 -15308351 -6705086 506718 3963063 10048826 18558263
40726 18558263 18663955 6208599 -6984074 -9609070 -6579046 -8363041 -13275989 -12011360
40718 -12011360 -4006174 2543558 3874918 3262724 2160189 -1785011 -8381126 -14250466
40710 -14250466 -18120972 -20898487 -22305836 -23017694 -26782947 -33693197 -35096390 -23502910
40702 -23502910 -4924226 7085217 7642862 2701556 -2183883 -5523820 -4222091 4471982
40694 4471982 14406510 14265987 2598383 -9134243 -11021183 -4977993 1319087 3405076
40686 3405076 588815 -5723467 -11640198 -13965888 -14893065 -18212048 -21232204 -17405788
40678 -17405788 -6827316 3600966 10334614 14805194 15049987 6624467 -6150526 -11420659
40670 -11420659 -6696945 -3773644 -10925558 -20207598 -19697727 -9539470 2117900 10972235
40662 10972235 15317742 10278484 -5534846 -21432797 -23296716 -10083543 5751887
40655 5751887 13066073 10746866 3486702 -3854057 -7615564 -6812934 -4181438 -2803821
40647 -2803821 -2565025 -2183262 -2097297 -2469622 -1707430 -317288 -2207373 -8068146 -11857405
40638 -11857405 -8905152 -3148284 -456684 785021 5120447 9745279 7746654 383756
40630 383756 -2648993 3756261 13952620 20055571 20739984 19525976 19073677 19543514 19608697
40621 19608697 17609022 13501085 9351171 5885592 449987 -8061801 -14397106 -12401028
40613 -12401028 -4583207 -451408 -4352856 -10136925 -10016417 -4486145 -67294 597441
40605 597441 2557786 11413536 24004591 29314934 20979375 6865447 1276367 7544420
40597 7544420 14592427 12948528 6918891 5544010 8080778 6885845 782460 -4091075
40589 -4091075 -5669786 -8687616 -14578325 -17068744 -11494642 -2509015 1681387 -919275
40581 -919275 -5353174 -6030269 -1299465 6043661 10624557 8397730 364006 -8227077
40573 -8227077 -12572281 -11296571 -5711814 1548343 7268881 9227233 7565063 3875407
40565 3875407 -206225 -2692684 -1553464 2832648 7331772 9819694 10919679 10351925
40557 10351925 5356521 -3935761 -11241866 -10841157 -4941655 99484 2170185 3127068
40549 3127068 3086573 1207688 347912 4319585 10978892 13958650 11171741 6286778 2190788
40540 2190788 -1392241 -3886523 -3291156 -453769 871004 -975286 -4131148 -6302656
40532 -6302656 -5607216 -126365 8618250 13911411 11348442 5883255 4758896 5962704
40524 5962704 2165721 -5653669 -8810665 -5414286 -3504418 -7348971 -11018283 -9690028
40516 -9690028 -7680116 -9564650 -11538814 -8118644 -1004284 4829996 8218875 9313553
40508 9313553 5758871 -2195859 -7466538 -3659770 6317322 14388277 16531708 13115980
40500 13115980 4630336 -6511184 -13406725 -11001287 -3349334 1444106 2060761 3796288
40492 3796288 8557558 11552877 9091593 4494081 3683565 7749327 12367121 13600947
40484 13600947 12280165 11811690 12558582 10926436 5363044 293255 465235 3577731
40476 3577731 3615072 424489 75678 5569775 13101877 18263505 20068467 18052477 11867471
40467 11867471 5085014 2642181 2845798 -885991 -8374904 -10929359 -4408407 4200095
40459 4200095 7398130 6319657 4640189 1760453 -2171066 -2559636 1717266 4277342
40451 4277342 1774384 457242 4806896 8239266 4263228 -1318493 10649 5077960
40443 5077960 5850215 3887888 4951499 5099188 -2868930 -12869347 -11552569 69056
40435 69056 6762098 1920978 -4972715 -6376144 -6826345 -9684985 -7911361 3564559
40427 3564559 16932403 21724870 18198478 12899464 7651372 712963 -5932861 -7634349
40419 -7634349 -3081679 4946347 12391467 15501250 13597763 11755666 15812112 23455143
40411 23455143 25953769 19839653 10379848 2544471 -3658510 -7523832 -6594140 -3971350
40403 -3971350 -6917104 -14323972 -15850280 -8563144 -3408546 -8072616 -14588007 -13418317
40395 -13418317 -9238111 -10636443 -13190653 -7340601 3075090 5866861 889925 -421055
40387 -421055 4794722 7092712 3241887 2684513 9756397 13558070 4783147 -7946076
40379 -7946076 -9604441 -189812 6312603 1567134 -8145140 -12519123 -9109282 -2666936
40371 -2666936 2406452 6039646 10559855 16308171 19477657 15358833 4251544 -7466714
40363 -7466714 -13227502 -11859956 -6773831 -1843270 720413 837787 822116 3388336 7846390
40354 7846390 10273029 8927415 6738319 6101413 4341688 -1730391 -9028099 -11087613
40346 -11087613 -7214770 -3585449 -4498461 -7563735 -9389538 -10806029 -12676037 -11046143
40338 -11046143 -2473007 7984713 10916287 5159341 -36970 2231319 7209733 6213916
40330 6213916 -335070 -3328068 2871439 13815610 20981638 20736779 16510212 14519772
40322 14519772 17662327 21815507 19160450 7821844 -3481317 -4799571 2135006 6341031
40314 6341031 3222380 268177 3983248 8783387 5747446 -2880597 -6975784 -4295772
40306 -4295772 -3314812 -8941524 -14435649 -12229765 -5882197 -4277689 -7815770 -8200612
40298 -8200612 -1161909 8013761 13062794 13979589 12090721 4287034 -10775895 -24160224
40290 -24160224 -23544095 -9750541 2016042 1629855 -2522916 3288908 16885825 22567413
40282 22567413 14032995 3797469 5435473 15388802 20165122 15981552 11478025 12329307
40274 12329307 13158719 7998203 1311812 2272651 11266896 18522764 16441486 8488612
40266 8488612 3707226 5400067 8343718 6145532 -1728267 -10567956 -15259173 -13118691
40258 -13118691 -4434248 6878879 14214314 13322199 7077596 2657715 3194729 5032881
40250 5032881 4701533 5072848 10578396 18076552 18128311 7062935 -6721162 -12330808
40242 -12330808 -9577719 -7571086 -10990923 -14120649 -10838965 -4456500 -2086297 -3393354
40234 -3393354 -2606727 -16003 -2332748 -10137415 -14323135 -9756494 -4117122 -5705460
40226 -5705460 -9200310 -3591603 9446103 16380428 10901896 1759799 -792936 2718521
40218 2718521 6279186 8332157 10943458 14154424 16483125 17887527 18233253 15518706
40210 15518706 8838936 749629 -5499335 -8448329 -7115674 -1456344 4323074 4147535
40202 4147535 -1562107 -5207674 -2936533 -454311 -3423755 -7912454 -6831688 -1444824
40194 -1444824 1003506 -1338860 -3266755 -1486772 1181334 1187931 -905537 -2032367 -413322
40185 -413322 2473942 2828753 -670920 -2738164 3097468 13537434 17229082 11477241
40177 11477241 8600805 17757028 28595708 24910280 9226049 -561614 2508115 6653554
40169 6653554 2191357 -4284772 -2887863 4006160 7602881 6103055 4203258 4907952
40161 4907952 8758203 16261032 24722738 27199380 20613963 10597718 2825210 -4863050
40153 -4863050 -14714825 -19530633 -11332899 3354829 8559205 226490 -7919453 -3684861
40145 -3684861 7168175 10097452 1533923 -8233378 -9702010 -4289809 1203409 4324238
40137 4324238 7356544 11040110 12811097 11509353 9849284 10150957 10280180 6682690
40129 6682690 -96565 -5913641 -8107087 -7171001 -4297781 -651759 1614605 1582818 2475675
40120 2475675 7781021 14314503 14636180 7877678 2375510 4339570 9020526 7620370
40112 7620370 -827409 -9362314 -12255459 -9554877 -4325400 83941 977349 -1551827
40104 -1551827 -3847161 -2831654 129067 1944487 2416614 3031782 3288200 2169250 1608040
40095 1608040 4057153 7496091 7251266 2579353 -2475871 -4712728 -4632004 -3809664 -3020106
40086 -3020106 -2990905 -3661455 -2914462 475537 3195420 973835 -4301251 -5965497 -2081109
40077 -2081109 1269515 -1633082 -8392751 -11936479 -9209224 -4069747 -2879764 -8130613
40069 -8130613 -14961733 -14525299 -3813508 8502715 10598957 2148087 -4983445 -2086072
40061 -2086072 6509467 11954709 12837170 13038678 12622989 8218749 461192 -5513404 -6411248
40052 -6411248 -2556023 5339677 15462843 22027162 19907917 12750797 10030422 14569270
40044 14569270 19181854 17748111 12977570 9711078 7232004 3923371 4040177 12056666
40036 12056666 23031206 26729698 21195834 15035355 14854213 16840421 13653930 4479176
40028 4479176 -5665169 -12845394 -15860776 -13243628 -3907491 8789596 17789475 19410915
40020 19410915 17615683 18627847 22093536 20924918 11399051 367578 -1712955 5893614
40012 5893614 13013395 12085816 7305900 6340780 8053351 5377511 -2172358 -6992124
40004 -6992124 -4774666 -104569 1314873 -221981 -1724347 -2317199 -1605627 1765996
39996 1765996 6518305 8169737 5295524 1955020 1010801 295970 -1278898 -250172
39988 -250172 3899505 4647339 -1177930 -5181049 1444660 13246870 17172659 11072058
39980 11072058 5054957 5728906 9710055 12689738 14049044 11224913 721496 -12001050
39972 -12001050 -14219028 -2542987 11107064 15373845 12858038 11784183 12707800 11349045
39964 11349045 8058294 5804045 3231855 -1933919 -5685612 -1982609 7299082 13546727
39956 13546727 11937983 5513007 -211374 -1836362 1514006 7613916 11672910 11312425
39948 11312425 9927930 11701827 15025951 14640174 8737934 444231 -6050634 -7636663
39940 -7636663 -3018281 4850789 9274201 6724716 1393613 -564953 1196322 2907842
39932 2907842 3198167 3419054 3865608 4073311 4627709 4744899 1204476 -5723990 -8955302
39923 -8955302 -3017500 7325408 13272660 13977775 15127752 17738575 16751098 10733870
39915 10733870 5155751 4239380 5309581 3104819 -3966639 -12274762 -15120148 -8594731
39907 -8594731 1419845 2569981 -7876379 -15551531 -6613122 11439952 18446465 9332562
39899 9332562 -429953 1163490 7134259 5837181 -1244152 -5105342 -4551607 -6088606
39891 -6088606 -12401928 -18860141 -19933957 -14205192 -4795656 2119246 2200237 -1005956
39883 -1005956 1303641 11834990 22901988 26537496 23939676 20793901 18128022 13505606
39875 13505606 8148274 6816077 11255935 17850309 21671603 20511308 15397873 8759074
39867 8759074 2059244 -4361033 -8429671 -6148737 2216670 8862926 7477862 3263445
39859 3263445 5870738 13474200 14048480 3922017 -5769940 -5265937 1225406 4973559
39851 4973559 5825533 8609271 13578539 17744335 20012462 18915727 11586704 1028922
39843 1028922 -3041731 2064920 5245528 -2411210 -12468197 -11217999 -805688 4771410
39835 4771410 1057252 -3513620 -4772732 -8811206 -17567516 -21018708 -10850995 5660082
39827 5660082 12732413 4162467 -10185370 -15159534 -5939471 6961540 9158091 -1097876
39819 -1097876 -11527439 -11988795 -5543638 350119 5431528 11508187 13177937 5297934
39811 5297934 -4510007 -3506426 7507761 15507600 14910101 12933513 13738555 11016925
39803 11016925 1554434 -6064533 -4189360 1712719 2257760 -1334900 -1093310 3541472
39795 3541472 4586335 -2110337 -10377776 -11331627 -4000008 3513312 2960632 -4750696
39787 -4750696 -10650097 -8583114 -1770485 3952454 8846086 15542436 20543253 17898600
39779 17898600 10076551 6426025 10316978 15720859 17174088 15086071 10512605 3531863
39771 3531863 -1829624 -503488 3614287 486071 -10133428 -16083786 -10606024 -1963236
39763 -1963236 902527 1462816 5861571 9949404 6935529 797805 551025 5883322
39755 5883322 9497241 10389850 13913168 20270966 23208837 20262965 15827488 13465957
39747 13465957 12136374 10288400 7657655 3331608 -2391293 -5425634 -3107364 -287799
39739 -287799 -3452960 -10244814 -12523524 -9209962 -7639707 -11189336 -13946259 -10564522
39731 -10564522 -4350415 -1513773 -2571296 -3587342 -2376702 170871 2593242 3833882
39723 3833882 3184821 1118078 -650737 -499759 2410571 7882518 13569474 15745681
39715 15745681 13681398 11496721 12632048 14608336 13187522 9421178 7445425 7220057
39707 7220057 5753207 4391274 7423083 13041427 13776785 8355270 5346306 10622461
39699 10622461 17942185 18117462 12534017 10179631 13717324 16100180 11440561 3071066
39691 3071066 -1635452 -678569 1292041 -404454 -4918601 -7096251 -3452213 3590290
39683 3590290 7914715 6292307 1904267 504747 3702276 7375703 6970267 3174428
39675 3174428 1114277 3979297 8880921 10347680 7304451 4479515 6139825 10270825
39667 10270825 10837339 5195973 -2525726 -5768501 -2336174 3577671 5906463 2931144
39659 2931144 -1416778 -2411785 565092 4785014 7966881 9052994 6808881 1301342
39651 1301342 -3715864 -3967138 -550777 1452351 765919 1268719 4078601 4215169 -1113283
39642 -1113283 -5927710 -2460749 8221709 17406167 18618569 12462400 3754399 -2210024
39634 -2210024 -2338825 1596571 4186218 2439754 -1750671 -6512600 -12493487 -17882156
39626 -17882156 -17493054 -11763477 -9748317 -15923100 -20717258 -13998804 -2528206 -1720319
39618 -1720319 -12776579 -21253895 -18465084 -11275230 -8226299 -8144443 -6789026 -4035280
39610 -4035280 566754 9564572 19548211 20745656 10879512 835611 -10025 4108433
39602 4108433 4716762 2040015 374548 -1472497 -5431852 -6562716 -773936 5153718
39594 5153718 2375434 -5196367 -6400682 -370059 3600831 2705078 4563454 12871488
39586 12871488 20432728 19960588 12679118 3046078 -6244669 -10610668 -4322001 9537367
39578 9537367 17663586 11835737 41078 -4107193 1351275 6402663 3006934 -6485911
39570 -6485911 -13380174 -11121540 -1441905 5477900 281926 -13415457 -20769639 -13524147
39562 -13524147 -864143 3142993 -2363765 -7483984 -7979260 -8780718 -11845032 -11434116
39554 -11434116 -4542672 2720034 3766451 72786 -3303437 -4951363 -5164762 -2226613
39546 -2226613 3661091 6972682 3412345 -3169343 -5953535 -4222548 -1431371 2487421
39538 2487421 9393634 15419405 13690297 5024270 -1796289 -2000891 -56605 -779712
39530 -779712 -2067055 182457 5620017 11440590 16008120 17640306 14954530 11288234
39522 11288234 12920826 19274394 21029068 12564257 317098 -6221179 -5459166 -66502
39514 -66502 9884782 21798089 25803612 16284253 3246750 182167 4217629 1750355
39506 1750355 -8270066 -12159187 -3823189 6566705 10773341 14105185 21222694 24486414
39498 24486414 17410446 8355335 8058667 12145745 9717053 2906037 2925966 10003045
39490 10003045 12718364 7579942 4594046 9795983 15008825 11207306 2125619 -3040675
39482 -3040675 -3385090 -4611113 -7927687 -8669554 -4800524 -393432 206834 -2324257 -4197036
39473 -4197036 -3582148 -2347215 -2961421 -4415203 -2665946 3778682 10459643 11924732
39465 11924732 9094167 7939430 10899447 14047161 13970416 12687789 12768118 11738185 6083780
39456 6083780 -1464048 -3964139 512714 6142728 6752738 2300158 -3388919 -7754897
39448 -7754897 -9926320 -9036755 -5753916 -3731108 -5412986 -7114567 -2945557 5817957
39440 5817957 10501259 6721332 1464781 3800112 11817679 14900158 8037328 -2098747
39432 -2098747 -6187537 -2314233 4572740 8737732 6822562 -1218091 -10962107 -15371605
39424 -15371605 -10909767 -1517991 4749311 2891766 -4649874 -9379572 -3812460 10103562
39416 10103562 20847830 19236125 9337749 3074255 5217174 9671920 9983744 6124985
39408 6124985 137368 -6712123 -10116854 -4557125 7239825 14634076 13097859 9608284
39400 9608284 9507834 8193649 3080582 2863935 13668321 25045252 23572431 13923470
39392 13923470 11143183 16050420 15105900 4160791 -4584190 -2475563 3725844 5099253
39384 5099253 2904846 1646483 859286 47974 2085929 5934939 5414298 631897 529749
39375 529749 8021220 13506256 10759271 7935764 12808173 17902522 13157270 4492284
39367 4492284 4662332 11505669 11649571 3438044 -359187 6140397 13311299 12819402 9427364
39358 9427364 9364361 8171344 -776170 -12801585 -16239832 -7234121 6282442 13625458
39350 13625458 10185147 -361639 -8781932 -7412310 2055645 9857362 9514032 4525694
39342 4525694 654466 -3725652 -13168315 -23798078 -25127500 -14863288 -4204161 -3495805
39334 -3495805 -8146208 -6005031 4085837 10234995 5261681 -2620167 -2426999 3488047
39326 3488047 4754428 198079 -1283897 3134158 4620084 -2857550 -12274409 -14308365
39318 -14308365 -10849509 -9896813 -12421505 -13032515 -10621546 -9799571 -12642385 -15919243
39310 -15919243 -16139262 -11947850 -2912091 8513156 15672380 14435950 9365443 6973072
39302 6973072 5614885 -164278 -8098932 -10962011 -9251234 -9548370 -10175411 -1991291
39294 -1991291 13288405 19972941 11185978 1845254 7560371 20551339 20668756 4685523
39286 4685523 -10375174 -11961547 -6118494 -4206772 -6980284 -7718157 -3979171 186583
39278 186583 759228 -1814709 -3715047 -1554871 3997673 8323213 8035647 5345593 5271603
39269 5271603 9583957 15749911 20359742 21031662 16953783 10760739 7782294 10002963
39261 10002963 13352646 14647353 17048315 22775609 25038294 16480202 3200742 -798809
39253 -798809 6382576 11664425 7065876 906351 2784229 7964470 5960332 -2930401
39245 -2930401 -9792663 -10620956 -7614888 -758286 11162972 22723459 25497091 19980523
39237 19980523 14838322 13605551 11378588 6251770 3995880 7285801 9417737 4978408
39229 4978408 -472056 1289438 8500462 12979767 12832705 13392021 16981227 19690243
39221 19690243 18816235 16537803 14360035 9855374 2008559 -4669493 -5245901 -1062562
39213 -1062562 2188067 1702833 -405635 -2009966 -4602228 -10191033 -16031780 -15506745
39205 -15506745 -6003494 5571834 8397626 -403072 -12333682 -17414910 -14307587 -7921149
39197 -7921149 -754163 7754498 15026788 15773230 10199234 5573808 6313326 7577470
39189 7577470 3158355 -4331794 -6804922 -1931636 4854506 8719167 9765162 8344766
39181 8344766 2228946 -8074718 -15152041 -10664665 4895129 21293330 28002659 23595864
39173 23595864 15745376 12592324 14529641 15063346 9821153 2717433 979115 5344686
39165 5344686 8818960 5579123 -2434948 -9379482 -12793044 -14390182 -15667493 -15855339
39157 -15855339 -13793289 -9788420 -5733344 -4262625 -6675489 -10561055 -11009307 -5849981
39149 -5849981 1640518 6924570 9486396 11760205 14358672 15307977 13301737 8906348
39141 8906348 2936135 -3577384 -7881964 -6797401 -202683 8469333 15198296 17387532
39133 17387532 14146149 7399865 2009224 1458625 3570806 3718671 1798162 1735192 3945531
39124 3945531 3652217 -1325058 -6059397 -5089923 278823 4775076 6106011 5509831 4280038
39115 4280038 3661440 5533163 8763245 7294816 -2729745 -15247463 -19526428 -13199546
39107 -13199546 -4417422 -10162 2612448 8803792 16854143 19801923 15161329 8336022
39099 8336022 6073165 9413782 14074714 15998841 14892418 12511436 9169933 3835442
39091 3835442 -2287405 -4819950 -1080569 5314307 7507767 3147662 -3213228 -5927819
39083 -5927819 -4401641 -2467511 -3105492 -5075551 -4549893 228668 5995236 7128007
39075 7128007 1981434 -4932926 -8726084 -10341260 -13902988 -18786536 -18630829 -9607136
39067 -9607136 3614071 12488273 13299674 9091150 4285932 74679 -4531004 -8932294
39059 -8932294 -10063838 -5956936 660756 4283159 2939213 812407 2923548 8711534
39051 8711534 13135515 12981002 9391377 4973226 1565226 688650 2761909 5095368
39043 5095368 3681859 -1695558 -6470278 -6719498 -3603359 -971246 -184750 869667
39035 869667 4146505 8246403 9561313 6716007 2905986 2022506 2873015 623064 -5079025
39026 -5079025 -7820013 -3149265 4695642 9060830 9716890 9739240 7607020 442793 -7049551
39017 -7049551 -6055789 3644803 12690022 14662516 11568358 6213318 -1258579 -6965152
39009 -6965152 -3953400 5765792 9413957 467554 -10549881 -10035726 486519 8361964
39001 8361964 6961873 626065 -3994943 -4030075 -248593 3231358 1651502 -3637954
38993 -3637954 -5405379 -1591478 371238 -4155416 -8450496 -6308637 -4178545 -10227215
38985 -10227215 -18187414 -15691849 -4312867 3100288 2657361 2238711 5040754 5885744
38977 5885744 5138866 10348436 20283357 22776829 14286742 6858070 7966068 7824305
38969 7824305 -2792674 -14962265 -15110428 -6354712 -1733063 -2619229 756618 10095475
38961 10095475 15392556 11694974 6737724 7869786 11061618 8561182 1305756 -2326742
38953 -2326742 2235609 10296203 14004988 11731232 9275275 11062951 12949518 8125459
38945 8125459 -1209764 -5128776 -393388 4271914 1483079 -3808827 -3051350 2792424
38937 2792424 7031516 8863910 11677150 13399067 9082453 1515588 -1431801 -24180
38929 -24180 -2346565 -9215413 -10724764 -2078558 7647843 9128713 6147482 6962429 9789985
38920 9789985 7485661 2007352 2132278 7755762 8600115 1219652 -3854477 1888202
38912 1888202 10696486 9312612 -1540225 -8867034 -6719856 -3115526 -5884485 -11237999
38904 -11237999 -11392876 -6503903 -2620930 -2231099 -3047371 -3277407 -2511336 172353 3726038
38895 3726038 3465669 -2283654 -6515263 -1370145 10192850 17895650 18008295 15668129
38887 15668129 14036632 10459900 4631116 1185927 1302815 314230 -3023789 -3605466
38879 -3605466 -294651 133250 -5031960 -7852524 -2808478 2096580 -2859016 -12769020
38871 -12769020 -14765713 -7131540 -502859 -1481580 -5404720 -5728329 -1715383 4324247
38863 4324247 9942690 11525657 6998160 701410 -397920 3807999 6778060 5777105
38855 5777105 5644512 9968089 14270634 11752099 2717621 -4902357 -3649755 5829118
38847 5829118 15120218 17013111 14004670 14359181 19156614 19873041 12466426 5807509
38839 5807509 8316760 13379461 9431816 -176214 -1417334 7377212 11784084 3810712
38831 3810712 -5959015 -5606400 459645 464987 -6439248 -10987453 -7898388 -39255 8293047
38822 8293047 14119754 14046069 7531854 1075991 2409925 10426719 16299646 14526300
38814 14526300 7634946 -117696 -7726516 -14067058 -14716283 -6518684 6574313 16094307
38806 16094307 17730708 15109002 14389161 17271080 20856560 22495952 21759389 18455051
38798 18455051 12838552 8532682 10556640 17853333 22050252 17462216 8515169 2547183
38790 2547183 -959121 -7477757 -16279957 -19866538 -14524979 -4846136 2911162 6118397
38782 6118397 4076334 -2658286 -9876719 -12229585 -9662777 -6675724 -4790999 -1270800
38774 -1270800 4352900 8758743 10611026 11350295 9568155 2211841 -7073557 -9161415
38766 -9161415 -1962825 6244955 9322886 10522517 12803776 11284563 2714738 -5144674
38758 -5144674 -2668074 7733342 15102715 14267026 9622768 7109760 8605748 12247858
38750 12247858 13321355 7268725 -4086084 -12743945 -14633685 -14469635 -16090532 -14596081
38742 -14596081 -5113572 6653787 11531558 10196182 10132701 12550930 12093155 7748408
38734 7748408 4349209 3524292 1878425 -1560347 -3821038 -4068882 -4121103 -3350491 -329943
38725 -329943 1312181 -3217495 -10487119 -11717183 -5167901 2702196 8378729 14166480
38717 14166480 19161784 17694648 9489979 1837153 -1602975 -4732220 -8220466 -5270896
38709 -5270896 5895840 14983059 12905367 4487776 -214996 -430401 -1417109 -2366906
38701 -2366906 1847507 9335223 11383346 3980898 -8033118 -17992627 -22198810 -18492769
38693 -18492769 -7140211 5965257 12794027 11396825 6745734 3374304 1591338 807509
38685 807509 1313961 1782984 -75415 -2745362 -1300599 5174795 10542766 9123978 3547368
38676 3547368 1743945 7385098 16029994 20236397 16445147 7123955 -2020406 -6639835
38668 -6639835 -6755122 -5623048 -5252939 -3763608 1260151 7250271 7785037 1329322 -4130279
38659 -4130279 124251 11112518 16640135 11564570 4578155 4455729 6681371 2017535
38651 2017535 -6687119 -7705611 673289 6793325 3898981 24727 3718079 10235114
38643 10235114 10665623 6868005 6946711 11052438 12543003 10512578 10509563 13475027 13816510
38634 13816510 9305959 4340514 2209017 2026774 4307461 10977741 17941547 16771132
38626 16771132 7569431 1587749 5817763 12715970 11767081 4412804 -630909 -1642990
38618 -1642990 -3823586 -7424484 -5927938 2979122 12700639 16533964 14991724 11405648
38610 11405648 5780180 -2412478 -8895891 -7598088 1522025 11796559 17466497 18461438
38602 18461438 16528234 10973185 2360434 -2545884 3341015 15716694 20537385 11777047
38594 11777047 1022365 2317491 12817161 18362134 14909713 11760719 13398056 12624158
38586 12624158 6631062 5621566 15685623 24888568 19674269 6947718 4706401 15038843
38578 15038843 22018590 15653371 3148732 -5346526 -8407940 -7151077 -220336 9359938
38570 9359938 13090513 9014097 5672905 8385020 11099919 8504650 6372781 11042142
38562 11042142 17111035 16014957 10452574 9394088 13179507 14238313 9720817 3500166
38554 3500166 -2146505 -7386313 -9411125 -5770428 -1586344 -3756281 -9200909 -9133992
38546 -9133992 -4204160 -3739538 -8987416 -9736577 -1655042 4771701 -531850 -12179026
38538 -12179026 -17293311 -12007151 -2657724 4392117 7151291 6157840 4642726 7490297
38530 7490297 14602896 18470718 13579688 4820611 839584 2361095 3727380 3364424
38522 3364424 4860307 8301594 8554876 3954917 58342 1498963 5084240 5079472 2061179
38513 2061179 1807640 6491954 11428753 11676574 8763972 8352464 12535172 17395552 18522372
38504 18522372 16280387 14202407 14312902 16055622 18137676 19127143 17619271 14073933
38496 14073933 10969857 9046251 5972909 1690589 1314367 7435710 12990896 9633939
38488 9633939 1661436 2135700 13823233 23548883 19687298 7106343 -1267674 -1436885
38480 -1436885 139646 -2047989 -6760041 -10254882 -10921445 -9452038 -6975539 -2891430
38472 -2891430 5228831 16882255 24819315 21839364 11941764 7449833 12855465 19357102
38464 19357102 18755720 13972149 10649930 7723531 3930032 4735604 12768012 18850903
38456 18850903 14223307 5886025 6949122 15750323 18482408 10882839 3164366 2831085
38448 2831085 6298035 9818627 15273225 20845169 18657786 8057140 303436 2666807
38440 2666807 7468723 5334773 891717 4996491 16785721 24129819 20138965 10553162
38432 10553162 4729034 5749136 10156746 12940368 11812683 8838057 7738342 8853383
38424 8853383 8908862 6633272 4911622 5427862 5435160 3036700 1698239 5390416 12294810
38415 12294810 17464399 19144904 18421674 15193518 9192507 3335771 1409776 3077941
38407 3077941 4923004 5682783 6842804 8659563 9366378 8607212 8677720 11634945 16855412
38398 16855412 21495090 22279081 17922010 11525946 9354827 14701778 23210412 26369227
38390 26369227 20029943 8495120 260714 334834 6477477 12680500 16191275 19545241
38382 19545241 24274967 25478849 17593429 4742614 -1395336 3601817 10345923 8367535
38374 8367535 499883 -1663728 6011822 15281537 16653300 9752459 1218466 -3484490
38366 -3484490 -3863369 -2321703 -540395 2096468 6620211 11273497 12073462 7895549
38358 7895549 2961433 1871146 3714261 3978781 1150159 -1906768 -2622380 -1249194
38350 -1249194 1497879 5732837 10123613 11610114 9811786 9572628 15951889 27092606
38342 27092606 34968677 34323603 28972157 27265471 32068091 37674096 37196838 30608420
38334 30608420 23604240 20195515 19143005 17194769 13101501 7976127 3807710 2391895
38326 2391895 4322252 8512668 13506060 18712663 23040786 23509673 17874633 8314285
38318 8314285 -116453 -4709606 -6430523 -6444405 -4368583 -198004 4887114 10078632
38310 10078632 15012007 18520329 19745531 19533149 17802304 11623821 776135 -6801037
38302 -6801037 -2395303 10500723 18366241 14518683 6041123 1367885 -76407 -850346
38294 -850346 2750057 13307278 23148897 22928155 16140320 14967913 22500190 28632077
38286 28632077 24978853 15544090 9456210 9524805 12084890 13910878 14923124 15855829
38278 15855829 16511912 16227548 14791542 12857790 11348251 10092248 7859340 4466120
38270 4466120 1721972 1435766 3834194 8484461 14528290 19212026 19289746 15417189 11874629
38261 11874629 10390752 8629664 7100432 11584373 23567143 33553397 31390148 20284727
38253 20284727 12730425 13936542 17367629 16852738 14878393 16187364 19541577 19777500
38245 19777500 14403086 5349972 -3103445 -6257842 -1528108 8797115 18598087 22712570
38237 22712570 20233863 14188783 9592787 10158289 14495941 17358147 17110215 18910899
38229 18910899 26512226 34340315 33764538 25086166 16628788 13260990 13025313 14434209
38221 14434209 18844685 24541800 26508884 24386575 23333830 24367139 21431013 11921102
38213 11921102 2974477 2178456 7779185 13202286 16029849 17225205 16519245 14536219
38205 14536219 15146629 19385264 20920359 14657885 6873886 8753442 20820019 31585191
38197 31585191 32520490 27461966 24849254 26411258 27545598 25629943 23407611 24067524
38189 24067524 25749222 23201102 15256643 8276578 8922751 14607362 16511565 13188336
38181 13188336 14288890 26102776 39488655 40017970 26923406 13387913 9022244 10848023
38173 10848023 12537078 13524489 15256405 15877028 13946961 12129410 11997217 9748191
38165 9748191 2687217 -3962235 -3178687 3564177 8864738 10651852 13604865 19402322
38157 19402322 23066267 21057733 16502835 13170776 9974450 5843749 5337106 13495000
38149 13495000 27266220 37359111 38008081 31052487 21407621 12925068 8597439 10262409
38141 10262409 16277754 21917748 23546282 21430646 18432824 17126706 17790280 18200225
38133 18200225 16409545 14316481 15710712 19200407 17393201 7135926 -3534229 -4700334
38125 -4700334 2213477 7740805 8633620 10040059 14088651 16309841 15310027 16274008 21157781
38116 21157781 24402480 23040449 22223104 24844949 24401810 15868010 6068519 4255548
38108 4255548 8468206 10628817 9911075 10880175 12605463 10852335 8869296 14710212
38100 14710212 27853481 38353943 40051117 36060091 30723514 24688819 18995832 16075208
38092 16075208 15301864 14307184 14898090 20494985 28015560 30420632 27481987 25719449
38084 25719449 27332737 27764127 24704269 20775306 16997500 12716230 11578298 16913672
38076 16913672 21750679 16439367 6648444 8151687 20777656 25366471 13797038 3890750
38068 3890750 12537925 30116491 36952118 31920246 27049474 23999887 15550319 4445486
38060 4445486 1335972 6404899 10378912 12077453 17930971 25254114 24221714 17333812
38052 17333812 17915632 25740985 23754618 6443086 -7427368 -2211817 10533690 10634591
38044 10634591 -17358 -2985788 7202581 17039682 16396409 11120946 10271002 12999880
38036 12999880 13617331 11683060 11354526 15084528 22036477 29891292 35458327 35815918
38028 35815918 31154790 25164875 21468121 20961947 23010119 27158623 32499525 36657514
38020 36657514 36864071 32475893 26779138 25788688 32975527 44040105 49536533 45246011
38012 45246011 37563671 34867354 35800749 32044035 22319419 16085722 20135280 28278153
38004 28278153 30363555 26676009 25397433 28395514 29149010 25411796 23926722 28352436
37996 28352436 31308335 25428765 15597313 11459173 12481986 10646441 5741074 6888426
37988 6888426 17936202 31526917 40489403 45859059 49594880 48304706 40263416 31438460
37980 31438460 27747355 26979668 24854251 23468407 26375812 30240052 29681726 26701011
37972 26701011 26799946 28866684 28106738 26742531 31418186 40222890 42995122 36804349
37964 36804349 31518119 35865814 45737712 51137607 48623702 41989093 35609971 32148529
37956 32148529 33237821 37703287 41070790 39951314 35339808 30404748 27923799 30423947
37948 30423947 38121656 45300259 44398829 36393192 31210266 34051337 37597571 33452523
37940 33452523 25445556 23564392 28477970 31401591 28429337 25986595 30416021 39584432
37932 39584432 47661805 52322399 54020087 53069196 50901927 50136664 50138237 46588308 39011659
37923 39011659 34137641 36682308 41102195 39747999 36269584 41222815 53962978 59814374
37915 59814374 50524090 38359884 40560206 55023414 62511774 52125985 34028529
37908 34028529 24441797 27199061 35121841 42405294 48571411 54139400 59281380 65327568
37900 65327568 72438000 76894488 75172391 69704839 66448343 67628578 70771203 73532760
37892 73532760 74751406 71692778 62138878 50146841 44369900 48297913 56091578 60433400
37884 60433400 60822146 60976445 61234166 58406601 52726291 50348562 56472354 67891855
37876 67891855 75399020 73918067 67926234 65437956 68649542 73092177 74572071 73199371
37868 73199371 70713561 67779122 64732876 61476184 56028597 47304146 39973472 41178974
37860 41178974 50443216 58408532 58486393 54182430 51567345 50882563 50345075 51783258 56240272
37851 56240272 59728530 60084131 62292847 69617331 75700840 74458384 71564500 75290809
37843 75290809 81720663 81954448 79158099 83161248 90941494 89831471 80398756 77920234
37835 77920234 87581569 96212297 94824920 91546982 93171222 91390742 80279649 72106003
37827 72106003 79481180 93166821 95102308 85806397 81399545 87997339 95857367 97190508
37819 97190508 94595100 91704853 88644162 87655810 91944794 98160477 99741701 97238939
37811 97238939 95887739 95083619 91382335 89576477 97296918 109197280 111146611 101794877
37803 101794877 95343231 99758962 107307275 111694290 118635477 130653502 136198782 126502988
37795 126502988 112187778 109260864 116342801 119620137 114835424 110097925 109748992 109536779
37787 109536779 107878034 109191135 113886507 115987400 114000886 114677130 121923380 130420518
37779 130420518 135041163 138804080 145328685 150284894 148530006 145044150 148979596 158300164
37771 158300164 160680424 152042001 144733678 151078464 165617178 172568789 167579394 161812051
37763 161812051 164051310 169401707 170415057 170205320 175992866 185247093 188136435 181763748
37755 181763748 173089453 168358215 168117712 172708642 183306562 195405050 200197675 196246996
37747 196246996 192174892 193862516 196759621 195664030 193918641 196116314 199078435 198497731
37739 198497731 198431582 204528424 212367346 213103159 208007363 206556805 211205981 215128167
37731 215128167 215567501 218145397 225257711 230840715 231206428 231644686 236412281 240408775
37723 240408775 237864464 232580087 231674094 234304604 235026576 234909939 240459489 252439871
37715 252439871 263572790 268118483 267863079 267611978 269442934 272393489 274204648 272930174
37707 272930174 269783329 269751977 275952710 284451025 288897478 289368710 291675213 298292855
37699 298292855 305459743 309747829 311905854 312892583 311707863 309353139 309622906 312975895
37691 312975895 314466652 311372242 308517527 311780432 319932297 327500766 332639382 337039922
37683 337039922 340352777 340515959 338997988 340285929 345270769 349186511 347476682 341024016
37675 341024016 334551860 331756517 332614566 334119382 333422248 330774376 328501366 326975401
37667 326975401 324428896 321958704 324465520 333121228 340914000 341028414 336602822 335562861
37659 335562861 337881688 336216577 329213724 325038138 328501821 332693779 328931821 319300995
37651 319300995 312911012 313274859 315803266 316064677 314574453 313469399 313223852 313616461
37643 313616461 314645771 315284239 313335754 307588473 299365524 291694146 286998984 284860926
37635 284860926 282052505 276199723 269318912 265526815 265272224 265144613 264106281 265547010
37627 265547010 270599309 273460030 267644009 254674673 242451450 236343792 235711242 238067138
37619 238067138 242065483 245655729 245077767 238275087 228568771 223287762 227255080 236579663
37611 236579663 240263492 231017196 214326333 203012439 202361430 205562692 205406340 204025768
37603 204025768 206424821 209992480 207751066 199415359 192072624 190379011 191768181 191230297
37595 191230297 186177592 177281664 169034170 168080430 175634919 182943148 180615311 171650757
37587 171650757 167988145 173923601 180817180 179982696 172945099 165608863 159656231 154627653
37579 154627653 152359743 153356788 153151442 148329835 143102700 144036867 150227508 154158448
37571 154158448 151301974 144136450 137303198 133239365 132560996 134612240 136564539 134721218
37563 134721218 127935547 118528366 109692767 103070648 98725210 96674463 98422956 106183515
37555 106183515 118706412 128739880 128759407 120337595 113423323 113851760 116023238 111823632
37547 111823632 102493283 95788149 94155776 92972335 90306997 91240973 99809863 111592831
37539 111592831 117900542 114790449 105281126 94647564 86321064 81595538 80709251 83033799
37531 83033799 86557360 88205449 86130766 82188852 80709295 83803623 89302189 94152940
37523 94152940 97296022 97426205 91621506 80482037 71867477 73391117 81775672 85855031
37515 85855031 80866618 73579558 71515449 73649748 75288829 75956330 77086961 76814398
37507 76814398 73557544 71341606 74462715 79049271 77546783 70685078 66787813 68513850
37499 68513850 69065714 64646064 62222029 69092819 81292099 89630586 92610462 95125054
37491 95125054 97190477 93343291 83489234 75672550 75301064 78324388 78538143 75962098
37483 75962098 73871720 72517489 71010378 71738887 76810587 81961250 80286235 72184177
37475 72184177 66008076 67135515 71009021 70220147 65487865 65098150 73435961 83876577
37467 83876577 85734307 76990397 66793711 64402287 68852899 72609887 72967669 74350856
37459 74350856 79057557 81931155 77903870 70487641 67409153 69722521 70833105 66551183
37451 66551183 61089117 60811235 65369361 68535331 66891086 64152748 65270592 68629872
37443 68629872 68042683 62710198 60162307 65593567 72504085 70654454 61357979 56356885
37435 56356885 60680502 65880022 64197950 60629938 63884296 71963925 75349188 70788239
37427 70788239 63956892 60819383 63331852 71146659 80325566 82750058 74675971 64336126
37419 64336126 63286273 71379932 78002038 76875730 71321468 65858018 61695531 60455678
37411 60455678 63196487 65387013 61989881 57586859 61182425 70455158 72909851 64686974
37403 64686974 55843535 53579371 53318904 51548125 53760990 61988527 67576492 65954729
37395 65954729 66165997 74424468 80161233 72186078 58397427 53797143 57333236 57659028
37387 57659028 55013276 58089875 63072244 56838893 41598401 35687171 45349271 54761774
37379 54761774 51468636 44156210 44798628 48614179 45294666 38449992 38653361 44453729
37371 44453729 45319614 39755177 36576088 39252578 41756718 41138818 42473425 47513042
37363 47513042 48380600 38917592 25562159 19627138 22618297 26751393 28433572 32782406
37355 32782406 42509300 49920588 46339344 35383455 28981715 31078888 33463315 29437955
37347 29437955 23528870 23356860 28837847 35222421 40817187 44767142 42659011 32960802
37339 32960802 23818476 23889919 29110372 28842793 23489157 24089553 33408870 39672180 33578876
37330 33578876 21462305 15605685 19328548 27725063 36591012 44044296 47883571 47312159
37322 47312159 44598461 41350486 36222714 28795867 21823059 17522850 15908071 17934791
37314 17934791 24556609 31506215 32394972 29055369 30245531 36764829 37566271 26365666
37306 26365666 12799785 9470896 15900433 23442878 28378064 30917799 28545355 21197770
37298 21197770 17412734 24111101 34728053 38488879 36868650 38620448 42602848 39818178
37290 39818178 30496296 23910334 21006674 13158748 1047147 -1554934 10614794 23699572
37282 23699572 25037791 21404800 25327476 33432941 32642678 22077041 14107417 14915261
37274 14915261 17097534 13587943 8069430 6959803 8828914 7888275 3956200 3095881
37266 3095881 9090508 18369937 24455603 25252565 24110329 24410170 25604892 25537968 24039541
37257 24039541 21725573 17717967 12684118 12072142 19946280 29667496 28460947 14341053
37249 14341053 1445011 3177698 15653288 24595964 24256365 20927956 19799262 18307129
37241 18307129 14489108 13108510 18059140 24157666 22946435 14425618 7292071 7804930
37233 7804930 13178309 16912447 16504638 13587432 9619352 5221245 2642465 4746131
37225 4746131 10470237 14412058 13103822 9646490 9345470 11889328 11320611 4442489
37217 4442489 -3519889 -3702055 6707705 20935331 28895712 26496050 18387379 11613954
37209 11613954 7849833 3789445 -1508195 -3675346 518679 7316419 10470955 9357933
37201 9357933 8061201 7983386 7010978 5618254 7122262 10177431 7677004 -3023387
37193 -3023387 -14329448 -17972956 -15940557 -15721167 -18070123 -17253178 -12370292 -9963793
37185 -9963793 -13331320 -16568701 -13411181 -6393248 -1805444 382541 4903629 11494089
37177 11494089 14252637 11523607 9576971 13247972 18351327 18175609 13704191 11540493
37169 11540493 13617604 15183275 12856749 8765410 5601488 3167705 1876441 4263843
37161 4263843 9790774 12875943 10091303 5360686 3973616 5612849 8141281 13668160
37153 13668160 23768000 31917161 29420994 18362551 10440988 11915892 17135140 18567569
37145 18567569 15658061 10876490 4397096 -2588484 -5114806 -546899 6285993 8724133
37137 8724133 6143720 2610453 1002877 2062514 5806374 10003385 10555405 7270374
37129 7270374 5786051 9656347 14387065 14308000 11556686 12026643 15279142 15477581 10859798
37120 10859798 5339690 1163434 -3234144 -7479178 -7674537 -2224671 5575572 12064927
37112 12064927 16195954 17544278 15997098 14046173 14630047 16064479 14171060 9996959
37104 9996959 9308767 12805911 13468759 6911583 -1611574 -4771899 -2547958 591887
37096 591887 2884690 3957441 775774 -7819425 -15100876 -12785694 -2855121 4311211
37088 4311211 4355548 4112372 9724723 16584217 16594342 10937105 8495591 12552124 15919238
37079 15919238 11687736 3806723 2077606 8473334 14167994 11837367 6180832 7663784
37071 7663784 17997561 27620434 28206303 22114617 16611804 13545163 9855832 5658393
37063 5658393 5532910 11287462 18253640 20668666 17855314 13539291 11202490 11340787
37055 11340787 11656239 9235007 3948879 -578905 -1668626 -2536079 -8590826 -18294344
37047 -18294344 -22495209 -15280073 -1428768 10107005 16444439 20460581 23538177 24018324
37039 24018324 21483456 17583331 13021626 7780802 3508938 1481560 -659883 -5271044
37031 -5271044 -9084020 -7313442 -2678138 -2876294 -8356281 -10983342 -7469028 -5259699
37023 -5259699 -10033905 -15676287 -14100391 -8325410 -6829874 -9656971 -9867556 -6030769
37015 -6030769 -3413319 -3790046 -3594237 -2495440 -4713185 -10189901 -12612697 -8600289
37007 -8600289 -2017843 2747157 5189229 5003090 1364954 -2279706 -505212 4592266
36999 4592266 4379607 -2668398 -7107504 -2877363 3358946 3457327 69784 -54454 2261968
36990 2261968 2727803 3500573 8798449 14216704 10823608 -995104 -10507371 -9830418
36982 -9830418 -1739179 5540110 6090967 -78800 -6388708 -4569609 5147132 11766392
36974 11766392 6813659 -3792675 -7556366 -1420913 7234480 12079126 12316164 8813088
36966 8813088 4217188 4183878 9961968 12956495 6054219 -3274148 -2296373 7617852 13510325
36957 13510325 10579014 5609366 1892373 -3752830 -8256112 -3464511 6796272 7999464
36949 7999464 -1468810 -5511961 3343044 11033106 6439232 1036079 8719204 21023633
36941 21023633 21006735 10827336 5616734 7069868 3423096 -7531597 -14796091 -13676844
36933 -13676844 -11844542 -13768817 -13880512 -8430824 -1574864 3709805 9766100 16034144
36925 16034144 16442878 8573175 -2044335 -8842515 -9373717 -4359708 1336578 -636251
36917 -636251 -11492052 -18598646 -10577347 4107724 7403726 -1509466 -5866925 1660978
36909 1660978 9245293 7025912 329113 -4902395 -12715908 -23546107 -25803710 -13507786
36901 -13507786 604606 2826159 -1715231 -719806 3963883 2405339 -3468457 -2883178
36893 -2883178 4309539 6768741 -340574 -9465214 -12922073 -10165148 -3207083 4959776
36885 4959776 7927454 1905569 -6170804 -6192168 144864 2043933 -2993146 -5438824
36877 -5438824 1061487 10958043 16111128 15357169 11922652 8385234 6393380 5403808
36869 5403808 1265123 -7515925 -13322418 -7809747 4191429 9305746 4135452 -1971712
36861 -1971712 -3164296 -2979332 -1647437 7336925 21498320 24942444 10184876 -7328001
36853 -7328001 -8803363 2825096 10272657 7127080 1725945 380603 990014 1935421
36845 1935421 4429976 5654180 897600 -6355122 -6805468 566908 6344003 4645229
36837 4645229 261126 -663278 1491283 4208686 6971854 7675697 2852664 -4562761
36829 -4562761 -5447975 2636082 9943730 7607699 -268783 -4116768 -2907948 -3082928
36821 -3082928 -7246319 -11529566 -12307024 -9174613 -2824608 4282752 6746402 1591116
36813 1591116 -6206293 -8850628 -5272038 -652921 1376441 -90431 -7355730 -20748395
36805 -20748395 -31578915 -28351983 -12683482 -159762 -1197679 -9325255 -13753859 -14674291
36797 -14674291 -17328117 -18240403 -9834129 3927724 9640506 4039358 -108294 7420992
36789 7420992 19547244 23037719 17037705 11174581 9612265 7575782 2994026 1073266
36781 1073266 4124185 5367900 -1265062 -10676860 -12743894 -6166641 457392 705936
36773 705936 -2691806 -3942629 -1729568 2024932 6665897 11980907 14995110 11816581
36765 11816581 2674148 -7686999 -14923362 -18270123 -18644315 -16082939 -10465482 -3391941
36757 -3391941 2222606 4146675 1845723 -3646380 -9781309 -13102516 -11644663 -7268261
36749 -7268261 -4101765 -3404891 -1181069 6905822 18628315 26202941 25245527 19725026
36741 19725026 15844207 14201766 11930603 9744817 10536865 11745535 6759592 -4065834
36733 -4065834 -11262923 -9342110 -5262207 -7788677 -14289606 -15919431 -11386026 -6444330
36725 -6444330 -2879335 1668778 4530977 183874 -7947213 -9879471 -5486978 -5679795
36717 -5679795 -12711319 -13263212 338686 15102058 15815643 7848295 6678746 12711288
36709 12711288 13750615 8103247 6576616 11640028 12818740 6206157 1662897 4793552
36701 4793552 7511695 4422470 3616037 10573056 14846719 6354577 -5664423 -5465006
36693 -5465006 4550226 8195938 832579 -5821599 -3963439 309026 220000 -1319371
36685 -1319371 311771 2874750 2322899 -542865 -3177010 -5561931 -7771301 -8189124
36677 -8189124 -6986977 -6676388 -7129348 -5150193 -796499 1709769 1627232 3891608 10370001
36668 10370001 15131291 12892336 6856866 3159471 2003007 -286751 -3906982 -5852879
36660 -5852879 -5293413 -3743114 -1485149 1840716 4351339 3536717 26625 -3171705
36652 -3171705 -4207718 -2891219 657298 5320547 8369426 7653582 3194263 -4054728
36644 -4054728 -12121087 -16145331 -11706319 -2457552 1180927 -4833921 -11693742 -9960959
36636 -9960959 -3236574 -2392662 -9963828 -18649154 -23161052 -24647049 -23824609 -18750495
36628 -18750495 -10931153 -5817663 -4969608 -4535929 -3532968 -6326084 -13736850 -18782927
36620 -18782927 -15894795 -8694309 -3742166 -1382074 2105212 7294962 11888930 15260351
36612 15260351 18009799 19420518 19178895 18519337 15872471 5841437 -11646795 -25155815
36604 -25155815 -22720588 -7598881 4876244 6304841 3157791 4001973 7009381 5335457
36596 5335457 -630524 -3299326 1404237 9043338 13228772 13383656 13759066 16408808
36588 16408808 18098298 15230285 9676633 6498725 6272826 4239046 -1030858 -3250464
36580 -3250464 2455718 10042900 9396398 1076084 -4004036 -412515 4731363 3752420
36572 3752420 -423127 -796530 2231277 3287935 2110864 3357804 7775407 10638910
36564 10638910 9057337 5016369 943545 -2277521 -2600360 1939550 7967986 8475432
36556 8475432 2043776 -4684796 -6316032 -5366665 -6154797 -7080152 -4260128 542965 1608665
36547 1608665 -2523473 -7756265 -10662151 -11037012 -8453097 -1701513 6845882 10862859
36539 10862859 6626831 -2883684 -12231124 -18818123 -21985512 -20561891 -15244350 -10978475
36531 -10978475 -11905841 -14425017 -10461759 1066051 11043812 11742281 7539677 8595955
36523 8595955 15846303 19450024 13423924 4439716 1151496 668224 -6129465 -18389217
36515 -18389217 -24318477 -18000157 -7883173 -3780147 -3540421 -182365 4160990 1934195
36507 1934195 -5084810 -6404345 696596 6241933 3071344 -2681167 -3231474 -2666912
36499 -2666912 -9191993 -19407384 -21764294 -14154989 -6865681 -6367703 -6519115 -607979
36491 -607979 6362931 4927653 -4126631 -10212618 -6715860 2111679 8261695 8886588
36483 8886588 6807315 5700473 6600065 7490719 5491252 390351 -4297618 -5098693 -2611656
36474 -2611656 -135339 521150 -398202 -2662479 -5206952 -4326990 2557972 11017570 12617936
36465 12617936 5779177 -1021795 -60053 5519696 6527870 -35058 -8119305 -10684203
36457 -10684203 -6630692 -418519 1967508 -2313806 -9144715 -9861856 -1326442 8221479
36449 8221479 8448311 721731 -3839719 -98520 4878539 3641108 -1036877 -2175995
36441 -2175995 517998 1807447 -695878 -5077695 -9431084 -12192721 -10427452 -3435154
36433 -3435154 3427200 4014093 -554285 -4202922 -4813184 -4979938 -5136630 -2953483 379079
36424 379079 594396 -1769621 -1223631 3055249 5170265 3144930 3448995 9823128 15389089
36415 15389089 13151022 7831848 8215650 12432107 11353783 4342830 312096 2448750
36407 2448750 2936512 -3454803 -10168361 -9300977 -3924273 -2567100 -6167288 -8355741
36399 -8355741 -6361872 -4076625 -4506416 -5780777 -5922361 -6151168 -7194183 -6639645 -3083764
36390 -3083764 32773 -1693996 -7298921 -11438367 -11738056 -12204426 -17784997 -26984891
36382 -26984891 -32029309 -26980433 -14790702 -5085251 -4552079 -10242708 -13210088 -8359492
36374 -8359492 637457 6429857 6287970 3906995 4032050 7644773 12623880 16548116
36366 16548116 17281364 13020975 4764032 -2206018 -2942536 454100 341524 -6289017
36358 -6289017 -12369919 -8928159 3388061 15288891 20518950 21417600 21806316 19880049
36350 19880049 12265233 1754504 -4326707 -2686963 3380439 9604437 13992833 13975955
36342 13975955 6482886 -5503115 -11577248 -5255899 5851348 8156207 4136 -5872943
36334 -5872943 289914 12832335 20161775 20377804 20059715 21221923 18525607 9509589
36326 9509589 -525692 -6124424 -7641079 -6843642 -3051003 1969663 1237433 -8594622
36318 -8594622 -19258404 -19323714 -9519323 -2310225 -5376770 -12360633 -12904661 -6137568
36310 -6137568 719843 3618718 5386753 8475127 9613549 4580904 -4582913 -10953332
36302 -10953332 -10980688 -8114635 -7230164 -8518692 -9285057 -9098059 -9110916 -7855740 -3086178
36293 -3086178 2159620 1509847 -4808926 -8414694 -5013037 -1831569 -6637470 -14909169
36285 -14909169 -16672356 -12496693 -11913164 -16582403 -17052472 -9570517 -4580368 -11020372
36277 -11020372 -21081349 -20953608 -11682560 -7765057 -15667161 -24496350 -21353807 -8070161
36269 -8070161 2701014 3452490 -1855261 -5612890 -5256528 -3004773 -562312 2583572
36261 2583572 5949094 6331824 1656389 -4931175 -8182350 -7777665 -8073617 -9666687 -6479731
36252 -6479731 4666426 16000118 16961219 8563673 2277231 4293580 8519901 7776153
36244 7776153 4431686 4362264 6029574 3372243 -2904853 -4950057 964338 9532212
36236 9532212 14375365 14963037 13137332 8575469 1946894 -2022964 -60909 3990760
36228 3990760 4414178 2185368 2258018 4021711 2034412 -3438646 -4872370 672943 5884649
36219 5884649 4372061 663794 1929038 5098861 1554398 -7918989 -13133537 -10080578
36211 -10080578 -6686826 -9592892 -13809062 -11465888 -4426659 -629577 -1524901 -1150693
36203 -1150693 3205686 6914158 6015546 3124239 2049857 1062895 -3691859 -10265522
36195 -10265522 -11936337 -6905475 -2076661 -3869408 -8527194 -6805532 2493058 9743679
36187 9743679 7229791 -846838 -5079422 -3078658 490515 2701261 4384543 5089596
36179 5089596 3373644 1921880 5066890 10507844 11069831 6241841 3706607 6446071
36171 6446071 7313218 1818709 -2455180 2329902 9629955 6206150 -8538251 -20998708
36163 -20998708 -20723612 -10740712 -52203 6175277 7023814 3248696 -2444523 -6574632
36155 -6574632 -8315283 -8892276 -7700076 -3245394 2163138 3855760 1812710 1283191
36147 1283191 5066615 9888564 12111515 12424248 12598236 11757684 8751003 5168191 3311862
36138 3311862 3240556 3586460 3354684 1867180 -812699 -2642020 -1356248 1794283 2750535
36129 2750535 -65893 -3543857 -3457285 1811392 10520412 17799331 18033938 11182832 5530708
36120 5530708 8969142 18300022 23135453 19762074 13747452 8678034 1639083 -7479026
36112 -7479026 -11986767 -9212497 -6750346 -10692521 -14874103 -10454210 -588836 4011210
36104 4011210 482870 -4791343 -7678410 -9199998 -8008631 -695879 8573111 8471671
36096 8471671 -5032073 -21506189 -27953282 -22953446 -14984028 -11071389 -11574169 -13160243
36088 -13160243 -12435651 -7896745 -1533321 2138673 601420 -3984191 -7854930 -9805631
36080 -9805631 -10705346 -10595995 -8741993 -6086702 -5468178 -8614829 -13634129 -16124875 -13039605
36071 -13039605 -5490394 2452339 7468667 8674419 6082398 -229721 -8292471 -13946210
36063 -13946210 -14811505 -13270741 -13071891 -14003824 -12712406 -8271998 -3862354 -2382363
36055 -2382363 -2908745 -2695642 -1146667 -429465 -2417998 -5752001 -6698166 -3705855 -382467
36046 -382467 -1787605 -7581081 -11564787 -9163961 -2758671 1881834 1778199 -2202928
36038 -2202928 -7168181 -8784449 -3591315 6076457 12647848 12131121 8898298 7954321
36030 7954321 6926841 1547895 -4814078 -4903807 824507 4207856 993780 -4398353
36022 -4398353 -6114270 -2607971 4879157 12962541 15218397 8113834 -1356755 -1828926
36014 -1828926 7015180 13306271 9656007 2384771 372416 3254602 5955751 7128609
36006 7128609 6888845 3292258 -2057185 -1544954 7632867 16206036 14742823 7318199
35998 7318199 4094559 5393882 3973301 -609652 -2185292 -1013125 -3863000 -10124060
35990 -10124060 -10290293 -1518212 6691126 7035314 4288994 4966870 6940414 6568417 7213607
35981 7213607 11662119 13386629 5719251 -5419269 -8708705 -3930992 -410714 -1261243
35973 -1261243 -1105692 658688 -2938558 -12867365 -19380610 -16225148 -9363055 -5107367
35965 -5107367 82599 8745190 11065811 -1963351 -19525336 -20843443 -3700196 11977827
35957 11977827 12161611 5725688 6372515 10892998 7332305 -4092097 -12322579 -13640362
35949 -13640362 -14642298 -17548482 -15858582 -7721873 -1985894 -4983582 -10275440 -8866069
35941 -8866069 -2889793 -703451 -2732213 -1579873 4837588 9171138 5824131 -484436
35933 -484436 -1466376 3497958 7661775 6809757 4011067 3669845 4932392 4212346 2102395
35924 2102395 3196652 8695896 13650262 13694793 10664926 8338256 6294369 2597420
35916 2597420 -618662 -512428 -687048 -7560900 -19211652 -25106107 -19160036 -7110011
35908 -7110011 1455722 2802394 -1405634 -7930231 -11972132 -9371197 -2834447 -448955
35900 -448955 -4114247 -5845770 -440753 5540159 4701965 1749294 5374343 11898928
35892 11898928 9108060 -4324769 -14653379 -10773426 2613282 12855543 13765820 8943443
35884 8943443 5596492 7726962 12495506 13127147 8428748 6730775 14454948 23973879
35876 23973879 22120160 9375151 -651769 -1733474 -2411577 -9068214 -14675414 -11913707
35868 -11913707 -5784646 -2963548 1350061 13169854 23901800 19916872 4590315 -4277871
35860 -4277871 929206 9638449 11848037 11242163 14268131 17976647 16765359 12731955
35852 12731955 10793722 9457154 4658716 -1480718 -3636651 -2176064 -1854391 -3704991
35844 -3704991 -5062969 -5915405 -7916463 -7887504 -349231 12012378 17745576 10087883
35836 10087883 -4007733 -12106253 -10097939 -4262067 -2013384 -4080697 -5115278 -181797
35828 -181797 8939603 14091187 9557838 162354 -3414454 1939041 8019172 7130551
35820 7130551 2013435 -498671 -756371 -4440882 -12012884 -17402808 -17154189 -14485204
35812 -14485204 -13152744 -12695778 -11462517 -9805187 -8371956 -6972499 -6569916 -8572541
35804 -8572541 -10863544 -8963288 -3178130 -57234 -3594949 -8825191 -8058931 -878240
35796 -878240 5832896 6073218 -243273 -8845925 -14516227 -13909030 -7876497 -1020104 2407762
35787 2407762 1748068 -1051874 -3695668 -4095121 -992724 4712387 10828749 16147119
35779 16147119 19649559 18521863 11303861 2705739 -193804 2941422 6445204 8906116
35771 8906116 14455798 21730502 21598818 11353832 1603775 1209010 4043358 437670
35763 437670 -6055590 -5248676 2272144 7506372 8841924 11612453 14154004 9028684
35755 9028684 -1874060 -8036427 -7448070 -8247358 -10785361 -4495325 11285317 19611323
35747 19611323 9329183 -6988045 -10585870 -1711507 5443156 4766666 1659869 -86965
35739 -86965 -1495762 -1253674 2865222 6970802 5594834 1556623 1552992 3877789 1187653
35730 1187653 -5392299 -6203089 1676527 9344599 8763269 1754784 -6211516 -12809678
35722 -12809678 -16304141 -14137122 -8187636 -5058946 -7447204 -10960252 -12234443 -13296566
35714 -13296566 -14351861 -10244178 -212814 5827986 -897275 -14398754 -21006556 -17717230
35706 -17717230 -14289891 -17242829 -21193882 -19173264 -13611832 -11267926 -12175221 -10579538
35698 -10579538 -5121836 -1390509 -3249939 -6932094 -6795466 -3676213 -3539492 -8748919
35690 -8748919 -14100206 -12325319 -1968125 10556218 15937420 9835149 -2513079 -10185275
35682 -10185275 -7108278 1788335 7030486 6086711 4815157 7721660 11628023 11151555
35674 11151555 6582738 2821845 2500777 3386623 1885450 -3030268 -8896013 -11513429
35666 -11513429 -8472721 -1730574 4357480 7618870 8673586 7192832 1301014 -7798733
35658 -7798733 -14255322 -13515937 -7657568 -2361772 -427931 -391485 248686 2540697 5458036
35649 5458036 6380298 3616656 -998589 -4008266 -4604049 -3979733 -1365851 4176404 8442267
35640 8442267 5892627 263248 2761010 15517865 25435226 21239938 9176464 3131378
35632 3131378 5260861 6795462 4242048 3297675 7064556 10599339 9160099 4390750
35624 4390750 282653 -1524069 -1501976 -1980040 -6643057 -15286097 -20464032 -15475573 -4541327
35615 -4541327 1683223 163702 -1728991 2619659 11602477 19227778 20819445 15693544
35607 15693544 9470992 10978912 20057321 22817200 9226888 -8471531 -8838337 8185929
35599 8185929 19848710 12848577 407800 -629461 5470618 3906746 -6177318 -12325641
35591 -12325641 -8652370 -1980052 461763 -907009 -2899831 -5091952 -8651672 -13239063
35583 -13239063 -16090226 -14213328 -9547919 -10266730 -21057983 -33232569 -33435236 -22650383
35575 -22650383 -15352842 -17403869 -18223570 -10445057 -2755478 -3822781 -7485713 -6362918
35567 -6362918 -7003545 -16001748 -22878152 -15565316 -3604043 -4493361 -13285206 -9744355
35559 -9744355 6338939 12596648 140810 -12651133 -10452995 -2264949 -590966 91302
35551 91302 8448252 16651324 13695365 6295028 8217546 17203434 20156067 15284857
35543 15284857 11716562 10851233 5362164 -4234298 -8161779 -3813316 608781 984593
35535 984593 2500070 6855695 7066240 90704 -6442294 -6251437 -3879873 -5687793 -9233106
35526 -9233106 -8525874 -3709815 1068434 4404158 6091937 3312434 -5201183 -14128721
35518 -14128721 -16291273 -10494260 -852132 8630294 14696386 13579109 4478068 -7495019
35510 -7495019 -16066163 -19784061 -20132068 -16881470 -9766447 -2094050 2163846 3047847
35502 3047847 2521108 607249 -1944109 -878737 5465557 10435620 7017935 -427688
35494 -427688 -912487 7015677 12784495 9152245 1622989 -958214 1847007 4305201
35486 4305201 3417228 1207879 1401690 6486127 14791788 19285447 14000402 2859456
35478 2859456 -3896814 -3754112 -4894838 -11770127 -16165166 -9246871 4090106 10949064
35470 10949064 6449238 -3114020 -9690318 -9321255 -1942689 7589902 10970599 5590260
35462 5590260 -694973 -586447 912292 -5387018 -16163687 -18089893 -7121023 5263872
35454 5263872 7626597 1630684 -3888211 -4627485 -2331312 454415 3392668 8429185
35446 8429185 17327527 26401296 26206795 12578621 -3913313 -7500823 4032754 17910746
35438 17910746 23130490 19581387 10639415 -1728305 -11499689 -9756595 2773806 13410011
35430 13410011 13622731 9071197 7782629 7506798 2890544 -2500458 -903135 7590790
35422 7590790 15784497 18445793 14313600 4022293 -7050174 -8982381 1652237 14742956
35414 14742956 17997219 11682550 5100788 2762278 2176017 1738516 2063734 1545582 -1720020
35405 -1720020 -5447973 -7073302 -9020623 -13308504 -15126524 -10025705 -3388435 -3260603
35397 -3260603 -7270140 -6998034 -2313971 87555 159543 3669736 8577735 6153907 -2481356
35388 -2481356 -4851035 3472443 10770963 6797074 -2763103 -7013517 -5320964 -3361343
35380 -3361343 -1524910 3051953 7746516 6703711 -377775 -7967007 -11133721 -8065588
35372 -8065588 214079 8259578 8553280 524327 -6591269 -4906832 2074359 5883890
35364 5883890 5135200 4278495 3790997 35902 -5866398 -7141600 -1231813 5424276 5508635
35355 5508635 38315 -3570443 -779449 5539685 9920700 11640563 14954440 21587221
35347 21587221 26132677 22406795 12486085 4346077 1069282 -1436067 -5179476 -5902580
35339 -5902580 -1441833 2678058 1450436 -1278566 942203 6767022 9840748 9079153
35331 9079153 9030984 11697646 14871557 17441253 19232289 16160540 3655937 -13498663
35323 -13498663 -22372106 -16667458 -4801707 759316 -2094998 -5621912 -3904493 573327
35315 573327 784559 -7530995 -21388968 -31368026 -28885849 -15358715 -2442967 -419385
35307 -419385 -7958487 -16107957 -19712124 -19905049 -17018710 -8570581 3461535 10288678
35299 10288678 6931148 1097686 4352430 15597624 20750860 10697632 -6700224 -16504963
35291 -16504963 -14229546 -8296016 -7264330 -10372106 -11339144 -7202744 -1189063 1235946
35283 1235946 -2374647 -9137693 -13057719 -10522008 -4080114 212318 -360485 -2178366
35275 -2178366 -237395 4666972 5875026 -736825 -9905334 -11823290 -4254659 4262445
35267 4262445 5972466 4421274 7989796 15993515 19359659 15018466 10504916 11196353
35259 11196353 11580789 4923107 -5420807 -11648611 -13316507 -15585106 -19123309 -19706961
35251 -19706961 -15925499 -10116396 -3192611 4640824 9557877 7568150 1357343 -2924432
35243 -2924432 -4491996 -6806759 -9346978 -8425988 -5251943 -4688559 -6055922 -3593517
35235 -3593517 3613712 10530656 14900176 17805248 15860582 4565087 -8943439 -9879118
35227 -9879118 2430830 9793754 68146 -15046073 -17768621 -9919912 -7579957 -16194333
35219 -16194333 -25155464 -25502657 -20420700 -16676441 -15429823 -14430667 -12454180 -8809343
35211 -8809343 -3190390 2128595 3582558 933013 -2119024 -2123269 1558625 7370058 11889499
35202 11889499 10755056 2743346 -7331673 -12358517 -9296756 -521437 9213934 14959063
35194 14959063 13146292 4788932 -3427174 -4307124 2727782 10417562 9859880 -1002754
35186 -1002754 -13806659 -16580032 -7056076 3047013 1483478 -9353819 -17136990 -16904147
35178 -16904147 -14444502 -13439672 -10808891 -6659262 -6406297 -8536130 -2950408 11448561
35170 11448561 19890757 12115399 -1426962 -5166351 -386824 1408211 -1486301 -2559193
35162 -2559193 -2368333 -6170545 -9925297 -4709152 6377482 11075495 7382175 4954418
35154 4954418 6604208 4283024 -3816295 -8023122 -4276347 -1840963 -6796625 -10818928
35146 -10818928 -5255916 4364174 7587092 4595868 3086206 5642909 8731918 9745771
35138 9745771 7904485 1999812 -6823700 -13658772 -15823345 -16073290 -16175441 -13085933
35130 -13085933 -6088745 -1336728 -3355857 -7803036 -9062969 -9428762 -13369111 -17613617
35122 -17613617 -15430057 -7645771 -1284886 589689 -54980 -3281473 -10614733 -17570495
35114 -17570495 -15393395 -2736960 10606183 14399209 7922282 -2559659 -11364869 -15476976
35106 -15476976 -13409183 -6837973 -1851977 -3955293 -10879652 -13481643 -5952523 6602655
35098 6602655 13595378 11163413 5114398 1155496 -2546070 -9455191 -16016875 -15353281
35090 -15353281 -7640084 -242020 1954833 245295 -3217328 -7371565 -8722521 -3783823
35082 -3783823 3571085 5412487 2498189 4410498 13320299 18224321 12283089 5638598
35074 5638598 10442790 21139237 22794372 14271022 8434033 10237194 9614385 -443388
35066 -443388 -12161418 -16066865 -14978861 -15882221 -15824440 -7064189 7481315 15277465
35058 15277465 11177902 3984374 2843454 4429890 -820561 -13887608 -24933375 -25342786
35050 -25342786 -17174878 -9399776 -7904227 -11066528 -13166364 -9772496 -466604 11201738
35042 11201738 19271768 18196755 6735697 -9222075 -18873099 -15027421 -2061721 7323978
35034 7323978 5879147 -261278 -1003685 3675122 5845567 3939803 5156154 11256158
35026 11256158 12138385 231843 -16409578 -23815135 -19506345 -11658048 -5707716 -1727626
35018 -1727626 -1561466 -7024019 -11879616 -7034369 5072308 11584083 6580514 -2518470
35010 -2518470 -7788637 -9254969 -7283443 1735469 15787816 23663272 19301978 11674065
35002 11674065 11652923 15853932 13211606 2831509 -4819055 -2530188 6338716 14429108
34994 14429108 17425982 14816763 9113919 4450128 2525419 956675 -2100892 -4582047
34986 -4582047 -4320353 -2264974 1017436 6868023 12633113 10407471 -2369932 -16522421
34978 -16522421 -22071074 -20444195 -18465419 -15806478 -8130477 1292672 4276884 685647
34970 685647 -1813749 -926326 -2484515 -8808979 -14076576 -14031763 -11779837 -10498301 -7984475
34961 -7984475 -2540740 2187811 2777915 1371306 1191919 826858 -2935948 -9565529 -15499227
34952 -15499227 -18171055 -16986582 -12665101 -7753849 -5683211 -7380099 -10242349 -11333067
34944 -11333067 -9919212 -6636524 -2442067 1149200 2815750 2656084 1207809 -1767760
34936 -1767760 -5506892 -7078180 -5146713 -3083602 -4311409 -6143161 -3201466 3650489
34928 3650489 6883715 1287059 -10563207 -21784066 -26404243 -21816149 -10554832 300203
34920 300203 5244917 5495174 5086087 4416020 2457797 2327952 7596193 14686729 16525679
34911 16525679 12967786 9906569 8762231 5606161 780767 -351817 2254481 2166922
34903 2166922 -1782989 -2797337 973298 1352051 -5967545 -12071063 -7384226 3735971
34895 3735971 9132083 4064314 -6797801 -17182838 -21986416 -17568776 -6919295 -410450
34887 -410450 -4544863 -13723127 -18672097 -17525866 -12520438 -3120588 8706664 13395870
34879 13395870 5387171 -5040311 -3697641 7086430 12593227 7975599 2580983 2338765
34871 2338765 2507560 587291 2147358 8346588 10509106 4712310 798467 7673791
34863 7673791 18410172 20276461 13379285 8633595 10748615 13651395 12110285 8887783
34855 8887783 8564835 10489144 10563728 6891883 1781425 -783674 631351 3015789 2192789
34846 2192789 -2459973 -8721712 -15553683 -21820967 -22088526 -11276220 4818782 12078939
34838 12078939 5618484 -2871155 -1280830 6758526 9708091 5545880 1245999 -914831
34830 -914831 -5266638 -12112944 -15589152 -13178221 -9146471 -7469979 -8256295 -11193736
34822 -11193736 -15441376 -16698184 -12238641 -7919081 -11049337 -17237287 -15585614 -7333905
34814 -7333905 -5817611 -14394320 -18719989 -8401775 6612430 11543689 7964161 7382174
34806 7382174 11869579 14339770 12895888 11839101 11242309 7536756 2986764 3639877
34798 3639877 8586336 11060233 9322064 7116737 4863230 444847 -2735099 400878
34790 400878 5429280 2982947 -5155086 -7050520 462340 6655034 4149345 -1299870
34782 -1299870 -3154697 -3915504 -6056364 -4705404 2425691 7789572 5514022 1365327
34774 1365327 2012306 2520335 -5007617 -16731519 -21951203 -18599100 -13990723 -12868633
34766 -12868633 -13221857 -11963569 -7992618 -1958549 2149762 -380629 -6351388 -5855245
34758 -5855245 1896581 3366676 -9416294 -23527403 -22550442 -10890164 -5075930 -7423464
34750 -7423464 -6929225 -2795015 -5695436 -13962009 -10331505 9850076 26142389 20578655
34742 20578655 3132996 -3945287 3514844 11430110 10760295 6320451 4644098 5587560
34734 5587560 6940136 8263756 8247059 4646320 -1183311 -4127829 -1566354 2818409
34726 2818409 3125349 -1523590 -4807560 119827 10817122 15571625 7222363 -5960486
34718 -5960486 -9788690 -2775658 3416922 2195339 183262 3793571 8095725 5851879
34710 5851879 -496425 -4064533 -4949998 -8017894 -12974316 -14386380 -9614980 -975180
34702 -975180 7702128 12150158 9152559 2051944 221363 6996075 13064343 9209254
34694 9209254 496004 -1715953 2298129 2496114 -2912778 -4684830 416003 3260239
34686 3260239 -1238644 -3458112 5589110 17159969 15477590 1350295 -7914202 -2603173
34678 -2603173 7309322 8197527 678845 -5844960 -8716908 -11687333 -13059883 -6468810
34670 -6468810 5539850 10380029 2883777 -5680130 -3316844 5840553 9638299 6730996
34662 6730996 5910891 9830389 11704196 8349292 5107080 5632739 6686505 5689664 4239952
34653 4239952 1626741 -5401836 -13342326 -12904898 -3628685 3213733 1824078 622551
34645 622551 6390823 11514553 7717699 2200100 6655138 17301231 19885233 10341787
34637 10341787 -2548055 -11748906 -16273592 -13579160 -1582534 12004339 15475767 9512921
34629 9512921 6048860 9666733 12318402 8828516 5016895 5636706 5542914 -433216 -7642367
34620 -7642367 -8928574 -5637735 -4734674 -8743139 -13250959 -11904959 -1978530 11694062
34612 11694062 18203187 11081973 -2679493 -9981230 -7221513 -1349290 3152516 8071453
34604 8071453 11997617 9044401 128096 -5817804 -5809085 -6404615 -9033166 -5396518 5170808
34595 5170808 8115505 -5102069 -20666579 -21428145 -11942158 -8210405 -10537224 -5792672
34587 -5792672 6962045 13356907 7743463 1747089 3477537 4522923 -3687468 -13555175
34579 -13555175 -12426589 -1979385 4209018 -1283490 -12197736 -17455896 -12436629 -2759447
34571 -2759447 626004 -7502505 -19574323 -23288654 -16811254 -9410776 -6457425 -3307667
34563 -3307667 2595162 4667827 -263407 -2516428 6244394 16932637 14543109 1220806
34555 1220806 -6822911 -4022710 -1513035 -6259753 -9924300 -5365942 -293586 -3626327
34547 -3626327 -8685966 -3376161 8817756 11819401 -692845 -17861847 -26801566 -24558809
34539 -24558809 -13957665 1442196 14481318 16158206 6334087 -3714495 -4681022 304294
34531 304294 3188297 2867892 3426301 5533987 6759796 7387221 9267712 10920452 9618534
34522 9618534 6419003 3722770 359964 -4859237 -7490058 -2902873 4245175 4250063 -4089637
34513 -4089637 -12189830 -14319949 -13056140 -10933294 -6104096 376755 2256443 -1463910
34505 -1463910 -2101699 5395367 11592632 4177953 -13674283 -26072814 -24259661 -15249252
34497 -15249252 -10287859 -12201601 -16245582 -17536245 -14240870 -6854647 2323607 9821472
34489 9821472 12552351 9030603 262251 -9394263 -14021096 -11241070 -4669624 509051
34481 509051 2859180 3604009 2662583 -786777 -5428284 -9184082 -12350695 -15915388 -18153502
34472 -18153502 -16887270 -13856055 -12342515 -11553077 -8559822 -5016052 -5451912 -8311875
34464 -8311875 -5974337 3536255 11751904 11411493 7138842 8010836 13388494 13901329 5400634
34455 5400634 -5527103 -10999315 -10250321 -6108871 972531 10500163 17254780 15262508
34447 15262508 6214171 -996812 -475662 4439540 6785647 4609740 1343129 -61581
34439 -61581 156655 676169 446049 -1816838 -6154128 -9236658 -7163854 -999630 4061360
34430 4061360 5896682 7600654 10903857 12586305 10671745 8938337 10184435 9841329
34422 9841329 3378124 -3667863 -2172432 5700939 8577032 3792966 1949638 9252879
34414 9252879 16324493 12591264 2731776 -1903464 -1581161 -4862900 -10478425 -7509369
34406 -7509369 4836100 12082911 5120986 -5952469 -7344250 -1470061 -310298 -5204916
34398 -5204916 -6017360 1609099 10325964 13562463 13458423 13505229 12566432 10459217 11258704
34389 11258704 15541568 16451686 10064280 3515857 4812203 9191514 5134696 -8013828
34381 -8013828 -18105849 -16593339 -8395858 -3043605 -3194617 -5466697 -6886114 -6309022
34373 -6309022 -3509395 -613254 -1270428 -5398406 -7992868 -5973181 -2563780 -1556986
34365 -1556986 -1116468 2168712 6254202 6266532 2527741 240713 1283729 1606402 -1940762
34356 -1940762 -6574654 -7882743 -6453165 -7141277 -12204950 -17623354 -17792765 -13068898
34348 -13068898 -9687247 -10629547 -10263424 -3037003 5183557 2987787 -8696641 -14880940
34340 -14880940 -7520812 2063231 751245 -5598798 -2588246 7175940 6327068 -8973392
34332 -8973392 -20570223 -14537897 -904029 3057409 -2553000 -5299347 -1956920 -145218
34324 -145218 -1753952 486180 8428089 12833398 6823726 -3649109 -8005723 -4034044
34316 -4034044 1782226 2802749 -2623594 -11281311 -17058692 -15181458 -7108126 431243
34308 431243 2547378 202357 -3349779 -6525521 -8336212 -7236273 -3846803 -1983348
34300 -1983348 -4032015 -7440111 -8424631 -6956078 -5095046 -2529628 2265485 7392649
34292 7392649 8438639 4925415 2387974 5746112 12419612 14841268 9904546 3414660
34284 3414660 3171812 8877469 12266385 7989433 524070 -2666410 -1416668 -1264464
34276 -1264464 -3800230 -5591814 -6790684 -12563577 -22403001 -25467076 -13317804 7129111
34268 7129111 20620477 21166313 15670949 11483511 8319247 3805254 -146809 -359548
34260 -359548 2319110 4221211 3237257 102956 -2713368 -2451912 1248487 4575032 3355347
34251 3355347 -1013464 -3234790 -2490046 -4392894 -12194631 -20435452 -21175994 -13828178
34243 -13828178 -5294106 -2178170 -5468290 -10934254 -12650665 -8562125 -4230082 -7255805
34235 -7255805 -15694778 -17371906 -5323388 11247923 17945096 12786082 4916445 -585097
34227 -585097 -6241479 -11743424 -11770511 -6630530 -4254649 -7172303 -7480512 -644861 5529437
34218 5529437 3863170 673016 4769270 10687756 6455662 -5489182 -9922952 -1949859
34210 -1949859 5569751 1698257 -7691259 -10901155 -6079861 1542221 9390598 15737906
34202 15737906 15145285 5838577 -2754226 -10997 10643173 16061173 11739663 6272988
34194 6272988 7190793 11841175 14571661 14526770 12822806 9077629 4684182 3315210 3993252
34185 3993252 -430877 -12788694 -24565788 -25209822 -15037412 -3325768 3728106 7552708
34177 7552708 11601681 16732055 21505163 22751572 16743359 4033457 -7735781 -10320247
34169 -10320247 -4165957 2320059 2469571 -2928612 -8731750 -10336314 -5799817 2911970
34161 2911970 10186437 11132107 6118925 -535538 -4980129 -5073994 -365526 5561841 6228094
34152 6228094 852025 -1818725 4917414 13881173 13136196 4882184 3458875 13404267
34144 13404267 22099195 18889790 9750433 5503237 5699642 3807255 234493 -853146
34136 -853146 -1852373 -7261681 -12633156 -9658285 -596673 3443727 -1722036 -9564725
34128 -9564725 -14707529 -17874543 -18163049 -12013919 -3156165 -2440128 -12176233 -20090188
34120 -20090188 -15505594 -3374583 5164799 8635791 12462075 16143667 14133173 7405856
34112 7405856 3786632 5791967 6465092 -196560 -10788422 -17294468 -16038471 -9565336
34104 -9565336 -3146284 -1485855 -5798013 -11885704 -13387345 -8880807 -3911706 -4330382
34096 -4330382 -9544525 -14330667 -15499279 -13886073 -10517080 -4392094 4469954 12326928
34088 12326928 14999208 13219560 11590138 11507705 8441122 -1231463 -13225641 -19180745
34080 -19180745 -16673121 -11475927 -9880337 -12736814 -17374623 -20623422 -18558984 -8698746
34072 -8698746 4254123 9786037 3536476 -5844001 -7236996 -1134326 3581886 4320520
34064 4320520 7077225 13632707 16586307 11826491 7423291 12086764 20100381 17479787
34056 17479787 1644337 -14530235 -19742117 -16724869 -13785448 -11537761 -5218720 4129621
34048 4129621 9223952 6862152 1865115 -306799 860747 4208848 9788072 15274148
34040 15274148 14780159 6205118 -3550185 -5831734 -634459 5018865 7131003 7442701
34032 7442701 6967460 3411220 -3386214 -8803849 -8921665 -4981009 -279651 3741432
34024 3741432 6022858 4318064 -1423502 -6655784 -6729464 -2357148 2028410 3779047
34016 3779047 3326732 1659085 -439706 -1511423 -534666 1424787 2599728 2927609 3513335
34007 3513335 4806894 6891230 9956411 12522293 11241914 5372321 -287618 -466839
33999 -466839 3678773 6452995 5485595 3260253 985224 -3638164 -10683234 -14956164
33991 -14956164 -12399251 -6495040 -4235914 -7231261 -10473516 -9169942 -3340170 4194232
33983 4194232 10888427 14771950 14782874 12462092 11158415 11869034 11662756 7943868 2393572
33974 2393572 -1641538 -3975504 -6613986 -8927178 -7702397 -2507380 2517108 3569697
33966 3569697 1240587 -1360602 -1731639 1546828 7674840 11393770 6402247 -5856333
33958 -5856333 -15033496 -13708562 -6606170 -2986920 -3578384 -1827898 4289197 9669848
33950 9669848 10952096 10353983 9603711 6906657 1651588 -3989950 -9682171 -16951851
33942 -16951851 -23223637 -22875927 -16506917 -11788329 -11935227 -10927994 -4465459 2017266
33934 2017266 2037987 -2036028 -4216191 -3874941 -2687021 1407953 9374004 15430999 14540475
33925 14540475 10892767 10341587 9295608 1474947 -8232167 -8878207 -1047980 3009106
33917 3009106 -2232426 -8591964 -7959172 -2276514 3816332 10218092 16138193 16159150 7666298
33908 7666298 -3607799 -10177493 -10020511 -4456732 4705938 12710033 13727234 9429017
33900 9429017 8721658 14378482 17463050 11013563 1839680 747362 6795264 10108835
33892 10108835 6517210 646969 -3280558 -5560293 -6968778 -7673163 -9526103 -13424025
33884 -13424025 -15439392 -11504955 -4701642 -1750553 -3489492 -5346713 -6042932 -8173590
33876 -8173590 -10245181 -6573322 2786607 9561056 8224365 3409827 2524067 6038932
33868 6038932 9280355 9650816 7553385 3193953 -3058006 -8869942 -11994490 -12707512
33860 -12707512 -11737257 -8083432 -2001809 2158158 179105 -6039065 -10476921 -10409857
33852 -10409857 -8271170 -6437128 -4121545 -415860 2837344 3041434 121988 -3140481
33844 -3140481 -3011932 2486026 10684308 14964986 11827744 6726222 7852764 13624662
33836 13624662 13241428 2807857 -6879721 -5464390 858574 -1262629 -11040713 -14707995
33828 -14707995 -7441266 278873 1666540 4121877 12783294 17443545 8432064 -5126005
33820 -5126005 -8143921 -3169411 -4191099 -11498847 -11795150 -2996685 989606 -5274827
33812 -5274827 -8368666 1184662 12081006 10157452 230141 -3553014 350694 2612058
33804 2612058 168190 -1994114 -2259364 -3359529 -4401717 -2440515 377874 716987
33796 716987 1801970 7264720 10893787 4193462 -7967136 -11424072 -2111531 9853227
33788 9853227 15442490 14817465 9793063 261390 -9521620 -12174843 -8126978 -5855661
33780 -5855661 -8551838 -10131314 -7117262 -4250649 -4659649 -4358283 -702273 3081340
33772 3081340 5810055 11051093 17622795 17591277 8787261 -890552 -6742642 -13386738
33764 -13386738 -21509256 -21721325 -11006286 -2365518 -5641389 -10399439 -3175297 7986496
33756 7986496 4704289 -11647464 -20778557 -13711392 -3514953 -2769895 -7070571 -7316382
33748 -7316382 -4639788 -4459681 -5416782 -3139951 954348 2066808 -407000 -3146071
33740 -3146071 -4208092 -4204887 -3989780 -3504369 -1658320 3012948 9839398 15272755 17239488
33731 17239488 18109818 19803352 19008311 12294579 2848815 -3899173 -8151032 -12495650
33723 -12495650 -14642475 -11757965 -8251356 -9227806 -9700427 -2250756 7378272 6620539
33715 6620539 -2859984 -6287422 642284 6169527 4211190 3687979 9026846 9492109
33707 9492109 -1036969 -10258605 -7278685 -1564000 -5965850 -13671264 -10850134 -2278602
33699 -2278602 -3370018 -12702087 -14301479 -5423773 -644763 -6187121 -10003728 -2930299
33691 -2930299 7383157 11143620 10740018 12014765 13184659 11712185 12767201 21015301
33683 21015301 30201515 29849956 18910578 5991501 -1789901 -5126496 -8682336 -13881842
33675 -13881842 -15974750 -9617153 1607271 6269503 552528 -3864684 3423102 13234015
33667 13234015 9280031 -4890648 -9580320 -438931 3942842 -7405008 -19464333 -15704765
33659 -15704765 -3902380 -929871 -4776105 -1429795 8078100 8496791 -3403201 -12627980
33651 -12627980 -9225172 -2159075 -4022049 -13560259 -20542579 -20350934 -16980356 -15622611
33643 -15622611 -17036478 -17452119 -12267609 -1651177 7721285 9218825 3756964 -2156022
33635 -2156022 -4224954 -2714695 738909 4039667 4065289 -110812 -4779023 -6327454
33627 -6327454 -6112816 -6532080 -5833612 -2290543 371288 -1454922 -3997381 -2432516 -857211
33618 -857211 -6103216 -14175406 -14566792 -7752194 -5703282 -12527277 -17245428 -11438469
33610 -11438469 -2913101 -3503835 -11452317 -15343727 -10742193 -4015460 -1718550 -3574822
33602 -3574822 -5889003 -6767580 -7078943 -8640996 -11718879 -14022333 -13509341 -11495934 -10072306
33593 -10072306 -7676766 -2136422 2765013 586519 -7254855 -11838892 -9538505 -6409025
33585 -6409025 -6761451 -6287803 -1717786 1682864 -114859 -594818 7020742 16131879 14729476
33576 14729476 3791852 -3792445 -1848997 2643693 2898920 1537766 2951716 5306168
33568 5306168 5232785 4019339 3991209 3651860 1251448 -989636 -1170878 -2626584 -8833070
33559 -8833070 -15588211 -14563868 -4853017 4378831 4655157 -2140814 -7323560 -5902947
33551 -5902947 -201121 5626995 10356819 13766086 13696539 8774737 2709601 1544160
33543 1544160 5819919 9306007 7661954 4933098 7590263 14144374 15824505 8118246
33535 8118246 -3052702 -9222928 -9935483 -11166980 -14749924 -14908343 -7261853 3173295
33527 3173295 7456476 4098519 -388388 -1988184 -3840996 -8160708 -10124401 -5402164
33519 -5402164 1089925 1635649 -1695795 179293 8141134 12048018 6127057 -1723507
33511 -1723507 -1780899 3356337 3945241 -2282957 -8902990 -11703775 -12461456 -12149798 -8312906
33502 -8312906 -1082243 4561949 5562873 5216942 7757069 12107742 14223210 12877031
33494 12877031 9843667 6374047 2971740 1448026 3449496 6855434 7034371 2918397
33486 2918397 -869845 -80076 2832775 1483547 -5705891 -12805395 -13687696 -9505873
33478 -9505873 -6536824 -7941406 -10326140 -8389788 -1038637 7410653 11121455 8209935
33470 8209935 3176802 2709875 7818678 12019101 9610491 3751611 2710979 9197475
33462 9197475 17557018 21469387 20311830 17077531 13579248 9331293 3382277 -3078431
33454 -3078431 -5059226 2546992 16292962 22987796 13909252 -2075040 -8205301 -1993269
33446 -1993269 2641175 -2929777 -10077048 -8351540 -1742564 -25825 -2325746 -1099604
33438 -1099604 2459835 -389086 -10470475 -17660401 -14790896 -5780371 2036089 6137067
33430 6137067 7129833 5648998 4034621 5824639 10436072 12231896 7440787 -973331
33422 -973331 -7062132 -7888946 -4826843 -1507643 -977465 -2356763 -631557 7075385 15649067
33413 15649067 16552208 8464411 -669754 -2841798 2334171 9428086 12824965 9881576
33405 9881576 2078545 -5939006 -10850686 -13763526 -16269860 -15787873 -10018241 -4186447
33397 -4186447 -6373198 -15057278 -18944531 -11757390 -454711 4754635 2544149 -1461404
33389 -1461404 -3105519 -1077457 5539215 15210665 22163650 21725670 15591990 8174516
33381 8174516 889990 -5563328 -7115790 -1092851 7008926 8596856 3461083 -512745
33373 -512745 514322 1637012 -1335979 -4959065 -5089821 -4753420 -8667913 -13799749 -13015096
33364 -13015096 -6822398 -3538261 -6619092 -9487663 -6448684 -1769569 -1962250 -4580159
33356 -4580159 -2899547 1561588 1170794 -3513065 -2497433 7141401 13870449 7973442
33348 7973442 -2828039 -3673979 6388142 14253648 11845988 4869626 1484522 1571898
33340 1571898 545332 -3164898 -8109528 -12120143 -11864282 -5136137 3929144 7349083
33332 7349083 4031770 2512538 9056674 18270710 20541126 14507388 6656995 1978296
33324 1978296 777466 2005369 3607778 1521842 -5352510 -10558721 -7334046 54719
33316 54719 12493 -9960475 -18562202 -16167513 -7688051 -3756696 -4743968 -2159515 6391960
33307 6391960 12966551 11300873 5239948 1728248 1562698 1784982 2469020 5258116 7958763
33298 7958763 6583492 1652685 -2673415 -4884712 -6578080 -7608015 -6454800 -4931163
33290 -4931163 -6114183 -7423704 -3210276 4245382 4703315 -5142916 -14636424 -13022937
33282 -13022937 -3886058 1328829 -993285 -5216662 -6722705 -5216934 -405679 6990360
33274 6990360 11052971 5889514 -4714871 -10240146 -6726019 -625952 983878 -2610929
33266 -2610929 -9066356 -16129551 -19964927 -17083373 -10265466 -6862248 -9231320 -12374200
33258 -12374200 -12609509 -12231354 -13113003 -12164455 -6937843 -471460 3313307 4485965 3823461
33249 3823461 -564506 -8788165 -15159809 -13851205 -6806031 -1707956 -2530581 -5082967
33241 -5082967 -2449366 6207718 13228174 10614675 872094 -4677719 -1346347 1274052
33233 1274052 -5825873 -14569617 -10181486 4680312 11516191 4004533 -1715237 7561188
33225 7561188 21035117 20743932 8776590 2263809 6744415 10380785 4351091 -4739123
33217 -4739123 -6136659 1183070 10011728 13554640 9097287 -1842715 -13561505 -19269132
$$ [...]
##END NTUPLES=NMR SPECTRUM
##END=
