##TITLE=31Pdec_2MBDE-3.1
 CDCl3
  24 sc
 21.11.2023
##JCAMPDX= 6.0         $$ Bruker NMR JCAMP-DX V2.0
##DATA TYPE= NMR SPECTRUM
##DATA CLASS= NTUPLES
##ORIGIN= UXNMR, Bruker Analytische Messtechnik GmbH
##OWNER= root
$$ XWIN-NMR		Version 3.5
$$ Tue Nov 21 15:39:03 2023 Russian Standard Time (UT+4h)  she@DPX200
##.OBSERVE FREQUENCY= 81.013821
##.OBSERVE NUCLEUS= ^31P
##.ACQUISITION MODE= SIMULTANEOUS
##.ACQUISITION SCHEME= undefined
##.AVERAGES= 24
##.DIGITISER RES= 16
##SPECTROMETER/DATA SYSTEM= spect
##.PULSE SEQUENCE= zgpg30
##.SOLVENT NAME= DMSO
##.SHIFT REFERENCE= (INTERNAL, DMSO, 0, 248.564)
##AUDIT TRAIL= $$ (NUMBER, WHEN, WHO, WHERE, WHAT)
$$ ##TITLE= Audit trail, XWIN-NMR		Version 3.5
$$ ##JCAMPDX= 5.01
$$ ##ORIGIN= Bruker BioSpin GmbH
$$ ##OWNER= she
$$ F:/spectra/data/she/nmr/P31/1/pdata/1/auditp.txt
$$ ##AUDIT TRAIL=  $$ (NUMBER, WHEN, WHO, WHERE, WHAT)
(   1,<2023-11-21 15:36:42.43 +0400>,<she>,<DPX200>,
      <created by zg, POWCHK disabled, PULCHK disabled
       configuration hash MD5:
       00 E9 B6 7A A2 85 ED C7 34 08 36 98 17 FE 4E 26
       data hash MD5: 32K
       9C E2 29 68 EB FA F9 B1 4A D3 2B 77 7D 1D 7A 41>)
(   2,<2023-11-21 15:36:44.89 +0400>,<she>,<DPX200>,
      <Start of raw data processing
       efp BC_mod = 2 LB = 5 FT_mod = 6 PKNL = 1 PHC0 = -10125.91 PHC1 = -1468.709 SI = 64K 
       data hash MD5: 64K
       20 93 46 45 8D 4E A5 3C 43 74 0C 1F 89 8B 65 D5>)
(   3,<2023-11-21 15:37:09.57 +0400>,<she>,<DPX200>,
      <pk PHC0 = 73.01228 PHC1 = 0 
       data hash MD5: 64K
       86 33 B0 04 37 E9 43 0B CD BF 4F 65 99 5D 5B B2>)
(   4,<2023-11-21 15:38:01.98 +0400>,<she>,<DPX200>,
      <pk PHC0 = -984.8536 PHC1 = 2209.204 
       data hash MD5: 64K
       09 62 12 90 14 1B B8 F9 3B 87 93 93 DD 1F 6A 48>)
(   5,<2023-11-21 15:38:14.64 +0400>,<she>,<DPX200>,
      <abs ABSG = 5 
       data hash MD5: 64K
       F3 DC 08 7C 15 58 96 59 F1 30 40 9F E5 8E 28 1C>)
$$ ##END=
$$ 
$$ hash MD5
$$ 81 3E CD 2E 12 F9 09 E4 37 D7 12 B4 8E 77 35 08
##$RELAX= 
##$RELAX= 
##$RELAX= 
##$RELAX= 
##$RELAX= 
##$RELAX= 
##$RELAX= 
##$RELAX= 
##$RELAX= 
$$ Bruker specific parameters
$$ --------------------------
##$DU= <F:/spectra>
##$EXPNO= 1
##$NAME= <P31>
##$PROCNO= 1
##$TYPE= <nmr>
##$USER= <she>
##$AMP= (0..31)
100 100 100 100 100 100 100 100 100 100 100 100 100 100 100 100 100 100 
100 100 100 100 100 100 100 100 100 100 100 100 100 100 
##$AQSEQ= 0
##$AQ_mod= 1
##$AUNM= <au_zg>
##$AUTOPOS= <>
##$BF1= 81.014009
##$BF2= 200.13
##$BF3= 200.13
##$BF4= 200.13
##$BF5= 200.13
##$BF6= 200.13
##$BF7= 200.13
##$BF8= 200.13
##$BYTORDA= 1
##$CFDGTYP= 0
##$CFRGTYP= 5
##$CHEMSTR= <none>
##$CNST= (0..31)
1 1 145 1 1 1 1 1 1 1 1 1 1 1 1 1 1 1 1 1 1 1 1 1 1 1 1 1 1 1 1 1 
##$CPDPRG= <waltz16>
##$CPDPRG1= <>
##$CPDPRG2= <waltz16>
##$CPDPRG3= <>
##$CPDPRG4= <mlev>
##$CPDPRG5= <mlev>
##$CPDPRG6= <mlev>
##$CPDPRG7= <mlev>
##$CPDPRG8= <mlev>
##$CPDPRGB= <>
##$CPDPRGT= <>
##$D= (0..31)
$$ [...]
##$SUBNAM3= <"">
##$SUBNAM4= <"">
##$SUBNAM5= <"">
##$SUBNAM6= <"">
##$SUBNAM7= <"">
##$SUBNAM8= <"">
##$SUBNAM9= <"">
##$SW= 501.771253377433
##$SWIBOX= (0..15)
0 1 3 0 0 0 0 0 0 0 0 0 0 0 0 0 
##$SW_h= 40650.406504065
##$TD= 32768
##$TD0= 1
##$TE= 0
##$TE2= 300
##$TE3= 300
##$TEG= 300
##$TL= (0..7)
0 120 53 12 22 120 120 120 
##$TP= (0..7)
150 150 150 150 150 150 150 150 
##$TP07= 0
##$TPNAME0= <>
##$TPNAME1= <>
##$TPNAME2= <>
##$TPNAME3= <>
##$TPNAME4= <>
##$TPNAME5= <>
##$TPNAME6= <>
##$TPNAME7= <>
##$TPOAL= (0..7)
0.5 0.5 0.5 0.5 0.5 0.5 0.5 0.5 
##$TPOFFS= (0..7)
0 0 0 0 0 0 0 0 
##$TUNHIN= 0
##$TUNHOUT= 0
##$TUNXOUT= 0
##$USERA1= <user>
##$USERA2= <user>
##$USERA3= <user>
##$USERA4= <user>
##$USERA5= <user>
##$V9= 5
##$VALIST= <valist>
##$VCLIST= <CCCCCCCCCCCCCCC>
##$VD= 0
##$VDLIST= <DDDDDDDDDDDDDDD>
##$VPLIST= <PPPPPPPPPPPPPPP>
##$VTLIST= <TTTTTTTTTTTTTTT>
##$WBST= 1024
##$WBSW= 4
##$XGAIN= (0..3)
0 0 0 0 
##$XL= 0
##$YL= 0
##$YMAX_a= 331
##$YMIN_a= -141
##$ZGOPTNS= <>
##$ZL1= 120
##$ZL2= 120
##$ZL3= 120
##$ZL4= 120
##$ABSF1= 248.5645
##$ABSF2= -253.2056
##$ABSG= 5
##$ABSL= 3
##$ALPHA= 0
##$AQORDER= 0
##$ASSFAC= 0
##$ASSFACI= 0
##$ASSFACX= 0
##$ASSWID= 0
##$AUNMP= <proc_1d>
##$AZFE= 0.1
##$AZFW= 0.5
##$BCFW= 0
##$BC_mod= 2
##$BYTORDP= 0
##$COROFFS= 0
##$CY= -3
##$DATMOD= 1
##$DC= 0
##$DFILT= <>
##$DTYPP= 0
##$F1P= 0
##$F2P= 0
##$FCOR= 1
##$FTSIZE= 65536
##$FT_mod= 6
##$GAMMA= 0
##$GB= 0
##$INTBC= 1
##$INTSCL= 6.047779e-11
##$ISEN= 30
##$LB= 5
##$LEV0= 0
##$LPBIN= 0
##$MAXI= 10000
##$MC2= 0
##$MEAN= 0
##$ME_mod= 0
##$MI= 50
##$NCOEF= 0
##$NC_proc= -12
##$NLEV= 6
##$NOISF1= 182.463
##$NOISF2= 159.3651
##$NSP= 0
##$NTH_PI= 0
##$NZP= 0
##$OFFSET= 248.5645
##$PC= 4
##$PHC0= -11037.75
##$PHC1= 740.4951
##$PH_mod= 1
##$PKNL= yes
##$PPARMOD= 0
##$PSCAL= 0
##$PSIGN= 0
##$REVERSE= no
##$SF= 81.0140089999694
##$SI= 65536
##$SIGF1= 159.3651
##$SIGF2= -187.1042
##$SINO= 113.3802
##$SIOLD= 16384
##$SREGLST= <1H.CDCl3>
##$SSB= 0
##$STSI= 65536
##$STSR= 0
##$SW_p= 40650.406504065
##$SYMM= 0
##$S_DEV= 0
##$TDeff= 32768
##$TDoff= 0
##$TI= <>
##$TILT= no
##$TM1= 0
##$TM2= 0
##$TOPLEV= 0
##$USERP1= <user>
##$USERP2= <user>
##$USERP3= <user>
##$USERP4= <user>
##$USERP5= <user>
##$WDW= 1
##$XDIM= 65536
##$YMAX_p= 369979522
##$YMIN_p= -22056110
$$ End of Bruker specific parameters
$$ ---------------------------------
##NTUPLES= NMR SPECTRUM
##VAR_NAME=  FREQUENCY,     SPECTRUM/REAL,   SPECTRUM/IMAG
##SYMBOL=    X,             R,               I
##VAR_TYPE=  INDEPENDENT,   DEPENDENT,       DEPENDENT
##VAR_FORM=  AFFN,          ASDF,            ASDF
##VAR_DIM=   65536,         65536,           65536
##UNITS=     HZ,            ARBITRARY UNITS, ARBITRARY UNITS
##FACTOR=    0.620285442955139, 1,           1
##FIRST=     20137.2065510682, 0,            0
##LAST=      -20513.1999529968, 0,           0
##MIN=       -20513.1999529968, -22056110,   0
##MAX=       20137.2065510682, 369979522,    0
$$ Real data points
##PAGE= N=1
##DATA TABLE= (X++(R..R)), XYDATA
$$ [...]
39477a689119K78602L20151L04830K67542K32428J86052J08537J0087q7467j84166
39467b52523k82128l42762l05419j61634J2958J15947R8478j3196j55909k72660
39457a558848l26369k95373j76858k826J59352K47267K57573K48143K72413L20086
39447h55440L36867K92107K05268J11927L2617k0842m0050m1449p1019j57724
39437b07738k66795l25194l00076k34968j96984j96599j72332n7562J42344L43984
39427a471920M57235M58081L88512K97271K03490J21612Q9933J39366K37243K96317
39417A217140K58797J59144Q8527J02326J71620K17608J79754N4225j15094k70753
39407B063294l71829m04059l73743l00540k15453j53259j31998j35889j25628
$$ y = [-1689119, -1410517, -1090366, -785536, -517994, -285566, -99514, 9023, 19110, -68357, -252523, -534651, -877413, -1182832, -1344466, -1331508, -1215561, -1117083, -1130279, -1286188, -1558848, -1885217, -2180590, -2357448, -2360274, -2200922, -1953655, -1696082, -1447939, -1175526, -855440, -518573, -226466, -21198, 90729, 123346, 102504, 62454, 21005, -50014, -207738, -474533, -799727, -1099803, -1334771, -1531755, -1728354, -1900686, -1958248, -1815904, -1471920, -1014685, -556604, -168092, 129179, 332669, 454281, 544214, 683580, 920823, 1217140, 1475937, 1635081, 1723608, 1825934, 1997554, 2215162, 2394916, 2449141, 2334047, 2063294, 1691465, 1287406, 913663, 613123, 397670, 244411, 112413, -23476, -149104]
39398a49104p3191J2097R3579J41837J54610J41561J00431K5725n5974q1704p947
39387C01920J31339K44525K68127K20749J69828J64582K09828K81278L42244L58085
39377B692505L21842K63646K11316J41987j30k26946m66704o15105o16583m90870
39367A214958l02358j24896k1607k1119r3812j63040j60161p8405K6666R0236
39357C66462R2143O2457M3236N3338Q6522J26424J52122J40793Q5238J0013m5453
39346A173295o4915o5755o7847o5687m1369K730L6002K5259l3852j08924j55402
39335F33535j55797j34344j26102j35805j41980j40021j57137k11855k77328l05850
39325a152684k82199k33636j89154j45873q0071J7971J23971J92339J93393J44078
$$ y = [-149104, -222295, -210198, -116619, 25218, 179828, 321389, 421820, 447545, 391571, 309867, 301920, 433259, 677784, 945911, 1166660, 1336488, 1501070, 1710898, 1992176, 2334420, 2692505, 3014347, 3277993, 3489309, 3631296, 3631166, 3404220, 2937516, 2322411, 1705828, 1214958, 912600, 787704, 766097, 744978, 651166, 488126, 327965, 249560, 276226, 366462, 458605, 521062, 564298, 617636, 704158, 830582, 982704, 1123497, 1208735, 1218748, 1173295, 1108380, 1042625, 974778, 909091, 867722, 870452, 906454, 931713, 897861, 788937, 633535, 477738, 343394, 217292, 81487, -60493, -200514, -357651, -569506, -846834, -1152684, -1434883, -1668519, -1857673, -2003546, -2083617, -2065646, -1941675, -1749336, -1555943, -1411865]
39315a411865R7518R5705J35150J78393J84339J21972j7968j92142k95330k26233
39305a330461J1429K84208M21410L38072Q2508k06955l82653l58711j47457J56106
39295a132504M31985N90195N90197M40156J98878l7097j84358k28225k19909k11685
39285B37633k02053j50108l4961J10267K23410K66949K57259K41792K44408K35145
39275A429741J66311M4171n1783m1033P2954K11709L10174L61609L66472K84019
39265C154344Q1184j88883m10421n15705n32902n11841m45176k96217p9940J23445
39255C77888K33954K29128J43259L4382m7726q2158p7231n2760l2317n3679j56193
39244E16547l28042m82229n23340m40328l05186j81201o8423N1952J59805K12749
$$ y = [-1411865, -1314347, -1218642, -1083492, -905099, -720760, -598788, -616756, -808898, -1104228, -1330461, -1319032, -1034824, -613414, -275342, -192834, -399789, -782442, -1141153, -1288610, -1132504, -700519, -110324, 479873, 920029, 1118907, 1081810, 897452, 669227, 449318, 237633, 35580, -114528, -149489, -39222, 184188, 451137, 708396, 950188, 1194596, 1429741, 1596052, 1640223, 1588440, 1547407, 1620361, 1832070, 2142244, 2503853, 2870325, 3154344, 3235528, 3046645, 2636224, 2120519, 1587617, 1075776, 630600, 334383, 254443, 377888, 611842, 840970, 984229, 1018611, 970885, 888727, 811496, 758736, 726419, 672740, 516547, 188505, -293724, -817064, -1257392, -1562578, -1743779, -1812202, -1760250, -1600445, -1387696]
39234a387696J99417J45409P4832n833q3097j18078o8108P3007K57118M04029
39224e09000M48452L75972K21652M0520j18432k19988k42827j80468m2160J40733
39214h5546L03284L58953K55864L2787j99463l46854l94863l80786l27068k24524
39204a008216p2722Q8984K01386K29643J83532R8956O180q1608j54987j97648
39194g06500j96215j51340p0018M2115J66458K61068K87770K47320J68938P2101
39184A21697l6467j36344k02101k42054k88307l34396l22242k15845n7733P2836
39174a640956J31284J18343N8772M264J9055J08338J80001J32035k6997j89192
39164a105053k70101k70198k19877j26453N814J53367K96403M26068N09014M89298
$$ y = [-1387696, -1188279, -1042870, -968038, -973871, -1056968, -1175046, -1243154, -1170147, -913029, -509000, -60548, 315424, 537076, 577596, 459164, 239176, -3651, -184119, -226279, -85546, 217738, 576691, 832555, 865342, 665879, 319025, -75838, -456624, -783692, -1008216, -1080938, -991954, -790568, -560925, -377393, -278437, -272257, -353865, -508852, -706500, -902715, -1054055, -1124073, -1081958, -915500, -654432, -366662, -119342, 49596, 121697, 85230, -51114, -253215, -495269, -783576, -1117972, -1440214, -1656059, -1713792, -1640956, -1509672, -1391329, -1332557, -1328293, -1309238, -1200900, -1020899, -888864, -915861, -1105053, -1375154, -1645352, -1865229, -1991682, -1985868, -1832501, -1536098, -1110030, -601016, -111718]
39154a11718L59484J96837R0699N4755M3361L2555M2865Q9547J49752J86124J77690
39143A311951J19764J3432j29726k74841l64923l49780k31538p9882K0866M8872
39133H4195N1562P0704Q8724O5889K771o2463j01321j11050r6374o3871k7452
39122i8686L935L4340N4713K7644o5071j70755k06854j56967q5134m6802k9942
39111g39579l464K1449J8464P405M0228J28527K22749K71920K75597K61119K27955
39100G32370J38344l4820k62240m66740n76000n66274m62044l06886j41470Q16
39090a944944R5631J34028J25160R2150O4814O6786R8602J36096J54286J49205
39080h28186J28820R3898M6987J3497K5402P6636J17489J07091N6505Q749q441
$$ y = [-111718, 247766, 444603, 535302, 590057, 633418, 665973, 708838, 798385, 948137, 1134261, 1311951, 1431715, 1445147, 1315421, 1040580, 675657, 325877, 94339, 14457, 35323, 84195, 135757, 206461, 295185, 361074, 363845, 301382, 200061, 89011, -7363, -71234, -98686, -94751, -60411, -5698, 21946, -43125, -213880, -420734, -577701, -662835, -709637, -739579, -743043, -721594, -703130, -695725, -655497, -526970, -304221, -32301, 243296, 504415, 732370, 870714, 835894, 573654, 106914, -469086, -1035360, -1497404, -1804290, -1945760, -1944944, -1849313, -1715285, -1590125, -1497975, -1433161, -1366375, -1267773, -1131677, -977391, -828186, -699366, -605468, -558481, -544984, -519582, -442946, -325457, -218366, -161861, -153112, -161553]
39069a61553L831L4655P5451J16375J44616J47979J18109N8863m496l8571l4465
39058D60794j3940Q174M9372J25213K03291K24272J72016R6193N4392N1572M9496
39047A480845J8852l7621j04777j73702k34343k66456k54938k12613j71953j45284
39037a01990j04588j8767R0926J54600J24742L0649n0207o4685j6687N5863J10984
39026B10840J14950N5080m6645j45621k06653k14884j62647n8324L8844L0148
39016c84912j30351l57189m87388m31619k50624o6395P5816K22399M00485N43275
39006h66503N54200M22229K40673J17304Q9970J23115J51840J21973K1801j00854
38996H75748j72293j66554j31552j21562j22163p4461L4813J44666J86521J49032
$$ y = [-161553, -157722, -123067, -47616, 68759, 213375, 361354, 479463, 538326, 533830, 495259, 460794, 446854, 455028, 504400, 629613, 832904, 1057176, 1229192, 1325385, 1379777, 1431349, 1480845, 1499697, 1462076, 1357299, 1183597, 949254, 682798, 427860, 215247, 43294, -101990, -206578, -225345, -134419, 20181, 144923, 175572, 125365, 60680, 43993, 99856, 210840, 325790, 380870, 334225, 188604, -18049, -232933, -395580, -453904, -415060, -384912, -515263, -872452, -1359840, -1791459, -2042083, -2108478, -2032662, -1810263, -1409778, -866503, -312303, 109926, 350599, 467903, 557873, 680988, 832828, 954801, 976602, 875748, 703455, 536901, 405349, 283787, 161624, 87163, 121976, 266642, 453163, 602195]
38986F02195O6431k8980j22337k01047k46889k45436k01797j52321j50957k17913
38976h99051k98204k99978j89045k3556J17507K11104K74077L04792K85653K30243
38966b86458J79878J48909J12906O0869K1793K1136M3367O3358Q9140J40331J98257
38955G93486K13244J62821P6593l72m6799o2737n1676k2037M916O107k3219o6360
38943I83967j01290j17547j19840j16250j00291m8752N0678J67165K36248K14658
38933A048746J23448L0896n062K1043O2528N4526l5674j71577k66040k56062j60763
38922D46009n5221N135J8632J2137J6733O5214J68555K76017K96287J89318J2369
38911A451185j54719l02869m69945o41788p33676o80980n09023k98450j11452
$$ y = [602195, 668626, 639646, 517309, 316262, 69373, -176063, -377860, -530181, -681138, -899051, -1197255, -1497233, -1686278, -1709834, -1592327, -1381223, -1107146, -802354, -516701, -286458, -106580, 42329, 155235, 216104, 237897, 259033, 302400, 365758, 454898, 595229, 793486, 1006730, 1169551, 1246144, 1245772, 1198973, 1136236, 1084560, 1062523, 1067439, 1073546, 1050327, 983967, 882677, 765130, 645290, 529040, 428749, 379997, 430675, 597840, 834088, 1048746, 1172194, 1203090, 1198028, 1219071, 1281599, 1336125, 1300451, 1128874, 862834, 606772, 446009, 390788, 395923, 414555, 426692, 443425, 508639, 677194, 953211, 1249498, 1438816, 1451185, 1296466, 993597, 523652, -118136, -851812, -1532792, -2041815, -2340265, -2451717]
38902b451717L6168J62431K99406M62189O16806O96232O66036N59124M30962K98055
38892A775692J39195n5322k54066l98465m42049l92883l22655l06259l36593l25832
38882i19237k11684l3444J23577K24479K82124K89700K25972J29498R9091J85735
38872C95811L21203L85158L19541J55667l9915k08800l07588l17675k61146j85539
38862B56717j19169m8250N5283J86646K93878L14867K33189R7503j8640p7477
38852A174547r8234j25065j80679k46097k78059k51643j92496j55853j61604j64116
38842f79299j06273R791J32548K28761L02046L46417L30089K45592J38925O2271
38832A010868K4498J2311K9733P9837J27009J20263N2828l2493r8003j44536j87900
$$ y = [-2451717, -2415549, -2253118, -1953712, -1491523, -874717, -178485, 487551, 1046675, 1477637, 1775692, 1914887, 1859565, 1605499, 1207034, 764985, 372102, 49447, -256812, -593405, -919237, -1130921, -1164365, -1040788, -816309, -534185, -244485, -18513, 110985, 210076, 395811, 717014, 1102172, 1421713, 1577380, 1537465, 1328665, 1021077, 703402, 442256, 256717, 137548, 89298, 144581, 331227, 625105, 939972, 1173161, 1270664, 1252024, 1174547, 1076313, 951248, 770569, 524472, 246413, -5230, -197726, -353579, -515183, -679299, -785572, -775781, -643233, -414472, -112426, 233991, 564080, 809672, 948597, 1010868, 1035366, 1047677, 1077410, 1157247, 1284256, 1404519, 1457347, 1424854, 1326851, 1182315, 994415]
38821I94415k27363k47659k38205k02964j57789j18583q7380n5541k4676r615
38811c75360q402J3850Q8461J98536K89822L16679K57880J05720j19346l41320
38801D26520m56768m13271k45067k4254J99828M00652N40894N70535M62149K39697
38791A700915k6530k53984l90091m31254m00004l09062j62021J2104J47121J77130
38781F4324Q2603r7099k81004l79119l40736j94845l2229P0303J04315J04737
38771h98750R2091O3151K6817J4081L9583P5221Q4820P8680J06306J79718K22756
38760H4474J33384r1357l21242m13490l56484k63725k32158k45826k28441j49857
38750b084722m9308K6162P2233J17288J81056K46499K69863K27351J51680J00858
$$ y = [994415, 767052, 519393, 281188, 78224, -79565, -198148, -285528, -341069, -365745, -375360, -383762, -369912, -281451, -82915, 206907, 523586, 781466, 887186, 767840, 426520, -30248, -443519, -688586, -712840, -513012, -112360, 428534, 999069, 1461218, 1700915, 1674385, 1420401, 1030310, 599056, 199052, -110010, -272031, -259927, -112806, 64324, 146927, 49828, -231176, -610295, -951031, -1145876, -1178105, -1107802, -1003487, -898750, -806659, -743508, -716691, -702610, -663027, -587806, -502986, -424306, -318000, -138282, 84474, 217858, 126501, -194741, -608231, -964715, -1228440, -1460598, -1706424, -1934865, -2084722, -2134030, -2107868, -2035635, -1918347, -1737291, -1490792, -1220929, -993578, -841898, -741040]
38740g41040Q3330M3584n6350j67281j97370j12228L7983J74306K36350J91686
38730e07030N3685j00709j77371j51801q1847k3902K3068O7452O3905m6435k46904
38719a127889m38506n24193m76174l30040j50102m827O0116M8607N327k5891k6034
38708b989606P913O4169J00848O4669m6383j57319j83107j14043r225Q6416J83752
38697b991916L03154M20804M83736M62878L74731K64115J81732J62678J99502
38688a38586K37864K22335J53235Q3935N7483N9856M3337j4323q4873j22861j19113
38677C78289j14416j49167j99342j86018o7993R4247K00119K24613K29857K58915
38667F69104K71062K12094J06540L1432J6567J8157j0202n9855q7077o1265J4470
$$ y = [-741040, -657710, -614126, -670476, -837757, -1035127, -1147355, -1109372, -935066, -698716, -507030, -453345, -554054, -731425, -883226, -965073, -988975, -965907, -898455, -834550, -880985, -1127889, -1566395, -2090588, -2566762, -2896802, -3046904, -3051731, -2991615, -2943008, -2937681, -2963572, -2989606, -2981693, -2917524, -2816676, -2752007, -2798390, -2955709, -3138816, -3252859, -3262084, -3175668, -2991916, -2688762, -2267958, -1784222, -1321344, -946613, -682498, -500766, -338088, -138586, 99278, 321613, 474848, 558783, 616266, 676122, 719459, 705136, 620263, 497402, 378289, 263873, 114706, -84636, -270654, -338647, -244400, -44281, 180332, 410189, 669104, 940166, 1152260, 1258800, 1290232, 1306799, 1324956, 1314754, 1254899, 1167822, 1106557, 1121027]
38656A121027J06586J66207J59607R3116O33q6905j45425j48644r2210k6884k9648
38645A117460j28185k79128m25940n42655o07555n76402m19793j70422R4243L05172
38635a633205M23581M37823L72040K83346K16429J64646R8963K4261k2958k6615
38625C38311r333K276L906K941N519J6616L0189J6511n7634j88970l32981m38019
38613f10668m67214l97943k37920n0229P4100R2790M6020J301j5248j9545k5850
38602a610406k8348j7574N064K9836M9992P4512J24913K02088K61031K50536J84369
38591d73987J34534J33742J24498M2152q2294j50788j13956r876J03759K00959
38581i1257K64954K70554K15780J31871L3478j05408k87325m28879m14223k17629
$$ y = [1121027, 1227613, 1393820, 1553427, 1646543, 1647176, 1560271, 1414846, 1266202, 1173992, 1147108, 1117460, 989275, 710147, 284207, -258448, -866003, -1442405, -1862198, -2032620, -1938377, -1633205, -1209624, -771801, -399761, -116415, 100014, 264660, 363623, 387884, 364926, 338311, 328978, 331254, 335160, 338101, 343620, 360236, 390425, 406936, 349302, 160332, -172649, -610668, -1077882, -1475825, -1713745, -1763974, -1689874, -1597084, -1551064, -1549763, -1565011, -1584556, -1610406, -1638754, -1656328, -1651264, -1621428, -1571436, -1496924, -1372011, -1169923, -908892, -658356, -473987, -339453, -205711, -81213, -39061, -121355, -272143, -386099, -395975, -292216, -91257, 173697, 444251, 660031, 791902, 825380, 719972, 432647, 3768, -410455, -628084]
38571f28084N5902K57627L03664K03070J8238j75659l09316l35776k50799r7139
38561i58272N9407J65334J97966J58920O0886p2956k02853k80802k77154k04264
38551a353788j14717o9922r3827j42710j26219J8986K60709M79330N56572M66661
38541a18925K88645J34834O3884N3466M8550K7986J5789L2556N9795O6738N1607
38530G24925K8132j6253j07631k22995k78373k06873l4073J41212K28638K01289
38520D57998R8096m78j6498O8791J95601K77463K71290J89939O7169o0039j44589
38509A404743j45424o6992L5226J00059J03864O0411l957o8484j23245j63302
38499A132899j77794j56605j18580j13736j68880k42250k68691k46007k31598
$$ y = [-628084, -572182, -314555, -10891, 192179, 210417, 34758, -274558, -610334, -861133, -958272, -898865, -733531, -535565, -376645, -315759, -388715, -591568, -872370, -1149524, -1353788, -1468505, -1538427, -1632254, -1774964, -1901183, -1882197, -1621488, -1142158, -585586, -118925, 169720, 304554, 368438, 421904, 470454, 498440, 514229, 546785, 606580, 673318, 724925, 753057, 736804, 629173, 406178, 127805, -79068, -113141, 28071, 256709, 457998, 556094, 555616, 539118, 607909, 803510, 1080973, 1352263, 1542202, 1609371, 1549332, 1404743, 1259319, 1192327, 1227553, 1327612, 1431476, 1491887, 1487930, 1419446, 1296201, 1132899, 955105, 798500, 679920, 566184, 397304, 155054, -113637, -359644, -591242]
38490e91242k45534k29199j32281k16P2372N6705J4642J6510P4114J54135K18516
38479e91478K42556K25751K00282K05131K35528K36255J62053L3096q3008j34507
38469G31659j19470o8597j2234L7708Q6340J38215J75983J62906P9843l9704j24973
38458A047676j28084o6850m964N702m1277j23358k22506l31484m31687m80078
38448g76910m31581k79199o9884J23955K52186L07545L02838K42151J31318J1421
38438a86160n0273k6736K6443K4693n0734j37618j74077j64787j54727j67564
38428a061540j95039k25998k51672k47082j79013m3473J18797K50904L17720L17925
38418a198471K70608J94175R6369j0459q4502o5562O6734K50912L81610L95358
$$ y = [-591242, -836776, -1065975, -1198256, -1198472, -1126100, -1069395, -1054753, -1038243, -964129, -809994, -591478, -348922, -123171, 77111, 282242, 517770, 754025, 916078, 949174, 866166, 731659, 612189, 543592, 531358, 569066, 655406, 793621, 969604, 1132510, 1212353, 1172649, 1047676, 919592, 852742, 847778, 853480, 812203, 688845, 466339, 134855, -296832, -776910, -1208491, -1487690, -1557574, -1433619, -1181433, -873888, -571050, -328899, -197581, -186160, -236433, -263169, -236726, -212033, -262767, -400385, -574462, -739249, -893976, -1061540, -1256579, -1482577, -1734249, -1981331, -2160344, -2203817, -2085020, -1834116, -1516396, -1198471, -927863, -733688, -637319, -647778, -732280, -797842, -731108, -480196, -98586, 296772]
38408B96772L11220J92364Q4575o580r5239j83564k50316k71574k50064k09840
38398c82246j56878o6919O7984J98432K51968K03346Q9682l2585j17873j32282
38388g7371o9283K7347R1407R8712P9526O3269M4564J3977j5071l1656n1098r1753
38376H2570j51740k25546l13263l88265l85797k62083n4305J44292K61127K84109
38366a008901K51688K27964K61073L30661L53296K72302J25946l195q0341j17371
38356F13122j07824l0902Q0193J40328J05681K0081m9986q4090r2867q0957n6112
38345D56667l8372k4685K7001J41903K78394L68534L89241L57721K77365J39400
38335B373169k3041j33075j44045q8359l5272k0166l1191m6213n8235o9457q1683
$$ y = [296772, 607992, 800356, 884931, 878351, 783112, 599548, 349232, 77658, -172406, -382246, -539124, -606043, -538059, -339627, -87659, 115687, 205369, 172784, 54911, -77371, -146654, -119307, -27900, 70812, 150338, 213607, 258171, 272148, 257077, 225421, 174323, 82570, -69170, -294716, -607979, -996244, -1382041, -1644124, -1698429, -1554137, -1293010, -1008901, -757213, -529249, -268176, 62485, 415781, 688083, 814029, 810834, 730493, 613122, 505298, 474396, 554589, 694917, 800598, 820679, 770693, 686603, 593736, 512779, 456667, 418295, 393610, 420611, 562514, 840908, 1209442, 1598683, 1956404, 2233769, 2373169, 2350128, 2217053, 2073008, 1984649, 1949377, 1929211, 1898020, 1851807, 1793572, 1724115, 1642432]
38324A642432r7869j20554j40574j35730r4067l8994j7349n2326j15829j58587
38314F70553j60225j34418r2390k8503N2702J22491J58991J74519J92324K09889
38304A165933K08150J87888J68551J48165Q9669l7618k12102l66234m38108m17946
38294D96348l51720l00062k82849k56725j54175M3325K67820M08252M01891K86471
38284E58576J56908O9878K629q7745j86828k37864k31465k37013l16879m33953
38274i43756m81240l96883k18659k7075J28785K36274K83718K52847J42993j3187
38264a036183j56866k22712j70353j9628J49152K52347K68600K39927K11445J88993
38254b95278J59757J28990J12688J04455P7379K4810k0288j8778L1242R2697J21799
$$ y = [1642432, 1544563, 1424009, 1283435, 1147705, 1053638, 1014644, 997295, 944969, 829140, 670553, 510328, 375910, 283520, 255017, 307719, 430210, 589201, 763720, 956044, 1165933, 1374083, 1561971, 1730522, 1878687, 1968356, 1930738, 1718636, 1352402, 914294, 496348, 144628, -155434, -438283, -695008, -849183, -805858, -538038, -129786, 272105, 558576, 715484, 785362, 787991, 700246, 513418, 275554, 44089, -192924, -509803, -943756, -1424996, -1821879, -2040538, -2067613, -1938828, -1702554, -1418836, -1165989, -1022996, -1036183, -1193049, -1415761, -1586114, -1605742, -1456590, -1204243, -935643, -695716, -484271, -295278, -135521, -6531, 106157, 210612, 287991, 312801, 292513, 273735, 304977, 397674, 519473]
38243E19473R3472P177j12560k19451k64103k21617j05724L9153J58884K14877
38233A09581K03035J49379Q2717J6710l7069n3517j2390O8890J37933J46769Q1194
38222H93232m0649j79186k85567l27279l09287k54257j63016k1514J46175K65417
38212b75931K78075K05691J23675Q5748R4004J24988J49915J32105M1488j10740
38202H49018k68699l77751m28057m47856m63479m73515m55452l87763k64397r4080
38192b812031J04902L00815M43716M83640M09487K67879J34805O7886Q3129J59562
38182c56210K49044K90339K41002J12159l0728j11142r5712j6826N4437O5015
38172D01378J6989m9602j01851j28281j17202n5231L7346R9375Q8369L4051K045
$$ y = [519473, 612945, 620122, 507562, 288111, 24008, -197609, -303333, -264180, -105296, 109581, 312616, 461995, 544712, 561422, 524353, 470836, 458446, 527336, 665269, 812038, 893232, 852583, 673397, 387830, 60551, -248736, -502993, -666009, -687523, -541348, -275931, 2144, 207835, 331510, 417258, 511262, 636250, 786165, 918270, 959758, 849018, 580319, 202568, -225489, -673345, -1136824, -1610339, -2065791, -2453554, -2717951, -2812031, -2707129, -2406314, -1962598, -1478958, -1069471, -801592, -666787, -598901, -515772, -356210, -107166, 183173, 424175, 536334, 505606, 394464, 298752, 281926, 336363, 401378, 418367, 368765, 266914, 138633, 21431, -33800, 3546, 102921, 191290, 225341, 227386]
38161B27386J0861J5689k5251r8869j58743j71763j31037m5847O0468J52250J98380
38150C3524J88884J33477N3105k2563o0936m2274K9573J32510K36130L06627L15440
38139A303497K55806J51670M5887k3192l9737j5803J4744J0460n9152j93531l46913
38128A103736m41304m18538k94163j48815n4040j4553J0403M7873R1560J24243
38118F402J32188J04033M2778k1762n8190p4814j12203j87290k64874k94264k58998
38107i86994j81479r2142n876P6025J48506J92821J94298J72680J74268K16714
38097i1179K61144K65250K44392K40046K39425J80255M5230r6532j63847j41240
38087I82944o2496L9617J32290J69263J30481O2269L2843M8347M8353j2548j10485
$$ y = [227386, 238247, 253936, 228685, 129816, -28927, -200690, -331727, -377574, -317106, -164856, 33524, 222408, 355885, 408990, 386427, 325491, 283217, 312790, 445300, 681430, 988057, 1303497, 1559303, 1710973, 1756860, 1733668, 1693931, 1678128, 1692872, 1703332, 1644180, 1450649, 1103736, 662432, 243894, -50269, -199084, -253124, -267677, -257274, -209401, -117841, 6402, 138590, 242623, 285401, 263639, 205449, 130635, 18432, -168858, -433732, -727996, -986994, -1168473, -1260615, -1266491, -1190466, -1041960, -849139, -654841, -482161, -307893, -91179, 169965, 435215, 679607, 919653, 1159078, 1339333, 1384563, 1288031, 1124184, 982944, 920448, 960065, 1092355, 1261618, 1392099, 1454368, 1487211, 1535558, 1583911, 1571363, 1460878]
38076A460878j88277k20827k30053k47365k74403k81142k41729j70692j14543
38067e08153j01946j11808r9547m5984K9531R5528J35741J55808J72700J93337
38057h4793J99693J66159R8017L8227K4544N1538Q3956R1115N5859k7728j37997
38046E58590k18624k18900j45853o0032j9281l7616q9668j33252j30525p3651
38036e68812n10L1015q9m7779l2878Q6191K69885M24274M78453M36382L47358
38025A423490K38450J03645m2825j46374j71091j49118j37065j40924j17582l8380
38015H22226Q1816K08055L00646L13106K17971M5523j32680k68114l59889m14921
38005H13739m19381l65387k78517j97287j38967r7701o1690k2172J9458M3954
$$ y = [1460878, 1272601, 1051774, 821721, 574356, 299953, 18811, -222918, -393610, -508153, -610099, -721907, -821454, -867438, -837907, -742379, -606638, -450830, -278130, -84793, 114900, 281059, 379076, 417303, 441847, 493385, 577341, 668456, 724315, 696587, 558590, 339966, 121066, -24787, -84819, -104100, -141716, -231384, -364636, -495161, -568812, -569322, -538307, -538396, -586175, -619053, -532862, -262977, 161297, 639750, 1076132, 1423490, 1661940, 1765585, 1722760, 1576386, 1405295, 1256177, 1119112, 978188, 860606, 822226, 904042, 1112097, 1412743, 1725849, 1943820, 1989343, 1856663, 1588549, 1228660, 813739, 394358, 28971, -249546, -446833, -585800, -683501, -745191, -767363, -747905, -703951]
37995g03951K8291k3248p4888r1483o0297J9132J38661K62490L32505L19119K53802
37984D00133J89334J39014P8399k40o3918p6742m5122j5021k9694r4764j81249
37973C00130k57004l08892l31035l02502j99033l4394J28442K25158K42917K13641
37963c22572J65115R9327J6334o6527j33108j90595k52782l03597k97205k05180
37953a490790n4621R2630J95394K56359K92697L02280K69972J96286J03813J6005
37943A80025n9789j26891j83349k12658j89064r8561L7365J62596K21340J95979
37933g3007J10427K752r8322j74965k11139j90451j07607J5067J30410K01654
37923c95181K37274K75698L31622L75988L75300L26905K42446J24605j4306j35048
$$ y = [-703951, -675660, -698908, -773796, -865279, -925576, -906444, -767783, -505293, -172788, 146331, 400133, 589467, 728481, 806880, 806640, 742722, 665980, 620858, 605837, 576143, 481379, 300130, 43126, -265766, -596801, -899303, -1098336, -1132730, -1004288, -779130, -536213, -322572, -157457, -58130, -41796, -108323, -241431, -432026, -684808, -988405, -1285610, -1490790, -1545411, -1452781, -1257387, -1001028, -708331, -406051, -136079, 60207, 164020, 180025, 120236, -6655, -190004, -402662, -591726, -690287, -652922, -490326, -268986, -73007, 37420, 40172, -58150, -233115, -444254, -634705, -742312, -727245, -596835, -395181, -157907, 117791, 449413, 825401, 1200701, 1527606, 1770052, 1894657, 1880351, 1745303]
37913A745303k09107k60635l33666m22759m71646m39067l31957j76158L366J65330
37903g30996K58638K68874K30538J75363R5737k2465j59017k75478l51203l81765
37893h91774l63472l04918k36052j77954j14973k0640J00365K19432L19462L93682
37883a076842M18441L63182K32801P3206p2762j92323k78050l02586k41133j11813
37873a187879K3983J04283J05182M2759n0342j43410k07602k11626j35198K500
37863a657350J33244J77179J08051j3256p9880k9483R8473J98937J97633J09569
37853g56883Q282m3964k9231L7836J27109K04377K51003K76708K98917L11672
37843F85826K90807K25619J26065M499j22389k15144k31530j80583j29689j36203
$$ y = [1745303, 1536196, 1275561, 941895, 519136, 47490, -391577, -723534, -899692, -896326, -730996, -472358, -203484, 27054, 202417, 298154, 275689, 116672, -158806, -510009, -891774, -1255246, -1560164, -1796216, -1974170, -2089143, -2109783, -2009418, -1789986, -1470524, -1076842, -658401, -295219, -62418, 10788, -61974, -254297, -532347, -834933, -1076066, -1187879, -1163896, -1059613, -954431, -911672, -962014, -1105424, -1313026, -1524652, -1659850, -1657350, -1524106, -1346927, -1238876, -1252132, -1332012, -1361495, -1263022, -1064085, -866452, -756883, -748601, -792565, -821796, -783960, -656851, -452474, -201471, 75237, 374154, 685826, 976633, 1202252, 1328317, 1332816, 1210427, 995283, 763753, 583170, 453481, 317278]
37833C17278j86976k21028j97649j29105o2691m6380r5871j73377k05667j42651
37823a144117k132J45712K31756K29211J65766J09170J23174K14944L26162L83995
37813G83641L57906K68367J57825O1294r783o5776j12600j27978q5440o092M2535
37802A263899J5531o4835j50361k26159l01644l61460l60260k68152j05693O3704
37792d95430J71087J88364J49872J12762Q8781M0738m2449j05579r2166j8550
37782b570N4592R8493J18922J04607L2487p3506j40948j23396m5158L5466P5114
37771A34103N2406l3060j46494k29645k52034k39980k41655k72164k98368k66479
37761a793370j43962M7705K36061L48462L67375L30135K83077K54680K63202L13326
$$ y = [317278, 130302, -90726, -288375, -417480, -480171, -526551, -622422, -795799, -1001466, -1144117, -1146249, -1000537, -768781, -539570, -373804, -264634, -141460, 73484, 399646, 783641, 1141547, 1409914, 1567739, 1629033, 1619250, 1553474, 1440874, 1312896, 1227456, 1221364, 1263899, 1279430, 1214595, 1064234, 838075, 536431, 174971, -185289, -453441, -559134, -495430, -324343, -135979, 13893, 126655, 215436, 256174, 213725, 108146, 15980, -2570, 52022, 150515, 269437, 374044, 406531, 333025, 192077, 68681, 23523, 58989, 134103, 186509, 153449, 6955, -222690, -474724, -714704, -956359, -1228523, -1526891, -1793370, -1937332, -1889627, -1653566, -1305104, -937729, -607594, -324517, -69837, 193365, 506691]
37751E06691L72257L76149K84120J21647l6864j24456j25854q3243o0720q7258
37741A142469j30645j38924j05999q0174j07581j83894k63763l01827k80802k12648
37731f63788j19146j2088R7261J69158J49610M2668n7402n1962N1983J59834K09412
37720b4460K20202K20510J90284J09348J5698k9643j5065J7795K7156M19n5990
37709F76254j27344j91807k24142j97731q9822Q9149K66293L39366K61264P6078
37699H77558j34544l11323m17028m26884l58583k81632k52747k54503k29446j58567
37689a947699p3618r140K3051L0416N2332J57398L70373N99951O95814N98477
37679D97355L93784K02914O2943n4247j47756j70348j01213J0018R0769J16620
$$ y = [506691, 878948, 1255097, 1539217, 1660864, 1624000, 1499544, 1373690, 1290447, 1229727, 1142469, 1011824, 872900, 766901, 686727, 579146, 395252, 131489, -170338, -451140, -663788, -782934, -795022, -697761, -528603, -378993, -336325, -393727, -445689, -393706, -233872, -24460, 195742, 416252, 606536, 715884, 731582, 701939, 686874, 704669, 731825, 732244, 676254, 548910, 357103, 132961, -64770, -154592, -65443, 200850, 540216, 801480, 877558, 743014, 431691, 14663, -412221, -770804, -1052436, -1305183, -1559686, -1789132, -1947699, -2021317, -2030457, -2007406, -1976990, -1924658, -1767260, -1396887, -796936, -101122, 497355, 891139, 1094053, 1156996, 1102749, 954993, 784645, 683432, 693450, 784219, 900839]
37669I00839J18954J32652J53645J49477R9006J2591q0907j54555j91497j88933
37659I51272j63391j41141j30783j11854o4249o351J0817m6746j57309k58288
37649a18023l00870k91078k74325k76390k70033k15679j26236n9956m1765k5334
37639a999689M3588J50950K28981K27362J41906j976j46762j95624p1646J88423
37629a434487M34604N27018M46180K76538J16474K7644L6937J35899K72246L70818
37619A209871L77965K86299J30252k7577j23083j38311j27186j67417k74750l82641
37609G63422m18097l80390l27654k98116k68076j88612m6003J21040K53565L16014
37599d72907L17705K99865K96905L03507K82881K12422J16297M5448K8191M7840
$$ y = [900839, 1019793, 1152445, 1306090, 1455567, 1554573, 1567164, 1486257, 1331702, 1140205, 951272, 787881, 646740, 515957, 404103, 339854, 333503, 344320, 297574, 140265, -118023, -418893, -709971, -984296, -1260686, -1530719, -1746398, -1872634, -1932590, -1974355, -1999689, -1956101, -1805151, -1576170, -1348808, -1206902, -1208878, -1355640, -1551264, -1622910, -1434487, -999883, -472865, -26685, 249853, 366327, 393971, 430908, 566807, 839053, 1209871, 1587836, 1874135, 2004387, 1976810, 1853727, 1715416, 1588230, 1420813, 1146063, 763422, 345325, -35065, -362719, -660835, -928911, -1117523, -1163526, -1042486, -788921, -472907, -155202, 144663, 441568, 745075, 1027956, 1240378, 1356675, 1402123, 1430314, 1478154]
37589A478154O5200N1971L014o7886j32879j57947j22630m1708L4054M8667j4352
37578A143658j10662j64443j30579l1587O9136J27458J48054J62482J91965K30491
37568A635973K49045K11867J03472m7495j76320k26649j94069j29297r8563j31094
37558A196870j92250k09215j35810M170J42673K29693K56372K26515J38641Q424
37548A666083j19590k09879k73948l44543m13742m20051l08235r5569J26657K58063
37538a34754K61205J77909P9294L452n7112j19675j81896k25266k26031j59955
37528e82829k3126J37399K35781K13497Q6451q2230k36832l41327l64896k94512
37518a252624j60307j9710Q9001J61928K03803K10394J79014J18302M4230k2392
$$ y = [1478154, 1543354, 1595325, 1598339, 1530453, 1397574, 1239627, 1116997, 1075289, 1109343, 1158010, 1143658, 1032996, 868553, 737974, 706387, 775523, 902981, 1051035, 1213517, 1405482, 1635973, 1885018, 2096885, 2200357, 2152862, 1976542, 1749893, 1555824, 1426527, 1327964, 1196870, 1004620, 795405, 659595, 663765, 806438, 1036131, 1292503, 1519018, 1657659, 1666083, 1546493, 1336614, 1062666, 718123, 304381, -115670, -423905, -519474, -392817, -134754, 126451, 304360, 383654, 387106, 329994, 210319, 28423, -196843, -422874, -582829, -605955, -468556, -232775, -19278, 67173, -15057, -251889, -593216, -958112, -1252624, -1412931, -1432641, -1343640, -1181712, -977909, -767515, -588501, -470199, -425969, -448361]
37508d48361o0243o6731o6149p6297p3472k2145N7936R0833L1737o7205j03464
37497h03561k9231J05743K09119K28864J85839J41723J44026J98255K79619L53392
37487A013788L80130L26782K02844P8463L1106O1925Q9841M5337m7944j03551
37477B078721p1568J0719N8983J4505j16817k73282l76655l80367l01379k10680
37467D32180j79753k18551k62716k36085j34092l1042O676n913j0897L07j9891
37456f59777q7121j40834j16101k5766O2154J04956J09322R6726Q8246J13029
37446d55166J81741K43190K11278N9314j36387k63825k65974j56139J8242J92520
37436c71206K90656K66000J46994J5806o5608q8710o2119J7674J38322K45244
$$ y = [-448361, -508604, -575335, -641484, -717781, -791253, -813398, -755462, -664629, -632892, -700097, -803561, -832792, -727049, -517930, -289066, -103227, 38496, 182522, 380777, 660396, 1013788, 1393918, 1720700, 1923544, 2002007, 2033113, 2095038, 2184879, 2230216, 2182272, 2078721, 2007153, 2017872, 2076855, 2091360, 1974543, 1701261, 1324606, 944239, 642860, 432180, 252427, 33876, -228840, -464925, -599017, -630059, -623383, -629296, -640193, -639886, -659777, -746898, -887732, -1003833, -1029599, -967445, -862489, -753167, -656441, -568195, -455166, -273425, -30235, 181043, 240357, 103970, -159855, -425829, -581968, -563726, -371206, -80550, 185450, 332444, 348250, 282642, 193932, 131813, 149487, 287809, 533053]
37426E33053K80388K39287J60654O6126n3819j89925k90577l13694k76949k25654
37416g1110j67957q1865J4922M7617l4960j81118k68245k19238p8482K7746L249
37405a009441j35984k78013l12687k22112p9476L6088J12011J87083K82022L66213
37395a054296L91761L42374K43485J38334O2530K9990K8689L2016K5194K2267
37385B62344N0024J13890J85606K25281K08472J31170K855j50495k81823l43116
37375D04208l23834k62473k06903j63462r5608K5065J77483L07568L77636L88275
37365F27955L56277K89407J92264Q4238q209q0854j59287k64269l70951m13119
37355B53452l36234j49677P2657K45073L29087L48423L53279L73567M02620M13433
$$ y = [533053, 813441, 1052728, 1213382, 1279508, 1225689, 1035764, 745187, 431493, 154544, -71110, -239067, -320932, -306010, -258393, -293353, -474471, -742716, -961954, -1040436, -1012690, -1009441, -1145425, -1423438, -1736125, -1958237, -2037713, -2001625, -1889614, -1702531, -1420509, -1054296, -662535, -320161, -76676, 61658, 124188, 154178, 182867, 214883, 240077, 262344, 312368, 426258, 611864, 837145, 1045617, 1176787, 1179642, 1029147, 747324, 404208, 80374, -182099, -389002, -552464, -648072, -623007, -445524, -137956, 239680, 627955, 984232, 1273639, 1465903, 1550141, 1541932, 1461078, 1301791, 1037522, 666571, 253452, -82782, -232459, -159802, 85271, 414358, 762781, 1116060, 1489627, 1892247, 2305680]
37345B305680L81107K95737J67501K1288j22292k58959l82383m58599m43759l37824
37335A167497k00321r6882m4546k1623p239J3343N8399J23603J56143J01761j4659
37324A235476r5686p5055J4879R2782J13568Q7469M8753L3714O2559J09102J05487
37313A733048J1244j29041k21686k10968j14823N060Q0497O5547k7666j23403
37303A067809j49064j12060q3346j07558j62072k02681k07502j65752o6931P1488
37293a17669J93963K53787K53968K19463J46550R941j82980l67987m61022m16899
37283d68885k61279p5040O1057J19724J26875J10694O7132j5439j15887j87396
37273f38444k01605j68358j10779l5835O3130J81762K90725L48723L30276K42348
$$ y = [2305680, 2686787, 2982524, 3150025, 3171313, 3049021, 2790062, 2407679, 1949080, 1505321, 1167497, 967176, 870294, 825748, 804125, 796886, 810229, 868628, 992231, 1148374, 1250135, 1235476, 1139790, 1064735, 1079614, 1172396, 1285964, 1373433, 1422186, 1455900, 1518459, 1627561, 1733048, 1744292, 1615251, 1393565, 1182597, 1067774, 1072834, 1153331, 1218878, 1191212, 1067809, 918745, 806685, 723339, 615781, 453709, 251028, 43526, -122226, -189157, -117669, 76294, 330081, 584049, 803512, 950062, 960003, 777023, 409036, -51986, -468885, -730164, -805204, -744147, -624423, -497548, -386854, -319722, -335161, -451048, -638444, -840049, -1008407, -1119186, -1155021, -1091891, -910129, -619404, -270681, 59595, 301943]
37263C01943J17387m241q6212j07042p5004k6880M987K3511N0601Q5991J07150
37252C92191J12615J35558J97821K72300L11632K99452K53613J92936J24547N4741
37242B347406j2767q4112j54746j85270j31686j0729R4167J14141O5053J6193
37232B057650N497J4610J8896K2381L0193J9541l1843j02746j44221j36089j03412
37221A650457p7718o8794p8228j08608j41939j35507o5650L7801J21516J58381
37211A291711J45737P4203o3233k32928l67012m20541m05437l65489l34572l16254
37201i93815k83017j98966o8094M4253O8792J0947n9538r4930j03612r6406n7111
37190a831497P583M3162J8695j3954J6068J00096J68101J89209J97446K21250
$$ y = [301943, 419330, 415089, 328877, 221835, 146831, 119951, 124938, 148449, 199050, 285041, 392191, 504806, 640364, 838185, 1110485, 1422117, 1721569, 1975182, 2168118, 2292665, 2347406, 2334639, 2250527, 2095781, 1910511, 1778825, 1768096, 1862263, 1976404, 2041457, 2057650, 2063147, 2077757, 2096653, 2119034, 2149227, 2168768, 2136925, 2034179, 1889958, 1753869, 1650457, 1572739, 1503945, 1425717, 1317109, 1175170, 1039663, 974013, 1011814, 1133330, 1291711, 1437448, 1511651, 1448418, 1215490, 848478, 427937, 22500, -342989, -677561, -993815, -1276832, -1475798, -1543892, -1499639, -1430847, -1419900, -1479438, -1574368, -1677980, -1774386, -1831497, -1823914, -1780752, -1762057, -1776011, -1759943, -1659847, -1491746, -1302537, -1105091, -883841]
37180h83841K44816K51140K54089K66292K73070K61141K41864K21906J78897R5426
37170A404800j882o7358r0371r9213j17726j42073j57468j54696j27245p1805
37160C74963J047P0729J29173J88719K57915L16188L23854K58119J33736j1976
37150B042467j48423k62965l46992l78901l28732j86506J0798J85247K63478K27917
37140A077388J25601K4447l7988o4149o9566o3322n2577m4622l2850M452P2286
37129I39100J31269J25124M7053l3529k8572Q0526K21013K99078K83759K15345
37119B280166J46017R7206P2657P6630R4978Q3011Q598j00053j83139k23621k57278
37108B095172l03203l22135k63331j27432L3554J54447J81911R5724o4666k15799
$$ y = [-883841, -639025, -387885, -133796, 132496, 405566, 666707, 908571, 1130477, 1309374, 1404800, 1402918, 1335560, 1245189, 1145976, 1028250, 886177, 728709, 574013, 446768, 374963, 376010, 446739, 575912, 764631, 1022546, 1338734, 1662588, 1920707, 2054443, 2042467, 1894044, 1631079, 1284087, 905186, 576454, 389948, 400746, 585993, 849471, 1077388, 1202989, 1227436, 1189448, 1125299, 1055733, 992411, 939834, 895212, 862362, 866814, 939100, 1070369, 1195493, 1242546, 1209017, 1180445, 1260971, 1481984, 1781062, 2064821, 2280166, 2426183, 2523389, 2596046, 2672676, 2767654, 2850665, 2859263, 2759210, 2576071, 2352450, 2095172, 1791969, 1469834, 1206503, 1079071, 1112625, 1267072, 1448983, 1544707, 1480041, 1264242]
37098A264242l00320l27042l25197k91462k15244j23813n1810J5420J12318K15054
37088b7854K53377K06395J28406O3366p646j02697j75759j66869q7364j0629N654
37077G8380m6354j46245k56608l22253l03885k20374j30110o8371k7508N528K7612
37066a410188M3644Q0155J53678K40568K95796K98368K71603K60610K87906L27865
37056H50005L34856L05079K90932L29364L72879L32453J88285J5889j06199j70141
37046B743402k02260k03519j69501j34312j37565j59967j44980q3646k6356k925
37036A478371J3935M1235L4015n2025j77727k55331k55693k27736k08184j68878
37026B21982q2146O474K2476l4482q0886n1212K8317Q5472R0686P1955O1632O4431
$$ y = [1264242, 963922, 636880, 311683, 20221, -195023, -318836, -370646, -355226, -242908, -27854, 225523, 431918, 560324, 623690, 616044, 513347, 337588, 170719, 83355, 72726, 78380, 32026, -114219, -370827, -693080, -996965, -1217339, -1347449, -1415820, -1443328, -1437800, -1410188, -1366544, -1286389, -1132711, -892143, -596347, -297979, -26376, 234234, 522140, 850005, 1184861, 1489940, 1780872, 2110236, 2483115, 2815568, 3003853, 3019742, 2913543, 2743402, 2541142, 2337623, 2168122, 2033810, 1896245, 1736278, 1591298, 1507652, 1481296, 1478371, 1492306, 1533541, 1567556, 1515531, 1337804, 1082473, 826780, 599044, 390860, 221982, 139836, 146310, 168786, 134304, 53418, 2206, 30523, 115995, 206681, 278636, 340268, 404699]
37014D04699P3397Q3106Q0929N5682K7157L9070J02755J69280J79598J24556L2949
37003A373178p6578j92871k72812k54507j28890K8540J16822R0666j9062j45285
36993E19201k36098k81461k97653k83403k08242o9460N5960O5237n4360k02161
36983i92440k68442k24582j01399O4854K29380L30350L37122K84020K16699J34100
36973I662K8660n0601m3368K4771N7444O016q2798j45577j72628j82218j74819
36962g25456j42210r0788l5618M001j914o5610j35038j20781M693J67280K72107
36951h69334K91654K55201J93015J24841P0539L2508j1938o7850r2089l8665Q0574
36940c1544K09208L03126L45796L28109K53281J54851P5560K8255j42j4956r898
$$ y = [404699, 478096, 561202, 642131, 697813, 724970, 764040, 866795, 1036075, 1215673, 1340229, 1373178, 1296600, 1103729, 830917, 576410, 447520, 476060, 592882, 683548, 664486, 519201, 283103, 1642, -296011, -579414, -787656, -857116, -801156, -735919, -790279, -992440, -1260882, -1485464, -1586863, -1522009, -1292629, -962279, -625157, -341137, -124438, 9662, 38322, -12279, -55647, -30876, 26568, 32584, -50214, -195791, -368419, -550637, -725456, -867666, -958454, -994072, -990071, -991985, -1057595, -1192633, -1313414, -1308721, -1141441, -869334, -577680, -322479, -129464, -4623, 65916, 98424, 86486, 18636, -73453, -112118, -31544, 177664, 480790, 826586, 1154695, 1407976, 1562827, 1638387, 1666642, 1666500, 1651544, 1641646]
36929A641646J0791L2539M7427N0254L1280K136J6905J26477L05397M54054M85646
36918C204552L96115K48394J09276O864o7595j26607j55768j27368n2062O326
36908C442127m585n9360q5038n0815P260M8211O9342P2934K9322r0659k57085
36897C121654l83655l97511l02936j78467j13073j37080k05394k42150j99816
36888I61572q4962N1129J38804J31404M7267l6909n6705k0408J7777L4044N6596
36877A239609J12774J83585K19852J85350Q0014n9096j72696k15506j92272j49855
36867A231759j28104j27684j27009j13205q6473m7357L490N2688P3053M8139M570
36856G83867Q947J07252K59484L60587L48458K72510K28313K41322K52575K11230
$$ y = [1641646, 1652437, 1684976, 1732403, 1782657, 1813937, 1816073, 1832978, 1959455, 2264852, 2718906, 3204552, 3600667, 3849061, 3958337, 3965201, 3897606, 3770999, 3615231, 3487863, 3435801, 3442127, 3437542, 3378182, 3293144, 3242329, 3249589, 3297800, 3367142, 3440076, 3469398, 3378739, 3121654, 2737999, 2340488, 2037552, 1859085, 1746012, 1608932, 1403538, 1161388, 961572, 876610, 927739, 1066543, 1197947, 1245214, 1208305, 1151600, 1131192, 1148969, 1183013, 1239609, 1352383, 1535968, 1755820, 1941170, 2021184, 1962088, 1789392, 1573886, 1381614, 1231759, 1103655, 975971, 848962, 735757, 649284, 601927, 605417, 658105, 731158, 779297, 783867, 792814, 900066, 1159550, 1520137, 1868595, 2141105, 2369418, 2610740, 2863315, 3074545]
36846C074545J35091P0389L4693K4662M9829J25806K43855L67252M49061M43035
36836E018218L20337J05164j16044k54534k96540l01244l16728l21140k64093
36827C573396j49019m4043n686j5044p284M7857J17884J57627J61645J53718J41290
36816D132341J02249J7518r4693j81559j93799j27981l3316L1926N4906P1011
36806C778603J09313J47430J30001K7178j27948k54847k86090k33224j91024k48508
36796B850884l88256n01243n10000m42021l65517k97908k17070j25839m6458L5594
36786g834J61949L25548M47900M49195L18307J13240p6926j72190j47313n5571
36776A356305K0180N0933O9070Q8505O2596n0074k12590l43265m06218m29222
$$ y = [3074545, 3209636, 3280025, 3314718, 3339380, 3389209, 3515015, 3758870, 4126122, 4575183, 5018218, 5338555, 5443719, 5327675, 5073141, 4776601, 4475357, 4158629, 3837489, 3573396, 3424377, 3380334, 3374648, 3359604, 3352320, 3400177, 3518061, 3675688, 3837333, 3991051, 4132341, 4234590, 4252108, 4157415, 3975856, 3782057, 3654076, 3620760, 3652686, 3707592, 3778603, 3887916, 4035346, 4165347, 4192525, 4064577, 3809730, 3523640, 3290416, 3099392, 2850884, 2462628, 1961385, 1451385, 1009364, 643847, 345939, 128869, 3030, -43428, -7834, 154115, 479663, 927563, 1376758, 1695065, 1808305, 1731379, 1559189, 1411876, 1356305, 1376485, 1427418, 1496488, 1584993, 1647589, 1597515, 1384925, 1041660, 635442, 206220]
36766B06220m37357m11719l28794k09101r6937k558J05315K44045L80863M72197
36756g7826N22061N68946O14441N97775M58638K06398q7388l45687n16944n71308
36746A369106n03002l43899j57573o899Q0900J27947J81898K60650L22469L17429
36736A649026K69058K64011L42890M40646M63900L91845K66268J18270m4925k02361
36726C958628l21075l88866m07503l68469k77345j83961j33716r5564O329J85410
36716A973868L64868M60274M44597L32649J60747k358q2679p5397n8409j01810
36706C416350j88076k43522k24605j51627p7892m7641p0636j18558j49049j39725
36696B005019r8783n3656m0699q7156j76538k44480k38337j69865q1878J2931
$$ y = [206220, -231137, -642856, -971650, -1180751, -1277688, -1280246, -1174931, -930886, -550023, -77826, 444235, 1013181, 1627622, 2225397, 2684035, 2890433, 2803045, 2457358, 1940414, 1369106, 866104, 522205, 364632, 357733, 438633, 566580, 748478, 1009128, 1331597, 1649026, 1918084, 2182095, 2524985, 2965631, 3429531, 3821376, 4087644, 4205914, 4160989, 3958628, 3637553, 3248687, 2841184, 2472715, 2195370, 2011409, 1877693, 1782129, 1788458, 1973868, 2338736, 2799010, 3243607, 3576256, 3737003, 3734645, 3651966, 3576569, 3518160, 3416350, 3228274, 2984752, 2760147, 2608520, 2530628, 2482987, 2412351, 2293793, 2144744, 2005019, 1906236, 1852580, 1811881, 1724725, 1548187, 1303707, 1065370, 895505, 813627, 826558]
36686H26558J13759J74368J33852J1317r3855j18476j01255j07875j38414j43298
36676E56681r6016j4204P0603J35838J74444J99068K32526K87386L63551M56532
36666B366409N43565N72927N08332L86278K89719K58095K60030K57019K46924
36657E689298K32682J97590J36661P2471J3711o5146j71635k53307k45866j51354
36647E455105m0946J4716J542m5276q9398j29054j82056k39446k58145k15447
36637D271595j45310r0654l9653N2865J91852L25536L95052L72710K66712J19550
36627E720255j4068j14184j94278k32378j62982P210J38497J05489l0369r4220
36617E128972k3613Q1635J27592J35731J70097K51839L68916M86813N29394M30005
$$ y = [826558, 940317, 1114685, 1248537, 1259854, 1165999, 1047523, 946268, 838393, 699979, 556681, 460665, 446461, 517064, 652902, 827346, 1026414, 1258940, 1546326, 1909877, 2366409, 2909974, 3482901, 3991233, 4377511, 4667230, 4925325, 5185355, 5442374, 5689298, 5921980, 6119570, 6256231, 6328702, 6342413, 6277267, 6105632, 5852325, 5606459, 5455105, 5414159, 5428875, 5430417, 5385141, 5295743, 5166689, 4984633, 4745187, 4487042, 4271595, 4126285, 4035631, 3995978, 4048843, 4240695, 4566231, 4961283, 5333993, 5600705, 5720255, 5706187, 5592003, 5397725, 5165347, 5002365, 5009575, 5148072, 5253561, 5223192, 5128972, 5105359, 5186994, 5314586, 5450317, 5620414, 5872253, 6241169, 6727982, 7257376, 7687381]
36607G687381K24055K1484j19441k14348k56404k04200q2686R713K7028J6527
36597G109109R336k7414r4926j23625p8998j6535J5722M3510R1419J29755J46463
36586G203816J92170L03049M44708N64372O26647N80308L85876J10599r3836j43382
36576A0174327p4926N6934K29398L87422M56247M48114M41871M40836L82647L00614
36566A3243484L12327M14718M63005M05054L62750M17302M92345N29408O04547
36557A7244940P80502J005208J237872J508571J780644J940384K003456K137727
36549B9639304K402453K673826K907443L242039L755957M370103N078974N999589
36541F0069688P102236Q211925R383792J0931714J2988166J5438301J8362161
$$ y = [7687381, 7911436, 7932920, 7813479, 7599131, 7342727, 7138527, 7055841, 7065554, 7092582, 7109109, 7118445, 7091031, 6996105, 6872480, 6793482, 6776947, 6792669, 6836179, 6927598, 7057353, 7203816, 7395986, 7699035, 8143743, 8708115, 9334762, 9915070, 10300946, 10411545, 10317709, 10174327, 10099401, 10156335, 10385733, 10773155, 11229402, 11677516, 12119387, 12560223, 12942870, 13243484, 13555811, 13970529, 14433534, 14838588, 15201338, 15618640, 16110985, 16640393, 17244940, 18025442, 19030650, 20268522, 21777093, 23557737, 25498121, 27501577, 29639304, 32041757, 34715583, 37623026, 40865065, 44621022, 48991125, 54070099, 60069688, 67171924, 75383849, 84767641, 95699355, 108687521, 124125822, 142487983]
36534A42487983K2008290K6218672L0509256L4676582L8040282L7579618K8660922
36527C60181605R797917j3630822l2401066m0815676m0237124l5616154l0399024
36520A76879656k5432649k0852935j7023831j3980669j1367023r088100p332295
36513G1802154o018045m829563l722263k877436k249871j610772r31008l21020
36505D9242176K83618J015813J809843K575418L457165M602552N886987P185293
36497G6058865Q670385J0532228J2691735J5101044J7962670K1322838K4878937
36490A87218702K8412080L1487124L2011892K6305963J2543973n787701k1463031
36483B90729002k9270949k9551775k6103593k2092372j8704186j6288199j5011940
$$ y = [142487983, 164496273, 190714945, 221224201, 255900783, 293941065, 331520683, 360181605, 369979522, 356348700, 323947634, 283131958, 242894834, 207278680, 176879656, 151447007, 130594072, 113570241, 99589572, 88222549, 79134449, 71802154, 65784109, 60954546, 57232283, 54354847, 52104976, 50494204, 49563196, 49242176, 49525794, 50541607, 52351450, 54926868, 58384033, 62986585, 68873572, 76058865, 84729250, 95261478, 107953213, 123054257, 141016927, 162339765, 187218702, 215630782, 247117906, 279129798, 305435761, 317979734, 312192033, 290729002, 261458053, 231906278, 205802685, 183710313, 165006127, 148717928, 133705988]
36476A33705988j4480567j3887309j2838240j1534365j0178248q734074p264030
36469E4789155o001494n017437m175441l446556k947143k647520k342335j946352
36461B6264877j577445j330245j181960j118282j143934j169761j080572r12816
36453A6749862p97095p43600o49575m94393l60707k80597k15372j66269j55798
36444A2886456j22625J8613K31830M06944N24566O43669P65671Q55521R66154
36435A7176799J189130J494145J759538J954644K150982K341131K366751K047459
36427C2480579J305512J95255j076483k176420k821242k965864k768718k405241
36419A9767378j988608j609119j316511j071331q18603n96980m81071m46819m08124
$$ y = [133705988, 119225421, 105338112, 92499872, 80965507, 70787259, 62053185, 54789155, 48787661, 43770224, 39594783, 36148227, 33201084, 30553564, 28211229, 26264877, 24687432, 23357187, 22175227, 21056945, 19913011, 18743250, 17662678, 16749862, 15952767, 15209167, 14559592, 14065199, 13704492, 13423895, 13208523, 13042254, 12886456, 12763831, 12782444, 13014274, 13421218, 13945784, 14589453, 15355124, 16210645, 17176799, 18365929, 19860074, 21619612, 23574256, 25725238, 28066369, 30433120, 32480579, 33786091, 33981346, 32904863, 30728443, 27907201, 24941337, 22172619, 19767378, 17778770, 16169651, 14853140, 13781809, 12963206, 12366226, 11885155, 11438336, 11030212]
36410A1030212l63727l81715m44555m40951l33615k23425k14081l00182m12798
36401G915163m93559n00805m20467l01546k22545k01069j81604j17164j8401O8791
36391E526794Q2999l5805k79496n26370o27383n43192l54727j59976j6258M3947
36381C110533J9518l8105o9715o9645n8791k8294K6305M7885k2804j44804k11493
36370B560590j81106j06364m6846j8129j2093m98O1270J64324K08400J16096m0420
36359B705224j17695q3817k4130J4325O3284J15587R4470k2863j54343k28216
36349B361826k62340k91655l04412k95445l00737l25323l07319k10030r0766k2838
36339d9039o31K3475N3838O2009N0212M8589O5444Q2225Q6067P6591N3792K5918
$$ y = [11030212, 10666485, 10284770, 9840215, 9399264, 9065649, 8842224, 8628143, 8327961, 7915163, 7421604, 6920799, 6500332, 6198786, 5976241, 5775172, 5593568, 5476404, 5458003, 5526794, 5609793, 5573988, 5294492, 4768122, 4140739, 3597547, 3242820, 3082844, 3066586, 3110533, 3130051, 3091946, 3022231, 2952586, 2893795, 2865501, 2891806, 2939691, 2916887, 2772083, 2560590, 2379484, 2273120, 2226274, 2208145, 2196052, 2195554, 2256824, 2421148, 2629548, 2745644, 2705224, 2587529, 2503712, 2479582, 2493907, 2557191, 2672778, 2767248, 2744385, 2590042, 2361826, 2099486, 1807831, 1503419, 1207974, 907237, 581914, 274595, 64565, -26201, -49039, -49670, -26195, 27643, 89652, 139864, 188453, 253897, 336122, 422189, 498780, 552572, 578490]
36327E78490J9341N9351J43745K38179K85504K27313M9313j85572l75212m60946
36317E79506m58436m11643l45220k64909j75179q2690O308Q9931J74642K57457
36307f30233K97131K40020J00426k6433p3943q7642j46716k41880l01384l06969
36297a177623k99183k83112k22025j29574p7387q7620r5566m8003L0220R9221
36287b290652J69466K66064L79230M85741N76574O35499O34815N80427N18009
36278A955173M66028L82755K27899K2022j76962l20178l74666l30410k26721j32568
36268A492372p6781l2717J5604M4076M7581O9806J32420J81809J56418P5396J2923
36257B118907N938K8228L7669J0565n8426j54503k42309k88016k79873k24545
$$ y = [578490, 597831, 657182, 800927, 1039106, 1324610, 1551923, 1601236, 1415664, 1040452, 579506, 121070, -290573, -635793, -900702, -1075881, -1158571, -1152263, -1062332, -887690, -630233, -333102, -93082, 7344, -19089, -93032, -180674, -327390, -569270, -870654, -1177623, -1476806, -1759918, -1981943, -2111517, -2188904, -2276524, -2372090, -2420093, -2389873, -2290652, -2121186, -1855122, -1475892, -990151, -413577, 221922, 856737, 1437164, 1955173, 2421201, 2803956, 3031855, 3053877, 2876915, 2556737, 2182071, 1851661, 1624940, 1492372, 1415591, 1382874, 1398478, 1442554, 1490135, 1559941, 1692361, 1874170, 2030588, 2105984, 2118907, 2124845, 2153073, 2190742, 2201307, 2142881, 1988378, 1746069, 1458053, 1178180, 953635]
36247I53635j44296q3442q3028j26939j40994p3201M2280J21962J16531L9240
36237F21748o8535j73233k56415l05045l00606k25733r3349M2545J30660J70606
36227d57357J91128J93967J62399J18240J11791J39817J25988J2216j65595l15452
36217A17142l69894l13148j73146k0014O0763L4002n5718j36371j71340j60916
36207a188640j15782n5379r237P358J0861L3232R9613K14658L39086L85123K86536
36196G429Q9955o6757q9273o068R6459J66532J91251J65793J07319O6707Q1066
36185H10413J32655J82987K19986K42770K34940J93294J53922J43784J25373L4539
36175B474663j35198l20843m50521m83792m09455k50051p1853M4515N8111j3533
$$ y = [953635, 809339, 725897, 642869, 515930, 374936, 301735, 344015, 465977, 582508, 621748, 553213, 379980, 123565, -181480, -482086, -707819, -801168, -758623, -627963, -457357, -266229, -72262, 90137, 208377, 320168, 459985, 585973, 598189, 432594, 117142, -252752, -565900, -739046, -759060, -698297, -664295, -720013, -856384, -1027724, -1188640, -1304422, -1359801, -1369038, -1361680, -1350819, -1317587, -1217974, -1003316, -664230, -279107, 7429, 97384, 30627, -58646, -64714, 31745, 198277, 389528, 555321, 662640, 729347, 810413, 943068, 1126055, 1346041, 1588811, 1823751, 2017045, 2170967, 2314751, 2440124, 2474663, 2339465, 2018622, 1568101, 1084309, 674854, 424803, 352950, 397465, 455576, 442043]
36165D42043j18388j99000k17910j84171j48782j51393j77555j87025j71760j58741
36155a272682j61614j61482j45079j39059j84210k74489l36662k90193j34348
36146c099818M0701J45128J76324J91959K14715K05238J29434J2415q5943j20101
36136b189948p8270J4805J06265J56409J77207K00234K10884J61874N8427k5448
36126a207561l9159j5833j0935k4450k2069k3J3554M232j3618j6084J3821P1131
36114a246994J16469J02010K5633o1408j09403j06562n7592L3587J44146K31826
36104i28288K72444K70638K30457J56767Q8606P4851J01288R8217L9812k2454
36094C82338m4770l8567k439J11936L06343M73420M98205L80072J96913k334k02750
$$ y = [442043, 323655, 124655, -93255, -277426, -426208, -577601, -755156, -942181, -1113941, -1272682, -1434296, -1595778, -1740857, -1879916, -2064126, -2338615, -2675277, -2965470, -3099818, -3059117, -2913989, -2737665, -2545706, -2330991, -2125753, -1996319, -1983904, -2069847, -2189948, -2268218, -2253413, -2147148, -1990739, -1813532, -1613298, -1402414, -1240540, -1182113, -1207561, -1246720, -1262553, -1273488, -1297938, -1320007, -1320030, -1306476, -1302244, -1315862, -1331946, -1318125, -1246994, -1130525, -1028515, -1002882, -1064290, -1173693, -1280255, -1337847, -1304260, -1160114, -928288, -655844, -385206, -154749, 2018, 90624, 165475, 266763, 364980, 404792, 382338, 337568, 299001, 296562, 408498, 714841, 1188261, 1686466, 2066538, 2263451, 2261117, 2058367]
36083B058367l67097m55081m78831m75391m43235l62311k53504j60614r3358m0850
36073a071905j7334m0100q5065j16015j31645j34378r1214J0442J05201J24141
36063a447872R9894J18282J85165K24344J96212J34190O7135q425p1448p4423
36053e76946j7240M6307R2097J47575K11747K23681J44325J6772q5618j29135
36043G3565j19306p8937n0012p2088j31390j67865j54134j28769j27360j19864
36033a076160n1633P7015K04313K68749K54908J85606Q8039k7181j55984k74830
36023e07158l37811l08793j90480k2177J34840K15051J91180J14161P4198R9446
36013e37543J24726P9908k7983j39837k04761j89592q3287O6847J70477J89523
$$ y = [2058367, 1691270, 1236189, 757358, 281967, -161268, -523579, -777083, -937697, -1031055, -1071905, -1089239, -1129339, -1214404, -1330419, -1462064, -1596442, -1687656, -1677214, -1572013, -1447872, -1347978, -1229696, -1044531, -820187, -623975, -489785, -422650, -431075, -502523, -576946, -594186, -547879, -455782, -308207, -96460, 127221, 271546, 288318, 202700, 73565, -45741, -124678, -174690, -246778, -378168, -546033, -700167, -828936, -956296, -1076160, -1127793, -1050778, -846465, -577716, -322808, -137202, -49163, -76344, -232328, -507158, -844969, -1153762, -1344242, -1366419, -1231579, -1016528, -825348, -711187, -636989, -537543, -412817, -332909, -360892, -500729, -705490, -895082, -978369, -911522, -741045, -551522]
36003e51522J77891J95360K37469K84205L43380L93189L61715K36398J21770J08491
35993A908346J54131J76036J83169K14795K27710J69133R8629J02921J35660P6842
35983C447372q1789k34970l07304k75343j05247J78402M07770M26972L11625K74299
35973D041787L77170N05736N96104O93444P93233Q25552Q12859Q60971R85909
35964A0492765J128802J329018J679550K129622K559911L033226L716806M587136
35956C0656836N513185O599808Q081741R895202J1781419J3733836J5611639J6142801
35948A18016467J3290184O477696j943885q290034j0580602r563230p096468m366953
35940I5943175j664139R83675L341249M692649L912237M05183m749794r155858
$$ y = [-551522, -373631, -178271, 59198, 343403, 686783, 1079972, 1441687, 1678085, 1799855, 1908346, 2062477, 2238513, 2421682, 2636477, 2864187, 3033320, 3131949, 3234870, 3370530, 3447372, 3365583, 3130613, 2823309, 2547966, 2442719, 2621121, 3028891, 3455863, 3767488, 4041787, 4418957, 4924693, 5520797, 6214241, 7007474, 7833026, 8645885, 9506856, 10492765, 11621567, 12950585, 14630135, 16759757, 19319668, 22352894, 26069700, 30656836, 36170021, 42769829, 50851570, 60746772, 72528191, 86262027, 101873666, 118016467, 131306651, 137784347, 135840462, 127550428, 116969826, 107406596, 100310128, 95943175, 94279036, 95262711, 98603960, 103296609, 107208846, 107614029, 102864235, 93708377]
35932I3708377j1051287j0649892r348703q105982p012512n977354n098851m395357
35924C2068439l713872l020300k463580k101554j825849j585887j445909j389455
35916A4522033j285591j088680q87134p24121n39410l15440j22318R377J14118
35907I682834J68121Q8308j09173k79942l22760k74038k07567j52531j40710k22079
35897H230463l81455n20596n65453n32319m71675m13973l82474l88513l98213
35888D175792l64660k99139k52435k32357k05959j71360j51669j29820p4925k6059
35878B267409n6568j52421k20484k28059k38944k91738l36953l25966k77260k19242
35868h0226j44950n8855M958M7828J18562K20924K75699K18546P8851p5580k12261
$$ y = [93708377, 82657090, 72007198, 62658495, 54552513, 47540001, 41562647, 36463796, 32068439, 28354567, 25334267, 22870687, 20769133, 18943284, 17357397, 15911488, 14522033, 13236442, 12147762, 11260628, 10536507, 9997097, 9681657, 9559339, 9568716, 9682834, 9850955, 9939263, 9830090, 9550148, 9227388, 8953350, 8745783, 8593252, 8452542, 8230463, 7849008, 7328412, 6762959, 6230640, 5758965, 5344992, 4962518, 4574005, 4175792, 3811132, 3511993, 3259558, 3027201, 2821242, 2649882, 2498213, 2368393, 2293468, 2267409, 2210841, 2058420, 1837936, 1609877, 1370933, 1079195, 742242, 416276, 139016, -80226, -225176, -284031, -279073, -231245, -112683, 108241, 383940, 602486, 681337, 605757, 393496]
35857C93496l13933l48939l15288k66936k45458k22966j55853n8500J8461N1833
35847a464083N2466M1763N6543J42992L04252M73361N66979N49723M37673K77752
35837A439421J39916P9952P5279L4915r3495k56170l54589l39044k26050p6524
35827D23611J5840k2737j53898k35419j75146l5744O4765J06487J50400K08015
35817C46174K20148J60094P7611K7422J5949L3566Q4432J61746K32625K67460
35807A627227K58486K04995J13550J8729l1895k5930O469L7471O3780Q1387P6269
35796B430538N5363N5089R7638J58211J91412J75485J21781N8404J2745p464k3591
35785C325611o0906j12404j50223j73888k12579k65630k77015j99901o4017N4921
$$ y = [393496, 79563, -269376, -584664, -851600, -1097058, -1320024, -1475877, -1534377, -1515916, -1464083, -1411617, -1369854, -1313311, -1170319, -866067, -392706, 174273, 723996, 1161669, 1439421, 1579337, 1659289, 1734568, 1769483, 1675988, 1419818, 1065229, 726185, 500135, 423611, 439451, 416714, 262816, 27397, -147749, -183493, -118728, -12241, 138159, 346174, 566322, 726416, 804027, 831449, 847398, 880964, 965396, 1127142, 1359767, 1627227, 1885713, 2090708, 2204258, 2222987, 2191092, 2165162, 2171631, 2209102, 2272882, 2354269, 2430538, 2485901, 2540990, 2638628, 2796839, 2988251, 3163736, 3285517, 3343921, 3356666, 3349202, 3325611, 3264705, 3152301, 3002078, 2828190, 2615611, 2349981, 2072966, 1873065, 1809048, 1863969]
35775A863969J19630J51229J72611J71541J28681M9228n2112j73623l08527m18261
35765A704366m54356m09338l23264k33746j41963m1808L9565O0663K1291l0083
35755A91327n4174o3633r1241j31520j38798q2545J5164J04139J54431J69585
35745G2735J59961J20913M5231n2637j39880j93219k09340j84262j04242K3548
35735d61192J48475K18168K42133K78898L47651L87418L33981K16286J36076J50085
35725A997979K03911J96203Q8618o4080j80490k26832k23440j98376j55727r0783
35715A346983j7579L5532N4602N1637M7441N2832O5825P6301P4091O3861O9010
35704A920536J03919J43719J45235J04342O6552O2919N6499j8732j69290l15658
$$ y = [1863969, 1983599, 2134828, 2307439, 2478980, 2607661, 2656889, 2604777, 2431154, 2122627, 1704366, 1250010, 840672, 517408, 283662, 141699, 99891, 139456, 200119, 221410, 191327, 137153, 73520, -17721, -149241, -288039, -370584, -355420, -251281, -96850, 72735, 232696, 353609, 398840, 346203, 206323, 13104, -196236, -380498, -484740, -461192, -312717, -94549, 147584, 426482, 774133, 1161551, 1495532, 1711818, 1847894, 1997979, 2201890, 2398093, 2486711, 2422631, 2242141, 2015309, 1791869, 1593493, 1437766, 1346983, 1329404, 1364936, 1419538, 1471175, 1518616, 1571448, 1637273, 1713574, 1787665, 1851526, 1920536, 2024455, 2168174, 2313409, 2417751, 2484303, 2547222, 2603721, 2584989, 2415699, 2100041]
35694B100041l62657k90401j73918j13882j43546k01762k00482j13144J3021J18370
35684F31640J74789J71879J03472q350j05485j40797j17929o5440L077P4357J09126
35673H30339P7611J2305k0622m540J3667j044k4457j9461L124l989o9171j76236
35661F17526k80900l39367l33785k83946k27629j84059j45667j04248o3436j8728
35651a364239M9770J45830K34219K72002K58960K40384K57059K98515L07417K33021
35641I32938Q7049n6564j28989j31331j17850j19058j07714m9396L8479R7557
35631D45121Q5844R755q9122j64526j91445j76252j40365r4038l8970M328M13
35620c49257n2610j00416q4786r837O5049R2733Q1296P5117J08437J72200K14311
$$ y = [2100041, 1737384, 1446983, 1273065, 1159183, 1015637, 813875, 613393, 500249, 513270, 631640, 806429, 978308, 1081780, 1073430, 967945, 827148, 709219, 643779, 646856, 721213, 830339, 907950, 920255, 899633, 895093, 908760, 907716, 883259, 863798, 866922, 862933, 793762, 617526, 336626, -2741, -336526, -620472, -848101, -1032160, -1177827, -1282075, -1345511, -1364239, -1314469, -1168639, -934420, -662418, -403458, -163074, 93985, 392500, 699917, 932938, 1019987, 963423, 834434, 703103, 585253, 466195, 358481, 309085, 347564, 445121, 530965, 540720, 451598, 287072, 95627, -80625, -220990, -315028, -353998, -349670, -349257, -401867, -502283, -587069, -596906, -531857, -439124, -357828, -282711, -174274, -2074, 212237]
35609B12237J81970P8140l3449r2954j01590j01204j19435j60932k30180l19449
35599f86846l79797l49052k20552n6708O9082J16782P5684l1840j30425j31081
35589a724753k7646Q0439R7196L4460k3749k5642K5614J22230K58310L90691M56495
35578c36355M43904L96345L32732K17908M2297j17579j67435j01921j473O3466
35568G71889Q6977R6884J11851J33997J51459J37816P1979l1004j24413j72275
35558A235160j78088j74100j95608k56915l26488l28041k00834K5561K36907L27628
35548A65182K75776J30312l5835j43779j27609J1399J81324K76352K80942K64179
35538A278243K70714K61514J83116N8890k8810l9685k6186p4235k08518l66457
$$ y = [212237, 394207, 472347, 438898, 345944, 244354, 143150, 23715, -137217, -367397, -686846, -1066643, -1415695, -1636247, -1692955, -1623873, -1507091, -1431407, -1463247, -1593672, -1724753, -1752399, -1671960, -1574764, -1540304, -1564053, -1589695, -1564081, -1441851, -1183541, -792850, -336355, 107549, 503894, 836626, 1054534, 1096831, 979252, 811817, 709896, 708423, 771889, 858866, 955750, 1067601, 1201598, 1353057, 1490873, 1562852, 1531848, 1407435, 1235160, 1057072, 882972, 687364, 430449, 103961, -224080, -424914, -399353, -162446, 165182, 440958, 571270, 535435, 391656, 264047, 275446, 456770, 733122, 1014064, 1278243, 1548957, 1810471, 1993587, 2052477, 2023667, 1983982, 1957796, 1883561, 1675043, 1308586]
35528A308586m60026m54560l85948l09139k43229j71169p9053K2023J11478J81492
35518d79545K39194K92452L31691L22055K29223P2485o3127j06095r2361j37617
35508F08355k95177m78138n55655m97467l79613k66927j47590J0512J92070L50754
35498a458876M60583N21568N34268M97266M21249L24744K20094J14546J4113q4711
35488A564844j90941k91407l45707l32075k82055k40330k02834j31385k4212P2275
35478d03827J30584J76723K33843K68655K33729J45741Q0531Q7190J32390J35999
35468A221558M8955j02363k34633k71978k05931r4352j68N4915P1016L7223m5221
35457D79021j22316j18857k3952Q5915J23898P1580k4295j01055j09486k8527
$$ y = [1308586, 848560, 394000, 8052, -301087, -544316, -715485, -794538, -772515, -661037, -479545, -240351, 52101, 383792, 705847, 935070, 1007555, 944428, 838333, 745972, 608355, 313178, -164960, -720615, -1218082, -1597695, -1864622, -2012212, -2001700, -1809630, -1458876, -998293, -476725, 57543, 554809, 976058, 1300802, 1520896, 1635442, 1649555, 1564844, 1373903, 1082496, 736789, 404714, 122659, -117671, -320505, -451890, -476102, -403827, -273243, -96520, 137323, 405978, 639707, 785448, 865979, 953169, 1085559, 1221558, 1270513, 1168150, 933517, 661539, 455608, 361256, 361088, 416003, 487019, 524242, 479021, 356705, 237848, 213896, 299811, 423709, 495289, 470994, 369939, 260453, 231926]
35447B31926J12458K37534K83062K56046K16972K05730K00112J48393L0175j19246
35437A803162k39478k96143k97347k57389j61841K167J83906K80275K35159J02767
35427A355238j4476o9660q3937q0350n4171q428K6083K3873p711m8501r4948j56907
35415G86105k34714l05121l26730k72209j74391j25929j94146l29813l93763k91607
35405a862318o5320J52666K51051K04284P0986m2165m4387O9045K10786K85089
35395g70283K72712K22669J80776J53093J26269Q7983K3222q1051k13518l35025
35385c33153m07950m20554l75526k64170o7973K04961M86573O65943O60867M84779
35375F33797K41114M8655k9093J839R1221J74348K00307J54865N6768o8200j95544
$$ y = [231926, 344384, 581918, 864980, 1121026, 1337998, 1543728, 1743840, 1892233, 1922408, 1803162, 1563684, 1267541, 970194, 712805, 550964, 553131, 737037, 1017312, 1252471, 1355238, 1340762, 1271102, 1187165, 1106815, 1052644, 1044216, 1070299, 1094172, 1086461, 1037960, 943012, 786105, 551391, 246270, -80460, -352669, -527060, -652989, -847135, -1176948, -1570711, -1862318, -1927638, -1774972, -1523921, -1319637, -1248651, -1290816, -1335203, -1266158, -1055372, -770283, -497571, -274902, -94126, 58967, 185236, 273219, 296441, 215390, 1872, -333153, -741103, -1161657, -1537183, -1801353, -1869326, -1664365, -1177792, -511849, 149018, 633797, 874911, 923566, 894473, 896312, 987533, 1161881, 1362188, 1517053, 1573821, 1505621, 1310077]
35364A310077k85690k91670k05582p9042K4637Q4398J10391J04629O6655K1614
35354H60417L42n055k6689o3124q1761q8794j46473k86434m37516m80829l66212
35343a122128j46218R1643K90108M21935M64959M03672K48587M1981j55262k83247
35333B56030l01716k05434l2497J41144K31575J98916Q2665k7381p0392o0876
35323B12034n0590n9065n7783j2064Q2222J96532K80791K83602J96533Q8084O0784
35312A221080J49433K77634L34050K76848J46584K695j14642j73274j53375q3309
35302A883724l9093p9873j92034l06597l56840l12798j86712k7777J05313J91571
35292F78884K58771L30568L80709L67622K99173K23628J58824P2835n3526j84551
$$ y = [1310077, 1024387, 732717, 527135, 448093, 472730, 557128, 667519, 772148, 838803, 860417, 860759, 855704, 829015, 765891, 684130, 595336, 448863, 162429, -275087, -755916, -1122128, -1268346, -1176703, -886595, -464660, 299, 403971, 652558, 694539, 539277, 256030, -45686, -251120, -283617, -142473, 89102, 288018, 370683, 343302, 272910, 212034, 161444, 102379, 44596, 32532, 114754, 311286, 592077, 875679, 1072212, 1160296, 1221080, 1370513, 1648147, 1982197, 2259045, 2405629, 2408324, 2293682, 2120408, 1967033, 1883724, 1844631, 1764758, 1572724, 1266127, 909287, 596489, 409777, 382000, 487313, 678884, 937655, 1268223, 1648932, 2016554, 2315727, 2539355, 2698179, 2771014, 2717488, 2532937]
35282B532937k75682l33747l97182m67103m89546m10573k32299j2926J74479K81437
35272C69795K98678K46187J51933L8873p0444j44709j52372r1387j1293J3112
35262F48373m4466j15955j00067J3644J13714R3432j5737q4412m6008M1290R6911
35251F00719J15460J30565J38404J10762N2175j0420p8554j71581k71440l27276
35241B88814l21953k94961k86846k88201k53105j41756N2233K88576M85153N63614
35231I1568N12365L97974L05024K65904K43837J72903J9807j77675l34895l94247
35221A102565l69641l10859k48645k01035k04060k76924l56084l25902j46066
35212a336651Q9322K50603L01667L00293K99486K95275K65526K16412J75168J58485
$$ y = [2532937, 2257255, 1923508, 1526326, 1059223, 569677, 159104, -73195, -86121, 88358, 369795, 668473, 914660, 1066593, 1105466, 1035022, 890313, 737941, 646554, 635261, 648373, 603907, 487952, 387885, 401529, 515243, 608675, 592938, 508526, 462518, 503808, 600719, 716179, 846744, 985148, 1095910, 1148085, 1137665, 1059111, 887530, 616090, 288814, -33139, -328100, -614946, -903147, -1156252, -1298008, -1245775, -957199, -472046, 91568, 603933, 1001907, 1306931, 1572835, 1816672, 1989575, 2009382, 1831707, 1496812, 1102565, 732924, 422065, 173420, -27615, -231675, -508599, -864683, -1190585, -1336651, -1247329, -996726, -695059, -394766, -95280, 199995, 465521, 681933, 857101, 1015586]
35202A015586J61027J63669J44395R0009Q133p2487j21290j31291j22897j15027
35192A019827r4425l0326P3618J62809J86462J51574R5694K4050q1644j93419
35182A314220k29476j42432J8100J58090K30152K48898K42723K23804J90314J25785
35172B380178N482j66628l32802m23418m26472l93984l78790l84485l77854l30773
35162h29546k46171j56998j00871q2393o1131R554J31734K60009L42132L49154
35152c84527K77852J51341J8642p1959j09889j20532j26905j31030j30997j27500
35142g55504j04543l4480P4765J58829J52775O0336n6042j46358k05274k34301
35132a089797k09314j10000L5278J60398K16472K01607J41948O6029L442j4208
$$ y = [1015586, 1176613, 1340282, 1484677, 1574686, 1582819, 1510332, 1389042, 1257751, 1134854, 1019827, 925402, 895076, 968694, 1131503, 1317965, 1469539, 1565233, 1589283, 1507639, 1314220, 1084744, 942312, 960412, 1118502, 1348654, 1597552, 1840275, 2064079, 2254393, 2380178, 2385660, 2219032, 1886230, 1462812, 1036340, 642356, 263566, -120919, -498773, -829546, -1075717, -1232715, -1333586, -1415979, -1477110, -1467556, -1335822, -1075813, -733681, -384527, -106675, 44666, 63308, -8651, -118540, -239072, -365977, -497007, -628004, -755504, -860047, -894527, -819762, -660933, -508158, -447822, -503864, -650222, -855496, -1089797, -1299111, -1409111, -1373833, -1213435, -996963, -795356, -653408, -587379, -583937, -598145]
35122e98145K6371J00366J58914J66300J20742M4422l7416j10022j72164k26265
35112e26897k59323k38173j37345K5940J94374L09876L42682K87517J54958k1099
35102A32510j85462k95027l51572l87507m15271m01778l03334j25068O4441J88504
35092b079564K32378K46991K79514L17979L20620K82707K41846K19152J92199
35083B53822J40806Q6905N9439L8371l0435j62105k98211l54321k93941j56010
35073g15680k0409N1962N4886K2400j2937l9526n2162m3478k2147j7853m3477
35062h38421o2646k2869P7315J76626K13803J86308J39334J11360J04044R8513
35052A83367Q4339O5991M9101L3549K2489K3858K9397L005q4872k08556k96709
$$ y = [-598145, -571774, -471408, -312494, -146194, -25452, 18970, -18446, -128468, -300632, -526897, -786220, -1024393, -1161738, -1135798, -941424, -631548, -288866, -1349, 153609, 132510, -52952, -347979, -699551, -1087058, -1502329, -1904107, -2207441, -2332509, -2268068, -2079564, -1847186, -1600195, -1320681, -1002702, -682082, -399375, -157529, 61623, 253822, 394628, 481533, 540972, 579343, 548908, 386803, 88592, -265729, -559670, -715680, -736089, -684127, -629241, -606841, -619778, -659304, -711466, -754944, -777091, -794944, -838421, -901067, -923936, -846621, -669995, -456192, -269884, -130550, -19190, 84854, 183367, 267706, 333697, 382798, 416347, 438836, 462694, 492091, 495096, 410224, 201668, -95041]
35041i5041l01184k38820j58912r6890p5574j16859k11078k89357k71955j51987
35031b007657l213R9716J43032J53484J49575J30896R5504M8000j575l6603m0451
35020a269292j1779L4858Q7462J43591J94068K14636J86811J21985N8251L6086
35010b03323P4290J55479K30898K55124K28722J99397K09405K44133K42050J59786
35000A795961K6176p4513q4352l8990l6385j24557k36600k61617j69808l5999
34990G59316N7048R9147J26453J53413J56586J01678l7305k61469n16614o94312
34980e6059p03144n48208l25378j39652l9656j1575j253N6063J89919L60243M87280
34969g31420N29915N23197N30520N69889N92744N24586L26431L7083k36053l88769
$$ y = [-95041, -396225, -635045, -793957, -890847, -966421, -1083280, -1294358, -1583715, -1855670, -2007657, -2010870, -1911154, -1768122, -1614638, -1465063, -1334167, -1238663, -1190663, -1192238, -1228841, -1269292, -1281071, -1246213, -1158751, -1015160, -821092, -606456, -419645, -297660, -239409, -203323, -129033, 26446, 257344, 512468, 741190, 940587, 1149992, 1394125, 1636175, 1795961, 1822137, 1747624, 1663272, 1624282, 1587897, 1463340, 1226740, 965123, 795315, 759316, 816364, 915511, 1041964, 1195377, 1351963, 1453641, 1416336, 1154867, 638253, -56059, -759203, -1307411, -1632789, -1772441, -1812097, -1823672, -1824925, -1768862, -1578943, -1218700, -731420, -201505, 321692, 852212, 1422101, 2014845, 2539431, 2865862, 2902945, 2666892, 2278123]
34959B278123m03407l57464l42797l85206m44527m67102m17901k83801q3146J27721
34949g79507K87244L76947M19769M29775L88875K81098J23749n0179k15374l36769
34939I25628l52822k19402K3089K54397L63261L27860K13676J10568P2228R0612
34929A809095J09081O7571n0311k10469l63240m72053n07121m36465k51021K130
34919c02803K34485L80581M44875M73776M80416M13931K24502m3228k53205k99970
34909A753360k14697j22232j00174j13627q9514j2395P4801J31401J46571J25950
34899A579444Q7540O5364Q4372J26035J40236R7645J7895n3069p8797m9594J3090
34888B030161O2574N5507r890q6049j13255o9343J0166N7064K3978p6618j87502
$$ y = [2278123, 1874716, 1517252, 1174455, 789249, 344722, -122380, -540281, -824082, -907228, -779507, -492263, -115316, 304453, 734228, 1123103, 1404201, 1527950, 1477771, 1262397, 925628, 572806, 353404, 376493, 630890, 994151, 1322011, 1535687, 1646255, 1718483, 1809095, 1918176, 1985747, 1935436, 1724967, 1361727, 889674, 382553, -53912, -304933, -302803, -68318, 312263, 757138, 1230914, 1711330, 2125261, 2349763, 2306535, 2053330, 1753360, 1538663, 1416431, 1316257, 1202630, 1113116, 1100721, 1175522, 1306923, 1453494, 1579444, 1666984, 1732348, 1816720, 1942755, 2082991, 2180636, 2198531, 2145462, 2066665, 2017071, 2030161, 2092735, 2148242, 2138352, 2052303, 1939048, 1869705, 1879871, 1936935, 1960913, 1884295, 1696793]
34877A696793k60900k87754k74500k18584j27168l9618M21r019l3375m5953m2033
34866C58310j6796L5061R1803J09577P1749J3732j5757m680J9806K4100o062n9912
34854F20931j12100j45899j68118j92365k12315k09366j83818j53824j19436n4486
34844i30796N2070J64652K24042J92453P6430p2496j76139j77953r0675K1693
34834g16719J17383K05427K88632L16572K35059O8358q3670j31081n8889P9944
34824C21016K06585K55220K03543Q2915m7185j39250j76418j68741j43450j23778
34814B70457r9880l4901P8362J81456K02210J38443N8703J7707K266k9738q6495
34803F98590j38270j57431j41029j01884n4452q331L3890P2236J02175J19837
$$ y = [1696793, 1435893, 1148139, 873639, 655055, 527887, 488269, 488690, 479671, 446296, 400343, 358310, 341514, 376575, 468378, 577955, 649704, 663436, 647679, 642999, 662805, 686905, 680843, 620931, 508831, 362932, 194814, 2449, -209866, -419232, -603050, -756874, -876310, -930796, -878726, -714074, -490032, -297579, -221149, -293645, -469784, -647737, -738412, -716719, -599336, -393909, -105277, 211295, 446354, 514712, 431042, 299961, 241072, 321016, 527601, 782821, 986364, 1069279, 1022094, 882844, 706426, 537685, 394235, 270457, 170577, 135676, 214038, 395494, 597704, 736147, 794850, 812557, 814823, 785085, 698590, 560320, 402889, 261860, 159976, 105524, 97193, 131083, 203319, 305494, 425331]
34793D25331J36047J69795K16685K36657J92694R9756J7378j1509j415J034l2706
34782A449747j00957j93436k95276l68444l63717k76336j72856j32502j63787
34773f17564k02049j87458j19911l5927L6127Q2141Q9646N4595o979o7273r8796
34762a073448p5458J4530J41546K43087K82355K82338K80359K70147K21406J41035
34752G27897P2623L5934O636l5198p1689p8813o5072o0285q4445j41775k25274
34741H0539l08735l51368l33430k79400k26376j74555q8038N5041K28693L78690
34731a018939M64673M77798M26578L19028J66241J94j26781j77190j66672j55778
34721B09152j93172k67345l18633k99393k22267j50573j39461j82864k18330j85086
$$ y = [425331, 561378, 731173, 947858, 1184515, 1377209, 1476965, 1494343, 1482834, 1481419, 1482453, 1449747, 1348790, 1155354, 860078, 491634, 127917, -148419, -321275, -453777, -617564, -819613, -1007071, -1126982, -1162909, -1126782, -1044641, -954995, -900400, -907379, -974652, -1073448, -1148906, -1134376, -992830, -749743, -467388, -185050, 95309, 365456, 586862, 727897, 800520, 836454, 843090, 807892, 736203, 657390, 592318, 532033, 447588, 305813, 80539, -228196, -579564, -912994, -1192394, -1418770, -1593325, -1681363, -1626322, -1397629, -1018939, -554266, -76468, 350110, 669138, 835379, 835573, 708792, 531602, 364930, 209152, 15980, -251365, -569998, -869391, -1091658, -1242231, -1381692, -1564556, -1782886, -1967972]
34711a967972p4980P1098K03746K95447L46577L78550M11682M31242L86092K49486
34701G30968P8511k1274j496Q6219J64156K10977K44173K51092J84466K5427j83330
34690A769889l72703m90474n08593m22816k67267j11135j4587J4936J6188K9309
34680c57253O3872J03047J26371J26737J11637R2801P7823P2318Q1698R9606R9092
34669F97749N4001k3730q2533p8624j7108O1855J25359J63005J72579J54322J18660
34658A345535P8026K6039n4477j50231k01847j53263j6990J25625J94625J72900
34648A365942R4359j2957j48477k98491l98451l69437k00349K7686K12623L10549
34638E82997L31026K84078J74703M1440n3224r3459j35457k31920l52586m10118
$$ y = [-1967972, -2042952, -1971854, -1768108, -1472661, -1126084, -747534, -335852, 95390, 481482, 730968, 809479, 788205, 786709, 872928, 1037084, 1248061, 1492234, 1743326, 1927792, 1953219, 1769889, 1397186, 906712, 398119, -24697, -291964, -403099, -417686, -402750, -386562, -357253, -293381, -190334, -63963, 62774, 174411, 267212, 345035, 417353, 499051, 598657, 697749, 751750, 728020, 645487, 566863, 549755, 611610, 736969, 899974, 1072553, 1226875, 1345535, 1423561, 1449600, 1395123, 1244892, 1043045, 889782, 872792, 998417, 1193042, 1365942, 1460301, 1447344, 1298867, 1000376, 601925, 232488, 32139, 59825, 272448, 582997, 914023, 1198101, 1372804, 1414244, 1361020, 1267561, 1132104, 900184, 547598, 137480]
34628A37480l53471k11681n7742M4365O7442L0205j4536j8832K8136J08373J96004
34617d4257K52921K31071J20511j3715q5102p8245n1634m8496n0571l0859j820
34606A99804J9144N3686J30848K30207K92485K79368J97914P5823n9522j77947
34596A241810k45299k37468j59418n6440K472k1104r1480j33866j18609q0106
34586A00492m5538P456R1956J54213J25450J0393j20862k11812k44076k01978
34576c34306p8310P5356J61514J28854K0583q7003j61547k08799k23214j85417
34566h92289j05425l9018m5512j29794k30850k75967k50043k00260j65645j22491
34556b457294k0424J45299L27347M77477N64096N46089L84348J03529j92751l98397
$$ y = [137480, -215991, -427672, -485414, -441049, -373607, -343402, -357938, -376770, -348634, -240261, -44257, 208664, 439735, 560246, 546531, 461429, 383184, 331550, 283054, 232483, 201624, 199804, 218948, 272634, 403482, 633689, 926174, 1205542, 1403456, 1479279, 1419757, 1241810, 996511, 759043, 599625, 543185, 545657, 524553, 433073, 299207, 180598, 100492, 54954, 62410, 154366, 308579, 434029, 444422, 323560, 111748, -132328, -334306, -412616, -337260, -175746, -46892, -26309, -113312, -274859, -483658, -706872, -892289, -997714, -1036732, -1082244, -1212038, -1442888, -1718855, -1968898, -2169158, -2334803, -2457294, -2477718, -2332419, -2005072, -1527595, -963499, -417410, -33062, 70467, -122284, -520681]
34546e20681m81971m73824m01471k65379p0408J40914K92220L14506K01444L1162
34536a233488q4378q7432r463P9537J39735J77496K15850K62699K95971K73219
34526B9746J71746K7079q6004j22450j03447p6446n7586k8446K5632R4411J56371
34515C0606K00828K35051K69900K94769K74740J88182O1746n3981j41229k19834
34505A140778k93279l24768k85060k00610j36136j42922k28151l47964m21240
34496a239352l84158k53471j11904j4766N7970J38225K01365K02006J46952Q2208
34486a174925K3809m6405j19029j41220p7891L9930J40471J72790J48897J40661
34476h92912K17754L60520M52285L97831K37495R8656M3587K2434k1675p1092
$$ y = [-520681, -1002652, -1476476, -1877947, -2143326, -2213734, -2072820, -1780600, -1466094, -1264650, -1233488, -1317866, -1405298, -1414761, -1335224, -1195489, -1017993, -802143, -539444, -243473, 29746, 201492, 228571, 142567, 20117, -83330, -159776, -217362, -245808, -220176, -125765, 30606, 231434, 466485, 736385, 1031154, 1305894, 1494076, 1555822, 1501841, 1360612, 1140778, 847499, 522731, 237671, 37061, -99075, -241997, -470148, -818112, -1239352, -1623510, -1876981, -1988885, -2003651, -1945681, -1807456, -1606091, -1404085, -1257133, -1174925, -1151116, -1197521, -1316550, -1457770, -1535661, -1495731, -1355260, -1182470, -1033573, -892912, -675158, -314638, 137647, 535478, 772973, 871629, 915216, 937650, 915975, 844883]
34466H44883q6682q2023r4389j19126j25734j18037j26516j48400j43420r5120
34456b94564l9983k3630n1195q8125r1482l8630N2555J26917J36906R2608N0009
34445a68614M5007O0678O7286O7051P8729R9450J10981J13407J22102J33255J22846
34434H52178Q7064N5914N0931N0420J7727m8680j15500j59502j91863k36065k95267
34423F7357l44024l45944k85424j92830j30163j33975j74504j86697j37540m4617
34413a908361O4095J76725K77424L32725L21705K64487K01740J55213J21704R3202
34403A00659O5644L5864O781p842K605K7458L8624J2620m9961j17540j41079r2484
34391a18651L854R3825J52307J96076K28992K06861Q7183j02262k74049l54204
$$ y = [844883, 758201, 676178, 581789, 462663, 336929, 218892, 92376, -56024, -199444, -294564, -334547, -358177, -409372, -497497, -588979, -627609, -575054, -448137, -311231, -218623, -168614, -123607, -62929, 4357, 71408, 150137, 249587, 360568, 473975, 596077, 729332, 852178, 939242, 995156, 1046087, 1096507, 1114234, 1065554, 950054, 790552, 598689, 362624, 67357, -276667, -622611, -908035, -1100865, -1231028, -1365003, -1539507, -1726204, -1863744, -1908361, -1844266, -1667541, -1390117, -1057392, -735687, -471200, -269460, -114247, 7457, 100659, 166303, 202167, 208948, 201106, 203711, 231169, 269793, 282413, 232452, 114912, -26167, -118651, -114797, -20972, 131335, 327411, 556403, 763264, 850447, 748185, 474136, 119932]
34381A19932l26634k22275r5714n615J5509j8442o8975j08956j23273r2648r913
34370i37004R3077J67162J95395J93822J66738R7823o470r8681j32876j05667
34360c66681m6856P620K6683j088m4704m6008J8037R7405J09231J2839j54462
34349c87984k98963l26978k10955k0761J27297J73598J62409J79346K55995L46105
34339h91L80264L31813K42610J94114K35254L23883L55263K65487R4694o4866
34329B357625j65596k30522l00546l84393m56209m78289m23992k96521j32978
34320e11421J4790J06756J31766J17401J23073J92410K93218L28427K33512M8756
34310A078688j27037k35216k80554k78816k30980j52142q3353n9238q9520j77964
$$ y = [119932, -206702, -428977, -524691, -530306, -514797, -533239, -602214, -711170, -834443, -927091, -937004, -843927, -676765, -481370, -287548, -120810, -22987, -29457, -128138, -261014, -366681, -413537, -405917, -379234, -380322, -425026, -471034, -452997, -355592, -246361, -233522, -387984, -686947, -1013925, -1224880, -1245641, -1118344, -944746, -782337, -602991, -346996, -891, 379373, 711186, 953796, 1147910, 1383164, 1707047, 2062310, 2327797, 2422491, 2357625, 2192029, 1961507, 1660961, 1276568, 820359, 342070, -81922, -378443, -511421, -496631, -389875, -258109, -140708, -17635, 174775, 467993, 796420, 1029932, 1078688, 951651, 716435, 435881, 157065, -73915, -226057, -309410, -368648, -458168, -636132]
34300f36132l24575m91761n98663n76961m21354j72526J26631M32517O75285P72036
34290a215503O85244M64564K25666Q0224O7145J33742J83479J51689M2026r9195
34280G19081k25123l01472l03656k29754j15874j7577L5204N9933R4938J55209
34270a29091K17239K45130K28530J91935J64790J46520J08236K8020q3360j89131
34260I28818k46628k24475j25772o882N0830J5702n7156q9407p3797p4373j31577
34249c4717k02978k14695j44121l1434O4638R5285L3513r4763j96794j79123m3668
34238i48857J14485K17951K79726L44478L97580L77557K62226R8031n3483j59954
34228I29740k08000j90628j23554m8383q67J2407L995l821K5609J23107K68935
$$ y = [-636132, -960707, -1452468, -2051131, -2628092, -3049446, -3221972, -3095341, -2662824, -1987539, -1215503, -530259, -65695, 159971, 240195, 307340, 441082, 624561, 776250, 818276, 719081, 493958, 192486, -111170, -340924, -456798, -474375, -439171, -379238, -284300, -129091, 88148, 333278, 561808, 753743, 918533, 1065053, 1173289, 1201309, 1117949, 928818, 682190, 457715, 331943, 325061, 375891, 391593, 334437, 245030, 171233, 96860, -34717, -237695, -452390, -596511, -627945, -563307, -468022, -434509, -529272, -726066, -905189, -948857, -834372, -616421, -336695, 7783, 405363, 782920, 1045146, 1143177, 1089694, 929740, 721740, 531112, 407558, 359175, 358308, 370715, 374710, 370889, 396498, 519605, 788540]
34217G88540L93966M48294M47985M31438L93571K97024J36141m4045j89474k72804
34207B830636k94966k79262k59450k46036k09236j25689l5234p606m3843n5299
34197A274015L1935J80481K78825K56606J36052j5157j46568k39405k89453k96410
34187A170921k66741k16742j66803j31194j16081j26421j62073j99301j95697
34178d10132j39560q3844r5736j69892k27066k09524j43350q8639o1646l2568
34168a661957K7100J24909K51739L72385M30197L98091L16387K49615K14593J79587
34158I02646J20845M4103m0367j22785j74938j66118j05084l5307J4878M7058
34148D84931N9311L6984j5824p0845j09600j29971j19036o6634j4135l0911j11730
$$ y = [788540, 1182506, 1630800, 2078785, 2510223, 2903794, 3200818, 3336959, 3292914, 3103440, 2830636, 2535670, 2256408, 1996958, 1750922, 1541686, 1415997, 1380763, 1373157, 1329314, 1274015, 1305950, 1486431, 1765256, 2021862, 2157914, 2142757, 1996189, 1756784, 1467331, 1170921, 904180, 687438, 520635, 389441, 273360, 146939, -15134, -214435, -410132, -549692, -633536, -729272, -899164, -1126230, -1335754, -1479104, -1567743, -1629389, -1661957, -1634857, -1509948, -1258209, -885824, -455627, -57536, 258851, 508466, 723059, 902646, 1023491, 1067594, 1027227, 904442, 729504, 563386, 458302, 422995, 437873, 484931, 544242, 581226, 565402, 494557, 384957, 254986, 135950, 69316, 55181, 24270, -87460]
34137h7460j48286m6478J62692L67366M90911N15921M32615K39479p336k09994
34127A709430l12149l28201k84699j79025j6357J48405K36964K07218P6816r9343
34117A159059k66344l95101m79641n11597m71781l58887k08159n8078Q6027K26028
34107a278474L25083L30900K44364J26199L1787k4479l9209k282P3462J44674
34097f7975J83153J99847K06340J86802J31167O4043J3714j8558l1032L691R6100
34086I67292J93927K22839J65341O5210l6571j32544k19206k74662k74713k10210
34076D66703r0748M4988J30430J20157M5305j1699j0499O400j7304o7849p6427
34065E39457r679Q3775J27458J02829O4685P1816J19413J53065J37562Q7368L0475
$$ y = [-87460, -235746, -282224, -119532, 247834, 738745, 1254666, 1687281, 1926760, 1919424, 1709430, 1397281, 1069080, 784381, 605356, 588999, 737404, 974368, 1181586, 1258402, 1159059, 892715, 497614, 17973, -493624, -965405, -1324292, -1532451, -1590529, -1504502, -1278474, -953391, -622491, -378127, -251928, -220141, -244620, -283829, -286111, -212649, -67975, 115178, 315025, 521365, 708167, 839334, 903377, 917091, 898533, 867501, 871192, 967292, 1161219, 1384058, 1549399, 1614609, 1578038, 1445494, 1226288, 951626, 676913, 466703, 375955, 420943, 551373, 671530, 716835, 705136, 694637, 701037, 683733, 615884, 539457, 529778, 613553, 741011, 843840, 908525, 980341, 1099754, 1252819, 1390381, 1477749, 1508224]
34054A508224k6080q0990j18005j26488j24673j35792j53652j56368j39530j06316
34044C40330l9659P5266K03242K74430K56932J83829J02165K8029l8431q9994
34034A296139j25635j59072j91000j95020j55376j00891p4206p6847o9460k3474
34024A25158M6665J01317J08952N9203m3430j85718l38226m44599m41707l18315
34014a330700j48681l3899K51J9642Q6721J85232K62479L07660L41295L46505
34004C6505K68601R5014j03879k34310k59699k12100j47154j04043r2285r6490
33994h49840r6102q7842q3176q2325o7315l1448k02k647k6601k2521M1422J39543
33982a169054K12636K28247K11344K15353K66056L35111L67106L29969K38103
$$ y = [1508224, 1482144, 1401154, 1283149, 1156661, 1031988, 896196, 742544, 586176, 446646, 340330, 300671, 375937, 579179, 853609, 1110541, 1294370, 1396535, 1424564, 1386133, 1296139, 1170504, 1011432, 820432, 625412, 470036, 369145, 294939, 218092, 148632, 125158, 171823, 273140, 382092, 441295, 397865, 212147, -126079, -570678, -1012385, -1330700, -1479381, -1513280, -1513029, -1493387, -1406666, -1221434, -958955, -651295, -310000, 36505, 305106, 400120, 296241, 61931, -197768, -409868, -557022, -661065, -753350, -849840, -945942, -1033784, -1116960, -1199285, -1266600, -1298048, -1298250, -1300897, -1327498, -1350019, -1308597, -1169054, -956418, -728171, -516827, -301474, -35418, 299693, 666799, 996768, 1234871]
33973A234871J30614L4540m8267j26522k03965k79579l50710m04033m08782l36982
33963g58815j98851m6289P1191J46534J97474K18041J75645O5441n6801j19763
33953c06193j06831o2030k9960j0857K1922Q0450J50322K07648K34948K27522
33943D06941J96868J63687J35262R3287J8869p0427j27688j30507j12963j29164
33933D44165j94600k79187l46984l76984l48682k43590p9023Q4059J91043K38729
33923i11054K53645K45557K10341J61504J18566O8825j4799j09634j42002p2990
33913a92041N1638J66168K63565L66065M44287M26921K94189J10479n2689j84687
33903A693895l04262l98919m35064m09390l49431k66317j43748J5018J55499K08764
$$ y = [1234871, 1365485, 1400025, 1351758, 1225236, 1021271, 741692, 390982, -13051, -421833, -758815, -957666, -1003955, -932764, -786230, -588756, -370715, -195070, -129629, -186430, -306193, -413024, -475054, -505014, -515871, -493949, -413499, -263177, -55529, 179419, 406941, 603809, 767496, 902758, 996045, 1014914, 944487, 816799, 686292, 573329, 444165, 249565, -29622, -376606, -753590, -1102272, -1345862, -1424885, -1340826, -1149783, -911054, -657409, -411852, -201511, -40007, 78559, 147384, 132585, 22951, -119051, -192041, -140403, 25765, 289330, 655395, 1099682, 1526603, 1820792, 1931271, 1878582, 1693895, 1389633, 990714, 555650, 146260, -203171, -469488, -613236, -598218, -442719, -233955]
33893b33955J56680N4177j0175K1535J36031K62191L29679L21220K67521J96773
33883A501677J03572k8546j88838l35546m23468m28017l53632k33787j17886m2939
33873e47410j6626l2614q9039j72132k30499j98220n6743J41602L18181M20722
33863d62778M32589L63477K52726J59510J21270J29073J58649K05003K59139K71573
33853A890231J86773K0188j35174j94470j53079o9152l633R519l7720j30574k39340
33842A143569l35240l93091l83907k93548j57589m5620J2255N9134J44417K43166
33832f454K76239K02403O0635p4848j55555j82169j97766k52901l42456l77181
33822a050053k60084m883K59117M19372M79221M97268M73814L61106J74245K1139
$$ y = [-233955, -77275, -23098, -33273, -11738, 124293, 386484, 716163, 1037383, 1304904, 1501677, 1605249, 1576703, 1387865, 1052319, 628851, 200834, -152798, -386585, -504471, -547410, -564036, -596650, -685689, -857821, -1088320, -1286540, -1343283, -1201681, -883500, -462778, -30189, 333288, 586014, 745524, 866794, 995867, 1154516, 1359519, 1618658, 1890231, 2077004, 2097192, 1962018, 1767548, 1614469, 1545317, 1541684, 1551203, 1513483, 1382909, 1143569, 808329, 415238, 31331, -262217, -419806, -465426, -453171, -394037, -249620, -6454, 269785, 472188, 532823, 457975, 302420, 120251, -77515, -330416, -672872, -1050053, -1310137, -1315020, -1055903, -636531, -157310, 339958, 813772, 1174878, 1349123, 1370262]
33812A370262o425O7889J42956J48316Q6201m362p9043r3250k5839Q6007J67152
33801A859864J80026J60926J66459K04112K34992K27800J85468J27789P0717J7903
33791C436056m6238j45576k68742l43962k94199j27870N4374J59777J88004J98185
33781B809809K15443K02904J21784j1857j43471k38282l06061l66492m01906l62176
33771A519695k26060m6101Q9751J44928J63895K05892K67341K88951K30244J14119
33761B752655n025r8148j74398k47230l07007l34910l32593l19987l01491k52000
33751C79866j48420l407J44912K63504L26893L05031J81906j3528k23441m10695
33741H02621n63249o47550o02831m12909j60143K6033P2562N618q9853j33821
$$ y = [1370262, 1363837, 1431726, 1574682, 1722998, 1809199, 1804837, 1725794, 1632544, 1606705, 1692712, 1859864, 2039890, 2200816, 2367275, 2571387, 2806379, 3034179, 3219647, 3347436, 3418153, 3436056, 3389818, 3244242, 2975500, 2631538, 2337339, 2209469, 2263843, 2423620, 2611624, 2809809, 3025252, 3228156, 3349940, 3338083, 3194612, 2956330, 2650269, 2283777, 1881871, 1519695, 1293635, 1247534, 1337285, 1482213, 1646108, 1852000, 2119341, 2408292, 2638536, 2752655, 2747630, 2649482, 2475084, 2227854, 1920847, 1585937, 1253344, 933357, 631866, 379866, 231446, 228039, 372951, 636455, 963348, 1268379, 1450285, 1436757, 1213316, 802621, 239372, -408178, -1011009, -1423918, -1584061, -1558028, -1485466, -1479848, -1569701, -1703522]
33731a703522r4810l760P3072R1309N9542J0693l9766r1032j28213j21404n3287
33720b001178O1705J77793K33008J88100P1981k6239l1195O2264K13508L83777
33710f66476N30574N88275N10359L30969J44327J8418m4325p0839q3907j04251
33700A153124j41893j74237j67650j29530j03554j04374r7209n7608r673J9784
33690A87180M6023R0287J29328J23595Q1046N3316P1955J19150J60319J77489
33680A239688J66118J21753M1546o8015j87191k83997l27191l08812k50758j83591
33670d0450j25338q3454o1716n4111m5564l1948k6690l4092l0825P533P3647J40646
33658c12362J92444K16552J81701O4410r4780j96990j69534l1004J38415K72267
$$ y = [-1703522, -1798332, -1802092, -1729020, -1637711, -1578169, -1567476, -1607242, -1698274, -1826487, -1947891, -2001178, -1939473, -1761680, -1528672, -1340572, -1268591, -1294830, -1326025, -1263761, -1050253, -666476, -135902, 452373, 962732, 1293701, 1438028, 1456446, 1412121, 1341282, 1257375, 1153124, 1011231, 836994, 669344, 539814, 436260, 331886, 234677, 177069, 167396, 187180, 233203, 323490, 452818, 576413, 657459, 710775, 782730, 901880, 1062199, 1239688, 1405806, 1527559, 1569105, 1501090, 1313899, 1029902, 702711, 393899, 143141, -40450, -165788, -249242, -310958, -365069, -410633, -442581, -469271, -503363, -534188, -526655, -453008, -312362, -119918, 96634, 278335, 342745, 247965, 50975, -118559, -149563, -11148, 261119]
33648B61119L47942L61647L05467J75757r294k05682l53241l97046l19094j58224
33638I351J0451J26220J73205J64116J12127L3734l5504o1689n9269r1394k00157
33627A81191l46703m41768m30494l29160j87097m1698Q5500J79215K36689K69390
$$ y = [261119, 609061, 970708, 1276175, 1451932, 1442638, 1236956, 883715, 486669, 167575, 9351, 19802, 146022, 319227, 483343, 595470, 629204, 593700, 532011, 472742, 381348, 181191, -165512, -607280, -1037774, -1366934, -1554031, -1595729, -1510229, -1331014, -1094325, -824935]
$$ [...]
##END NTUPLES=NMR SPECTRUM
##END=
