##TITLE=31Pdec_2MBDE-2.1
 CDCl3
  24 sc
 21.11.2023
##JCAMPDX= 6.0         $$ Bruker NMR JCAMP-DX V2.0
##DATA TYPE= NMR SPECTRUM
##DATA CLASS= NTUPLES
##ORIGIN= UXNMR, Bruker Analytische Messtechnik GmbH
##OWNER= root
$$ XWIN-NMR		Version 3.5
$$ Tue Nov 21 15:47:28 2023 Russian Standard Time (UT+4h)  she@DPX200
##.OBSERVE FREQUENCY= 81.013821
##.OBSERVE NUCLEUS= ^31P
##.ACQUISITION MODE= SIMULTANEOUS
##.ACQUISITION SCHEME= undefined
##.AVERAGES= 24
##.DIGITISER RES= 16
##SPECTROMETER/DATA SYSTEM= spect
##.PULSE SEQUENCE= zgpg30
##.SOLVENT NAME= DMSO
##.SHIFT REFERENCE= (INTERNAL, DMSO, 0, 248.564)
##AUDIT TRAIL= $$ (NUMBER, WHEN, WHO, WHERE, WHAT)
$$ ##TITLE= Audit trail, XWIN-NMR		Version 3.5
$$ ##JCAMPDX= 5.01
$$ ##ORIGIN= Bruker BioSpin GmbH
$$ ##OWNER= she
$$ F:/spectra/data/she/nmr/P31/1/pdata/1/auditp.txt
$$ ##AUDIT TRAIL=  $$ (NUMBER, WHEN, WHO, WHERE, WHAT)
(   1,<2023-11-21 15:46:03.26 +0400>,<she>,<DPX200>,
      <created by zg, POWCHK disabled, PULCHK disabled
       configuration hash MD5:
       00 E9 B6 7A A2 85 ED C7 34 08 36 98 17 FE 4E 26
       data hash MD5: 32K
       CD B3 BF 9B 25 B5 62 14 47 61 A9 D9 7B B1 89 61>)
(   2,<2023-11-21 15:46:05.39 +0400>,<she>,<DPX200>,
      <Start of raw data processing
       efp BC_mod = 2 LB = 5 FT_mod = 6 PKNL = 1 PHC0 = -11037.75 PHC1 = 740.4951 SI = 64K 
       data hash MD5: 64K
       7C 1A AB B6 DE 4F 8E C0 D3 4A 7D A8 3A 58 B1 AE>)
(   3,<2023-11-21 15:46:34.26 +0400>,<she>,<DPX200>,
      <pk PHC0 = -432.5376 PHC1 = 561.5994 
       data hash MD5: 64K
       BD 9D 1C C4 35 28 16 07 68 FB EB A3 0D 48 FE 37>)
(   4,<2023-11-21 15:46:53.67 +0400>,<she>,<DPX200>,
      <pk PHC0 = -0.6008765 PHC1 = 0 
       data hash MD5: 64K
       26 15 7F E7 6A 32 6E 1C 86 5D 7F E6 6C 67 5A 72>)
(   5,<2023-11-21 15:47:03.98 +0400>,<she>,<DPX200>,
      <abs ABSG = 5 
       data hash MD5: 64K
       0B 37 1E A4 27 56 6A 3D D0 5B 5E D7 28 DA 27 91>)
$$ ##END=
$$ 
$$ hash MD5
$$ F7 FD F0 E1 C9 DD 82 1F B4 11 E1 8C 35 75 BC FE
##$RELAX= 
##$RELAX= 
##$RELAX= 
##$RELAX= 
##$RELAX= 
##$RELAX= 
##$RELAX= 
##$RELAX= 
##$RELAX= 
$$ Bruker specific parameters
$$ --------------------------
##$DU= <F:/spectra>
##$EXPNO= 1
##$NAME= <P31>
##$PROCNO= 1
##$TYPE= <nmr>
##$USER= <she>
##$AMP= (0..31)
100 100 100 100 100 100 100 100 100 100 100 100 100 100 100 100 100 100 
100 100 100 100 100 100 100 100 100 100 100 100 100 100 
##$AQSEQ= 0
##$AQ_mod= 1
##$AUNM= <au_zg>
##$AUTOPOS= <>
##$BF1= 81.014009
##$BF2= 200.13
##$BF3= 200.13
##$BF4= 200.13
##$BF5= 200.13
##$BF6= 200.13
##$BF7= 200.13
##$BF8= 200.13
##$BYTORDA= 1
##$CFDGTYP= 0
##$CFRGTYP= 5
##$CHEMSTR= <none>
##$CNST= (0..31)
1 1 145 1 1 1 1 1 1 1 1 1 1 1 1 1 1 1 1 1 1 1 1 1 1 1 1 1 1 1 1 1 
##$CPDPRG= <waltz16>
##$CPDPRG1= <>
##$CPDPRG2= <waltz16>
##$CPDPRG3= <>
##$CPDPRG4= <mlev>
##$CPDPRG5= <mlev>
##$CPDPRG6= <mlev>
##$CPDPRG7= <mlev>
##$CPDPRG8= <mlev>
##$CPDPRGB= <>
##$CPDPRGT= <>
##$D= (0..31)
$$ [...]
##$SUBNAM3= <"">
##$SUBNAM4= <"">
##$SUBNAM5= <"">
##$SUBNAM6= <"">
##$SUBNAM7= <"">
##$SUBNAM8= <"">
##$SUBNAM9= <"">
##$SW= 501.771253377433
##$SWIBOX= (0..15)
0 1 3 0 0 0 0 0 0 0 0 0 0 0 0 0 
##$SW_h= 40650.406504065
##$TD= 32768
##$TD0= 1
##$TE= 0
##$TE2= 300
##$TE3= 300
##$TEG= 300
##$TL= (0..7)
0 120 53 12 22 120 120 120 
##$TP= (0..7)
150 150 150 150 150 150 150 150 
##$TP07= 0
##$TPNAME0= <>
##$TPNAME1= <>
##$TPNAME2= <>
##$TPNAME3= <>
##$TPNAME4= <>
##$TPNAME5= <>
##$TPNAME6= <>
##$TPNAME7= <>
##$TPOAL= (0..7)
0.5 0.5 0.5 0.5 0.5 0.5 0.5 0.5 
##$TPOFFS= (0..7)
0 0 0 0 0 0 0 0 
##$TUNHIN= 0
##$TUNHOUT= 0
##$TUNXOUT= 0
##$USERA1= <user>
##$USERA2= <user>
##$USERA3= <user>
##$USERA4= <user>
##$USERA5= <user>
##$V9= 5
##$VALIST= <valist>
##$VCLIST= <CCCCCCCCCCCCCCC>
##$VD= 0
##$VDLIST= <DDDDDDDDDDDDDDD>
##$VPLIST= <PPPPPPPPPPPPPPP>
##$VTLIST= <TTTTTTTTTTTTTTT>
##$WBST= 1024
##$WBSW= 4
##$XGAIN= (0..3)
0 0 0 0 
##$XL= 0
##$YL= 0
##$YMAX_a= 192
##$YMIN_a= -233
##$ZGOPTNS= <>
##$ZL1= 120
##$ZL2= 120
##$ZL3= 120
##$ZL4= 120
##$ABSF1= 248.5645
##$ABSF2= -253.2056
##$ABSG= 5
##$ABSL= 3
##$ALPHA= 0
##$AQORDER= 0
##$ASSFAC= 0
##$ASSFACI= 0
##$ASSFACX= 0
##$ASSWID= 0
##$AUNMP= <proc_1d>
##$AZFE= 0.1
##$AZFW= 0.5
##$BCFW= 0
##$BC_mod= 2
##$BYTORDP= 0
##$COROFFS= 0
##$CY= -3
##$DATMOD= 1
##$DC= 0
##$DFILT= <>
##$DTYPP= 0
##$F1P= 0
##$F2P= 0
##$FCOR= 1
##$FTSIZE= 65536
##$FT_mod= 6
##$GAMMA= 0
##$GB= 0
##$INTBC= 1
##$INTSCL= 6.047779e-11
##$ISEN= 30
##$LB= 5
##$LEV0= 0
##$LPBIN= 0
##$MAXI= 10000
##$MC2= 0
##$MEAN= 0
##$ME_mod= 0
##$MI= 50
##$NCOEF= 0
##$NC_proc= -11
##$NLEV= 6
##$NOISF1= 182.463
##$NOISF2= 159.3651
##$NSP= 0
##$NTH_PI= 0
##$NZP= 0
##$OFFSET= 248.5645
##$PC= 4
##$PHC0= -11470.89
##$PHC1= 1302.094
##$PH_mod= 1
##$PKNL= yes
##$PPARMOD= 0
##$PSCAL= 0
##$PSIGN= 0
##$REVERSE= no
##$SF= 81.0140089999694
##$SI= 65536
##$SIGF1= 159.3651
##$SIGF2= -187.1042
##$SINO= 113.3802
##$SIOLD= 16384
##$SREGLST= <1H.CDCl3>
##$SSB= 0
##$STSI= 65536
##$STSR= 0
##$SW_p= 40650.406504065
##$SYMM= 0
##$S_DEV= 0
##$TDeff= 32768
##$TDoff= 0
##$TI= <>
##$TILT= no
##$TM1= 0
##$TM2= 0
##$TOPLEV= 0
##$USERP1= <user>
##$USERP2= <user>
##$USERP3= <user>
##$USERP4= <user>
##$USERP5= <user>
##$WDW= 1
##$XDIM= 65536
##$YMAX_p= 314287132
##$YMIN_p= -29597322
$$ End of Bruker specific parameters
$$ ---------------------------------
##NTUPLES= NMR SPECTRUM
##VAR_NAME=  FREQUENCY,     SPECTRUM/REAL,   SPECTRUM/IMAG
##SYMBOL=    X,             R,               I
##VAR_TYPE=  INDEPENDENT,   DEPENDENT,       DEPENDENT
##VAR_FORM=  AFFN,          ASDF,            ASDF
##VAR_DIM=   65536,         65536,           65536
##UNITS=     HZ,            ARBITRARY UNITS, ARBITRARY UNITS
##FACTOR=    0.620285442955139, 1,           1
##FIRST=     20137.2065510682, 0,            0
##LAST=      -20513.1999529968, 0,           0
##MIN=       -20513.1999529968, -29597322,   0
##MAX=       20137.2065510682, 314287132,    0
$$ Real data points
##PAGE= N=1
##DATA TABLE= (X++(R..R)), XYDATA
$$ [...]
39549G41738K11251K16551J76113P1871n5143j48545j86825j88376j79749j69022
39539D89864j44402q8761O60R5509J40939R4507k7544j49805j96318j52653o8101
39528f105l510J3614r522n0376p9957o7616Q21J06004K07561K79091L25521L63005
39516A078531L87794L71933K91543J58771K4216n6889o7074l8864k6333o4683
39506B058945j51039k50684l15947l12025k41438j42761n5509J0725O2575Q8988
39496G51830O7374Q457l2878j3801M1823O8921L9914k452J716N6599J03195Q2479
39484A173177l380r8019j54578j80714k14088k65217l03263k95744k39605j47627
39474g29058l0676Q7509J59831J52445Q8016K6638L374P599K3120N7674J19774
$$ y = [741738, 952989, 1169540, 1345653, 1417524, 1362381, 1213836, 1027011, 838635, 658886, 489864, 345462, 256701, 257361, 352870, 493809, 588316, 560772, 410967, 214649, 61996, -6105, -9615, 3999, -5523, -55899, -135856, -203472, -202651, -96647, 110914, 390005, 715526, 1078531, 1466325, 1838258, 2129801, 2288572, 2312788, 2255899, 2188825, 2149961, 2123628, 2058945, 1907906, 1657222, 1341275, 1029250, 787812, 645051, 589542, 600267, 662842, 751830, 819204, 827661, 794783, 780982, 822805, 891726, 931640, 929188, 930904, 987503, 1090698, 1173177, 1169797, 1071778, 917200, 736486, 522398, 257181, -46082, -341826, -581431, -729058, -759734, -672225, -512394, -359949, -271933, -245295, -241921, -234322, -211202, -153528, -33754]
39463c3754J90618K37778K41889J96090R9676k2278j06199r1888J3108J27913
39453H52953J65182R7011l8405j72238k41874k18686j24858k0363M2234N4849
39443C95805M4772L5279K2896j0757p4045j51906k12387k29786k08455j80807
39433e69391j74155j82005j76867j48177j14303r4787q4291o2077j9058L2717
39423a592394P1012P5852L7986l1673r9314j24462q5348J1316J42796K85668M15834
39412h92727M98894M93069L76798J82403m340r6014o7287L2018J25791J68295
39402H16900J59552J27485J06631J17768J48491J60462J32786R2107Q0348R6987
39392B039517R7804N4287j0383n5766p3713q6274j07511j26430j23467r1404m4723
$$ y = [-33754, 156864, 394642, 636531, 832621, 932297, 910019, 803820, 711932, 725040, 852953, 1018135, 1115146, 1076741, 904503, 662629, 443943, 319085, 298722, 340956, 395805, 440577, 475856, 498752, 487995, 413950, 262044, 49657, -180129, -388584, -569391, -743546, -925551, -1102418, -1250595, -1364898, -1459685, -1543976, -1606053, -1625111, -1592394, -1521382, -1445530, -1407544, -1439217, -1538531, -1662993, -1748341, -1737025, -1594229, -1308561, -892727, -393833, 99236, 476034, 658437, 654097, 558083, 490796, 522814, 648605, 816900, 976452, 1103937, 1210568, 1328336, 1476827, 1637289, 1770075, 1862182, 1942530, 2039517, 2137321, 2191608, 2181225, 2125459, 2051746, 1965472, 1857961, 1731531, 1608064, 1516660, 1471937]
39381A471937j7686m3165j16506j85025j92176j34910o2979j8273R753N9409J39226
39370I09605K09164K17609J48149L0114q7636j68710k02420j97272j67716j25536
39360E65351p9229l7439q908L985R339J7382K7154K7467J2096j4424m8392r1199
39348C83183j33913j52154j32444r2977n8801k6491K0244O6355P2947L5341l237
39337b1947j4605k9040q6326j68253k17436k12018j84859j70027j62539j35379
39327a402429o9528L7557J65855K65677K83070K11855J08281M0780L3042O1647
39317b64193R4615J20793J51180K00556K59834K83864K25087R3159l3673p7397
39307A053825l7196J7197K5816l992k1557K431M6816O9299N1674J1730k0299k3032
$$ y = [1471937, 1454251, 1411086, 1294580, 1109555, 917379, 782469, 719490, 701217, 710970, 770379, 909605, 1118769, 1336378, 1484527, 1514641, 1427005, 1258295, 1055875, 858603, 690887, 565351, 486122, 448683, 439775, 443760, 453099, 470481, 497635, 525102, 537198, 522774, 474382, 383183, 249270, 97116, -35328, -128305, -187106, -213597, -193353, -126998, -54051, -18710, -21947, -36552, -65592, -151918, -320171, -537607, -749625, -934484, -1104511, -1267050, -1402429, -1471957, -1434400, -1268545, -1002868, -719798, -507943, -399662, -358882, -325840, -264193, -169578, -48785, 102395, 302951, 562785, 846649, 1071736, 1164895, 1131222, 1053825, 1016629, 1033826, 1059642, 1055650, 1034093, 1036524, 1083340, 1152639, 1204313, 1216043, 1195744, 1172712]
39295A172712J7133J05349K16537K87306K61441J49844K1468p2978j41328k00465
39285A817019k21929j66865o0753J3434O126m8122q5084q8603r4689j39555k26018
39274G04961l24105l77435l21611j35665J13887L06253L62745L03508K06469J29876
39264I68883Q4863N8662L4660l816o0964j14447j33638j17897j00031j05968j28772
39253C81535j50896j71830j96382k10050j88823j30419n8904P32M0181O3825Q0982
39242e40049R9322J11900R4315L2553m6170q9159p1142j8262K4019L2509J3368
39231c56796j1604j3643L0799J15776J97110K22924J77191R1072J4450k3325l3616
39220D10338n4349j08131j71416j95123j58428q7615j6764M9317J17831J72801
$$ y = [1172712, 1189845, 1295194, 1511731, 1799037, 2060478, 2210322, 2231790, 2158812, 2017484, 1817019, 1595090, 1428225, 1367472, 1380906, 1387032, 1338910, 1253826, 1165223, 1070534, 930979, 704961, 380856, 3421, -318190, -453855, -339968, -33715, 329030, 632538, 839007, 968883, 1053746, 1112408, 1147068, 1143252, 1082288, 967841, 834203, 716306, 616275, 510307, 381535, 230639, 58809, -137573, -347623, -536446, -666865, -725769, -725037, -684856, -621031, -540049, -440727, -328827, -234512, -201959, -248129, -337288, -408430, -426692, -402673, -370164, -356796, -368400, -382043, -351244, -235468, -38358, 184566, 361757, 452829, 467279, 443954, 410338, 355989, 247858, 76442, -118681, -277109, -364724, -381488, -332171, -214340, -41539]
39210d1539J83935J45156Q0935J4135n2178j18084j70179j88516j59925q4329
39200c90589J7890J05116J41220J31674J17631J25047J34669J13810O2440R551
39190E68459k6215m9668o3716n3639q894M9771P8426M7115l3569j21993j80405
39179B05672k02609k08812k14015k05146j53905n0849P7773J86510K39638K28880
39169i6863J77447J33733J46848K26754L22942L54893K74968J02686j00146k77453
39159A265809l99422m53123m35255l56744k40889j11626R738R8755J37056J36172
39149c49529J36761J67145K08753K18602J83050J32492J01102Q9044P3077M2340
39139A002837J0811l276l019j7535p9561j89103k95869l29748k61738j32910j6965
$$ y = [-41539, 142396, 287552, 368487, 382622, 330444, 212360, 42181, -146335, -306260, -390589, -372699, -267583, -126363, 5311, 122942, 247989, 382658, 496468, 558908, 568459, 542244, 492576, 428860, 375221, 366327, 416098, 494524, 541639, 508070, 386077, 205672, 3063, -205749, -419764, -624910, -778815, -829664, -751891, -565381, -325743, -96863, 80584, 214317, 361165, 587919, 910861, 1265754, 1540722, 1643408, 1543262, 1265809, 866387, 413264, -21991, -378735, -619624, -731250, -721512, -622757, -485701, -349529, -212768, -45623, 163130, 381732, 564782, 697274, 798376, 887420, 960497, 1002837, 1013648, 1010372, 1007353, 989818, 910257, 721154, 425285, 95537, -166201, -299111, -316076]
39128c16076M0829M2569J1128l1605n9920m4400K2672J07755J56455J36292N7290
39117A22989m2566j23173j58047j38537p1863K2363J13097J61962J42259O3658
39107I2142l1048j04612j53292j85489j87519j38385n6645M55R6k6484k6602Q257
39095h09126M0231L5586n690o1712j04448j06762n9533J4965Q6286J51172K20903
39084e98128K73427K54432J44992R52j00444j35366j31098j09289o8737j9296
39074d88555P967q82k0686k1158l772J5725M8266J26831K55446L81030M31039
39063G31251L78525K64619J57179R1680N3191R204m9547j02532j24900j11677
39053A296993p8840m7156k6173j1375L572J3183M879j9212l3225j1067M1856Q8643
$$ y = [-316076, -275247, -232678, -221550, -253155, -313075, -357475, -334803, -227048, -70593, 65699, 122989, 80423, -42750, -200797, -339334, -411197, -388834, -275737, -113775, 28484, 92142, 61094, -43518, -196810, -382299, -569818, -708203, -764848, -764393, -764297, -790781, -817383, -809126, -768895, -733309, -738999, -800711, -905159, -1011921, -1071454, -1056489, -970203, -819031, -598128, -324701, -70269, 74723, 75675, -24769, -160135, -291233, -400522, -469259, -488555, -480588, -481470, -502156, -523314, -527086, -511361, -463095, -336264, -80818, 300212, 731251, 1109776, 1374395, 1531574, 1623254, 1676445, 1685649, 1636102, 1533570, 1408670, 1296993, 1218153, 1170997, 1144824, 1133449, 1137021, 1150204, 1155083, 1135871, 1102646, 1091579, 1133435, 1222078]
39041A222078R3133M5995l8745j39881k33614k88588k70885j67866j5313J04602
39031C10916J13663N414j39430k20146k01947j28639n7914n637M3668R8033J48995
39020c3024J85426J93761J52582N2759p4776j74379k19854k38146k66303k97088
39010g19042k87279k19362j35831r8995j22659j57648j48626r3636l6500q055
39000b027633M177K2610L7618K0493k9570p4454p5228k3400O7544J78634K81744
38989a617465L40269L35606K85333K18565J42018N0406l6424p4641m2409L3321
38979c65421J03692J36963J26119P9182J8161k6576m1477m5644o6692j03548j26648
38968c11889j13556p0831j9411K8939P5239J20583J55066J58953J18440M6655
$$ y = [1222078, 1315211, 1361206, 1322461, 1182580, 948966, 660378, 389493, 221627, 206314, 310916, 424579, 429993, 290563, 70417, -131530, -260169, -318083, -323720, -280052, -182019, -33024, 152402, 346163, 498745, 551504, 476728, 302349, 82495, -155651, -421954, -719042, -1006321, -1225683, -1361514, -1460509, -1583168, -1740816, -1889442, -1983078, -2019578, -2027633, -2023456, -2000846, -1963228, -1942735, -1972305, -2046759, -2121987, -2145387, -2077843, -1899209, -1617465, -1277196, -941590, -656257, -437692, -295674, -245268, -281692, -356333, -398742, -365421, -261729, -124766, 1353, 80535, 98696, 72120, 30643, -15001, -81693, -185241, -311889, -425445, -496276, -515687, -486748, -411509, -290926, -135860, 23093, 141533, 188188]
38958A88188j4547k4694J9427Q1490J18736J14364Q2898N3565M6914N7910O1446
38947G85697M2587J9423K4230O1283R6459R3127M7572j4620o3336p7606n0112
38936I64704M024M7304M4835o180p6512j32007j54753j43990j11304p8138o5441
38925B92542p6031r1628r4313q7612q9180j05172j21597j22058j03986p3310l4396
38914g06741O408L9831P1289J27098K17222K96733K99238K18163J20348N9108
38904G48697R363p6279j77912k28110k10577j82275j89678k14316k19368k01510
38894i41965j66460r6170J4781J16433J45624J03732N4665M8363P8349J11730
38884e30918J26401J13369P3232K4226m630J067L2853P7174J25994J68413J88791
$$ y = [188188, 173641, 148947, 168374, 249864, 368600, 482964, 565862, 619427, 666341, 724251, 785697, 828284, 847707, 871937, 933220, 1029679, 1122806, 1170378, 1155758, 1092422, 1014816, 964704, 968728, 1016032, 1060867, 1054687, 978175, 846168, 691415, 547425, 436121, 357983, 292542, 216511, 124883, 30570, -57042, -146222, -251394, -372991, -495049, -599035, -672345, -706741, -700333, -660502, -589213, -462115, -244893, 51840, 351078, 569241, 689589, 748697, 758060, 681781, 503869, 275759, 65182, -117093, -306771, -521087, -740455, -941965, -1108425, -1204595, -1189814, -1073381, -927757, -824025, -769360, -720997, -642648, -530918, -404517, -291148, -217916, -193690, -198320, -197253, -164400, -87226, 38768, 207181, 395972]
38873C95972J77805J32824M7580q2021k38920l87111m96502n53164n46447m66164
38863b016148l19661j36989M6745K01871K96256K98879K05809N4088r8184k00801
38853a668135k25623j74751q5057p660L2259M8857O4613Q2616J00980J35509K01959
38842a494433K79178L14573K77398J96657J35677J30368J57769J65914J29251
38833B92352O8945K2299N352J0660K6678M3780N0854M6301M8422P2849R9228Q4693
38821H72413J7664o3091j13145j26401j23261j16997j11856j18039j41763j63224
38811a87700j45081o7830N0117J64573K32628K38600K06552J81281J83647J87612
38801A044399J50955O4218l9706j17974j49596j42990j25660j22343j31850j29389
$$ y = [395972, 573777, 706601, 754181, 672160, 433240, 46129, -450373, -1003537, -1549984, -2016148, -2335809, -2472798, -2426053, -2224182, -1927926, -1629047, -1423238, -1369150, -1467334, -1668135, -1893758, -2068509, -2153566, -2161226, -2128967, -2080110, -2015497, -1932881, -1831901, -1696392, -1494433, -1215255, -900682, -623284, -426627, -290950, -160582, -2813, 163101, 292352, 361297, 383596, 388948, 399608, 426286, 470066, 520920, 567221, 615643, 688492, 787720, 872413, 890077, 826986, 713841, 587440, 464179, 347182, 235326, 117287, -24476, -187700, -332781, -400611, -350494, -185921, 46707, 285307, 491859, 673140, 856787, 1044399, 1195354, 1259572, 1219866, 1101892, 952296, 809306, 683646, 561303, 429453, 300064]
38791C00064r9955n9144k7663J655M7994R9028J10550N6416l8895j22646j53202
38780A14202j16211k5842P6826J43593J54167J25460Q0369K3581l8856p5179n2133
38769D09977J7872P9208R1534O8827M9895M6249L8578J8457R619L7843R2906J33871
38757A094836J27173O8374k8327j43230k48663l11122l13553k72252k19659j72503
38747d18926j28353r0845p9287j03297j39588j48053j07661k6230P9467J93718
38737i69055K86567L09592K32180Q3957n6084j22740j12944p2191m6322n1733
38727e18773p6419r2995p6169k2692M6461J11356J71342K24037K38878J81921
38717A86947P0950k1944l8086J3000P5757J06127R3370M6102j6062o1628n9884
$$ y = [300064, 200109, 140965, 113302, 114957, 162951, 261979, 372529, 428945, 390050, 267404, 114202, -2009, -27851, 48975, 192568, 346735, 472195, 552564, 576145, 537289, 462110, 409977, 427849, 507057, 598591, 667418, 717313, 763562, 802140, 820597, 830216, 868059, 960965, 1094836, 1222009, 1290383, 1262056, 1118826, 870163, 559041, 245488, -26764, -246423, -418926, -547279, -638124, -717411, -820708, -960296, -1108349, -1216010, -1242240, -1162773, -969055, -682488, -372896, -140716, -56759, -112843, -235583, -348527, -420718, -467040, -518773, -595192, -688187, -764356, -787048, -740587, -629231, -457889, -233852, 5026, 186947, 257897, 235953, 197867, 210867, 286624, 392751, 486121, 532223, 516161, 454533, 394649]
38706C94649p96J00170K08025K73645K52744J42338o925j32406k10623k55878
38696G64943k80205k76196k33710j51418l5524Q9339J69953J55285M9970p8960
38686A73477j56071j46928o0697O3958J64776J79966R7306k6875j14106j25249
38676D9557p2926N724P0962R2270O5150J5313k7384n2266n4238j6483O3499J39005
38664B78183J43626O7474k1604m7289L312Q6823J56081J81579J41390L0341j13632
38653I06284k20025k41367j91031j18581n8022j0093L4024O8919P9408O0155K3068
38642C32739j6042n4508j00638j52720j89474j93361j78195j73798j78438j49455
38632a053890n9254N5323J25019J22800Q0717L5622r105n8492r6224j05822j02692
$$ y = [394649, 393853, 494023, 702048, 975693, 1228437, 1370775, 1363850, 1231444, 1020821, 764943, 484738, 208542, -25168, -176586, -212110, -122771, 47182, 202467, 252437, 173477, 17406, -129522, -190219, -126261, 38515, 218481, 315787, 288912, 174806, 49557, -23369, -17645, 53317, 145587, 210737, 226050, 198666, 146400, 92162, 75679, 139178, 278183, 421809, 489283, 467679, 420390, 423702, 510525, 666606, 848185, 989575, 1019916, 906284, 686259, 444892, 253861, 135280, 77258, 67165, 101189, 170108, 249516, 309671, 332739, 316697, 262189, 161551, 8831, -180643, -374004, -552199, -725997, -904435, -1053890, -1113144, -1057821, -932802, -810002, -729285, -693663, -702768, -761260, -857484, -963306, -1065998]
38621a065998j15773j42073j42207q1839L5656J72364K76044L04918K56210J73582
38611c29116J09527P6898N0143J1613k3747l2390r611L4007Q2733J10837Q9257
38600A70151J9043n3341p8453o1730o0465j17842k12285k78940k73303k05677
38590a152842j17526l6414L7716J07531J56473J63063J29761Q3584M8570K8766
38580e51318J5760m012n1010j38553k42659l03228k78014j90713j07103o5841
38570a916691n0922l2134p910P197K3333P8643J93274L29210M08503L78407K59172
38559c29918J24924L6716l056l1736p3473j15423j31132j10810o2497K311O8322
38548f25772J08448R8959N1701J4092J9047M3206L6713p118l8609j8999K3878
$$ y = [-1065998, -1181771, -1323844, -1466051, -1547890, -1512234, -1339870, -1063826, -758908, -502698, -329116, -219589, -142691, -92548, -80935, -104682, -137072, -146683, -112676, -29943, 80894, 170151, 189194, 135853, 57400, -4330, -64795, -182637, -394922, -673862, -947165, -1152842, -1270368, -1306782, -1269066, -1161535, -1005062, -841999, -712238, -628654, -580084, -551318, -535558, -539570, -590580, -729133, -971792, -1275020, -1553034, -1743747, -1850850, -1916691, -1967613, -1999747, -2007657, -2000460, -1977127, -1898484, -1705210, -1376000, -967497, -589090, -329918, -204994, -168278, -171334, -203070, -276543, -391966, -523098, -633908, -696405, -694094, -625772, -517324, -418365, -366664, -352572, -333525, -290319, -253606, -260724, -299333, -318332, -294454]
38537b94454L0327j6210p7392j16094j30514j26535q9511o527J00174J85037K19848
38526c21851K09562J75914J40602J18730J11394J02602P3646K1957l8463q9410
38516E04683j14425j02681o2101k2953j0254j1823R790O9241J34982J59844J26902
38505F81205O3916K1896L7478R8611J42075J03575j5662j42141k00854j83013
38495F07086j34388r3838o6133m5980l7722m3123n1415n4436n8167o8281p5600
38484a21997o7978m8284k9735k0505k2409l5307n0226m7285j7308J9679L4696
38473d06659K4823J0563L395N97J2202O1692J46260K22248K49891K32595J91021
38462G48628J20446Q206j15663j84274j61789q3876k0967j5922o1458j19278j49332
$$ y = [-294454, -264127, -280337, -357729, -473823, -604337, -730872, -820383, -826910, -726736, -541699, -321851, -112289, 63625, 204227, 322957, 434351, 536953, 610599, 632556, 594093, 504683, 390258, 287577, 225476, 202523, 192269, 180446, 190236, 259477, 394459, 554303, 681205, 745121, 767017, 804495, 903106, 1045181, 1148756, 1133094, 990953, 790099, 607086, 472698, 378860, 312727, 266747, 229025, 185902, 134487, 80051, 21884, -46397, -121997, -189975, -238259, -267994, -288499, -310908, -346215, -396441, -443726, -461034, -441355, -406659, -381836, -371273, -367878, -367281, -355079, -293387, -147127, 75121, 325012, 557607, 748628, 869074, 877280, 761617, 577343, 415554, 331678, 310711, 294789, 233331, 114053, -35279]
38451c5279j31635p2246J0435J00561J79307K17134J96677J43850J09943J13222
38441H31969J21037J02759P6615Q0538J12218J28411J04167O8142O7097J05681
38431A798634J34335J00881J1290o9461q5151n1310l6951q6124j76334k55405
38421A284404k93415k86539k38077j63756j00532p8360q5406q6602p6898r1011
38411b16192j53668k41055l02860l08933k64065j87778r2753J7933J38257K45415
38401a365699L02516K83655J99643R5737K3470J4412P0526J65624K56638L07508
38391C54030L10367K83067K49816K29557K33482K55000K61245K14789J16366J4957
38381B522676l8740m4994m9432q5241j33670j49902j21299q6032q8920j30634
$$ y = [-35279, -166914, -239160, -228725, -128164, 51143, 268277, 464954, 608804, 718747, 831969, 953006, 1055765, 1132380, 1212918, 1325136, 1453547, 1557714, 1625856, 1692953, 1798634, 1932969, 2033850, 2045140, 1975679, 1890528, 1839218, 1802267, 1716143, 1539809, 1284404, 990989, 704450, 466373, 302617, 202085, 123725, 38319, -48283, -125181, -216192, -369860, -610915, -913775, -1222708, -1486773, -1674551, -1767304, -1749371, -1611114, -1365699, -1063183, -779528, -579885, -484148, -460678, -446266, -375740, -210116, 46522, 354030, 664397, 947464, 1197280, 1426837, 1660319, 1915319, 2176564, 2391353, 2507719, 2522676, 2483936, 2438942, 2389510, 2304269, 2170599, 2020697, 1899398, 1813366, 1724446, 1593812]
38371A593812j74143j95088k03834k12032k00698j43193n1338K2757L3448j9402
38361D50289r3837j36673j17673n0972J7176N5878Q3269J36856K12663K56737
38351H13713K24766J30842K5940n5257j10841j48380j66818j61977j37233j05598
38341C09157q6258r5759j33441j74373j83545j41651n8027L8500J17504J58016
38331b49877J50789R9324K2247n0873r5625j07440r4990n9317Q545J02220J83880
38320i1117K09063J67030Q7796J1891l8304o1704o6159n6333l0045J0818M5276
38309A88212M3305K094m0575m5955j7566J3764L7532P1246J25181J85111K29123
38298G91472K37938J93015R5181j5300r3094j48040k32144l52547m38426m21188
$$ y = [1593812, 1419669, 1224581, 1020747, 808715, 608017, 464824, 413486, 436243, 469691, 450289, 356452, 219779, 102106, 51134, 68310, 124188, 207457, 344313, 556976, 813713, 1038479, 1169321, 1195261, 1140004, 1029163, 880783, 713965, 551988, 414755, 309157, 222899, 127140, -6301, -180674, -364219, -505870, -563897, -525397, -407893, -249877, -99088, 236, 22483, -28390, -124015, -231455, -326445, -385762, -377217, -274997, -91117, 117946, 284976, 372772, 384663, 346359, 284655, 218496, 162163, 132118, 142936, 188212, 231517, 233611, 193036, 147081, 129515, 143279, 180811, 252057, 377238, 562349, 791472, 1029410, 1222425, 1317606, 1302306, 1209212, 1061172, 829028, 476481, 38055, -383133]
38288c83133l15521j92455j02927o1285p2298j23808j66331j50689q8716l8015
38278a695178k3747j2983K7199Q4171J26680J44714J41996J14419O2259J0931
38268a019539m821K2908O6978R2219Q4000N3149J9920l570j4270o287K8260Q0000
38256f01053J19381J28097J20144J11849Q5533J4859p8605j30864j05815l0702
38246c67176M7455J09478J54080J73781J67253J51718J32674P7889m3998k02681
38236D00473l13181l09076j94242k6102J31142K35828K74452K53056J81941P0956
38226G05247n5170j47693j60105q7471L0643J47084K37924L00155L34712L36636
38216A641962K93383J91938L8781j23814k32281k42516j60275l8331N1538N7541
$$ y = [-383133, -698654, -891109, -994036, -1055321, -1127619, -1251427, -1417758, -1568447, -1657163, -1695178, -1718925, -1731908, -1704709, -1620538, -1493858, -1349144, -1207148, -1092729, -1030470, -1019539, -1024360, -1001452, -934474, -842255, -758255, -705106, -685186, -688756, -703026, -709313, -681053, -601053, -481672, -353575, -233431, -121582, -36049, -21190, -99795, -230659, -336474, -367176, -319721, -210243, -56163, 117618, 284871, 436589, 569263, 647152, 603154, 400473, 87292, -221784, -416026, -442128, -310986, -75158, 199294, 452350, 634291, 705247, 650077, 502384, 342279, 254808, 285451, 432535, 670459, 970614, 1305326, 1641962, 1935345, 2127283, 2166064, 2042250, 1809969, 1567453, 1407178, 1368847, 1420385, 1477926]
38206A477926j6676j10000j54235j37552j10030j21194j63502j85910j52431p4455
38196B51941Q691O6847R6368J12246J28111J39728J25736O8207k4242j13884j55860
38185G03889j26762l8291P2603J69282K37049K82815L13865L18649K71898J61360
38175B366357R030j37292k36941k81515k87233k67652k22953j56336q7907m0819
38165F56739j7899j484K5285O4084J02822J20216R4092K3148n7283r9543r4104
38154H16073q2878j10417j70478k12912j96537j23053k4577O6306J31819J64906
38144B58252J56093Q7027n2939k35595l89170m42621l79102k42697j01486j3613
38134a355851j0509p7719j46882j39436m0559Q6152J74934K31959L09031M14106
$$ y = [1477926, 1461250, 1351250, 1197015, 1059463, 949433, 828239, 664737, 478827, 326396, 251941, 260632, 327479, 423847, 536093, 664204, 803932, 929668, 997875, 973633, 859749, 703889, 577127, 538836, 611439, 780721, 1017770, 1300585, 1614450, 1933099, 2204997, 2366357, 2375387, 2238095, 2001154, 1719639, 1432406, 1164754, 941801, 785465, 697558, 656739, 638840, 637356, 662641, 726725, 829547, 949763, 1043855, 1067003, 1009720, 910177, 816073, 733195, 622778, 452300, 239388, 42851, -80202, -104779, -38473, 93346, 258252, 414345, 501372, 448433, 212838, -176332, -618953, -998055, -1240752, -1342238, -1355851, -1366360, -1444079, -1590961, -1730397, -1770956, -1684804, -1509870, -1277911, -968880, -554774]
38124e54774M79484M26803K46027N319k00023l02489k89450k00052r5145j6060
38114e00360L4906P6437J17995J52430J71493J77065J74758J63856J39907J06022
38104H14509P5088N5652L8333N739m0088p0238o0594k5923o863k1358m4249m1556
38092F78452j1166K1050L3780K4114m028m7488r8128j41112j62011j51500j09607
38081C2356n6912l4046o7617j31432j59907j10808l805J08247J87788K19515J89591
38070A72970Q8061o6090k20529l16172l14443k10891m3238J18168K14919K46321
38060c30924K56983K76862K93325K85393K55859K12305J43077M0414o9300j49179
38050A214815j95638k27347k38858k05799j41635j07795j44051k14843k48682
$$ y = [-554774, -75290, 351513, 597540, 602859, 402836, 100347, -189103, -389155, -484300, -500360, -465454, -389017, -271022, -118592, 52901, 229966, 404724, 568580, 708487, 814509, 889597, 945249, 983582, 989321, 949233, 878995, 818401, 792478, 785615, 764257, 720008, 678452, 667286, 688336, 722116, 746230, 742202, 694714, 596586, 455474, 293463, 141963, 32356, -24556, -58602, -126219, -257651, -417558, -528366, -532171, -423924, -236136, -16621, 172970, 261031, 194941, -25588, -341760, -656203, -867094, -910332, -792164, -577245, -330924, -73941, 202921, 496246, 781639, 1037498, 1249803, 1392880, 1433294, 1363994, 1214815, 1019177, 791830, 552972, 347173, 205538, 97743, -46308, -261151, -509833]
38041e09833k13154j30841m0561K9108N9691M8695J9457N543K1092N6091R4427
38030e60285J21844J25378J08030J00670J33837J94646K35890K34692K18234K19666
38020A132602K31108K18491J65687Q1610k4748j48059k63571l24944l01999k15256
38010E50921j22621p1005o4838q0373j00577j25122j48768j48687j07284l7797
38000d56151L0431Q6798J37943J71905J52943O9306l1765p9784m9271J9411O2397
37989A14163M5149j9181q7601j22043j16798r5766q1335o9536l8763K1511R3374
37978c56826J36588J13812K2994r1170j70792j93328j72380j12895m39J47360
37968f77076K55811K62082J93210J32327J13755R7447M9550m335k8966l7946o4348
$$ y = [-509833, -722987, -853828, -894389, -865281, -805590, -756895, -737438, -731895, -710803, -654712, -560285, -438441, -313063, -205033, -104363, 29474, 224120, 460010, 694702, 912936, 1132602, 1363710, 1582201, 1747888, 1829498, 1804750, 1656691, 1393120, 1068176, 766177, 550921, 428300, 357295, 292457, 212084, 111507, -13615, -162383, -311070, -418354, -456151, -425720, -338922, -200979, -29074, 123869, 193175, 161410, 81626, 32355, 51766, 114163, 159312, 140131, 52530, -69513, -186311, -282077, -363412, -432948, -471711, -450200, -356826, -220238, -106426, -83432, -174602, -345394, -538722, -711102, -823997, -824436, -677076, -421265, -159183, 34027, 166354, 280109, 377556, 427106, 422771, 393805, 355859, 291511]
37957B91511j01076j14251j03818j06815j35489j48254r9797P6R5265J41054J39168
37946a42426J20619J07205R3107N8704j972o8344j07682j02672o6333l2109k9767
37935a71670o6884j27438j83991k11877j98696j48949q0203o541P6684J81085
37925i38480K91995L61801L54149K88434K20123J78363J44036R1892L0237j2319
37915A010231j8349J6339R3379J99358K89577L10392K46202J34909L4241k1689
37905B294590l7081l8525m7334o1192o2067m4371k9538m5206r3808j49915j86414
37894A499139j96313j91473j86147j78907j47083o8514M1226J22964J22991M7892
37884H65775m2333r4845j04645r7274r0986q4760p0151m1979j331M3228P7108
$$ y = [291511, 190435, 76184, -27634, -134449, -269938, -418192, -517989, -517913, -422648, -281594, -142426, -21807, 85398, 178505, 237209, 235237, 166893, 59211, -43461, -109794, -141903, -171670, -238554, -365992, -549983, -761860, -960556, -1109505, -1189708, -1196249, -1119565, -938480, -646485, -284684, 69465, 357899, 578022, 756385, 900421, 992313, 1022550, 1010231, 991882, 1008221, 1101600, 1300958, 1590535, 1900927, 2147129, 2282038, 2316279, 2294590, 2257509, 2218984, 2171650, 2110458, 2048391, 2004020, 1974482, 1929276, 1835468, 1685553, 1499139, 1302826, 1111353, 925206, 746299, 599216, 530702, 571928, 694892, 817883, 865775, 823442, 728597, 623952, 526678, 435692, 350932, 280781, 238802, 237471, 280699, 357807]
37873C57807Q5353N8231m067q6781j64515k18485k48019k57260k36635j73522
37863h87893q0596N848O3253J03105J43899J77822J78560J33449N2755m8352j61553
37852c19703k77945l79692m42819m45189l76397k49707j04357J3761P9331R6663
37842b406054Q9044Q8616J30315K32411L67187M61125M47509L29335J81568Q1839
37832B895M2687J9675k1764o6709q1094o0009k7294J159K8608N1003M2940j6763
37820h4666j16032k14252k67282k44536j40193J4337J55962K26712K11850J42018
37810c16082O6829L0509N5371J25009J84481J76850R0148l3802j33784j67761
37800G7768j31017n7608l019m823n3108j10212j57259k01174k33339k09816r4051
$$ y = [357807, 443160, 501391, 497324, 410543, 246028, 27543, -220476, -477736, -714371, -887893, -968489, -962641, -899388, -796283, -652384, -474562, -296002, -162553, -109798, -158150, -319703, -597648, -977340, -1420159, -1865348, -2241745, -2491452, -2595809, -2582048, -2502717, -2406054, -2317010, -2228394, -2098079, -1865668, -1498481, -1037356, -589847, -260512, -78944, 2895, 45582, 65257, 43493, -23216, -104310, -164319, -191613, -190454, -161846, -110843, -67903, -84666, -200698, -414950, -682232, -926768, -1066961, -1052624, -896662, -669950, -458100, -316082, -249253, -218744, -163373, -38364, 146117, 322967, 413115, 379313, 245529, 77768, -53249, -110857, -113876, -118699, -171807, -282019, -439278, -640452, -873791, -1083607, -1177658]
37789a177658R2667K81654M12033M64233M49703L87952K94695J79514N1896o6217
37779A370472j39970j44631q8258n099O9135J09446J00698M3407l8845j11211
37769A165144j51120j55894j32517r0764m2548M023M6396P1344M6047m9988j81874
37758E28249k73331k77242k18162j55828j22797j10810j02066r1038p7751n6553
37748i57329j7373M5259J22935J92589K33883K51760K71521L04042L25725L01526
37738A074538K18158Q6164p6064k41481l65957m06151l56089k58445j73357j34164
37728f32848j25415r7275q592J31887K64960L24134K79768J51238j459r5864p2217
37717A18317M8191J63444J78660R0290l2396j30550j89104k03903j66147q9548
$$ y = [-1177658, -1084991, -803337, -391304, 72929, 522632, 910584, 1205279, 1384793, 1436689, 1370472, 1230502, 1085871, 997613, 992514, 1061649, 1171095, 1271793, 1315200, 1276355, 1165144, 1014024, 858130, 725613, 634849, 592301, 596324, 642720, 714064, 760111, 710123, 528249, 254918, -22324, -240486, -396314, -519111, -629921, -731987, -823025, -900776, -957329, -974702, -929443, -806508, -613919, -380036, -128276, 143245, 447287, 773012, 1074538, 1292696, 1378860, 1302796, 1061315, 695358, 289207, -66882, -325327, -498684, -632848, -758263, -855538, -864130, -732243, -467283, -143149, 136619, 287857, 286398, 190534, 118317, 166508, 329952, 508612, 598902, 566506, 435956, 246852, 42949, -123198, -212746]
37707b12746j3432M0108Q5166J34468J72288J84880J92170K21730K64714K80848
37697A350194K42380J61620Q4126N9826J00629J53437J35463J5983j48489k71472
37687A883697l10658k76224j99516j24215j02477j53869k29912k53261j95754
37678C7811r4951J926Q1427J50861K11533K54773K66693K32917J55225O4472k92
37667A362395k5252j8574J7087P9506J35746J33008N7224m3534j12239j43054
37657A442313j72871k26618k87022l11378k67461j59725k9596P3657J26966J37335
37647C25600J19181Q1910L7517J207k1559l6048m3720m0708l3618m2554q3626
37636B63582j56095k40258k93009k59635j25851L9953J34156J23522P6230P4124
$$ y = [-212746, -226178, -186070, -100904, 33564, 205852, 390732, 582902, 804632, 1069346, 1350194, 1592574, 1754194, 1838320, 1898146, 1998775, 2152212, 2287675, 2303658, 2155169, 1883697, 1573039, 1296815, 1097299, 973084, 870607, 716738, 486826, 233565, 37811, -57140, -55214, 26213, 177074, 388607, 643380, 910073, 1142990, 1298215, 1362687, 1362395, 1337143, 1318569, 1335656, 1415162, 1550908, 1683916, 1741140, 1697606, 1585367, 1442313, 1269442, 1042824, 755802, 444424, 176963, 17238, -12358, 61299, 188265, 325600, 444781, 526691, 564208, 565415, 543856, 507808, 464088, 423380, 389762, 347208, 263582, 107487, -132771, -425780, -685415, -811266, -771313, -637157, -513635, -437405, -363281]
37626c63281J24704J80079K10858K26367K37925K36174K02858J25322N137j30714
37616A055429k34281k67471k24018j18410K4052J52772J98298J29692l266j12689
37606F00108j52556j37106r4686l5462L6449J05738J47884J40570Q3377J7593
37596G11909N043O1944J31982J55421J46044J58074J89609J72756O7456q2083
37586A718155k03326k70795l02502l09692k78450j92369o0761O8510J27439Q1965
37576C78174k7717j21177j53177j33790q1668K214J06984J98233K47707K45280
37566F61063J74574K3304j62267k82752k81325j96503q8221L9430J90584K99518
37556C77405K80206J43251p587r9962j52149j99185k25655k02826j44761q9763
$$ y = [-363281, -238577, -58498, 152360, 378727, 616652, 852826, 1055684, 1181006, 1186143, 1055429, 821148, 553677, 329659, 211249, 235301, 388073, 586371, 716063, 712797, 600108, 447552, 310446, 215760, 180298, 216747, 322485, 470369, 610939, 694316, 711909, 716952, 778896, 910878, 1066299, 1212343, 1370417, 1560026, 1732782, 1800238, 1718155, 1514829, 1244034, 941532, 631840, 353390, 161021, 100260, 168770, 296209, 378174, 350457, 229280, 76103, -57687, -139355, -137141, -30157, 168076, 415783, 661063, 835637, 858941, 696674, 413922, 132597, -63906, -152127, -112697, 77887, 377405, 657611, 800862, 793275, 693313, 541164, 341979, 116324, -86502, -231263, -321026]
37546c21026n3736k9341o792K8376R3321J77776K36606K38111K02756J70938J50987
37535H87976J25276Q9405N1470L090p1216j53882j96001j69347r4590j0435O2384
37524E24130J15421J34926J13399O8396K6578j0924o8002j51506k24085k32844
37514B95489j61952m7815N4039J04599Q7053K207j20945k19790k31326j44515
37504c82956j2844R0720J27363J05689N9169K0012M912J3009L5246O4932R4122
37493B19374J03693P3984J2151m4938o6489n8063m9083o2349j04073j64518k08499
37482c48810j82771o7735P7811J55635J25181M2657o328P357M9814P8615P6443
37471G869M2606j4185o5301o7824j767J00635J75346J81811J36745R1784Q0686
$$ y = [-321026, -374762, -404103, -410895, -382519, -289198, -111422, 125184, 363295, 566051, 736989, 887976, 1013252, 1102657, 1154127, 1157217, 1086001, 932119, 736118, 566771, 472181, 461746, 524130, 639551, 774477, 887876, 956272, 982850, 971926, 903924, 752418, 528333, 295489, 133537, 85722, 139761, 244360, 331413, 333620, 212675, -7115, -238441, -382956, -395800, -305080, -177717, -72028, -12859, 7153, 12065, 25074, 60320, 125252, 219374, 323067, 397051, 409202, 364264, 297775, 239712, 190629, 128280, 24207, -140311, -348810, -531581, -599316, -521505, -365870, -240689, -198032, -204360, -197003, -147189, -68574, 7869, 50475, 36290, -29011, -96835, -98602, 2033, 177379, 359190, 495935, 587719, 668405]
37460F68405R4798J11600J34274J84908K59783L13735L02219K25703J19482J3877
37450B428784p5509j31187j40435j23079j24160j63446k09471k17013j75020j05091
37440I64373l2405J9399K0547m2831j35788j90540j67129q4289J3194R6268J50307
37429F11106J55670R7155r181j17439j85539k02659j87839j70659j67725j64001
37419c41111j18640n922J43096K52456K66341J98145J08130L9084j4029p2553
37409D54997j29539j50249j15080n0306q772k1492p2266j19020j34857j24908
37399d71492j05256p2748m979J04625K18233K75902K54220J92127J46153J29013
37389F65798J11185P7374N0828M9847M7540J736q6917j73507k22086k36389k37648
$$ y = [668405, 763203, 874803, 1009077, 1193985, 1453768, 1767503, 2069722, 2295425, 2414907, 2428784, 2353275, 2222088, 2081653, 1958574, 1834414, 1670968, 1461497, 1244484, 1069464, 964373, 931968, 951367, 971914, 929083, 793295, 602755, 435626, 351337, 364531, 460799, 611106, 766776, 863931, 854750, 737311, 551772, 349113, 161274, -9385, -177110, -341111, -459751, -465673, -322577, -70121, 196220, 394365, 502495, 541579, 527550, 454997, 325458, 175209, 60129, 9823, 1051, -20441, -92707, -211727, -346584, -471492, -576748, -649496, -654475, -549850, -331617, -55715, 198505, 390632, 536785, 665798, 776983, 854357, 905185, 955032, 1002572, 1004308, 917391, 743884, 521798, 285409, 47761]
37378D7761k37039k37180k38267k29293j89738j14873k8148M5549J09161J80733
37368h91334K58171L14052L26383L01834K63672K22788J65808P4553m0045j28168
37358H67714j36732n6467P6630K23152L60282M55310M55368L37575J55853L484
37348B742169p0758q7188q5702q5694r4019j13354j28853j17207q4495o6082p0895
37337A737922n7021Q931R3377J32235J10967P2401N2709M5901L1306J510m3415
37326B186823r9361j46394j60538j48716j46574j66342j69999j15251j2942Q1920
37316A102626J26924J22481R3322N8974K2826k0394o6651r0397o2468R581P0500
37305A367324O3449j5583j19268j96601k25271k06741j55480r9929p4190r1235
$$ y = [47761, -189278, -426458, -664725, -894018, -1083756, -1198629, -1226777, -1181228, -1072067, -891334, -633163, -319111, 7272, 309106, 572778, 795566, 961374, 1035927, 995882, 867714, 730982, 674515, 751145, 974297, 1334579, 1789889, 2245257, 2582832, 2738685, 2742169, 2671411, 2584223, 2498521, 2412827, 2318808, 2205454, 2076601, 1959394, 1874899, 1808817, 1737922, 1680901, 1689832, 1783209, 1915444, 2026411, 2098812, 2151521, 2197422, 2228728, 2230238, 2186823, 2087462, 1941068, 1780530, 1631814, 1485240, 1318898, 1148899, 1033648, 1020706, 1102626, 1229550, 1352031, 1445353, 1504327, 1527153, 1506759, 1440108, 1349711, 1287243, 1296824, 1367324, 1430773, 1415190, 1295922, 1099321, 874050, 667309, 511829, 411900, 337710, 246475]
37295B46475j26907j40081j10829n5905o174K8568O7352J27834J94643K29341
37285D54317K12175J60042R7557K5755o5891j65348k34281k40348j83873r3810
37275c3705p368M5849N1044J0653n4182j04030r5807j7444Q9481J61883J78578
37264B24952J72621J71091J50848P9293k4736j07936j49080j69505j81283j67907
37254a642j24563p6835m0491M467P6015J52131J96547K03426J91251J68035J29847
37243H78188Q3961M5072R452m4898j28431k23165k95559l17108k78339j96091
37233d66918j04059k4148N0702J36886K30448L08480L52551L55528L10071K08586
37223A358127N8345j13146k69218l76368m14548l89575l32712k73726k12406j25174
$$ y = [246475, 119568, -20513, -131342, -187247, -193421, -164853, -97501, 30333, 224976, 454317, 666492, 826534, 924091, 949846, 883955, 718607, 484326, 243978, 60105, -33705, -41073, 4776, 55820, 66473, 12291, -91739, -187546, -204990, -115509, 46374, 224952, 397573, 568664, 719512, 798805, 774069, 666133, 517053, 347548, 166265, -1642, -126205, -203040, -243531, -239064, -163049, -10918, 185629, 389055, 580306, 748341, 878188, 962149, 1007221, 1016673, 971775, 843344, 620179, 324620, 7512, -270827, -466918, -570977, -595125, -544423, -407537, -177089, 131391, 483942, 839470, 1149541, 1358127, 1416472, 1303326, 1034108, 657740, 243192, -146383, -479095, -752821, -965227, -1090401]
37213a090401oJ41437K53901K97574K67763K06261J72796J89819K21548K19912
37203H80604J80406J34177R7247N7763J2589j6223j4357r13l145j9070k1491P224
37191A294811N5706R5029J04403R1375Q8478J18766J59667J53512O4068q3540
37181B142275k24021l03018l02710k34849j29786k9718K6847K5493j9198p7152
37171H74163j17444j16416o8448J136M1971J5479o4583j35255j40220q3188j7120
37160A90075J7551K8173L9318M8722L4921K18j8366J2860Q7004J61177J91523
37149G93176J65887J11455O8522M8451K2961l3712j01018j31525j11740p8536
37139G53921o6358n8990r901R9423K34647L37193L69200L34252K62827J82616
$$ y = [-1090401, -1090407, -948970, -695069, -397495, -129732, 76529, 249325, 439144, 660692, 880604, 1061010, 1195187, 1292434, 1350197, 1362786, 1346563, 1332206, 1331293, 1328148, 1309078, 1287587, 1294811, 1350517, 1445546, 1549949, 1641324, 1729802, 1848568, 2008235, 2161747, 2225815, 2142275, 1918254, 1615236, 1312526, 1077677, 947891, 918173, 945020, 970513, 951315, 874163, 756719, 640303, 571855, 572991, 614962, 630441, 565858, 430603, 290383, 207195, 190075, 207626, 235799, 275117, 323839, 358760, 358978, 340612, 353472, 440476, 601653, 793176, 959063, 1070518, 1139040, 1187491, 1210452, 1176740, 1075722, 944197, 832457, 753921, 687563, 628573, 618672, 718095, 952742, 1289935, 1659135, 1993387, 2256214, 2438830]
37129B438830J06905M8477K4446K9709K0315m4478j40902j91254j50425o2479
37119B079144j6190n7466j56813k47872k82160k55990k01546j52735j13796o1597
37109E32979K3955J39332K59646L44001L45019K43639Q3623n4872j31018j72666
37099A613638k18626k57018k41162j47243L254J58472K52799K33543J06485n4455
37089A449687j72272k35206k75729k96478k59346j53916l9156O868l4087j06440
37079a16075j40976j22213r6575j13474j62429j82253j34523m5919L3540Q8373
37069i92524J32188J70957K05872K53896L23587L78795L69262K96794K10339J34827
37059A483993N2144l7322q6617o6530k0686j8656p3991j39197j66032j42664q5566
$$ y = [2438830, 2545735, 2594212, 2618658, 2648367, 2668682, 2624204, 2483302, 2292048, 2141623, 2079144, 2062954, 2005488, 1848675, 1600803, 1318643, 1062653, 861107, 708372, 594576, 532979, 556934, 696266, 955912, 1299913, 1644932, 1888571, 1972194, 1917322, 1786304, 1613638, 1395012, 1137994, 896832, 749589, 752843, 911315, 1164114, 1397657, 1504142, 1449687, 1277415, 1042209, 766480, 470002, 210656, 56740, 17584, 24452, -9635, -116075, -257051, -379264, -475839, -589313, -751742, -933995, -1068518, -1114437, -1080897, -992524, -860336, -689379, -483507, -229611, 93976, 472771, 842033, 1138827, 1349166, 1483993, 1536137, 1498815, 1412198, 1345668, 1324982, 1306326, 1232335, 1093138, 927106, 784442, 698876]
37048F98876k6221p84k4426p2533j05352j12445j17650j39148j59489j41872p0166
37037b71210L1542J19218J68236J89349K04052K15609K17028K14004K12414J88092
37027A488334J07014j2978r6967r5242m5912k7913p0947j40383j91680k01187
37017G12139j52467l9500J00681J88800J62600L2858j24199k24806k33866j83737
37007B38503j45293j68743k41835l03650k95459j98067l6628J32122K45186K70946
36997e02918K29619J66684J07612N1392K101j9883p173J5341J8307O211J1751
36986G9044N2732J06401J32265J17001R0276R2697J32858J84333K20628K35162
36976A443397K23662J72673Q6757R485j3523R392K2093j3709p7967j19418j06186
$$ y = [698876, 672655, 671871, 647445, 574912, 469560, 357115, 239465, 100317, -59172, -201044, -271210, -239668, -120450, 47786, 237135, 441187, 656796, 873824, 1087828, 1300242, 1488334, 1595348, 1582370, 1485403, 1390161, 1344249, 1316336, 1245389, 1105006, 913326, 712139, 559672, 520172, 620853, 809653, 972253, 1005111, 880912, 656106, 422240, 238503, 93210, -75533, -317368, -621018, -916477, -1114544, -1151172, -1019050, -773864, -502918, -273299, -106615, 997, 52389, 54490, 34607, 27434, 42775, 61082, 67293, 79044, 131776, 238177, 370442, 487443, 577719, 670416, 803274, 987607, 1208235, 1443397, 1667059, 1839732, 1926489, 1935974, 1922451, 1931843, 1953936, 1940227, 1862260, 1742842, 1636656]
36965A636656m9397M868Q479m1305q5570n9260L2503J17956J43044J22555R7933
36954A928462Q0112N8606L8415L3160L4727J9656j9816p1512j19618j44431j20682
36943A717079m6529L1479N3141Q708n0814o6261j6141P9914J73785K06529J47842
36932B238732L2789n9183p3750k3021L7585N6622J9471l6048l7743N1754J72654
36921B379862K05806Q9594j22849l30364m73044n38660n24786m41955l37763k70573
36911c64732k51191k34637j72961n9977P2519J83219K45571K59448K42650K08188
36901A28097J58867J06992P7248P4551P0931M7048K7094M4172Q7582J17188J17850
36890A057620J05191Q8397O7058N8786Q4802J24137J25022P2672Q484k7777l5004
$$ y = [1636656, 1587259, 1592127, 1600606, 1559301, 1473731, 1414471, 1446974, 1564930, 1707974, 1830529, 1928462, 2008574, 2067180, 2105595, 2138755, 2173482, 2193138, 2173322, 2101810, 1982192, 1837761, 1717079, 1670550, 1702029, 1755170, 1763878, 1713064, 1646803, 1630662, 1710576, 1884361, 2090890, 2238732, 2271521, 2212338, 2138588, 2115567, 2153152, 2209774, 2229245, 2193197, 2155454, 2207208, 2379862, 2585668, 2675262, 2552413, 2222049, 1749005, 1210345, 685559, 243604, -94159, -364732, -615923, -850560, -1023521, -1083498, -1010979, -827760, -582189, -322741, -80091, 128097, 286964, 393956, 471204, 545755, 616686, 663734, 690828, 735000, 822582, 939770, 1057620, 1162811, 1251208, 1318266, 1377052, 1461854, 1585991, 1711013, 1783685, 1792169, 1764392, 1729388]
36879A729388j7300M1705J44110K51773L23476L51018L35191K59776J24949j8369
36869C525717j07767j32709j29900j29554j36606j52436j79849k08145k19904
36860B128847k11462j86933j39692o4253J7482O5447N9044J3934l0956l2784K9028
36849A647702J21833J70238J25826J8089q6376j57603k03360k16172j70678p7315
36839A172184O881L7630K3319n610l4921n6537m7847J1898J11557K07130K47767
36828A673451K07177J08007J5995j2186J7101M7793M2454J7280Q363K9551P1857
36817B226843J18916J48981J41455R6441L4555l0568j01384j69076j99119j62757
36807B104287p1588L2349J11232J48335J46505J25780J14478J29050J63414J99145
$$ y = [1729388, 1712088, 1753793, 1897903, 2149676, 2473152, 2824170, 3159361, 3419137, 3544086, 3525717, 3417950, 3285241, 3155341, 3025787, 2889181, 2736745, 2556896, 2348751, 2128847, 1917385, 1730452, 1590760, 1526507, 1543989, 1609436, 1668480, 1682414, 1651458, 1618674, 1647702, 1769535, 1939773, 2065599, 2083688, 1997312, 1839709, 1636349, 1420177, 1249499, 1172184, 1179065, 1216695, 1240014, 1234404, 1199483, 1142946, 1095099, 1106997, 1218554, 1425684, 1673451, 1880628, 1988635, 2004630, 1992444, 2009545, 2057338, 2099792, 2117072, 2125435, 2154986, 2226843, 2345759, 2494740, 2636195, 2732636, 2767191, 2736623, 2635239, 2466163, 2267044, 2104287, 2032699, 2065048, 2176280, 2324615, 2471120, 2596900, 2711378, 2840428, 3003842, 3202987]
36797C202987K17186J99172J33454K8803q6400j83230k44519k63056k43534k04517
36787B556346j60112j00036q370R8407J77232K05617J96577J61977R3927l283
36777C218282r5764j59837k15096k88336l59565l74700l09423j98458r9816m2842
36767A074445j1151L2731J07338J95097K65569L06497L18785K92210K15703J13419
36757B910643L9072K1897M1443O4778Q1701R2653R4312R6229J20644J60038J62867
36746C886277R3510j4141r6140j35323j63179j94972k02284j56383p1499P827
36736B953693N2860Q0050J35068K37323L36878L47158K35821O6181o7438j26426
36726D251168j31639j07680o1959j0288J7346P894j9212l6380l5217k5446j6004
$$ y = [3202987, 3420173, 3619345, 3752799, 3781602, 3695202, 3511972, 3267453, 3004397, 2760863, 2556346, 2396234, 2296198, 2287828, 2386235, 2563467, 2769084, 2965661, 3127638, 3221565, 3218282, 3122518, 2962681, 2747585, 2459249, 2099684, 1724984, 1415561, 1217103, 1117287, 1074445, 1063294, 1096025, 1203363, 1398460, 1664029, 1970526, 2289311, 2581521, 2797224, 2910643, 2949715, 2971612, 3013055, 3077833, 3159534, 3252187, 3346499, 3442728, 3563372, 3723410, 3886277, 3979787, 3965646, 3869506, 3734183, 3571004, 3376032, 3173748, 3017365, 2945866, 2953693, 3006553, 3086603, 3221671, 3458994, 3795872, 4143030, 4378851, 4445032, 4377594, 4251168, 4119529, 4011849, 3949890, 3939602, 3956948, 3964842, 3945630, 3909250, 3874033, 3848587, 3832583]
36715C832583j633L1039P8027J02703O7169j4443p8718q4549n8377m6272m5000
36704C782529j4696N1880J10278J18039Q0776L6845J3629Q076L457l21K2454R2336
36692D305282J85280K42489K27028J53859N7481m5423j45318k15734k26589j73696
36682D364659p9453K6706J18893J81003K14714K30251K27326K06448J97562K38603
36672E926712L12975L49706L09443K31534J66505J02753M613j06052j57938j11073
36662G029178P974J43910K54848L24936L63715L91933M16393M30597M43991M82376
36652A0289851N51229O37136P59173R69053J269337J572775J773675J823161J720465
36643B1365855J497656J248127J091285J044271R93827Q63397P31352O81496N99652
$$ y = [3832583, 3830950, 3861989, 3940016, 4042719, 4109888, 4095445, 4016727, 3932178, 3873801, 3827529, 3782529, 3767833, 3819713, 3929991, 4048030, 4128806, 4165651, 4179280, 4187356, 4190813, 4190492, 4212946, 4305282, 4490562, 4733051, 4960079, 5113938, 5171419, 5125996, 4980678, 4764944, 4538355, 4364659, 4285206, 4311912, 4430805, 4611808, 4826522, 5056773, 5284099, 5490547, 5688109, 5926712, 6239687, 6589393, 6898836, 7130370, 7296875, 7399628, 7404241, 7298189, 7140251, 7029178, 7037152, 7181062, 7435910, 7760846, 8124561, 8516494, 8932887, 9363484, 9807475, 10289851, 10841080, 11478216, 12237389, 13206442, 14475779, 16048554, 17822229, 19645390, 21365855, 22863511, 24111638, 25202923, 26247194, 27241021, 28104418, 28835770, 29517266, 30116918]
36634C0116918K61204l77231j085240j577172j742408j653181j439962j198901
36626B1304027r59104o93252l75637l4036K74488N21697P14242Q70416J027143
36617B2649984J235584J507833J804810K113798K483174K935720L417303L885149
36609D2033355M353823M771548M957362M794396M424774M139579M139439M489549
36601G8103825N167792N977753O534717O592779O379561O439228P184659Q728719
36593A31109033J0980927J3621425J6066721J7724319J8131290J6535892J1728710
36586B35898317L195792p343307j6331896k0946601k1089200j8668776j5485141
36579A39229188j2278137r252507o559549m172128j886728L62119K492430M581655
$$ y = [30116918, 30378122, 30000891, 28915651, 27338479, 25596071, 23942890, 22502928, 21304027, 20344923, 19651671, 19276034, 19241998, 19516486, 20038183, 20752425, 21622841, 22649984, 23885568, 25393401, 27198211, 29312009, 31795183, 34730903, 38148206, 42033355, 46387178, 51158726, 56116088, 60910484, 65335258, 69474837, 73614276, 78103825, 83271617, 89249370, 95784087, 102376866, 108756427, 115195655, 122380314, 131109033, 142089960, 155711385, 171778106, 189502425, 207633715, 224169607, 235898317, 239094109, 231750802, 215418906, 194472305, 173383105, 154714329, 139229188, 126951051, 117698544, 111138995, 106966867, 105080139, 105442258, 107934688, 112516343]
36571A12516343O861773R427155J2242800J5369241J8855635K2479189K5812037
36564B23564173K8178257K8033683K2947067J1563952l954154j8406362k7332345
36557B64594271l0136898k9277612k7149484k4522803k1416388j8160155j5226741
36550I8704190j2737609j0601822q833043p457219o347137n370328m542032l892672
36542C8922328l341149k818405k374535k057595j809485j571837j380030j266145
36534B2303147j168513j019456q47425p30931p15086q07309r78624j137986j185549
36525A3712268j123820j043983r85074q92913p39490n86747m92196m34050l72017
36516G041978l10605k64908k30452k19926k64032l44859l91802l71549l19797
$$ y = [112516343, 119378116, 128805271, 141048071, 156417312, 175272947, 197752136, 223564173, 251742430, 279776113, 302723180, 314287132, 310332978, 291926616, 264594271, 234457373, 205179761, 178030277, 153507474, 132091086, 113930931, 98704190, 85966581, 75364759, 66531716, 59074497, 52727360, 47357032, 42815000, 38922328, 35581179, 32762774, 30388239, 28330644, 26521159, 24949322, 23569292, 22303147, 21134634, 20115178, 19267753, 18536822, 17821736, 17014427, 16035803, 14897817, 13712268, 12588448, 11544465, 10559391, 9666478, 8926988, 8340241, 7848045, 7413995, 7041978, 6731373, 6466465, 6236013, 6016087, 5752055, 5407196, 5015394, 4643845, 4324048]
36507D324048k62553j78451o7436J8880N4756Q0770J26021J53223J24248O1724
36497D435230K462n3567j03575j08579n2525J1618K6337k44l5655r0241j83695
36486C847566k74953k87469j95204m0803J19287K49174L25496L35499K85770J94084
36476D558447P9333l0489j01302j22099j13218r2946n9898k0062L010O610K2804
36465D130190O4644R0308N6964j5271p2500j00370j26123j60135j79887j71559
36455C516261j47903j16508o2899J8443R5958J21645P6361r442p4883o9000J6643
36444C364676J44466K55136K97870K51369J34278j190j00129j39936j33945j05951
36434C966644p4662o1443r1325j71764k75939l54674l66829l07697k20574j73594
$$ y = [4324048, 4061495, 3883044, 3815608, 3834488, 3889244, 3970014, 4096035, 4249258, 4373506, 4435230, 4437692, 4384125, 4280550, 4171971, 4119446, 4131064, 4157401, 4157157, 4121502, 4031261, 3847566, 3572613, 3285144, 3089940, 3049137, 3168424, 3417598, 3743094, 4078593, 4364363, 4558447, 4637780, 4607291, 4505989, 4383890, 4270672, 4177726, 4117828, 4097766, 4100776, 4107386, 4130190, 4194834, 4285142, 4342106, 4326835, 4254335, 4153965, 4027842, 3867707, 3687820, 3516261, 3368358, 3251850, 3188951, 3207394, 3303352, 3424997, 3501358, 3491916, 3417033, 3348033, 3364676, 3509142, 3764278, 4062148, 4313517, 4447795, 4446605, 4346476, 4206540, 4072595, 3966644, 3891982, 3830539, 3739214, 3567450, 3291511, 2936837, 2570008, 2262311, 2041737, 1868143]
36424A868143k04366k84515l52249l76410l70262l48855l04014k28038j33048
36415g33614l2452P3462J77677K54511K89443L04630L28837L48704L15711K06667
36405A533576N9522o1316j26424j56163j77039j80994j42399o5634R275N2571
36395G44975P1712Q1734P7632N9796O0184J04249J59894J67806J23635Q9400J11386
36384A852403J60682J74203J30827O4797J5006k0754p8504j76031k70497k87025
36374A565107k05732r9394n2024n4260k4414O7538J48925J36836L9867o2468j11883
36363A348098j07982p0847p067P9446J61679J88897J21830j9601j48009j71065
36353A375379p4404O7219J64552J88576J74790J76210K18150K78526L01539K44187
$$ y = [1868143, 1663777, 1379262, 1027013, 650603, 280341, -68514, -372528, -600566, -733614, -766066, -692604, -514927, -260416, 29027, 333657, 662494, 1011198, 1326909, 1533576, 1593098, 1531782, 1405358, 1249195, 1072156, 891162, 748763, 683129, 692404, 744975, 816687, 898421, 976053, 1035849, 1096033, 1200282, 1360176, 1527982, 1651617, 1741017, 1852403, 2013085, 2187288, 2318115, 2382912, 2397918, 2377164, 2298660, 2122629, 1852132, 1565107, 1359375, 1259981, 1207957, 1153697, 1129283, 1196821, 1345746, 1482582, 1522449, 1459981, 1348098, 1240116, 1169269, 1162202, 1241648, 1403327, 1592224, 1714054, 1694453, 1546444, 1375379, 1300975, 1368194, 1532746, 1721322, 1896112, 2072322, 2290472, 2568998, 2870537, 3114724]
36343C114724J17324k7038j45545k24891k61771k51550k03334j42290q8783n1864
36333A834982m1711o3014r5665j11574j14181j30609j61774j77077j66303j55543
36323F17531j57246j48736j24501j25402j77852k37979k41164j87573j37189j31598
36313a051709j56408j70770j38265l4617J37327L32860M89446N72572N86477N45384
36303A112297M52664L08036J22531p2478k27155k99162k90947k47668k04753j54476
36293D98889q0596k886M3073N7023P0781R6788J11620R6829P1303P0835J07623
36282A141282J56015J69982J14790m945j40729k28760k32403j66548q6438m3889
36272F78357l8394j4955O9364J78065K21664J58711M3476l6653m0710K2324J28609
$$ y = [3114724, 3232048, 3205010, 3059465, 2834574, 2572803, 2321253, 2117919, 1975629, 1886846, 1834982, 1793271, 1730257, 1634592, 1523018, 1408837, 1278228, 1116454, 939377, 773074, 617531, 460285, 311549, 187048, 61646, -116206, -354185, -595349, -782922, -920111, -1051709, -1208117, -1378887, -1517152, -1551769, -1414442, -1081582, -592136, -19564, 566913, 1112297, 1564961, 1872997, 1995528, 1923050, 1695895, 1396733, 1105786, 858118, 653365, 498889, 418293, 415407, 458480, 515503, 586284, 683072, 794692, 891521, 962824, 1033659, 1141282, 1297297, 1467279, 1582069, 1577124, 1436395, 1207635, 975232, 808684, 722246, 678357, 639963, 625008, 694372, 872437, 1094101, 1252812, 1296288, 1259635, 1218925, 1241249, 1369858]
36261A369858K41662L05616K80541J81798N9992m7370j22851j51176j33861j11072
36251A873137j26623j68560j77697j19044j6048Q7986J71130K28717K58130K62759
36241B273887K53050K34194K07649J86484J85801J89664J51900M9177p8611j58424
36231C494771j52537q8574k5250J914k416k4412p3850j69050k90053l69936l49518
36220A951089k32116p5396N6197J20129J02589K9640l5539l8977J2640O3327P1149
36209B024732M2253J218n0347j31889k46364l52976l84769l05340j51393n410
36199D39715P9326J10294J11528Q4103L3363J24K1468P7533J18995J34507J46073
36188A357029J49175J15959O3450N6761J16163J69103J34166K1888q6619j39397
$$ y = [1369858, 1611520, 1917136, 2197677, 2379475, 2439467, 2392097, 2269246, 2118070, 1984209, 1873137, 1746514, 1577954, 1400257, 1281213, 1265165, 1353151, 1524281, 1752998, 2011128, 2273887, 2526937, 2761131, 2968780, 3155264, 3341065, 3530729, 3682629, 3731806, 3653195, 3494771, 3342234, 3253660, 3228410, 3230324, 3227908, 3203496, 3129646, 2960596, 2670543, 2300607, 1951089, 1718973, 1643577, 1699774, 1819903, 1922492, 1952132, 1916593, 1877616, 1890256, 1953583, 2024732, 2066985, 2068203, 2017856, 1885967, 1639603, 1286627, 901858, 596518, 445125, 439715, 519041, 629335, 740863, 824966, 858329, 858453, 879921, 957454, 1076449, 1210956, 1357029, 1506204, 1622163, 1685613, 1742374, 1858537, 2027640, 2161806, 2183694, 2097075, 1957678]
36178A957678j51820j56951j59193j42929r9123l2834L9847R4243J07381P3842
36168A530141Q123o9853j45552k03695k20030j74634q3398q023j2851j01382k08034
36157C10812k61912k43930j71158n3973R4661K21859K57429J89243Q2860P270
36147D33161l3342p4459j23911j50890j32051p9213j7963M1923J06209J73364
36137A42828K17340J95853Q4861q7343k44649l12405k68900j52043j9701R5365
36127c48794J94937K84442L40874L26007K38572J39881J09440J75577K97915M08873
36117B167724M57132M22115L16399J81555O1120l2943j16069j92025k36392k27375
36107B801241j78817j32351j23500j57759k09693k44520k52535k61210k97401
$$ y = [1957678, 1805858, 1648907, 1489714, 1346785, 1247662, 1214828, 1254675, 1348918, 1456299, 1530141, 1538264, 1468411, 1322859, 1119164, 899134, 724500, 641102, 633079, 620228, 518846, 310812, 48900, -195030, -366188, -420161, -325500, -103641, 153788, 343031, 425891, 433161, 399819, 325360, 201449, 50559, -81492, -160705, -178668, -136745, -30536, 142828, 360168, 556021, 640882, 553539, 308890, -3515, -272415, -424458, -444159, -348794, -153857, 130585, 471459, 797466, 1036038, 1175919, 1285359, 1460936, 1758851, 2167724, 2624856, 3046971, 3363370, 3544925, 3606045, 3573102, 3457033, 3265008, 3028616, 2801241, 2622424, 2490073, 2366573, 2208814, 1999121, 1754601, 1502066, 1240856, 943455]
36098I43455l39873l33773k58327j55329p7217k9496J5980O8990J09456J23251
36088F7117J25442J40687J71582J94444J86201J52656J22654J06954P1553k7957
36078A311333j82056l15804l51562k72315j19974M6696J76372K27974J84585P6097
36068G81346k6155n3811J0048J21014K11261K42485K25418J90761J50038R1719
36058A944124P349r0472j70769j95272j40193k8390O8404Q7119L4755k8880o4674
36047A423101p9635q0968m9385K1513R3356J19014R1116L4524k6862p2515p7756
36036A395503l5423K6515P4406J04922J29314J37757J09258M8296j6370o2464
36026A911714p8757n1751J6772Q4259R8892O3432L5772N7794J12608J58987J74290
$$ y = [943455, 603582, 269809, 11482, -143847, -221064, -250560, -234580, -165590, -56134, 67117, 192559, 333246, 504828, 699272, 885473, 1038129, 1160783, 1267737, 1339290, 1311333, 1129277, 813473, 461911, 189596, 69622, 116318, 292690, 520664, 705249, 781346, 755191, 701380, 711428, 832442, 1043703, 1286188, 1511606, 1702367, 1852405, 1944124, 1951473, 1861001, 1690232, 1494960, 1354767, 1326377, 1394781, 1481900, 1516655, 1487775, 1423101, 1343466, 1262498, 1213113, 1234626, 1327982, 1446996, 1538112, 1572636, 1545774, 1473259, 1395503, 1360080, 1386595, 1461001, 1565923, 1695237, 1832994, 1942252, 1990548, 1974178, 1911714, 1832957, 1781206, 1797978, 1882237, 1981129, 2044561, 2080333, 2138127, 2250735, 2409722, 2584012]
36015B584012J49123P5060l3959j30617j74512j73353j63668j65128j77697k08687
36005A580574k67444l32745l55574l03328j83817k6038J35886K54472K80688K12144
35995I94818J11033M4068J2061l4450j15895j93067k20373j97102j49270q8156
35985A63667j4084N3975Q3823O5376K0590k1859m4636l6713O582P0419J23682
35974D70822J46274J44285J31320J05799N8640j095m1799l7743J69K9090J5083
35963A020845l4141q4745j19423j47543j72477j72641j26749l7459Q2947K23517
35953D32131L47518L84212K93564J32527J6410J0959Q9531J85306K42026K18123
35943B352307J00698o0128j73162j91873j52469j11503q1606m9835j8638P008
$$ y = [2584012, 2733135, 2808195, 2774236, 2643619, 2469107, 2295754, 2132086, 1966958, 1789261, 1580574, 1313130, 980385, 624811, 321483, 137666, 111628, 247514, 501986, 782674, 994818, 1105851, 1149919, 1161980, 1127530, 1011635, 818568, 598195, 401093, 251823, 163667, 149583, 203558, 287381, 352757, 373347, 351488, 306852, 270139, 276721, 347140, 470822, 617096, 761381, 892701, 998500, 1057140, 1056045, 1014246, 976503, 976672, 1005762, 1020845, 986704, 901959, 782536, 634993, 462516, 289875, 163126, 125667, 208614, 432131, 779649, 1163861, 1457425, 1589952, 1606362, 1617321, 1706852, 1892158, 2134184, 2352307, 2453005, 2392877, 2219715, 2027842, 1875373, 1763870, 1682264, 1632429, 1613791, 1620799]
35933A620799M2917R7800J42804J42961J01386M3193k0191p4489p5917P054J30278
35922B158595J96278J44022j1235k15298m08144n22035n00384l47718j41107K5373
35912C78347J03680J11720J17032J92772L51019N09770N54132M40361K21610k1481
35902B958962k36144l81882m15481l30634j87134o4724L679L3575M3254L7471
35892A460942K8160L7860P3593J15554J40091J42576J30771J05351N8396j0232
35882B283062q6303j58425k34413l25425m13489m54440m24120l44446k47285j31180
35872e36464J7346J69747K59569K49270J69115Q3270L8811M9555R6330J25406
35862G21955P4813o6637k32968l32935l27260k49949j68208j33648j56124k01853
$$ y = [1620799, 1663716, 1761516, 1904320, 2047281, 2148667, 2191860, 2171669, 2097180, 2021263, 2028317, 2158595, 2354873, 2498895, 2487660, 2272362, 1864218, 1342183, 841799, 494081, 352974, 378347, 482027, 593747, 710779, 903551, 1254570, 1764340, 2318472, 2758833, 2980443, 2958962, 2722818, 2340936, 1925455, 1594821, 1407687, 1342963, 1346642, 1380217, 1423471, 1460942, 1489102, 1526962, 1600555, 1716109, 1856200, 1998776, 2129547, 2234898, 2293294, 2283062, 2196759, 2038334, 1803921, 1478496, 1065007, 610567, 186447, -157999, -405284, -536464, -519118, -349371, -89802, 159468, 328583, 411853, 450664, 500219, 596549, 721955, 796768, 730131, 497163, 164228, -163032, -412981, -581189, -714837, -870961, -1072814]
35852a072814k20094j88440j32541r3023p9546o9941m7627k0980k854J4378N3870
35841a859612J27540K18518K90442L15235K92610K41661J76708R9053J1143p3835
35831a60537j42796j92961k21893k15270j58557o1949L5016Q8574Q1576L3616
35821i15181j5417l4823k3123l529j987k9120p6016j18115j24898p8843O601R0452
35809a323999J30086J07779M2454j3824l87J03993K45118L22348K74569J37750
35799B5887Q886m3112k4062J6242M0297M4536M1252L4405J4703k6497q1439j26233
35787g5135j39808j22899r4436o7868l7316O206M9665O3450L7079m120l0665m6265
35775d62112p2671j01977r2863k4206P2444J51693K04621K45570K63911K22811
$$ y = [-1072814, -1292908, -1481348, -1613889, -1706912, -1786458, -1856399, -1904026, -1925006, -1927860, -1913482, -1859612, -1732072, -1513554, -1223112, -907877, -615267, -373606, -196898, -97845, -86702, -160537, -303333, -496294, -718187, -933457, -1092014, -1153963, -1118947, -1030373, -948797, -915181, -930598, -965421, -988544, -992073, -994060, -1023180, -1099196, -1217311, -1342209, -1421052, -1414451, -1323999, -1193913, -1086134, -1043680, -1057504, -1057891, -953898, -708780, -386432, -111863, 25887, 34773, -8339, -32401, -16159, 24138, 68674, 109926, 144331, 159034, 132537, 51098, -75135, -214943, -337842, -432278, -500146, -537462, -531256, -481591, -418141, -381062, -385182, -415847, -462112, -534783, -636760, -729623, -753829, -681385, -529692, -325071, -79501, 184410, 407221]
35765D07221J09059l9118j60494k14741k01365j54127j16726j05220r2348m5439
35755f13298K2697O3863N7158L5425M0154P3340J05856J11644P8999R854p0867
35744h5175j20892j19886r6800r9586j42254j96120k24214k04676j27592J975
35734a415220J46583K41730K41174J61165P1639L6937O3961J08751J28441J16260
35724i8579Q6182M4788l148l5697k9995K626K5371K5235K7054M9302P4496P9391
35712B47026O6808M4758P72p0406j33490j47869j29528j36764j89457k39732k35966
35701i23848j83124j18858n8043P108O7358R6302R6604J16066J95526L12075L94455
35690A621L92623L14564J95777N9805p5245j75909k14288k05527j91029j79150
$$ y = [407221, 516280, 477162, 316668, 101927, -99438, -253565, -370291, -475511, -567859, -613298, -590601, -526738, -469580, -434155, -394001, -320661, -214805, -103161, -24162, -14308, -85175, -206067, -325953, -422753, -522339, -664593, -860713, -1084927, -1289603, -1417195, -1415220, -1268637, -1026907, -785733, -624568, -552929, -515992, -452031, -343280, -214839, -98579, -12397, 32391, 29243, -6454, -36449, -33823, -8452, 16783, 43837, 93139, 167635, 247026, 313834, 358592, 359364, 288958, 155468, 7599, -121929, -258693, -448150, -687882, -923848, -1106972, -1225830, -1283873, -1276765, -1209407, -1113105, -1016501, -900435, -704909, -392834, 1621, 394244, 708808, 904585, 964390, 889145, 713236, 498948, 293421, 102392, -76758]
35680g6758j34741l9958O7692J41688J83081K18918K44756K27278J55311N0611
35670A037878o9273j99532l14557l65785l30831k36300j16183K0984J60307K47968
35660a65324K33524J36871L5505j9923m8925r1313j40490j47620q2565K7469J19965
35649a42826J47009J04174K4551m3413n6427N023J19481K26405K63872K18746
35639H66595J35964P0003L2104n579o1435j19389j55865j72962j90511k14338
35629A84587k28199k14051j65186p9116M4023J84578K95165L25479K60439J33807
35619G41526Q047o0640n3338k12M2225L8395o86m2594p2097q7895p2732j593J08794
35606E47200J87168J70497O9200m9236j31107j68909j73203j46644r5964m3684
$$ y = [-76758, -211499, -251457, -183765, -42077, 141004, 359922, 604678, 831956, 987267, 1037878, 968605, 769073, 454516, 88731, -242100, -478400, -594583, -573599, -413292, -165324, 68200, 205071, 240576, 220653, 171728, 80415, -60075, -207695, -290260, -262791, -142826, 4183, 108357, 132908, 89495, 33068, 38091, 157572, 383977, 647849, 866595, 1002559, 1072562, 1104666, 1099087, 1037652, 918263, 762398, 589436, 398925, 184587, -43612, -257663, -422849, -501965, -457942, -273364, 21801, 347280, 607719, 741526, 749573, 688933, 635595, 635383, 677608, 716003, 715317, 672723, 600626, 512731, 439999, 438406, 547200, 734368, 904865, 974065, 924829, 793722, 624813, 451610, 304966, 209002, 165318]
35596A65318p820J7864M7351P6370R1732J00594J26994J73172K03275J79481J05199
35585A279530K0517l7780n8495m6447j3020J9950K8552J4282J2213N6440J41920
35574A417662K30592K86854K93238K41264J32387p386j33926k17487k59188k71060
35564A712950k55446k15610j73897j60010j79571k04337j97579j47260p5217j6436
35554H7587J1233J8836L1034O4452J21196J91085K48485K56187J91984P3098n7847
35543A237330j67513k37378k45833j80381p6524r427k1029p5132j08313j06404
35533I396j00329j00015p3649k51Q8253J36308J22700P7131M8583O6740J25034
35522C99901J87237K10696J75063R8504K6537k872P871J7376j4103q3868j50892
$$ y = [165318, 157498, 175362, 222713, 299083, 390815, 491409, 618403, 791575, 994850, 1174331, 1279530, 1300047, 1262267, 1203772, 1157325, 1144305, 1164255, 1192807, 1207089, 1219302, 1275742, 1417662, 1648254, 1935108, 2228346, 2469610, 2601997, 2594611, 2460685, 2243198, 1984010, 1712950, 1457504, 1241894, 1067997, 907987, 728416, 524079, 326500, 179240, 104023, 87587, 98820, 117656, 148690, 213142, 334338, 525423, 773908, 1030095, 1222079, 1295177, 1237330, 1069817, 832439, 586606, 406225, 329701, 320274, 299245, 224113, 115800, 9396, -90933, -190948, -264597, -264848, -176595, -40287, 82413, 159544, 208127, 274867, 399901, 587138, 797834, 972897, 1071401, 1097938, 1095066, 1102937, 1120313, 1106210, 1022342, 871450]
35511H71450j78469j64662j32940j05540q7259o3016j1246O3979J13777Q1019
35501C87093l4019j64485k43394k57499k25816j59533p3603j1760j5141o9491
35491h67648j18189j29516j23059j27895j42300j42127j09178m5752K4655P3592
35481a707417J00961J43773K27365L15996L45560L05330K51252K31272K34057
35472D48149K25954K02747J79706J57120J23440P5132J0328p9385j85277k64853
35462H93061k78198k33284j68889r9918j1018R3641J66433J59207P3914m3698
35452E51251j48907k20699k47751k16148j25168p899Q0285J01714O2430K10m1838
35441b12520k7827O2195K10507L52724M15237L72163K57947J27772K1788l6612
$$ y = [871450, 692981, 528319, 395379, 289839, 202580, 139564, 128318, 192297, 306074, 387093, 353074, 188589, -54805, -312304, -538120, -697653, -771256, -783016, -798157, -867648, -985837, -1115353, -1238412, -1366307, -1508607, -1650734, -1759912, -1805664, -1781009, -1707417, -1606456, -1462683, -1235318, -919322, -573762, -268432, -17180, 214092, 448149, 674103, 876850, 1056556, 1213676, 1337116, 1412248, 1422576, 1343191, 1157914, 893061, 614863, 381579, 212690, 112772, 101754, 195395, 361828, 521035, 594949, 551251, 402344, 181645, -66106, -282254, -407422, -415321, -335036, -233322, -170892, -170682, -212520, -240347, -178152, 32355, 385079, 800316, 1172479, 1430426, 1558198, 1579986, 1543374]
35431A543374l7448O183O2715J10138J47206J67751J42972M9349r2339k20993
35421A878908k76904k36703j21344J6724J22483J70198J69621J41637R7450M1728
35411B003798k2342r9043j91482k73018k86553j95264k7198J45188K60415K93471
35401A607972K49627J61446P9759L5569J1481k6175p3646r8369r8613j16441j79106
35390A553504k59593l15231l38725l43646l18158k30306q2740O4562J41703J31333
35380B703P5960K8788P691J45K623L6314J14338K05953K53142K22861J26881q742
35368A068657j67335l21317m15081m04157l11096k11571j51130r6420R640J54979
35358h44831K48757K13336O9619q1962j55588j40777p8224l018P3811J42866J80775
$$ y = [1543374, 1505926, 1512109, 1574824, 1684962, 1832168, 1999919, 2142891, 2192240, 2099901, 1878908, 1602004, 1365301, 1243957, 1260681, 1383164, 1553362, 1722983, 1864620, 1962070, 2003798, 1981456, 1882413, 1690931, 1417913, 1131360, 936096, 908898, 1054086, 1314501, 1607972, 1857599, 2019045, 2098804, 2134373, 2145854, 2119679, 2046033, 1947664, 1849051, 1732610, 1553504, 1293911, 978680, 639955, 296309, -21849, -252155, -334895, -270333, -128630, 2703, 78663, 107451, 115142, 115287, 117910, 154224, 268562, 474515, 727657, 950518, 1077399, 1068657, 901322, 580005, 164924, -239233, -550329, -761900, -913030, -1009450, -999810, -844831, -596074, -382738, -313119, -395081, -550669, -691446, -769670, -772688, -698877, -556011, -375236]
35347c75236J65550J00338J6579m5776o2912l8852K600L6990N2032M5820K0221
35336h2646j9614o2409r2104r2716n5994N260M9598L0295n5533j47742j74584
35325f98189j27455o8787o1091j05912j61511j98314k12325j95358j26009N2J52786
35314a802113K93861M02741M62357M39815L15696J34756k725k0759O7379J79982
35304D70990K40645K23825J45591L4823q2505j84222k46948k45098j66084l4867
35294A56150Q6030J36670J01957J0978r3703j72544j88427j20151J3514J57722
35284H8196K57205K83836K38618J48382N8687J977l6437r6759j77688k16933j60271
35273C88813l2265Q3850J23843Q1594q670r6019j28649q7197j3867J7544k5627
$$ y = [-375236, -209686, -109348, -92769, -138545, -201457, -240309, -237709, -200719, -148687, -102867, -82646, -102260, -164669, -256773, -349489, -405483, -400223, -350625, -320330, -375863, -523605, -698189, -825644, -894431, -955522, -1061434, -1222945, -1421259, -1633584, -1828942, -1954951, -1954899, -1802113, -1508252, -1105511, -643154, -203339, 112357, 247113, 244388, 223629, 291008, 470990, 711635, 935460, 1081051, 1115874, 1033369, 849147, 602199, 357101, 191017, 156150, 242180, 378850, 480807, 491785, 398082, 225538, 37111, -83040, -69526, 88196, 345401, 629237, 867855, 1016237, 1074924, 1076901, 1040464, 943705, 766017, 549084, 388813, 356548, 440398, 564241, 645835, 637165, 541146, 412497, 325300, 311433, 328977, 303350]
35262C03350j07380j72984k03746k10814k00570j74938j56273j78838k44015l02588
35252a648796k97992k21089j10352m462Q7103J65903K20983K40993K36399K27403
35242a103907K14576J84387J43600J23200J41154J83101K27401K63915K76289
35233F53716K38309J57344R8622J26322K24590L09113L17922K63669J96139J44039
35223B729785J02752N3005k3297j28698k39533l22998l72193m08069m37513m28150
35213E25091l43143j93325l9461N8058Q7321Q6994J03547J42901J66283J39842
35203G34108P9537L0173O843j5798n4013q8283j02651j20434j68305k19300k07577
35192a25700j03790M8156J77128K51459K92573L35337L85929M14553L81595K70043
$$ y = [303350, 195970, 22986, -180760, -391574, -592144, -767082, -923355, -1102193, -1346208, -1648796, -1946788, -2167877, -2278229, -2282691, -2195588, -2029685, -1808702, -1567709, -1331310, -1103907, -889331, -704944, -561344, -438144, -296990, -113889, 113512, 377427, 653716, 892025, 1049369, 1147991, 1274313, 1498903, 1808016, 2125938, 2389607, 2585746, 2729785, 2832537, 2885542, 2862245, 2733547, 2494014, 2171016, 1798823, 1390754, 953241, 525091, 181948, -11377, -50838, 7220, 94541, 181535, 285082, 427983, 594266, 734108, 813645, 843818, 850661, 834863, 780850, 692567, 589916, 469482, 301177, 81877, -125700, -229490, -181334, -4206, 247253, 539826, 875163, 1261092, 1675645, 2057240, 2327283]
35182B327283R7745r3521k55775l50416l65114l23111k65180k14317j64338j03904
35172B89352l4632M2777J38644K47921L26700L24314K40021J24775K3458o1518
35162A661812j40794j96790j94330j25839k9633L6358L2801l8935j35183j91259
35152F78208j64557p2019J7462L7540k2994j17886j86255j94601j46885p1605
35142b43592o295J8232k983m1230n5022k6094K6822P0959R2259J04054J27972
35131F5082J69109K08393K20200K00166J70862J51513J27766O9883j5824p6666
35121A290484p3308l6369l7982j06815j93886k31612k09907j78077j78343j95478
35111a51293j79588j11000k9059J2289J3429L7964J41185K95942M04217L84781
$$ y = [2327283, 2425028, 2331507, 2075732, 1725316, 1360202, 1037091, 771911, 557594, 393256, 289352, 254720, 297497, 436141, 684062, 1010762, 1335076, 1575097, 1699872, 1723330, 1661812, 1521018, 1324228, 1129898, 1004059, 974426, 1010784, 1043585, 1004650, 869467, 678208, 513651, 441632, 459094, 496634, 473640, 355754, 169499, -25102, -171987, -243592, -249887, -231655, -234638, -275868, -330890, -356984, -330162, -259203, -166944, -62890, 65082, 234191, 442584, 662784, 862950, 1033812, 1185325, 1313091, 1382974, 1367150, 1290484, 1217176, 1180807, 1142825, 1036010, 842124, 610512, 400605, 222528, 44185, -151293, -330881, -441881, -470940, -458651, -445222, -407258, -266073, 29869, 434086, 818867]
35101H18867K42067N2117j01668j73530j59524q6337r92M7525L5819j9014p4980
35090E80350j00080r6787r6205j26914j83692k22990j93211p8212Q2969K20924
35080b13848K86795K83601K48816K09092J59585R0412K1065j0594K894J8159j4801
35069A081176r4484j69170j93090j62900r8223j4680O4599R4054M2343n2057r5211
35058D02357k9066J05616K12782K35087J89614J25883P6391M7678L3074J9651
35048A419067p109n4084j15082j72138j98184j68812q9137o907K1868j2284o3994
35037E53204q1460m7664K5803J18223J99403K34973K16898J76063J42527J04536
35027A642506L1023p3469j64568k08191k09358j88628j55934j16793q1806n6962
$$ y = [818867, 1060934, 1113051, 1011383, 837853, 678329, 591992, 591000, 638525, 674344, 655330, 580350, 480270, 383483, 287278, 160364, -23328, -246318, -439529, -517741, -434772, -213848, 72947, 356548, 605364, 814456, 974041, 1064453, 1085518, 1074924, 1077818, 1095977, 1081176, 986692, 817522, 624432, 461532, 363309, 348629, 413228, 507282, 549625, 497568, 402357, 373291, 478907, 691689, 926776, 1116390, 1242273, 1318664, 1366342, 1399416, 1419067, 1411958, 1357874, 1242792, 1070654, 872470, 703658, 614521, 607614, 629482, 617198, 553204, 471744, 424080, 449883, 568106, 767509, 1002482, 1219380, 1395443, 1537970, 1642506, 1673529, 1600060, 1435492, 1227301, 1017943, 829315, 673381, 556588, 474782, 417820]
35017D17820m0400l8428o5817j16543j53270j46837j13779r1961q6746o6856j3253
35006e16070N3451J03277J34345J64416J95770K05293J69290Q8975r252r3001
34996D96494j43226j59952j52176j23828p3235q161M4097M9955l327r4224j80361
34985c47944k25409k17253j66502q9753P869J34575K93276M58110N71909N74862
34975I93740M45711K22592j5994j97938k94815l18380k85766j99507o9462N9234
34965C39415J28035J24687J00313J07006J31258J15388M0896m1162p3543n9550
34955I12743m5889n7753p9079r0966j00525j24005j59743j87425j83798j34204
34945b50644m1212P0441J66758K29710K62626K68395K38548J75934J12593Q0567
$$ y = [417820, 377420, 338992, 273175, 156632, 3362, -143475, -257254, -349215, -435961, -502817, -516070, -462619, -359342, -224997, -60581, 135189, 340482, 509772, 598747, 589495, 496494, 353268, 193316, 41140, -82688, -155923, -164084, -119987, -70032, -73359, -167583, -347944, -573353, -790606, -957108, -1046861, -1038992, -904417, -611141, -153031, 418878, 993740, 1439451, 1662043, 1646049, 1448111, 1153296, 834916, 549150, 349643, 280181, 339415, 467450, 592137, 692450, 799456, 930714, 1046102, 1086998, 1045836, 972293, 912743, 866854, 809101, 730022, 639056, 538531, 414526, 254783, 67358, -116440, -250644, -291856, -221415, -54657, 175053, 437679, 706074, 944622, 1120556, 1233149, 1313716]
34935A313716O6334J8806q5307j99017k45388j97906j08421n4510p0019j30440
34925C07848j91788k26665k24639j79716r5885n31O5610Q0299N7513L2234L3777
34914c41943P2661J37879J95610K00696J29100N127j10994j66089j42680n3220
34904g3853P4897K01133K76561K70950J99747J11251M0012j8983q3505j42548
34894H55662j59651j20163n8604k5176l0982m1037k1187K3197O1030P3797O6472
34883F23358M7832J7256k5751p0284r7703r1319m3006L7673J15179J41715R6383
34872G51333J2685m2705k4924N4664J44698J97243J95504J49730P8074m661q4677
34861A426964j44630j68519j52961j11819o7327l4026q062K7838Q1638J28117
$$ y = [1313716, 1380050, 1398856, 1313549, 1114532, 869144, 671238, 562817, 508307, 438288, 307848, 116060, -110605, -335244, -514960, -610845, -611376, -545766, -465467, -407954, -375720, -341943, -269282, -131403, 64207, 264903, 394003, 399130, 288136, 122047, -20633, -73853, 1044, 202177, 478738, 749688, 949435, 1060686, 1100698, 1081715, 998210, 855662, 696011, 575848, 517244, 492068, 461086, 420049, 398862, 422059, 483089, 556886, 623358, 671190, 688446, 662695, 592411, 494708, 403389, 360383, 398056, 513235, 654950, 751333, 764018, 721313, 696389, 751053, 895751, 1092994, 1288498, 1438228, 1516302, 1511641, 1426964, 1282334, 1113815, 960854, 849035, 781708, 747682, 739620, 767458, 849096, 977213]
34851I77213J15399J2310j45973k72239k97310k22570j03671O13N3281L4943n2682
34840I9314j75468k80826l32566l22952k54207j32263J2418J22746J57915J32169
34830i73720R5695Q3110R3754J12153J25545J22425R5754N4771J8565q840m2959
34819b23747q9428j23598j14393o1801M854O3834J18711J73246K04420J79131
34809A31229R7260K775n7051p7128r2150j34484k03563k71728l06094k83510k00034
34798a394478p6752M8945J44090J90591J81578J27256P0000O8158J38417K22602
34788b79593K36911J56170L3033o3062j04012j01524p9744o6760q9491j46744
34778e04816j90353j58096l7093J12486K02884J87522Q7702l9649j52442k40493
$$ y = [977213, 1092612, 1104922, 958949, 686710, 389400, 166830, 63159, 63772, 117053, 151996, 99314, -76154, -356980, -689546, -1012498, -1266705, -1398968, -1386550, -1263804, -1105889, -973720, -878025, -794915, -701161, -589008, -463463, -341038, -245284, -190513, -171948, -180788, -223747, -313175, -436773, -551166, -612967, -608113, -544279, -425568, -252322, -47902, 131229, 228489, 231264, 174213, 97085, 4935, -129549, -333112, -604840, -910934, -1194444, -1394478, -1471230, -1422285, -1278195, -1087604, -906026, -778770, -708770, -640612, -502195, -279593, -42682, 113488, 146521, 83459, -20553, -122077, -201821, -268581, -358072, -504816, -695169, -853265, -890358, -777872, -574988, -387466, -299764, -339413, -491855, -732348]
34768g32348l00586l11385k47761j18603K4331J24237J63284J66915J69805J80992
34758h81119J80069J46363R1054N1629M5136L6676k3145j26456j97997j73934
34748h51724p7607K869P915m0152p6926p0298m2480k4688p646M8029J52233K53962
34736g26513K87214K43774J80506J50894J47865J23096M6577o4617j62941k03062
34726B2793j71489r9654l8375o641K1633O6203R6912P2424J2010j0751M5127J37276
34714A47468J89340J66095Q2812l4663j67431k88495l61769l69500l30571k83746
34704a250460k56073k47634k38050k00762j15924J7937J75549L10356L79896L74464
34694a050701L19526K46896J68215Q1871r82m9700l6098M0231J44582K19570K14688
$$ y = [-732348, -1032934, -1344319, -1592080, -1710683, -1686352, -1562115, -1398831, -1231916, -1062111, -881119, -701050, -554687, -463633, -412004, -366868, -330192, -353337, -479793, -677790, -851724, -929331, -926462, -918547, -958699, -1035625, -1105923, -1148403, -1173091, -1180737, -1132708, -980475, -726513, -439299, -195525, -15019, 135875, 283740, 406836, 453413, 388796, 225855, 22793, -148696, -248350, -286725, -293366, -271733, -205530, -108618, -36194, -24184, -34935, 10192, 147468, 336808, 502903, 585715, 551052, 383621, 95126, -266643, -636143, -966714, -1250460, -1506533, -1754167, -1992217, -2192979, -2308903, -2290966, -2115417, -1805061, -1425165, -1050701, -731175, -484279, -316064, -234193, -235175, -284875, -320973, -280742, -136160, 83410, 298098]
34683B98098J22846p223j06747j43136j38258j33740j49654j78623k05355k21105
34673h62897k25761k25009k22349k07974j60153o5752N9820J76718K45955K53589
34663a233813K15958J63679J17103P4903K6193l0667q5910j29545j56098j62756
34653a200953j54990j50393j59866j63112j21751k6045Q5915J65835J99045K00253
34643a326062J81098J40923Q2292J7004m1548p7649o9148l215J00416J96873K52595
34632e46421K64753K43598J92649J17541M3516O282K1194O7835J09524J26809
34622F47280J28433J27122J09290M1777q2413k14693k86378k78304k41319k37854
34612b87059k72155k90549k45762j45876l7278M6356J06478J58868K08575K51946
$$ y = [298098, 420944, 413721, 306974, 163838, 25580, -108160, -257814, -436437, -641792, -862897, -1088658, -1313667, -1536016, -1743990, -1904143, -1969895, -1910075, -1733357, -1487402, -1233813, -1017855, -854176, -737073, -662170, -635977, -666644, -752554, -882099, -1038197, -1200953, -1355943, -1506336, -1666202, -1829314, -1951065, -1977110, -1891195, -1725360, -1526315, -1326062, -1144964, -1004041, -921749, -904745, -946293, -1023942, -1093090, -1096305, -995889, -799016, -546421, -281668, -38070, 154579, 272120, 315636, 321918, 343112, 410947, 520471, 647280, 775713, 902835, 1012125, 1053902, 971489, 756796, 470418, 192114, -49205, -287059, -559214, -849763, -1095525, -1241401, -1278679, -1232323, -1125845, -966977, -758402, -506456]
34602e06456K89960L22624L31790K88925J93143R2610N0363Q3136J40757J50741
34592A437593Q3204k3587r4386p7839P689Q1800O7953l3681j41393j71315j22851
34581A013187p6437j05484k00734k85834k95350k25301j16012q921P0295J04341
34571a26250Q4889K3686n2377j24320j88131k31577k19672j25954K1658J47707
34561g90341J94523J71899J33788J18169J24994J43996J77727K27519K73934K88805
34551A065013K64421K20094J79312J46606J07972N0838j8039p6852j14419j46678
34541A678268j94068k40916k36180j48486q199J20668J98736K23443J99544J33243
34531A726053N4914Q246R7r210m6048q1744p7423m6240l4330n2933o9202o2151
$$ y = [-506456, -216496, 106128, 437918, 726843, 919986, 1012596, 1062959, 1146095, 1286852, 1437593, 1520797, 1497210, 1402824, 1324985, 1332674, 1414474, 1482427, 1448746, 1307353, 1136038, 1013187, 936750, 831266, 630532, 344698, 49348, -175953, -291965, -300886, -230591, -126250, -41361, -17675, -70052, -194372, -382503, -614080, -833752, -959706, -938048, -790341, -595818, -423919, -290131, -171962, -46968, 97028, 274755, 502274, 776208, 1065013, 1329434, 1549528, 1728840, 1875446, 1983418, 2034256, 2016217, 1939365, 1824946, 1678268, 1484200, 1243284, 1007104, 858618, 850419, 971087, 1169823, 1393266, 1592810, 1726053, 1780967, 1789213, 1789310, 1780100, 1734052, 1652308, 1574885, 1528645, 1494315, 1441382, 1372180, 1310029]
34519A310029m9298n0723o1406p1906q3818q4073l2630R1106K40019L26671L01791
34508A835762J91362N9443m9132j29551j98852k66831l19686l27616k70701j59831
34498C64367l2739P0559J31224J54895J51027J08802O105j43497k64154k69125
34488B77464j49833P036J04000J16698Q2808L6297j3944n2893m9487P588Q6376
34477D52110J39481J45897J17006P1217J3866n9473j44799k16305k37127j93624
34467H8249j19341p3197q4833j23076j22555m3821Q9396K08802K58088K34807
34457C12519J79697J31951J02515Q3343O1371J8863n5473j38563j75956j37978
34447C82289o1256p386J2050L8691R7813J59932J81210J52905R6812L7643j943
$$ y = [1310029, 1260731, 1210008, 1148602, 1076696, 992878, 908805, 876175, 967281, 1207300, 1533971, 1835762, 2027124, 2086567, 2037435, 1907884, 1709032, 1442201, 1122515, 794899, 524198, 364367, 331628, 402187, 533411, 688306, 839333, 948135, 954240, 810743, 546589, 277464, 127631, 134667, 238667, 355365, 438173, 474470, 460526, 407633, 358146, 365734, 452110, 591591, 737488, 854494, 925711, 939577, 880104, 735305, 519000, 281873, 88249, -31092, -104289, -189122, -312198, -434753, -478574, -389178, -180376, 77712, 312519, 492216, 624167, 726682, 810025, 871396, 890259, 834786, 696223, 520267, 382289, 321033, 313647, 325697, 364388, 462201, 622133, 803343, 956248, 1053060, 1090703, 1088760]
34436A088760j711L6147P9779R9736R6730Q0185L6515n1254j57346k17017j84990
34425I05534p4398O3065J75300K24561J91234Q6921m0992j35061j65475j43748
34415A086941j05086q1108q2832r9272j09096r7066o3238j8793K4667O0848Q6350
34404F02315R7603R4253Q3623P3484N6781J4309n4955j13945j19909p9357m6282
34393F07920n1909n9283j4688O8622J13051O8463k6099q6272p0902j3880J8578
34382E53601j1544q6065j48198j52045j04629n4721l5699l2231j4930P542n035
34371h3954o9826j56384k18896k30761j81837o9397Q4880K22234K78352K33178
34361a92411J21599q5q7079j15769q5836j9641N5333J28607J98101K38662K05880
$$ y = [1088760, 1087049, 1123196, 1202975, 1302711, 1399441, 1479626, 1516141, 1464887, 1307541, 1090524, 905534, 831136, 894201, 1069501, 1294062, 1485296, 1572217, 1531225, 1396164, 1230689, 1086941, 981855, 900747, 817915, 718643, 609547, 512481, 449243, 430450, 455117, 515965, 602315, 699918, 794171, 877794, 951278, 1008059, 1022368, 967413, 853468, 733559, 654202, 607920, 556011, 496728, 482040, 550662, 663713, 732176, 706077, 619805, 548903, 535023, 553601, 542057, 455992, 307794, 155749, 51120, -3601, -39300, -71531, -86461, -78919, -83954, -153780, -310164, -529060, -759821, -941658, -1011055, -926175, -703941, -425589, -192411, -70812, -70897, -157976, -273745, -359581, -379222, -323889, -195282, 2819, 241481, 447361]
34350D47361R1793l8810r6113n1384M0963J06201J15575Q9525O0694M9407N8838
34339H74050P1896N7967M458n4811o1893J311Q1585J04099N3185j3069l6692l2209
34327A049877o3585j51650k30826k13670q4028R1269K31832L01836L05546K57383
34317A493984J70895O1090n4754j50275j84100j25241R42J12014J36329P4020
34307A534904k1947j06888j63032j75083j27633l2870O7418J37333J66294J52607
34297A431103R5500J2418o2713j14500j59609k13239k65756l08334l52681l97071
34287c34882l97886l16973j88745r7583q3077j01856r2043m2751J5639O0138Q9652
34276a490367J10343J33132J76844K50676L33868L85912L75218K92875J52741
$$ y = [447361, 539154, 500344, 404231, 352847, 393810, 500011, 615586, 705111, 765805, 815212, 874050, 945946, 1003913, 1008371, 953560, 891667, 892978, 974563, 1078662, 1131847, 1118778, 1082086, 1049877, 986292, 834642, 603816, 390146, 306118, 397387, 629219, 931055, 1236601, 1493984, 1664879, 1725969, 1671215, 1520940, 1336840, 1211599, 1212541, 1324555, 1460884, 1534904, 1512957, 1406069, 1243037, 1067954, 940321, 907451, 974869, 1112202, 1278496, 1431103, 1526603, 1539021, 1476308, 1361808, 1202199, 988960, 723204, 414870, 62189, -334882, -732768, -1049741, -1238486, -1336069, -1419146, -1521002, -1613045, -1655796, -1640157, -1580019, -1490367, -1380024, -1246892, -1070048, -819372, -485504, -99592, 275626, 568501, 721242]
34267G21242n598j26092j74044j66911j50880j46601j35151r8477n1821k4087
34257c58420k0140j7246O092M8257Q9047J08998J05417R3173Q7875Q6381O7387
34246B96821J3313p1323j62462k30403k51182k16256j40171n4559J2196M8191
34236g55835N2251K6345j9306o4111r2958j09087j19961j16631q3870k9547J5359
34225a297351L2654L8034N8190J00414J54903K11799K57916K67135K20080J36482
34215A80256O7586M7112O2265P8681P7119N4723Q332n9830j25041j51386j26269
34204A13548p3044k8595j8261m7657r9657j38109j35907j06416q6067p6822l3930
34193g30917O6091J69434J94681J31654N4110L0737N7423Q7237R2295P3667L7639
$$ y = [721242, 715644, 589552, 415508, 248597, 97717, -48884, -184035, -282512, -334333, -358420, -378560, -395806, -389714, -341457, -252410, -143412, -37995, 55178, 143053, 229434, 296821, 310134, 238811, 76349, -154054, -405236, -621492, -761663, -816222, -804026, -755835, -703584, -677239, -696545, -760656, -853614, -962701, -1082662, -1199293, -1283163, -1312710, -1297351, -1264697, -1226663, -1168473, -1068059, -913156, -701357, -443441, -176306, 43774, 180256, 247842, 294954, 357219, 435900, 513019, 567742, 576074, 516244, 391203, 239817, 113548, 40504, 11909, -6352, -54009, -153666, -291775, -427682, -534098, -620165, -696987, -730917, -664826, -495392, -300711, -169057, -114947, -84210, -26787, 60450, 152745, 226412, 264051]
34182B64051n336k9439j0716M4116J02757J37573J37567J01073L8309k4140o3443
34171F92372q2487r1328p4946j3121O4930Q5974J5262r4646j65405j82253j88473
34160c4121k04004j92091j15213Q122J20270J78624J77008J30857O4877R716j2495
34149A31550o279N379J3327L6941R8531J88025K61513K74248K10868Q8476n6576
34138A246003j81375k50978k57533k25185j85882j50885j16486r3541j08725j65201
34128d89788k20292k22973j67053q9673k3366K9151P5242J14223J46342J75596
34118f72591J89773J60160Q3072N029k1965l752O509j7041l8996j5214M6064R6575
34106a82377J06803Q9400O9313N2545K9020p145m5817o2336l0382N4510J57005
$$ y = [264051, 258715, 229276, 218560, 262676, 365433, 503006, 640573, 741646, 779955, 755815, 692372, 609885, 518557, 443611, 430490, 495420, 581394, 596656, 502010, 336605, 154352, -34121, -238125, -430216, -545429, -537307, -417037, -238413, -61405, 69452, 134329, 144045, 131550, 125271, 130650, 143977, 180918, 279449, 467474, 728987, 1003235, 1214103, 1302579, 1246003, 1064628, 813650, 556117, 330932, 145050, -5835, -122321, -215862, -324587, -489788, -710080, -933053, -1100106, -1189779, -1213145, -1183994, -1108752, -994529, -848187, -672591, -482818, -322658, -239586, -234557, -256522, -260274, -253765, -270806, -309802, -325016, -278952, -182377, -75574, 13826, 83139, 135684, 164704, 157559, 111742, 49406, 19024, 73534, 230539]
34095B30539K14962J83459P3638n0550j18353j05427n1677k7350p4128j72709
34085A02404k64442l01298k75663k10887j33377n4634K5159R8318J36634J08815
34075g68971K3065n4046m2773P3542K22965L02437K59620J22352l5478j45913
34065d3200j77814j40953p1266n868L8090O6068Q9997J10098J13344R2169O3336
34054A34001N9038R1044J29464J29000P3618j7160j19837k18732k81048k53868
34044b74480j17477O9626K08640K44535J95085J06590J5050m5902m2227K1706
34034C81146Q0872O3799k8281j20857j49637j23744r7669j02842j27812j52776
34024c77801j71641j71912j20356K451J57765K66313K82444K35054J81446J36681
$$ y = [230539, 445501, 628960, 702598, 652048, 533695, 428268, 376591, 349241, 275113, 102404, -162038, -463336, -738999, -949886, -1083263, -1137897, -1112738, -1014420, -877786, -768971, -745906, -799952, -842725, -769183, -546218, -243781, 15839, 138191, 102713, -43200, -221014, -361967, -433233, -439101, -401011, -334943, -244946, -134848, -21504, 70665, 134001, 193039, 284083, 413547, 542547, 616165, 599005, 479168, 260436, -20612, -274480, -391957, -322331, -113691, 130844, 325929, 432519, 447569, 401667, 359440, 381146, 462018, 525817, 497536, 376679, 227042, 103298, 5629, -97213, -225025, -377801, -549442, -721354, -841710, -839259, -681494, -415181, -132737, 102317, 283763, 420444]
34014D20444P4362p408n5793j9982P8291J57441J59985J05806N7008M5672M8065
34003A063891K0827n2788j50976k31398k54462k02362r3008K2837R0300Q6289
33993B99150K9126m4050j03476j33401j27076q5542j8087O1493J36109J82174
33983A96420J77431J22958N1061O7j4599L589N1229J17089J61619J38671N1839
33972A057374l6540p5063q2988j11978j61601j74300j21885n6984m9443r5234
33962I1358j26120j02547n6964l6128l7306k5950J0427N9828J19959J92541K45385
33951C34483K25522J28020J7451m3433o0475p8127j08694j27167j19109r1578
33941G6893m1582M2744J40620J94052J62061N9551o3553j57825j87052j42433
$$ y = [420444, 494806, 487398, 431605, 411623, 489914, 647355, 807340, 913146, 970154, 1015826, 1063891, 1084718, 1031930, 880954, 649556, 395094, 192732, 99724, 122561, 212861, 299150, 328276, 284226, 180750, 47349, -79727, -165269, -183356, -121863, 14246, 196420, 373851, 496809, 547870, 547937, 533338, 536927, 588156, 705245, 866864, 1005535, 1057374, 1020834, 945771, 862783, 750805, 589204, 414904, 293019, 236035, 186592, 91358, -34762, -137309, -194273, -230401, -267707, -293657, -283230, -223402, -103443, 89098, 334483, 560005, 688025, 705476, 662043, 601568, 523441, 414747, 287580, 168471, 76893, 35311, 78055, 218675, 412727, 574788, 634339, 570786, 412961, 225909, 83476]
33931H3476o1425k988J5703L2079P0774R7333O9934Q788k7029j7245L925K094
33919B75419k2593m9751n4016j0714P7333J58171J70840J10270K0851p0328j67437
33908D38045k46918k41985j21449N2021J79735K19730J92825J26698L8103m7866
33898E88939j11545j71220k58620l54360l85739l05242j46118J1947J08475J24482
33888h99001P2999m571n2074m2264o284K137k7100m7490j0628Q2351J87282K57240
33876d87403K67120K15809J27037M6232J3771K7139L7887l42q1705j53876j70386
33865a58717j26352m5035N2116J52290K41794L05951L36079L26157K65792J49133
33855A499208o887j61140k68884l04362k71568k03384j45741j26317j31249j18882
$$ y = [83476, 22051, 19063, 34766, 66845, 137619, 234952, 304886, 313674, 286645, 269400, 273325, 275419, 252826, 203075, 149059, 138345, 215678, 373849, 544689, 654959, 675810, 605482, 438045, 191127, -50858, -172307, -120286, 59449, 279179, 472004, 598702, 636805, 588939, 477394, 306174, 47554, -306806, -692545, -997787, -1143905, -1131958, -1023483, -899001, -826002, -830573, -882647, -924911, -931195, -929058, -956158, -1003648, -1014276, -931925, -744643, -487403, -220283, -4474, 122563, 168795, 182566, 209705, 247592, 247250, 165545, 11669, -158717, -285069, -330104, -277988, -125698, 116096, 422047, 758126, 1084283, 1350075, 1499208, 1492321, 1331181, 1062297, 757935, 486367, 282983, 137242, 10925, -120324, -239206]
33845b39206o1975K4117R3041J03773N1938k4436p2576p0194m4467l8166o1180
33834c39331q9286j05351j15195j14653o9895M1938J83579K78760K87767K44592
33824B02925K12035K12663K13221J69409P4668l6543j25671j80860k09472k13152
33814C19223j88226j49170j27609j33571j35013r7195l2916J0477J0904p615j7573
33803e48284k3735m0588n5394m0134M034L7416K5178k1247n7412o0033n8198r9297
33791i37694j81809k35519j84236k5818J63493L01564L59672L52158K98441K15391
33781A25643J27751N6888J085n3453j02571j22901j02502n7622j5753N940N607
33770a31888k453J2742P8890J84160K69794K73670J81422L1921j15215k06223
$$ y = [-239206, -301181, -277064, -184023, -80250, -28312, -52748, -125324, -195518, -239985, -278151, -339331, -428617, -533968, -649163, -763816, -833711, -791773, -608194, -329434, -41667, 202925, 414960, 627623, 840844, 1010253, 1084921, 1048378, 922707, 741847, 532375, 319223, 130997, -18173, -145782, -279353, -414366, -511561, -544477, -534000, -523096, -530711, -548284, -572019, -612607, -668001, -708135, -704101, -666685, -641507, -662754, -720166, -780199, -838397, -937694, -1119503, -1355022, -1539258, -1565076, -1401583, -1100019, -740347, -388189, -89748, 125643, 253394, 310282, 311367, 257914, 155343, 32442, -70060, -127682, -143435, -137495, -131888, -134341, -121599, -42709, 141451, 411245, 684915, 866337, 898258, 783043, 576820]
33760E76820k04697j11216J6733Q8753N3589n1561j38430j55852j28240j07191
33750a61292j06508r9038o2611p176L9551N3742K4103l9263r9434j16988r1303
33739f66217o3098o6986r8435j37805j82577k31776k57289k25630j44203n3424
33729b127440L0010J29846K58530L76950M27496L92413L01781J96856J06166N0673
33719A43281M7581R7109J69506K11368J74250N2632r9823k03675k16934j64825
33709B10470j04695p0337n5940m0246r176M0341J00891J54488J82422J79954J55702
33698G43874J15429N4700k6208j04250j40620j14794n2641j1961l0572r0883j43979
33687A98095j64455j66892j68550j57046j08951k9057M4996P6345O1021L1766
$$ y = [576820, 372123, 260907, 277640, 366393, 419982, 368421, 229991, 74139, -54101, -161292, -267800, -366838, -429449, -436625, -397074, -343332, -319229, -358492, -457926, -574914, -666217, -729315, -796301, -894736, -1032541, -1215118, -1446894, -1704183, -1929813, -2074016, -2127440, -2097430, -1967584, -1709054, -1332104, -904608, -512195, -210414, -13558, 92608, 143281, 190862, 287971, 457477, 668845, 843095, 895727, 795904, 592229, 375295, 210470, 105775, 35438, -20502, -60748, -69924, -29583, 71308, 225796, 408218, 588172, 743874, 859303, 914003, 887795, 783545, 642925, 528131, 475490, 463529, 432957, 342074, 198095, 33640, -133252, -301802, -458848, -567799, -596856, -551860, -475515, -414494, -382728]
33677c82728L4522R0804J73036K23648K08189J45668Q3188N3660O6774J22055
33667H18816K05682K80085L02228K59863J78611R1894J2541o9935j74296l00621
33657A604868m01948l96659k43621r308J71187K14461J48993M8886n4295j62729
33647I19835k46157k42557j37497n079N8088K7769l6643o5580m2881K912M6947
33636B79157Q9600J34986J66524J54946Q7511j6245j15323j69994j60687r6856
33626C53619r877O9688J29149J62571J48278N8134r9126k58257l42495l29643
33616a17959k61333j87588j18374l6046N9724J35430J48885Q0213n7530k21825
33606e76403l50214l84363l06289j55527j542J06511J62001J78359J59408J02757
$$ y = [-382728, -348206, -257402, -84366, 139282, 347471, 493139, 576327, 629987, 696761, 818816, 1024498, 1304583, 1606811, 1866674, 2045285, 2137179, 2149720, 2079785, 1905489, 1604868, 1202920, 806261, 562640, 553332, 724519, 938980, 1087973, 1136859, 1082564, 919835, 673678, 431121, 293624, 288545, 346633, 374402, 337759, 272179, 229298, 232210, 279157, 368757, 503743, 670267, 825213, 912724, 896479, 781156, 611162, 450475, 353619, 343742, 413430, 542579, 705150, 853428, 911562, 812436, 554179, 211684, -117959, -379292, -566880, -685254, -721300, -661576, -526146, -377261, -297048, -354578, -576403, -926617, -1310980, -1617269, -1772796, -1774338, -1667827, -1505826, -1327467, -1168059, -1065302]
33596a065302K6813k2764o332O9030J48119J71855J24230L7373m1831q1704o8121
33585g08634J666J12008K24034K96985L18934L07635K80747K35832J60724N1743
33575A281674q1675k19437l33916m01223m14013l75248k81820j33667L5949J61991
33565g61385J97534J52765P5146N453l7877n5136o9050j12383j80959k11644j44368
33554a141904o414R9912J03497L2996k7998k6810L0250J07780J72343K02869J91715
$$ y = [-1065302, -1038489, -1061253, -1067585, -998555, -850436, -678581, -554351, -516978, -558809, -640513, -708634, -706968, -594960, -370926, -73941, 244993, 552628, 833375, 1069207, 1229931, 1281674, 1199999, 980562, 646646, 245423, -168590, -543838, -825658, -959325, -923376, -761385, -563851, -411086, -335940, -330487, -368364, -423500, -492550, -604933, -785892, -997536, -1141904, -1148318, -1048406, -944909, -911913, -939911, -966721, -936471, -828691, -656348, -453479, -261764]
$$ [...]
##END NTUPLES=NMR SPECTRUM
##END=
