##TITLE=31Pdec_2BnP3105
 CDCl3, 24 sc
 1.6.2022
##JCAMPDX= 6.0         $$ Bruker NMR JCAMP-DX V2.0
##DATA TYPE= NMR SPECTRUM
##DATA CLASS= NTUPLES
##ORIGIN= UXNMR, Bruker Analytische Messtechnik GmbH
##OWNER= root
$$ XWIN-NMR		Version 3.5
$$ Wed Jun  1 14:03:37 2022 Russian Standard Time (UT+4h)  she@DPX200
##.OBSERVE FREQUENCY= 81.013821
##.OBSERVE NUCLEUS= ^31P
##.ACQUISITION MODE= SIMULTANEOUS
##.ACQUISITION SCHEME= undefined
##.AVERAGES= 24
##.DIGITISER RES= 16
##SPECTROMETER/DATA SYSTEM= spect
##.PULSE SEQUENCE= zgpg30
##.SOLVENT NAME= DMSO
##.SHIFT REFERENCE= (INTERNAL, DMSO, 0, 248.564)
##AUDIT TRAIL= $$ (NUMBER, WHEN, WHO, WHERE, WHAT)
$$ ##TITLE= Audit trail, XWIN-NMR		Version 3.5
$$ ##JCAMPDX= 5.01
$$ ##ORIGIN= Bruker BioSpin GmbH
$$ ##OWNER= she
$$ F:/spectra/data/she/nmr/P31/1/pdata/1/auditp.txt
$$ ##AUDIT TRAIL=  $$ (NUMBER, WHEN, WHO, WHERE, WHAT)
(   1,<2022-06-01 14:02:31.50 +0400>,<she>,<DPX200>,
      <created by zg, POWCHK disabled, PULCHK disabled
       configuration hash MD5:
       00 E9 B6 7A A2 85 ED C7 34 08 36 98 17 FE 4E 26
       data hash MD5: 32K
       0D DB 53 79 3B 44 A1 F2 84 D0 08 17 8A 08 23 26>)
(   2,<2022-06-01 14:02:33.73 +0400>,<she>,<DPX200>,
      <Start of raw data processing
       efp BC_mod = 2 LB = 1 FT_mod = 6 PKNL = 1 PHC0 = -10153.01 PHC1 = -181.1461 SI = 64K 
       data hash MD5: 64K
       9A BB 09 9B CD C0 4A 4E 39 40 44 5E 71 C9 E8 5C>)
(   3,<2022-06-01 14:02:50.06 +0400>,<she>,<DPX200>,
      <pk PHC0 = 0.1554424 PHC1 = 8.4 
       data hash MD5: 64K
       BE 30 BC D6 61 C8 25 86 A8 90 D3 DB D3 77 99 0E>)
(   4,<2022-06-01 14:02:59.48 +0400>,<she>,<DPX200>,
      <abs ABSG = 5 
       data hash MD5: 64K
       CB 2C 49 44 A4 68 A1 04 65 5A 82 57 D3 15 C0 53>)
$$ ##END=
$$ 
$$ hash MD5
$$ 3C C0 21 69 07 0D 5A 01 39 F6 BA 49 D4 95 45 A4
##$RELAX= 
##$RELAX= 
##$RELAX= 
##$RELAX= 
##$RELAX= 
##$RELAX= 
##$RELAX= 
##$RELAX= 
$$ Bruker specific parameters
$$ --------------------------
##$DU= <F:/spectra>
##$EXPNO= 1
##$NAME= <P31>
##$PROCNO= 1
##$TYPE= <nmr>
##$USER= <she>
##$AMP= (0..31)
100 100 100 100 100 100 100 100 100 100 100 100 100 100 100 100 100 100 
100 100 100 100 100 100 100 100 100 100 100 100 100 100 
##$AQSEQ= 0
##$AQ_mod= 1
##$AUNM= <au_zg>
##$AUTOPOS= <>
##$BF1= 81.014009
##$BF2= 200.13
##$BF3= 200.13
##$BF4= 200.13
##$BF5= 200.13
##$BF6= 200.13
##$BF7= 200.13
##$BF8= 200.13
##$BYTORDA= 1
##$CFDGTYP= 0
##$CFRGTYP= 5
##$CHEMSTR= <none>
##$CNST= (0..31)
1 1 145 1 1 1 1 1 1 1 1 1 1 1 1 1 1 1 1 1 1 1 1 1 1 1 1 1 1 1 1 1 
##$CPDPRG= <waltz16>
##$CPDPRG1= <>
##$CPDPRG2= <waltz16>
##$CPDPRG3= <>
##$CPDPRG4= <mlev>
##$CPDPRG5= <mlev>
##$CPDPRG6= <mlev>
##$CPDPRG7= <mlev>
##$CPDPRG8= <mlev>
##$CPDPRGB= <>
##$CPDPRGT= <>
##$D= (0..31)
0 1 0 0 0 0 0 0 0 0 0 0.03 2e-05 3e-06 0 0 0 0 0 0 0 0 0 0 0 0 0 0 0 0 
0 0 
##$DATE= 1654077750
##$DBL= (0..7)
120 120 120 11 120 120 24 19 
##$DBP= (0..7)
150 150 150 150 150 150 150 150 
##$DBP07= 0
##$DBPNAM0= <>
##$DBPNAM1= <>
##$DBPNAM2= <>
$$ [...]
##$SUBNAM3= <"">
##$SUBNAM4= <"">
##$SUBNAM5= <"">
##$SUBNAM6= <"">
##$SUBNAM7= <"">
##$SUBNAM8= <"">
##$SUBNAM9= <"">
##$SW= 501.771253377433
##$SWIBOX= (0..15)
0 1 3 0 0 0 0 0 0 0 0 0 0 0 0 0 
##$SW_h= 40650.406504065
##$TD= 32768
##$TD0= 1
##$TE= 0
##$TE2= 300
##$TE3= 300
##$TEG= 300
##$TL= (0..7)
0 120 53 12 22 120 120 120 
##$TP= (0..7)
150 150 150 150 150 150 150 150 
##$TP07= 0
##$TPNAME0= <>
##$TPNAME1= <>
##$TPNAME2= <>
##$TPNAME3= <>
##$TPNAME4= <>
##$TPNAME5= <>
##$TPNAME6= <>
##$TPNAME7= <>
##$TPOAL= (0..7)
0.5 0.5 0.5 0.5 0.5 0.5 0.5 0.5 
##$TPOFFS= (0..7)
0 0 0 0 0 0 0 0 
##$TUNHIN= 0
##$TUNHOUT= 0
##$TUNXOUT= 0
##$USERA1= <user>
##$USERA2= <user>
##$USERA3= <user>
##$USERA4= <user>
##$USERA5= <user>
##$V9= 5
##$VALIST= <valist>
##$VCLIST= <CCCCCCCCCCCCCCC>
##$VD= 0
##$VDLIST= <DDDDDDDDDDDDDDD>
##$VPLIST= <PPPPPPPPPPPPPPP>
##$VTLIST= <TTTTTTTTTTTTTTT>
##$WBST= 1024
##$WBSW= 4
##$XGAIN= (0..3)
0 0 0 0 
##$XL= 0
##$YL= 0
##$YMAX_a= 6337
##$YMIN_a= -7706
##$ZGOPTNS= <>
##$ZL1= 120
##$ZL2= 120
##$ZL3= 120
##$ZL4= 120
##$ABSF1= 248.5645
##$ABSF2= -253.2056
##$ABSG= 5
##$ABSL= 3
##$ALPHA= 0
##$AQORDER= 0
##$ASSFAC= 0
##$ASSFACI= 0
##$ASSFACX= 0
##$ASSWID= 0
##$AUNMP= <proc_1d>
##$AZFE= 0.1
##$AZFW= 0.5
##$BCFW= 0
##$BC_mod= 2
##$BYTORDP= 0
##$COROFFS= 0
##$CY= -3
##$DATMOD= 1
##$DC= 0
##$DFILT= <>
##$DTYPP= 0
##$F1P= 0
##$F2P= 0
##$FCOR= 1
##$FTSIZE= 65536
##$FT_mod= 6
##$GAMMA= 0
##$GB= 0
##$INTBC= 1
##$INTSCL= 5.30512e-09
##$ISEN= 30
##$LB= 1
##$LEV0= 0
##$LPBIN= 0
##$MAXI= 10000
##$MC2= 0
##$MEAN= 0
##$ME_mod= 0
##$MI= 50
##$NCOEF= 0
##$NC_proc= -5
##$NLEV= 6
##$NOISF1= 182.463
##$NOISF2= 159.3651
##$NSP= 0
##$NTH_PI= 0
##$NZP= 0
##$OFFSET= 248.5645
##$PC= 4
##$PHC0= -10152.85
##$PHC1= -172.7461
##$PH_mod= 1
##$PKNL= yes
##$PPARMOD= 0
##$PSCAL= 0
##$PSIGN= 0
##$REVERSE= no
##$SF= 81.014009
##$SI= 65536
##$SIGF1= 159.3651
##$SIGF2= -187.1042
##$SINO= 113.3802
##$SIOLD= 16384
##$SREGLST= <1H.CDCl3>
##$SSB= 0
##$STSI= 65536
##$STSR= 0
##$SW_p= 40650.406504065
##$SYMM= 0
##$S_DEV= 0
##$TDeff= 32768
##$TDoff= 0
##$TI= <>
##$TILT= no
##$TM1= 0
##$TM2= 0
##$TOPLEV= 0
##$USERP1= <user>
##$USERP2= <user>
##$USERP3= <user>
##$USERP4= <user>
##$USERP5= <user>
##$WDW= 1
##$XDIM= 65536
##$YMAX_p= 289725471
##$YMIN_p= -15925457
$$ End of Bruker specific parameters
$$ ---------------------------------
##NTUPLES= NMR SPECTRUM
##VAR_NAME=  FREQUENCY,     SPECTRUM/REAL,   SPECTRUM/IMAG
##SYMBOL=    X,             R,               I
##VAR_TYPE=  INDEPENDENT,   DEPENDENT,       DEPENDENT
##VAR_FORM=  AFFN,          ASDF,            ASDF
##VAR_DIM=   65536,         65536,           65536
##UNITS=     HZ,            ARBITRARY UNITS, ARBITRARY UNITS
##FACTOR=    0.620285442955139, 1,           1
##FIRST=     20137.2065510759, 0,            0
##LAST=      -20513.1999529892, 0,           0
##MIN=       -20513.1999529892, -15925457,   0
##MAX=       20137.2065510759, 289725471,    0
$$ Real data points
##PAGE= N=1
##DATA TABLE= (X++(R..R)), XYDATA
$$ [...]
41680E89844j29148l41819m85801j66081L22450K26438l74842n04404J55469O68608
41670c9286L38628j83645l9856M17012K83098l83784p18095m33575j12970j55774
41660a028247k44916p727L82049M88234J65402l14015n13012k16254L00157M99742
41650d88587K25397j02081j03550M3225M280j07942L1756L36889M10906J87106
41640D37399k605R51k1438k15939l65253k14233J47171L84999K90468m2213l43981
41629E5326m30345l35890j81746J0317K27612K81553J0836l36644l04826J01687
41619i02120L67167K28936J3452k0125j14907m08434m63081K2562N29608M51961
41609b94981J06392J88991N34109L81980k44635m87469p9370K27378k4465k59447
$$ plain form
41680 589844 460696 118877 -366924 -533005 -210555 15883 -358959 -863363 -707894 -39286
41670 -39286 299342 115697 75841 492853 775951 392167 -325928 -759503 -872473 -1028247
41660 -1028247 -1273163 -1280890 -898841 -410607 -245205 -559220 -1072232 -1288486 -988329 -488587
41650 -488587 -263190 -365271 -468821 -425596 -421316 -529258 -497502 -160613 250293 437399
41640 437399 434794 435745 414307 198368 -166885 -381118 -233947 151052 441520 399307 55326
41629 55326 -375019 -710909 -892655 -882338 -654726 -373173 -362337 -698981 -1003807 -902120
41619 -902120 -534953 -306017 -292565 -312690 -427597 -836031 -1299112 -1276550 -746942 -294981
41609 -294981 -188589 402 534511 916491 671856 184387 105017 332395 307930 48483
41599D8483K3657L12745l140m92515l54554K23094L36836j88468n47703k15811
41589h57376L26021L82057k2186l36784k44699J04830L96103M07088J00670l16878
41579f1154m80031j79570L84062P42741N89960O2788m05161n06226l08395p2588
41569b33574Q2595K04739K68075J50968r8031k13480o8139J22681J16983q474
41559C24343k1038J12276K48056L13133K92463R7119k66934m89877k74411J41079
41549D76209J71184k79811n60491j40563N60168O49769k4653o29526m46656J93019
41539c1351M18437J1504l80697k17940K18443L04506o7980m51928m94537k78154
41529i69697n6292N3752R3821J93099M54625P20769N64091j70274r05802q75037
$$ plain form
41599 48483 72140 384885 381745 -110770 -465324 -242230 94606 -93862 -641565 -857376
41589 -857376 -531355 -149298 -171484 -508268 -752967 -648137 -252034 155054 255724 -61154
41579 -61154 -541185 -720755 -336693 406048 996008 1058796 653635 147409 -160986 -233574
41569 -233574 -150979 53760 321835 472803 374772 161292 93153 215834 332817 324343
41559 324343 303305 415581 663637 976770 1269233 1366352 1099418 609541 335130 476209
41549 476209 647393 367582 -192909 -333472 226696 876465 851812 222286 -224370 -31351
41539 -31351 387086 398590 17893 -200047 18396 322902 254922 -197006 -691543 -969697
41529 -969697 -1025989 -972237 -878416 -685317 -230692 490077 1054168 883894 -21908 -896945
41519h96945j55330L55052J75600j06446J83088O94492N75599j85253p10734n18656
41509e89533r5768L0329P7853L93145O18954K07971n07653n87643J29636O98125
41499C75416M15306k16246l99072k67012l94001n43651j6599Q66192R04278l9640
41489F84971n35066K22731R31649J35009j297187j332392L6303P24784j57964
41480e87162r48632j65000J143641J143553M6378m75500J5406L53356r6634n57328
41470a27922l35802J25889J86755N11J2563J74992J91051N2428p4243j20872k4046
41459F1304K49989M16525P6309n99152q83672m45681J88317L88653J90348J2560
41449c44500L3531J65603K90968K37073j27467n25638m14939K17641O52218L89339
$$ plain form
41519 -896945 -1052275 -697223 -521623 -628069 -444981 249511 825110 639857 -70877 -589533
41509 -589533 -685301 -654972 -577119 -183974 434980 642951 135298 -452345 -322709 375416
41499 375416 790722 574476 175404 -91608 -485609 -1029260 -1045859 -179667 724611 684971
41489 684971 149905 372636 1304285 1439294 142107 -1190285 -1153982 -429198 -587162
41480 -587162 -1535794 -1700794 -557153 586400 632778 157278 172684 526040 429406 -127922
41470 -127922 -463724 -337835 -151080 -150569 -138006 36986 228037 280465 206222 85350 61304
41459 61304 311293 727818 804127 204975 -678697 -1124378 -936061 -547408 -357060 -344500
41449 -344500 -310969 -145366 145602 382675 255208 -270430 -685369 -467728 184490 573829
41439E73829j35541k37093K5411R1645j46923k50348J104K68129J42469l42585
41429i903p30444n33256K67781J011028R30618J11614n23181m30357j36274k80097
41419c22471n40419k38645M13042N85466J70102j27971n0216j29772n28925n32437
41409a302246K44711R66203O65285l13360q00627m34152M5483N8395q7560N8384
41399h99484L00501J88140k03442l70298j14909K28516L17923K27075K16008K99626
41389A89656K63373L8542j56453j09876R1627J79258M3947j54700k12524j22608
41379E0242o4383j86646m16593m96186k55770J46242L52190K23536J6829L2548
41369e97991J97087J86490p1649k62873j37703J13659J38956m0749n2520K40256
$$ plain form
41439 573829 438288 201195 226606 318251 171328 -79020 -77916 190213 332682 -9903
41429 -9903 -740347 -1273603 -1005822 5206 935824 1047438 524257 93900 -42374 -322471
41419 -322471 -862890 -1101535 -688493 -103027 67075 -60896 -111112 -240884 -769809 -1302246
41409 -1302246 -1057535 -91332 573953 260593 -540034 -974186 -928703 -870308 -957868 -899484
41399 -899484 -598983 -410843 -614285 -984583 -1099492 -870976 -553053 -325978 -109970 189656
41389 189656 453029 491571 335118 225242 316869 496127 540074 385374 172850 50242
41379 50242 -14141 -200787 -617380 -1113566 -1369336 -1223094 -870904 -647368 -630539 -597991
41369 -597991 -400904 -214414 -286063 -548936 -686639 -572980 -434024 -474773 -527293 -287037
41359b87037M64195K56882j53775k39597L5768J56361j12086l01813K6809N37915
41349C83622N92607K03808o5476k8045m5712k55091k95820l694K41378J55322
41339H82899j0150j2228p9587m09342o72274n09113j35159M1824O0911J76441
41329f65778L30504L64341M08094N25563L56519k68393p59385n52153p9915r4028
41319d34631l58101p5960N88722O57540L6006k46186K03500M49509j26878p28240
41309c4719n21644l1960j03248l62907K5472P00501N77954k91109p04334j81982
41299i27976L95718K87896q8027r8801Q8714O2601J4274L05018O54673M96240
41289A190330r9260n05647m47524k34416r1881J54189N39243O11460K2886p93156
$$ plain form
41359 -287037 177158 434040 280265 40668 76436 232797 120711 -181102 -154293 383622
41349 383622 976229 1180037 1114561 1086516 1040804 785713 489893 486199 727577 882899
41339 882899 872749 860521 780934 371592 -300682 -809795 -944954 -903130 -842219 -665778
41329 -665778 -335274 29067 437161 962724 1319243 1050850 291465 -260688 -340603 -434631
41319 -434631 -792732 -868692 -279970 377570 413576 167390 370890 820399 693521 -34719
41309 -34719 -556363 -588323 -691571 -1054478 -1029006 -328505 249449 -41660 -745994 -927976
41299 -927976 -532258 -244362 -332389 -431190 -342476 -279875 -265601 39417 694090 1190330
41289 1190330 1091070 585423 137899 -96517 -188398 -34209 505034 1116494 1139380 346224
41279C46224r94379l56755M47224O84158L45883o7385k35938j92478k9394J78607
41269A25767K49994O4476j76565j98038j05730j99540l82143k52030J73057L79205
41259c21547J51991j07799q8910j6356q2143k2926K96003M37935R0455k93888
41249D2815j96617N8337j58629o53191o32520Q0319Q23123J031457P07707L5899
41239A138700p25137j003116l93833N20544O45042j40717p52733m27194L16861
41230h21583O29567M77854K86745Q9884k57957m61903j23062N03584P16959K82722
41220A322810l25105n63231l47757J4046J49338o6771l47801k78443J19616L64396
41210D1098K17182M7292K12592M57564L49554O843j17354J3898J7447k34736m35173
$$ plain form
41279 346224 -648155 -1004910 -557686 126472 472355 404970 169032 -23446 -52840 125767
41269 125767 375761 440237 263672 65634 -40096 -239636 -621779 -873809 -700752 -321547
41259 -321547 -169556 -277355 -366265 -382621 -464764 -487690 -191687 246248 336703 42815
41249 42815 -153802 -95465 -254094 -907285 -1539805 -1459486 -636363 395094 1102801 1138700
41239 1138700 413563 -589553 -983386 -462842 182200 41483 -711250 -1138444 -821583
41230 -821583 -192016 285838 572583 662467 404510 -57393 -180455 323129 1040088 1322810
41220 1322810 997705 434474 86717 100763 250101 183330 -164471 -442914 -323298 41098
41210 41098 258280 305572 518164 975728 1325282 1332125 1214771 1228669 1246116 1011380 576207
41199E76207l63110j66560m5047J0851O6806R1860N3972k547k9550k8321m9140
41188A15421j77288l87271l89606Q1180P15585P86250J31631m69042l34982J52262
41178B24140K23575n3694m0808K43819J46157l78321n67336j40903J96425j5300
41168a62246j83994K57571P65325N24939k02689n18619k94283j69398l39096l43495
41158f65985p4078j6443k86276l10910J75433O00405M70980J34202Q5036J37861
41148B50225n6065j98764J43396N85311L87947k76943m79810j2637K57101j67013
41138D32748n37550o9032P10251O89442j37309o70178l29654K20142K01382j83709
41128C26533k50197R3899L38467J94507j00956k50099k40337j78665j03951n7159
$$ plain form
41199 576207 213097 46537 1490 12341 79147 171007 224979 222432 192882 164561 115421
41188 115421 -61867 -449138 -838744 -757564 -41979 744271 875902 406860 71878 224140
41178 224140 447715 394021 353213 597032 743189 364868 -202468 -343371 -146946 -162246
41168 -162246 -346240 -88669 676656 1201595 998906 480287 186004 16606 -322490 -665985
41158 -665985 -740063 -756506 -1042782 -1353692 -1178259 -577854 -106874 27328 112364 250225
41148 250225 194160 -4604 138792 724103 1112050 835107 355297 342660 599761 432748
41138 432748 -104802 -173834 536417 1225859 1088550 418372 88718 308860 510242 326533
41128 326533 76336 170235 508702 703209 602253 352154 111817 -66848 -170799 -227958
41118b27958j02329j85110j60191l9563k2840j73290k49879k6171L58864N58545
41108b69922M45644J97163J4073l9225M5084K13026K48791m4141m71330n41172
41098b02009j03809L72868M12104J54225L1351M9222j18926m29923m46877r5803
41088c77577J34985j3012j17682K00945N66562L75723k56093o42517m81640j28121
41078g38427N5241J12004J76822J68037k6314l01062m09248j84085K89259O27320
41068b30453M45932j07553l66841R102M85964L79596j34545l08554N8013M40345
41058F71006M62468K70308K6511k67618l88392o6899L35510J20618n87904q35506
41048b59898k88660K18549N0973k50293k2595L58911K35725j37465j13393J82037
$$ plain form
41118 -227958 -330287 -515397 -675588 -715151 -737991 -911281 -1161160 -1187331 -828467 -269922
41108 -269922 175722 372885 386958 347733 392817 605843 854634 810493 339163 -202009
41098 -202009 -305818 67050 479154 633379 664730 713952 595026 165103 -281774 -377577
41088 -377577 -242592 -255604 -373286 -172341 394221 769944 513851 -128666 -610306 -738427
41078 -738427 -683186 -571182 -394360 -226323 -252637 -553699 -962947 -1147032 -857773 -230453
41068 -230453 215479 107926 -258915 -249813 236151 615747 481202 172648 230661 671006
41058 671006 1133474 1403782 1430293 1162675 774283 707384 1042894 1163512 575608 -259898
41048 -259898 -548558 -330009 -279036 -529329 -551924 -193013 42712 -94753 -208146 -26109
41038b6109J88894j8922O723J22361j12056m72143m15141j18596j26595k28234
41028a199818J43773O11488K87009n40025o07960K46291P31719K39964j81898
41019b69457K91674Q41016M52467m04373p00768m84803l87975k96261K11308P05573
41009d1599M84371j17373k38651K7051q0990m82758l76895K07549L38111k03222
40999d84406n21901j38225K88816K05091J6907J39963K09030p4149k01922K20802
40989c39994N65079J00600p11494q10591j06846M69964L72144K6331k9401J50039
40979c14169K83303L47484L95350K81996j04150n38660o46223l31985J01219K57451
40969b68384M4590k26514j88326J25914L01254Q4203k69501l43338j00502J38635
$$ plain form
41038 -26109 162785 143863 150586 272947 160891 -311252 -726393 -844989 -971584 -1199818
41028 -1199818 -1056045 -444557 -157548 -697573 -1305533 -1059242 -327523 -87559 -269457
41019 -269457 22217 863233 1315700 911327 210559 -274244 -662219 -958480 -747172 -41599
41009 -41599 442772 325399 86748 113799 32809 -449949 -826844 -619295 -281184 -484406
40999 -484406 -1006307 -1144532 -855716 -650625 -633718 -493755 -284725 -358874 -560796 -339994
40989 -339994 225085 325685 -385809 -1196400 -1303246 -833282 -461138 -434807 -464208 -314169
40979 -314169 -30866 316618 711968 993964 889814 351154 -295069 -627054 -525835 -268384
40969 -268384 -223794 -450308 -638634 -512720 -211466 -127263 -396764 -740102 -840604 -701969
40959g01969J59987N6581m942N512L8519O2373M4836m8416j77515k14709n6767
40948h36510K53393N13056M83827J04150l89097o23886m34974m691L50405M56250
40938a28077L31869R4175r8945j03672Q5064K79821K62850K5341j99581j82269
40928C66576K8060J36056k7914k43539j79277R2935J42332j67026l96216j53335
40918d01348K95743M02419J09891j67919j98379j09512j0704R0908N6954j93242
40908a25189l11433P8593O16222N27376j78683n84764j92478L86283M56280J99712
40898H71919N7606j30503o15473r30644m81956L76795P15727L12593k02130l65855
40888c91921l02388j75947M1546K22856J53494p936P2916K52854Q8301l21769
$$ plain form
40959 -701969 -541982 -485401 -490343 -484831 -446312 -383939 -339103 -387519 -565034 -779743 -836510
40948 -836510 -583117 -70061 413766 517916 128819 -495067 -930041 -934732 -584327 -128077
40938 -128077 203792 297967 199022 95350 180414 460235 723085 748426 548845 366576
40928 366576 394636 530692 502778 259239 79962 172897 315229 148203 -248013 -401348
40918 -401348 -105605 296814 406705 238786 40407 -69105 -79809 11099 68053 -125189
40908 -125189 -436622 -358029 258193 785569 606886 22122 -170356 215927 672207 871919
40898 871919 929525 799022 183549 -747095 -1229051 -852256 -136529 176064 -26066 -391921
40888 -391921 -694309 -870256 -828710 -605854 -452360 -460296 -387380 -134526 -46225 -367994
40878c67994l63365J12726N18883M35724J65602J24289K22616J47907j50711m81926
40868C63751n93216k74723L36770O22714J78049m57554m47804M8657J19309l51092
40858d55139m63956Q7168L88777j12564n38688j41Q46790P80253j11607p14490
40848b93597o15463l60425k19547J21558O34807P80177M34808J20927J18864J14901
40838H37010r0536k44791k11528k07751k71194j41357J13048K1689m31848n43840
40828a171098P7112P59846O14570k10345o90157k40801N94730Q68900L62735k21184
40818G44308j95093K13632K15660l41769o88320l07243K18411J26737k85629k10776
40808e10082K29970J66860m56269o58232j5471O15755M83780Q1698J85045N26640
$$ plain form
40878 -367994 -731359 -618633 -99750 335974 501576 625865 848481 996388 845677 363751
40868 363751 -229465 -504188 -167418 455296 633345 175791 -272013 -223356 -104047 -455139
40858 -455139 -919095 -831927 -443150 -555714 -1094402 -1094543 -247753 532500 420893 -293597
40848 -293597 -909060 -1269485 -1489032 -1367474 -732667 47510 482318 603245 722109 837010
40838 837010 746474 501683 290155 82404 -188790 -330147 -217099 -195410 -627258 -1171098
40828 -1171098 -1093986 -334140 280430 70085 -620072 -860873 -266143 602757 965492 744308
40818 744308 549215 762847 978507 636738 -51582 -358825 -140414 -13677 -299306 -510082
40808 -510082 -280112 -113252 -569521 -1227753 -1243224 -627469 -143689 -61991 123054 649694
40798F49694L13485m20507q63182o03622k0152M08943N60305M66609J89541p3470
40788F07644j32619o7759p9417j47526r7492P6684J91671J07011j74193n09755
40778b25751o25036l32191J53327L84924K61037Q3154k7768k68067n45558l70422
40768a512351K93290O94532L25003k77236l48620k611J75697J50476K33289K53099
40758a5432j33267n33421k22230N92662Q92698L50387k24055j84118Q5224N057
40748F13505k52150k01638J04558K28802L5786k16993k85239j35586R6861J72138
40738A60044l7012k98782k53387N4687K08565M7880j20941m7978J30853K28829
40728G2758K72730K71028J11594j37123k10803r9895j05522k74098k35072J58792
$$ plain form
40798 649694 963179 542672 -320510 -924132 -944284 -535341 24964 491573 681114 607644
40788 607644 475025 407266 327849 180323 82831 159515 351186 458197 284004 -225751
40778 -225751 -850787 -1182978 -1029651 -644727 -383690 -300536 -328304 -596371 -1141929 -1512351
40768 -1512351 -1219061 -524529 -199526 -476762 -825382 -827993 -652296 -501820 -268531 -15432
40758 -15432 -148699 -682120 -904350 -311688 581010 931397 707342 523224 608448 613505
40748 613505 361355 159717 264275 493077 528863 311870 26631 -108955 -12094 160044
40738 160044 123032 -175750 -429137 -374450 -165885 -118005 -238946 -286924 -156071 72758
40728 72758 345488 616516 728110 590987 380184 280289 174767 -99331 -334403 -175611
40718a75611M86277L58734l5641k99959l65140l50271k60227j41475j74766l00795
40708a258874j44014L61388O98865N01785J03871q0422k23475n63171p17736k83924
40698a605707K60344J52330l57491k88561M73943Q85482L33716m07027l55178
40689i08149K70060N20378J25942l21653l68869j59116Q8840M02856O86030N68329
40679I04648l1680n57378m37129J34701M62131L08970J16967J94055K15308j49650
40669A160943n58624m73923n6853M5469k60766l58150P6123N42968M95206J06389
40659G18782j21912j00321p6253j41544k24879l18824l61841j67544J99297L13900
40649b81139K6355j97934l3756P0815l36543p40314l32308N72845Q05900P0851
$$ plain form
40718 -175611 310666 669400 633759 333800 -31340 -381611 -641838 -783313 -958079 -1258874
40708 -1258874 -1402888 -1041500 -342635 159150 263021 182599 -40876 -604047 -1321783 -1605707
40698 -1605707 -1345363 -1193033 -1550524 -1839085 -1365142 -479660 -145944 -552971 -908149
40689 -908149 -638089 -117711 8231 -313422 -682291 -841407 -752567 -349711 336319 904648
40679 904648 872968 315590 -121539 13162 475293 784263 901230 1095285 1310593 1160943
40669 1160943 602319 128396 71543 117012 -143754 -501904 -425781 117187 612393 718782
40659 718782 596870 496549 420296 278752 53873 -264951 -626792 -794336 -595039 -281139
40649 -281139 -254784 -452718 -486474 -415659 -752202 -1492516 -1824824 -1251979 -446079 -375228
40639c75228n86208l21929L77770N94267K76956K9922Q8115J56185L1956j45466
40629A26340j91705p7211J00563J52293m5484k93314k17523J67328L58171N7976
40619A37434l43320k95404J50295M49574K88825j04933l03965j20784K30560L20885
40609D09167j8375l96636l05782J33418K84274n1728l28561j51379J09643L6111
40599b79848p9090J74321M38836J14510n05299n40222P8251M43562Q9245l21897
40589c87631j31582K69019J60625k94185l38280J40107M33408J10488l66946l52243
40579g57220J31440N64042O45114M68450J55931k59146n75968m67967J8482L16826
40569B39984J4719n09358n21588N0376M81327K33821l40545n30661j67704L21860
$$ plain form
40639 -375228 -961436 -1283365 -905595 -311328 -34372 -4450 83665 239850 271806 126340
40629 126340 -65365 -142576 -42013 110280 64796 -228518 -446041 -278713 79458 137434
40619 137434 -205886 -501290 -350995 98579 387404 282471 -21494 -142278 88282 409167
40609 409167 390792 -5844 -311626 -178208 106066 54338 -274223 -425602 -315959 -279848
40599 -279848 -358938 -184617 254219 368729 -136570 -676792 -598541 -154979 -65734 -387631
40589 -387631 -519213 -250194 -89569 -383754 -722034 -581927 -148519 -38031 -404977 -757220
40579 -757220 -625780 -61738 583376 1051826 1207757 948611 372643 -95324 -76842 239984
40569 239984 254703 -254655 -776243 -725867 -244540 -10719 -351264 -881925 -1049629 -727769
40559g27769N36702M34666J84781l330J5242J44303R0280k04040l71040j51367
40549e1572J24003q583m07102n43500l23202j05028L0618L48338P20407N85634
40539C70013o8274m20154M38N00971K65355l31936l15743L01064N27511L026m17911
40528D14360m6954N34810L93405l29284o90938l65895K8695J8015q3160J30953
40518D007M22768L36401j9656j46848M4659J30647j16568l76493l01563k4743
40508d7389J07952N8526M6016J12018O0931j65815l24251j80384J64034L82704
40498B14342L12073J26141Q9871J91002J38891k05301n38420m58342k6558K93153
40488A36852K65733J16536M0540j12378m08769m83906n6668M70905M47443j04512
$$ plain form
40559 -727769 -191067 243599 428380 425050 440292 584595 674875 470835 99795 -51572
40549 -51572 72431 63848 -343254 -886754 -1209956 -1314984 -1284366 -936028 -215621 370013
40539 370013 301739 -118415 -117977 382994 648349 316413 670 301734 829245 832271 414360
40528 414360 367406 902216 1295621 966337 275399 -90496 -61801 -43786 -126946 4007
40518 4007 426775 763176 743520 596672 641331 771978 655410 278917 -22646 -47389
40508 -47389 60563 119089 165105 277123 338054 172239 -152012 -332396 -168362 214342
40498 214342 526415 652556 742427 933429 1072320 867019 328599 -129743 -156301 136852
40488 136852 402585 519121 559661 447283 38514 -445392 -502060 -31155 416288 311776
40478C11776n12198l86114k5064J80187K40626K78069J91386r0430l42531l38184
40468d92477j86816j12298q8282L5305J98512K11516Q6809K6768R6452J31765
40458i2746J0078j59956k05486j42253j22771j33235P5691N76880R17831N59183
40448A283216k84402p07828k88023K76831J65481l67684m78779r4420J10148k1852
40438d07312Q2257N12323N27690j32658o00410k28943K90408N9128n08071l86151
40428g91739L24357N87072J67312o7489K97449N44326J05857m63759m21930O14
40418B82070J01644j17938o0841L94709O61716L43439k01692m26257l42647l53249
40408B80954n09225l91909J44603N30221K00211m68005n50845P6846N03004J52500
$$ plain form
40478 311776 -200422 -586536 -611600 -431413 -190787 87282 278668 188238 -154293 -492477
40468 -492477 -679293 -791591 -879873 -844568 -646056 -434540 -347731 -320963 -224511 -92746
40458 -92746 -82668 -242624 -448110 -590363 -713134 -846369 -770678 -193798 724033 1283216
40448 1283216 998814 290986 2963 279794 445275 77591 -401188 -495608 -385460 -407312
40438 -407312 -325055 187268 714958 582300 -18110 -247053 43355 102483 -405588 -791739
40428 -791739 -467382 119690 287002 219513 516962 1061288 1167145 703386 281456 282070
40418 282070 383714 265776 204935 599644 1261360 1604799 1403107 976850 634203 280954
40408 280954 -228271 -620180 -475577 54644 254855 -213150 -763995 -687149 -184145 -31645
40398c1645l41179j95272K55959J91686k56092k22613L89597O97295K50170l10006
40388D27900l15764K8067K14716J91887R6682j46530m75068m62374N6491N71107
40378A87114N66413J94572j44860m23646o82544n88915N8346P26061P29748K02414
40368H24703j61973j54916j67803l56359m07238k03899o9824j63711j89786L9835
40358a010971K30450J07542q1960N5962M25080N57729K76552r6941k07559o6515
40348A89369J06923K18610K75461J64850k35365o98293p32767k20457L18210L89851
40338b23608J91962J95032L07347O6938m25249m96721L8389N20165M20147K2431
40328F16833k19200l38226m19986j94249L33435M94186m4931m84759j3162P79734
$$ plain form
40398 -31645 -372824 -568096 -312137 -120451 -376543 -599156 -209559 487736 737906 427900
40388 427900 112136 140203 354919 546806 643488 496958 21890 -440484 -383993 187114
40378 187114 753527 948099 803239 379593 -302951 -891866 -833520 -107459 622289 824703
40368 824703 662730 507814 340011 -16348 -423586 -627485 -697309 -861020 -1050806 -1010971
40358 -1010971 -780521 -672979 -754939 -698977 -273897 283832 560384 463443 255884 189369
40348 189369 296292 514902 790363 955213 719848 21555 -711212 -931669 -613459 -223608
40338 -223608 -31646 163386 470733 537671 112422 -384299 -345910 174255 594402 616833
40328 616833 397633 59407 -360579 -554828 -221393 272793 227862 -256897 -270059 509675
40318E09675P09533j06223m32644O5057L57980j24870n61468k40230J94731q6385
40308B85156o10772l86075M29998P96345M20725J3766j1923l8689k99288l98743
40298B00500j24029P0401j44666l41650n3686L77946L12410j57704l50499k8069
40288b39046L53341M17051K87758J39887j02712l97224m32268j67894o7001l80056
40278e88164o07032k01032M97517O64696J88479k02315k0386L97858N27868L15136
40268I72625o5k28476k05528J13429L57955O1372n36649o21724j6793M43257J85083
40257E24486k14421p1256K13930o1458n13739k34412N66482P51948R2273l56264
40247F97569K0461M70747J95453m39669o90330n78116m76129k65405K29513N26436
$$ plain form
40318 509675 1219208 1112985 680341 745398 1103378 978508 417040 176810 371541 285156
40308 285156 -325616 -711691 -281693 514652 935377 949143 937220 898531 599243 200500
40298 200500 76471 146872 2206 -339444 -393130 -15184 297226 139522 -210977 -239046
40288 -239046 114295 531346 819104 958991 856279 459055 26787 -141107 -208108 -588164
40278 -588164 -1195196 -1396228 -898711 -234015 -45536 -247851 -268237 129621 657489 972625
40268 972625 972560 744084 538556 651985 1009940 1071312 534663 -87061 -103854 339403 524486
40257 524486 310065 238809 452739 391281 -122458 -356870 209612 961560 1053833 697569
40247 697569 718030 1188777 1384230 944561 254231 -323885 -800014 -1065419 -835906 -309470
40237c09470J50310l79115k03985M63864O11477L5431l76462j30609J60903k7315
40227d971k07707J49099M99762M1984q15834q74157N8719Q26280O02093j8950
40217B56318q9024K94425L74828K8309j67323K0644J56807o9788l73348l71551
40207F0297p2249L02077N51445M43939j09996o84634o43404k1819M10160K19763
40197D55579j24533j15816j4090k27831m37986j04379M81660M84350k15286p93509
40187f11841o01771R2768O21239O78611M10977J04672n4731j18362k83530n20678
40177b82646m78059k1194L99120L18162n1597j75992j1974Q2515M2614P9755J27322
40166B8026l0302j86318K2665L55349K42245j92925k37657J86714L09747k07733
$$ plain form
40237 -309470 -159160 -538275 -742260 -278396 333081 368512 -7950 -138559 22344 -4971
40227 -4971 -212678 -63579 436183 478167 -337667 -1211824 -1153105 -326825 275268 256318
40217 256318 167294 461719 836547 864856 697533 718177 874984 805196 431848 60297
40207 60297 -11952 290125 841570 1285509 1175513 490879 -152525 -174344 235816 455579
40197 455579 331046 215230 201140 -26691 -464677 -569056 -87396 396954 181668 -611841
40187 -611841 -1213612 -1120844 -499605 179006 589983 694655 639924 521562 238032 -282646
40177 -282646 -760705 -781899 -382779 -64617 -116214 -292206 -304180 -221665 -179051 -99296 28026
40166 28026 -2276 -188594 -165929 189420 431665 238740 1083 187797 497544 289811
40156B89811o41253k98308M61584Q14876N45963O2318k35993k12609K1758J18374
40146I26521j48835m11281j11178N23840O06272r2640p18623n89840j12710L6460
40136i2014p7239l5489J57678K91871M01707M52275J34048m84144p13636k57263
40126b22206J90039K5518k76398p5970K42915J2092l91119j38348N29500O37012
40116E33035J22744j23262J59716K57301j27480l59853r2327J18289j12124k96634
40106G9405l0877K31999K6848k42352p779M47632M48803L351l18147l12339k63314
40095F3230k87854k04074p081R2359J20952L18408N86704M63788j56934o98241
40085B91257n94091l5545L19773K15926o274l5674J6384j6137P126K08435K93996
$$ plain form
40156 289811 -351442 -649750 -188166 626710 1172673 1234991 998998 786389 808147 926521
40146 926521 777686 366405 255227 779067 1385339 1292699 574076 -15764 -128474 -92014
40136 -92014 -169253 -204742 -47064 244807 646514 1098789 1232837 748693 35057 -222206
40126 -222206 -32167 -6649 -283047 -359017 -116102 -104010 -495129 -633477 -103977 533035
40116 533035 655779 532517 692233 949534 822054 462201 369874 488163 376039 79405
40106 79405 48528 280527 307375 65023 57244 504876 953679 957030 638883 326544 63230
40095 63230 -224624 -428698 -435779 -343420 -222468 95940 682644 1146432 989498 291257
40085 291257 -302834 -338379 -18606 197320 191046 155372 171756 155619 162745 371180 665176
40074F65176p4246o39732p70095l17938K06391L85263L20249J81312j02329m20733
40064e66682l21758K74663O78525L15970l48550m18300J48583N49690L37984q9035
40054E61090k55588k11277j70649r3473P9714J64120R381k16716k73604j75138
40044e82140o2587N9787K35784L48765K55732O8916M6909J73873J06487k90853
40034C60673n77069k52338M20608O01611M8856m22585q4941N87803O33836P9083
40024A395537k10298k1590p4119o27727r03588l80453K98680L91201J93067L10141
40014C70851N10255K44646k29728k70024k8640j68079n82419m66306K97596Q00780
40004D78932M20293l05267m85158l3675L69516K03387l03853m73871o974N68545
$$ plain form
40074 665176 590930 -48802 -818897 -1136835 -930444 -545181 -224932 -43620 -145949 -566682
40064 -566682 -888440 -613777 64748 380718 32168 -386132 -237549 312141 650125 561090
40054 561090 305502 94225 -76424 -169897 -90183 73937 83318 -133398 -407002 -582140
40044 -582140 -644727 -584940 -349156 -391 255341 324257 371166 545039 651526 360673
40034 360673 -216396 -468734 -48126 553485 602341 179756 94815 682618 1316454 1395537
40024 1395537 1185239 1163649 1089530 461803 -441785 -822238 -523558 -132357 60710 370851
40014 370851 881106 1125752 896024 626000 597360 429281 -153138 -619444 -321848 478932
40004 478932 899225 593958 108800 75125 444641 648028 344175 -129696 -136670 431875
39994D31875N05644j39702n63950l85065j12029j69932k10622R4352L26213R1447
39984a31769j61125P2311L69831J31267k66966j33704K12876r550n31483l83903
39974h32215L73272O24290n175n83668l81145J57938L18651Q9289j37927j31531
39964e08221J62759N75730O26228R1251m39404k94531J99531K34433j35887k03620
39954C08269N5729M6530j73212J2686M26974K33745m69637o40016r2727J68848
39944a22811k24358l86143J16527M66248J79560K902M08666O17478P3066m39130
39934F92005k10579Q7894l07117p74321l96357L91448N46119R8979j43428j1071
39924b6428N6468j4342R401L4962r7965j79737j23209k68496n63155k85976O43238
$$ plain form
39994 431875 937519 797817 233867 -151198 -263227 -433159 -643781 -549429 -223216 -131769
39984 -131769 -292894 -220583 149248 280515 13549 -120155 92721 83171 -448312 -832215
39974 -832215 -458943 165347 160172 -423496 -804641 -646703 -328052 -238763 -376690 -508221
39964 -508221 -345462 230268 856496 947747 508343 213812 413343 647776 511889 308269
39954 308269 363998 410528 237316 250002 676976 910721 441084 -198932 -291659 -122811
39944 -122811 -347169 -733312 -616785 -150537 29023 31925 440591 1058069 1131135 692005
39934 692005 481426 569320 262203 -512118 -908475 -517027 29092 128071 -15357 -26428
39924 -26428 30040 15698 25099 60061 -37904 -217641 -340850 -609346 -1172501 -1458477 -815239
39913h15239J055259K19196q22701p69873j6529K28999j8055J39716O64241O71520
39903E36534Q2324k47117J6864K96156J47307k77834p01193q28630l10839N89301
39893f97127Q11475p0115q70074m00432O12202O22588k78035o25276J4733O07297
39883b72764N61599M18904M68588K32420l45238n78118k87468j38672l83571m36835
39873g61155m1581K75988K48725K61688L85864J36702m50527o19965j69575J59615
39863e74221j6873j39488J16829K09778j28690k15812L65976Q46779M29184m03278
39853D90184o28864j63945K48170K15681j691j22649j41523j14723p6713q1440
39843c77513j09413q6373o5737j36781j66524R666K08526J58800K9053J46156
$$ plain form
39913 -815239 240020 459216 -363485 -1133358 -1149887 -920888 -938943 -799227 -134986 536534
39903 536534 618858 371741 388605 684761 832068 554234 -146959 -975589 -1286428 -697127
39893 -697127 114348 44233 -825841 -1226273 -614071 8517 -269518 -894794 -880061 -272764
39883 -272764 288835 707739 1176327 1408747 1063509 485391 197923 59251 -324320 -761155
39873 -761155 -802736 -526748 -278023 -16335 369529 506231 55704 -564261 -733836 -574221
39863 -574221 -591094 -730582 -613753 -403975 -532665 -748477 -382501 464278 893462 490184
39853 490184 -138680 -302625 -54455 161226 159535 36886 -104637 -219360 -296073 -377513
39843 -377513 -486926 -573299 -639036 -775817 -942341 -932675 -724149 -565349 -536296 -390140
39833c90140L25605J53102j93346j88535O4247mk94769j54181L85135M75125r9881
39822H2358m73393j24602K99913J71659q8879J04713M11368J84980l92169o02885
39812d26937k58914J89909L67279K90340J51646R7381P6607j47083n55187n97950
39802h12909P4382P74727N19624m30871p92726j53752M78893L71753J24203M14568
39792E67892P68191M35409l14839o68696m56859j05216J13610J28983j44696m96579
39782a72800l89601K38153O87441N01766J30550P0723N5050k66084n31735l09557
39772A3906P1763R3772q1607n6753J5999j36437k04912J53158N14232K93080k25185
39761D51016l12913M0156K39073J21249M2909P1981r1200m05323m20626j4735
$$ plain form
39833 -390140 -64535 88567 -104779 -293314 -229067 -229071 -523840 -678021 -292886 182239 82358
39822 82358 -391035 -515637 -215724 -44065 -132944 -28231 383137 568117 175948 -426937
39812 -426937 -685851 -495942 -128663 161677 313323 410704 487311 340228 -214959 -812909
39802 -812909 -738527 36200 555824 124953 -667773 -821525 -342632 29121 153324 567892
39792 567892 1336083 1771492 1456653 787957 331098 225882 339492 468475 323779 -172800
39782 -172800 -562401 -324248 363193 864959 995509 1066232 1121282 855198 323463 13906
39772 13906 85669 179441 97834 41081 57080 -79357 -284269 -131111 383121 676201 451016
39761 451016 138103 178259 417332 538581 581490 653471 562271 156948 -263678 -278413
39751b78413L48226K28401k50077n46371k61024L84873O55917J71270m46498l41726
39741c35422K63250L74348j35369l13102J62655L48774k53567o65738q2392O33257
39731c306L48170m33162m71050J67254M64948K85503K95222M33810M4010o22267
39721E09132n58576K84342Q27474N39225J7330k47789m53191o24120l77751J59455
39711G5531K91649r1032l14527j22158k5514k01385j43504K47557L46521j254
39701F1884r5961K78127K88009m49039r04943j61353R80752J048236O264q03255
39691B48721n75969J19784M05178J53961j71977j93664P5462L08492J88022k04114
39681C53896m26834k58082j4001o8498k97561l01188J4054L89908O03629N86842
$$ plain form
39751 -278413 69813 298214 48137 -498234 -759258 -374385 281532 452802 6304 -335422
39741 -335422 -72172 302176 166807 -146295 16360 365134 111567 -554171 -636563 -3306
39731 -3306 344864 -88298 -559348 -392094 72854 358357 653579 1087389 1131399 509132
39721 509132 -49444 234898 1062372 1601597 1618927 1371138 917947 293827 -83924 75531
39711 75531 367180 276148 -38379 -160537 -186051 -387436 -530940 -283383 63138 61884
39701 61884 -34077 244050 532059 83020 -821923 -983276 -2524 1045712 1051976 248721
39691 248721 -327248 -207464 197714 351675 179698 -13966 61496 369988 558010 353896
39681 353896 -72938 -331020 -345021 -413519 -711080 -1012268 -998214 -608306 -4677 582165
39671E82165K86495k37679o22329m76216O9150L86763J07827l74125m10104K8077
39661f59976L42244J98789k2067Q1316K34961l683l67587k36750K52590L14928
39651A34765j71533l86593P0212M79459K25555j69483j9619K98762P5432l83982
39641A52975k59046L15544M54977L9223j36635K25242M48571O0921m67925n13115
39631C20732j17548K91373M50036K81575j43877m88522m06007k4420K07351J50181
39621E20874M6439K9117M00q0890j99353m09150n72212k88576M33032Q66646N40282
39610H86609J3063n4229N756l28815n26376J25044R05266N03805p49007j189866
39600d08750l96443K95327J18395p7618L20507N28790m9777n96187k93992K82423
$$ plain form
39671 582165 868660 630981 8652 -467564 -398414 -11651 96176 -277949 -688053 -659976
39661 -659976 -317732 -118943 -141010 -59694 175267 171584 -196003 -432753 -180163 134765
39651 134765 -36768 -423361 -353149 126310 351865 182382 162763 461525 536957 152975
39641 152975 -106071 209473 664450 703673 567038 792280 1240851 1301772 833847 320732
39631 320732 203184 494557 944593 1226168 1082291 593769 187762 163342 370693 520874
39621 520874 567313 596430 596830 515940 316587 -92563 -664775 -953351 -520319 346327 886609
39610 886609 899672 845443 851199 522384 -3992 121052 1026318 1530123 781116 -408750
39600 -408750 -805193 -509866 -391471 -469089 -148582 380208 330431 -265756 -559748 -277325
39590b77325K86636J9134J41378M28431L73394J87167J86459R668n63898q41970
39580e0926l00009L63567L13078o5833m401K27349l9576m95115m07248N417N4427
39569c99270p1522K28806O16954L42550k32699j27090M63705M05162l88007p68421
39559G0168l10496Q8131r5273j83731K68385N62098J25501m22065l23701J04499
39549a16484J90735Q9749L18317O52188M52194j83623m87040j99944O9190j70896
39539F14386n37870l56288L17484P08094L76173j69130k30935L0415p1840m97514
39529A82975m37058K46352N24999k04257r57005n64465M93527Q64552L96048M1676
39519E87344K6594l05012q28096n28965N66474J012640K05778n04295L2921Q75085
$$ plain form
39590 -277325 9311 28445 169823 598254 971648 1158815 1345274 1354942 791044 -50926
39580 -50926 -350935 12632 325710 259877 255476 482825 443249 -51866 -459114 -453697 -399270
39569 -399270 -470792 -241986 374968 717518 484819 357729 821434 1226596 838589 70168
39559 70168 -240328 -152197 -247470 -431201 -162816 399282 524783 102718 -220983 -116484
39549 -116484 74251 164000 482317 1134505 1586699 1403076 916036 716092 785282 614386
39539 614386 76516 -279772 37712 745806 1121979 952849 721914 752329 680489 182975
39529 182975 -254083 -7731 517268 313011 -643994 -1208459 -714932 149620 545668 587344
39519 587344 613938 308926 -519170 -1048135 -481661 530979 736757 232462 265383 1140468
39509A140468N57497n32551q99060l50622l3167l56092m88718l060M17906K82312
39499b65087J10009M04056P25638M34010k92395p71450p10587k97405K29014O48864
39489B14667P03860L81387M0925n2868p4671k35146l57833k41095j39404l83342
39479a43520p08473n28388J50772O35635M79920M4237q6908J29858K88921J36435
39469C98489j94352m04893l02193K4637K00592n2828m43778l47838K95558P31228
39459i5378L93753k20633k38120K93779M82016p0932o98662o28210N5298O64808
39449f2281P05810J84394m89916p06602j61419O38017Q06647K26908k64960j28387
39439G48211P5941l36781r61812q55469L359O48536M91820q86j41129R5234K79321
$$ plain form
39509 1140468 1697965 1165414 266354 -84268 -117435 -473527 -962245 -965305 -547399 -265087
39499 -265087 -155078 248978 974616 1408626 1116231 344781 -365806 -663211 -434197 214667
39489 214667 918527 1299914 1340839 1287971 1213300 978154 620321 379226 239822 -143520
39479 -143520 -851993 -1380381 -1229609 -593974 -114054 -69817 -156725 -26867 262054 398489
39469 398489 204137 -200756 -502949 -478312 -277720 -330548 -774326 -1122164 -826606 -95378
39459 -95378 298375 77742 -160378 133401 615417 544485 -154177 -782387 -727089 -62281
39449 -62281 643529 827923 338007 -368595 -530014 108003 914650 1141558 876598 748211
39439 748211 824152 487371 -474441 -1329910 -1326551 -678015 -186195 -187081 -328210 -232976 46345
39428D6345J92548k4067j60431j67486j78444l33703n18020m03388Q3767N37171
39418i25708N71122L31967J83887J33590J1662j4350K91405N82216K55901n13482
39408I08210p90628j70263N74871N12344k66067q94489q17529k23581L59494N42588
39398b65050L04057m216j4477J74977J37280j63946k29657J44042L88769P90n51267
39387g8698m23980L02411O76588K58613k88731k48266J59145K87596Q5431k151
39377G27958J24062J44877L5220J57462M81400L83907l59114r43575n53654L33972
39367E32515M74383l69063j030723n84933L94297P48413L24635o8609K2790K17515
39357F61220J15857r2931m2739K61351N43138N96918L58860j01211n09885n39225
$$ plain form
39428 46345 238893 214826 54395 -113091 -291535 -625238 -1143258 -1546646 -1462879 -925708
39418 -925708 -354586 -22619 161268 294858 306520 292170 583575 1165791 1421692 908210
39408 908210 117582 -52681 522190 1034534 768467 -126022 -943551 -1167132 -807638 -265050
39398 -265050 39007 34791 20314 195291 332571 168625 -61032 83010 471779 472569 -78698
39387 -78698 -502678 -200267 476321 734934 446203 197937 357082 644678 730109 727958
39377 727958 852020 996897 1032117 1189579 1670979 2054886 1695772 752197 198543 532515
39367 532515 1006898 637835 -392888 -977821 -583524 164889 489524 420915 443705 661220
39357 661220 777077 684146 641407 902758 1445896 2042814 2401674 2300463 1790578 1251353
39347A251353j69917K62224M61771M33565L01373J05425j18021k72394l43896
39338A911483m33970n42700n03901k59373j4120M2907J5961J02764K30312J38048
39328F87411j79982l58791j13789L43162N37082L33613P7113P0338J76681J24237
39318A697075m2078j22622j74186l36049l93313o6484L17424J32631m62649n47786
39308A963J30881N96157J08050n83293l34333O16478J026343M94067j65897l15841
39298A574575j95772j25875j293J63884O0204k44327k37506J36649K95602N5488
39288A481629R983M32313O48823J29689n45221n64686j31718o352k42024k44419
39278I68017J41827M14163K29974j89392m69796m35205j16010K11423J54318k63697
$$ plain form
39347 1251353 1081436 1343660 1805431 2238996 2540369 2645794 2527773 2255379 1911483
39338 1911483 1477513 934813 430912 171539 157419 200326 216287 319051 549363 687411
39328 687411 507429 148638 34849 378011 915093 1248706 1325819 1396157 1572838 1697075
39318 1697075 1654997 1532375 1358189 1022140 628827 562343 879767 1012398 549749 1963
39308 1963 132844 729001 837051 253758 -80575 535903 1562246 2056313 1890416 1574575
39298 1574575 1378803 1252928 1251635 1415519 1475723 1231396 993890 1130539 1426141 1481629
39288 1481629 1491612 1923925 2572748 2702437 2157216 1592530 1460812 1454460 1212436 968017
39278 968017 1109844 1524007 1753981 1564589 1094793 659588 543578 755001 909319 645622
39268F45622m62063j09000K83708J18680k92490k02729L57417O50993M10015J01327
39258A501480M85j48003l89981l18997J16013L20368n640l04427n1774L74071
39248A093595L34973o958R263M29493O12477K62821j07083P1577O67008J106762
39238D473928J150609J158364J620556K486702K977891K228543K86318j682124
39230A4700787k486192k145176j678076j696916j734077j191822m13077k16243
39222C139208o20701p76708k60572K62692O7347m95719n38509k9959J33022m86604
39212C93497j138549r14888J1634O94141O67259L44427K43728L41227L20125Q9478
39202A052079j64212k51928j38426O5396J53518l2534m01286o17321m16501R6877
$$ plain form
39268 645622 183559 74559 358267 476947 184457 -18272 339145 990138 1400153 1501480
39258 1501480 1501965 1353962 963981 644984 760997 1081365 1075725 771298 719524 1093595
39248 1093595 1428568 1421610 1430873 1860366 2472843 2735664 2628581 2700158 3367166 4473928
39238 4473928 5624537 6782901 8403457 10890159 13868050 16096593 16382911 14700787
39230 14700787 12214595 10069419 8391343 6694427 4960350 3768528 3355451 3139208
39222 3139208 2518507 1741799 1481227 1743919 1811266 1315547 777038 747079 880101 393497
39212 393497 -745052 -1659940 -1648306 -954165 -286906 57521 301249 642476 962601 1052079
39202 1052079 887867 635939 497513 562909 716427 683893 282607 -334714 -751215 -654338
39192f54338N25748N47834J87473k43290m26189k72094N7285L08550L35530K08936
39182E75445J47696K74505M17739K70934j73758m98195l40681J04409L17685J32261
39172A228040j25277j96404k34608m16369n26339k46669K96105O01012M00033
39163G79524m7890l19396l07558k35997k69762k57840L0305M56486N39209Q9426
39153D56507m01154l47749P6531J49787l07548n98912j64098N59364P23955K07290
39143C53973l32456l84373r6922J21931J23858N3249R8613K83120M09639K75146
39133I05778N240l4508J90262K02258k92384q15753o79926L2590N65358N16142
39123E95057K37254J36093J02070j24588m12259m15611j01546K07455K64747J60350
$$ plain form
39192 -654338 -128590 419244 606717 363427 -62762 -334856 -277571 30979 366509 575445
39182 575445 723141 997646 1415385 1686319 1512561 1014366 673685 778094 1095779 1228040
39172 1228040 1102763 906359 671751 255382 -270957 -517626 -221521 379491 779524
39163 779524 731634 412238 104680 -131317 -401079 -658919 -628614 -172128 367081 456507
39153 456507 55353 -292396 -215865 -66078 -373626 -972538 -1136636 -577272 146683 353973
39143 353973 21517 -362856 -459778 -337847 -213989 -160740 -62127 220993 630632 905778
39133 905778 911018 876510 1066772 1269030 976646 160893 -519033 -486443 78915 595057
39123 595057 832311 968404 1070474 945886 533627 118016 16470 223925 488672 649022
39113F49022J18219J57835P6169k06478m21166k71562Q6808K16467P9534J12446
39103E97294M40088N27892J7976n47912m18959K69102P26820O29490L45821J94646
39093B782258J65126L12401P40786J211879J439286J696508K333695K744745J834456
39084A5261140k83802k078944k481716k023821j636175j325694p63091k73656
39076D394241l04979n47687m81993k67421k55778j98010J43305J82962n88543
39067B076097j388679j079911m581M68218Q1307q9632L55041M72226k06772o61943
39057B1371l7261Q67036Q04062n7062n74775l85723j24910j74654j93962J06375
39047B50497M79998N59158K82501j45463m30104l96261k28240k78108m50058j92113
$$ plain form
39113 649022 767241 925076 1001245 794767 373601 102039 188847 405314 484848 597294
39103 597294 1037382 1565274 1583250 1035338 616379 885481 1612301 2241791 2587612 2782258
39093 2782258 2947384 3259785 4000571 5212450 6651736 8348244 10681939 13426684 15261140
39084 15261140 14977338 12898394 10416678 8392857 6756682 5430988 4667897 4394241
39076 4394241 4089262 3541575 3059582 2792161 2536383 2338373 2481678 2664640 2076097
39067 2076097 687418 -392493 -397074 71144 152451 62819 417860 890086 683314 21371
39057 21371 -15890 851146 1655208 1598146 1023371 637648 512738 338084 144122 250497
39047 250497 730495 1289653 1572154 1426691 996587 600326 372086 93978 -356080 -548193
39037e48193N78821J062779O27684j81960l84962K2425K00203j54430m32401j92212
39027E97754J84725J96293k8720m0770K55228N45306N03462P1976m72395o80164
39017A132695l70986R5592K35748N6838n8230J6663N5737k6310o9246q6127k82124
39006G00250n48297m53259N0887L89291J31030l80483m95910r2355L70392M49165
38996A20711J31948k25310k35639J22608M17363K73732o9983p1753K55852K98436
38986A017965j98494o52432m56175J67994N38249M17534J19123o7134j29384j31606
38976F25640j12933j43381k45875l27215l24481k80338j81316M4577K78433K85624
38966c81265J58385K59279N39655M43375j84396o62551m36984O4750J65846J1216
$$ plain form
39037 -548193 30628 1093407 1721091 1539131 1154169 1176594 1376797 1222367 789966 597754
39027 597754 782479 978772 950052 909282 1164510 1709816 2213278 2285254 1812859 1132695
39017 1132695 761709 857301 1093049 1149887 1091657 1108320 1164057 1137747 1068501 982374 700250
39006 700250 151953 -301306 -250419 138872 269902 -110581 -606491 -698846 -328454 120711
38996 120711 252659 27349 -208290 -85682 331681 605413 535430 463677 719529 1017965
38986 1017965 819471 167039 -289136 -121142 417107 834641 953764 886630 757246 625640
38976 625640 512707 369326 123451 -203764 -528245 -808583 -989899 -945322 -666889 -381265
38966 -381265 -222880 36399 576054 1019429 835033 172482 -264502 -199752 -33906 -22690
38956b2690J08674K37586j69984p76709o17110K88262P35870J25699n93433l80365
38946a064200L64560N48261N7852k66436m2848K09482O6090j61627m0078K93869
38936c5075M14655K54801J10438J40211J63794l1773l84210o31331n95513l12467
38926i06470O2077L63936M60891L30540J47314J52103L46938M48800K52570r7486
38916A561213l22772l42153k38070o9947P9748N8598j14710j57299M2482J24374
38906F21464k12733n86108l68316L33555P31498M50308j2890j02938N4731K4112
38896I32683k53412m78469m24550r3460L26179M96866K17729j99366k05707J86392
38886E04885L43868j2121l11451l9514L73635K10017l21469l11380M41798J003534
$$ plain form
38956 -22690 85984 323570 153586 -623123 -1240233 -951971 -216101 -90402 -683835 -1064200
38946 -1064200 -699640 -151379 -93527 -359963 -402811 -193329 -127239 -288866 -328944 -35075
38936 -35075 379580 634381 744819 885030 1048824 1017051 632841 1510 -594003 -906470
38926 -906470 -844393 -480457 -19566 310974 458288 610391 957329 1406129 1658699 1561213
38916 1561213 1238441 896288 658218 588271 668019 726617 611907 454608 497090 621464
38906 621464 408731 -177377 -545693 -212138 519360 969668 956778 853840 908571 932683
38896 932683 679271 200802 -223748 -317208 8971 505837 723566 524200 318493 504885
38886 504885 848753 836632 525181 485667 859302 1069319 747850 436470 878268 1881802
38876A881802N53028m75792r39289m22819L20335L99782j10024l92116o5453L21345
38866A070799J58501l08546m15995j47397p6025l06943k67378K58030O61326M79301
38856A105673J29928J38534K42837n2275n19456n79107k80825j22502j27772P6411
38846A1446L90807K95359k12536n14292l11433L3449K15329L49200M56819L00571
38836A014719k9899m7079L09680M25594m1027n68104n63478j96866M6658J35536
38826D85734K60615K77092N824k30782k5972L62304L15562j94914n62470m30564
38816B62429p3509J49189K11347J87601N3579j10894p2701K11103M55829M15026
38806A688999J91810N9170J12861J95294Q6165k35498m67081k50775L03097N79397
$$ plain form
38876 1881802 2434830 1959038 1019749 596930 917265 1317047 1207023 814907 749454 1070799
38866 1070799 1229300 920754 504759 357362 281337 -25606 -292984 -34954 626372 1105673
38856 1105673 1235601 1374135 1616972 1564697 1045241 466134 185309 62807 -64965 11446
38846 11446 402253 697612 485076 -29216 -340649 -307200 -91871 257329 714148 1014719
38836 1014719 984820 937741 1247421 1673015 1631988 1063884 500406 303540 350198 485734
38826 485734 746349 1023441 1029265 798483 772511 1134815 1450377 1255463 692993 262429
38816 262429 188920 338109 549456 737057 790636 679742 607041 818144 1273973 1688999
38806 1688999 1880809 1939979 2052840 2248134 2334299 2098801 1631720 1380945 1684042 2263439
38796B263439K12648l44758m06912k3420J66925l6056j64668L0641J65371j7419
38786A845791j31384J30209L26640k9005n18229l44844L81516P06470K14235m01258
38776B180141l64915K14722P28150Q82227P37627L56688j13077k80990Q5171O39939
38766E065683Q41325O41928M25908L60994K41332l1644k37817k11645q0044J1033
38756G027053J04768J98558Q4734l23518p03769o52051k11328J95640L35316L93893
38746F449296N78066P42941O08437K05653j19215j08171K05165O77400J183468
38737A0423040J503484J387718R41660P02145J052740J750338K321821K717692
38729B2800638L208419L871587M672015N823851P453993R139066J0598100J2627679
$$ plain form
38796 2263439 2476087 2131329 1724417 1700997 1867922 1831866 1667198 1697839 1863210 1845791
38786 1845791 1714407 1844616 2171256 2142251 1624022 1279178 1660694 2367164 2581399 2180141
38776 2180141 1815226 2029948 2758098 3640325 4377952 4734640 4621563 4340573 4425744 5065683
38766 5065683 5907008 6548936 6974844 7335838 7577170 7545526 7307709 7096064 7016020 7027053
38756 7027053 7131821 7330379 7415113 7091595 6387826 5735775 5524447 5720087 6055403 6449296
38746 6449296 7027362 7770303 8378740 8584393 8465178 8357007 8562172 9239572 10423040
38737 10423040 11926524 13314242 14255902 14958047 16010787 17761125 20082946 22800638
38729 22800638 26009057 29880644 34552659 40376510 47830503 56969569 67567669 80195348
38721H0195348J6207205K0767111K4896978K8860191L3897577L7606438L2767665
38714B75198513J4526958j1668662l2853262m0380014l6762124l0123690k4966785
38707A12970934k0566237j5847658j1921234r826194q718581p336800n669366
38700C3084864m346336l500217k941369k654151k536299k243750j714318j327605
38692A1820819j243787j110597p12292l89413m73408p22428o69907k67088Q4017
38683F315916j2381n49167j041246r24323k35020L07206K08058j16093l5029K76601
38673D194522K32719m2535P4530M72691L57162l05516m97512K57877J011290P43162
38663F498390k03419p86494p22044m95593m07786m03023n14164p36071p05503
$$ plain form
38721 80195348 96402553 117169664 142066642 170926833 204824410 242430848 275198513
38714 275198513 289725471 278056809 245203547 204823533 168061409 137937719 112970934
38707 112970934 92404697 76557039 64635805 54809611 46091030 38754230 33084864
38700 33084864 28738528 25238311 22296942 19642791 17106492 14862742 13148424 11820819
38692 11820819 10577032 9466435 8754143 8364730 7891322 7168894 6498987 6231899 6315916
38683 6315916 6303535 5754368 4713122 3788799 3553779 3860985 4069043 3952950 3917921 4194522
38673 4194522 4427241 4384706 4459236 4931927 5289089 4983573 4486061 4743938 5755228 6498390
38663 6498390 6294971 5508477 4786433 4290840 3883054 3480031 2965867 2229796 1524293
38654A524293j98006K74070O2176n71328p26742j49407M54146M56889M0350k85146
38644H81295l44484k26063K9214L46436M73934K19360k55401n53165m38639n1985
38634H0502K57282K91539J79442J38409J34977k1945k78658l51158k26855k62932
38624e9397n54187n96160K0435Q59460J073121M69552l04313o10029m29704j09736
38614b40958J06419J62954R8313J9986J6318K7005o3789j99741j92103j6264J03512
38603a78348j1459k21414k04604J18669L84053J72888l47358m57396J52097P39652
38593A46780M00390n41064q16749l2754O98080M09427l04270l32445J95741K94722
38583A17858j29807j71480M26839P27393Q6887p89643q77776k19051L60549M32897
$$ plain form
38654 1524293 1326287 1600357 1662533 1091205 364463 215056 669202 1126091 1166441 881295
38644 881295 536811 310748 339962 686398 1160332 1379692 1124291 571126 132487 80502
38634 80502 337784 629323 808765 947174 1082151 1060206 781548 430390 203535 -59397
38624 -59397 -613584 -1209744 -1189309 -329849 743272 1212824 908511 298482 -131222 -240958
38614 -240958 -134539 28415 126728 146714 163032 190037 126248 -73493 -265596 -281860 -178348
38603 -178348 -189807 -411221 -615825 -497156 -113103 59785 -287573 -744969 -592872 146780
38593 146780 547170 6106 -810643 -843397 -145317 264110 -40160 -372605 -176864 117858
38583 117858 -11949 -183429 243410 970803 1057690 268047 -609729 -828780 -468231 -35334
38573c5334K24296j8608k92237n21827m63867l1960N05177P41031N05291L8729
38563F50691k28381j46045J021n6537j58564l0937J92006J92402O2035J25463
38553F03154K56511L4997l80253k99296L46912O72224R7109p17139p83606j36148
38543c05535L86606L54799Q7563l1270J7237Q5341M5872j68725m10131l49183
38533b87426N2652L52603K27822l5568l5297J11771J03560O5682K27712K90273
38523A073784j57140p60304p34959o7588L93927J81892j73678k4075N00289Q02562
38513A034710O00461R9349l16335l78476j64306p0387k82517l85511M5904O02995
38503G85887M50182m16531j053878q64538k70389J44570L97524O32096O08354
$$ plain form
38573 -35334 188962 170354 -121883 -643710 -1107577 -1139537 -634360 106671 611962 650691
38563 650691 422310 276265 277286 220749 62185 31248 223254 415656 477691 603154
38553 603154 859665 894662 514409 215113 562025 1234249 1331358 614219 -169387 -305535
38543 -305535 81071 435870 523433 492163 509400 594741 640613 471888 61757 -287426
38533 -287426 -234774 117829 345651 310083 274786 386557 490117 555799 783511 1073784
38523 1073784 916644 156340 -578619 -646207 -252280 -70388 -244066 -268141 232148 1034710
38513 1034710 1635171 1734520 1418185 1039709 875403 805016 522499 136988 182892 785887
38503 785887 1236069 819538 -234340 -1098878 -1369267 -1224697 -827173 -195077 413277
38494D13277J90909k28219l00145k08835j65327O471L22293L36779n1389j92049
38484A23765K43579N20237K1307n57464k82106L77023K86531l90659m60740K24465
38474A05938N23334l684m02776o6655K84783L0914k65887n2685J29075k35958
38464D6399m85652O4806O87138L03497o34817p65977L2300N62157K89653j9699
38454G9805J58957K72257j33487n20028l05508J45066J90691n7523r9935J8710
38444b50995j15942m14695k90631M30151J104538R68358K9992q84858r87699l75800
38434g87581J29019N8619j12048K08378O80476N11513j75838l80494J87080N30496
38424H49620p6899q39059o07577L14736O24016M964m73415o9548N54926M17317
$$ plain form
38494 413277 604186 375967 75822 -133013 -298340 -291869 30424 367203 315814 123765
38484 123765 367344 887581 908888 351424 69318 446341 732872 342213 -118527 105938
38474 105938 629272 625588 222812 156157 440940 471854 205967 153282 282357 46399
38464 46399 -439253 -374447 312691 616188 -18629 -784606 -752306 -190149 99504 79805
38454 79805 238762 511019 377532 -142496 -448004 -302938 -112247 -169770 -269705 -250995
38444 -250995 -366937 -781632 -1072263 -642112 462426 1430784 1460776 575918 -411781 -787581
38434 -787581 -658562 -599943 -711991 -503613 176863 688376 512538 132044 319124 849620
38424 849620 772721 -66338 -673915 -359179 264837 269801 -203614 -273162 281764 699081
38414F99081l79910r14427o64542Q5366P76562J007672O07628k25692q73607p85553
38404f67422j09549M20029K94380k59676o20451m33901J25583N89430N99115J97823
38394A35361j87004j32909L28265P12105N91020L5826n04058o70780m61393j16036
38384b69603J06306P5649j19901k12428l1019K24434J69066k05871l67388J11139
38374e19616Q43450R33892R3057q64419r21476r5351N95136M13263k34521m51885
38364b08470o4977K58015M3076l31410k47701K38280N05737K53422j53175k59195
38354C3602p5646R5545J08659L7387j3676M7550K88203N66430N08639n4333p10841
38343H31519q39871l74405J05789J41841l1112R7649N20857O81665K47140m00610
$$ plain form
38414 699081 319171 -595256 -1259798 -1174432 -397870 609802 1217430 991738 118131 -667422
38404 -667422 -776971 -356942 -62562 -322238 -942689 -1376590 -1251007 -661577 -62462 135361
38394 135361 -51643 -184552 143713 855818 1446838 1482664 978606 307826 -153567 -269603
38384 -269603 -163297 -87648 -207549 -419977 -450996 -226562 -57496 -263367 -630755 -519616
38374 -519616 323834 1257726 1350783 486364 -435112 -530463 64673 477936 243415 -208470
38364 -208470 -273447 -15432 27644 -303766 -551467 -313187 192550 445972 292797 33602
38354 33602 -42044 53501 162160 199547 185871 233421 521624 1088054 1596693 1542360 831519
38343 831519 -8352 -382757 -276968 -135127 -166239 -68590 452267 1133932 1381072 980462
38333I80462o34134l45595L5305J98920K57775L12676J44802l29923o32322k78583
38323b90617L67515M30979k04765o21749j72830N43315N60139n2317l88544j09540
38313F1586J66521l1294k89761o1088M03517M29390l8362l49083j04825K86396
38303D72997K23264k43545n05443k23212K75788M86991L29101P3545j08577k50280
38293E30629l48902l22093j76735L0832L37211O77063O65706M3140o95775p08253
38283C2823K6327N67760L14391k06140k68412k7438m1170k44228j64841J76912
38273A65984L62278L35711L30464K36186j82563o00562m94501q6076m8025l30611
38263c11715k51702K11299L03392j27557k74820J79131M03406j21718n62017q7230
$$ plain form
38333 980462 346328 733 36038 234958 492733 805409 950211 620288 -12034 -290617
38323 -290617 76898 507877 303112 -318637 -491467 51848 611987 559670 171126 61586
38313 61586 228107 196813 -92948 -154036 249481 678871 640509 291426 186601 472997
38303 472997 696261 452716 -52727 -275939 -151 486840 815941 889486 780909 530629
38293 530629 181727 -140366 -317101 -286269 50942 728005 1393711 1436851 741076 32823
38283 32823 59150 626910 941301 735161 466749 439311 398141 153913 -10928 165984
38273 165984 528262 863973 1194437 1430623 1248060 647498 152997 66921 18896 -311715
38263 -311715 -563417 -352118 -48726 -176283 -451103 -271972 131434 9716 -552301 -639531
38253f39531O21961M01910m51100n71629L54281J122139Q00529q5421n39745m28717
38243E84677k85136l22163k58646N3681L21853K20237j26307k43983J00525N51340
38233E96078N60479O3353m81668p03789o46651m47250r4335L25440N24783M04222
38223A00662K32673K30681K94307L04276L07306K03622k39297p93657p82561q7857
38213b29845M64833K59968j90467j61080P9322j21078m84097k16694N12646P05876
38203F19384J55646k27142P1204M16852K08367j70577j54335N8702K9222r3629
38193I13694L3536K16508R1903j38625m3602K21987J32620l02943n19411k75119
38183C30548M6990J12185P5026J63591K67731K05888P9979P7903J41749J08035
$$ plain form
38253 -639531 -17570 384340 -66760 -638389 -284108 838031 1638560 1553139 1013394 584677
38243 584677 299541 -22622 -281268 -227587 94266 314503 188196 -55787 44738 596078
38233 596078 1156557 1219910 738242 34453 -612198 -1059448 -1153783 -828343 -303560 100662
38223 100662 333335 564016 858323 1162599 1469905 1673527 1434230 640573 -141988 -229845
38213 -229845 234988 494956 304489 143409 222731 101653 -382444 -599138 -86492 619384
38203 619384 775030 547888 619092 1035944 1244311 1073734 919399 978101 1007323 913694
38193 913694 947230 1163738 1255641 1117016 1073414 1295401 1428021 1125078 605667 330548
38183 330548 377538 489723 564749 728340 996071 1201959 1281938 1359841 1501590 1609625
38173A609625J5661q254m3125k23051l53124r0935M07492M74294j56115q04264
38163H28204o66567P4481N09431K48145k10064l59811k66573r3934K47941O35052
38153I46305N62553o0077n12311k47980K27527J52878k63182k48659J96035L17613
38143A070702r8444l89521j20271K88938L14863M9726j46196j76417r8911P4626
38133G69095K27904J71540j2932m2484P7383Q2716L342J16117K85567M9524m60985
38122A266787m73601J98054O70416K85512l26797k21988L80972M79789j52435
38113B106709o89459n03754P1433L72957K22484r4225k67604j91660J8583J38048
38103A183512Q8237L3104Q5001R4846l2520m4396K73974O02795M40956j08341
$$ plain form
38173 1609625 1625286 1617032 1573907 1350856 997732 906797 1314289 1788583 1632468 828204
38163 828204 161637 236118 745549 993694 783630 423819 157246 63312 311253 946305
38153 946305 1508858 1448781 936470 688490 916017 1068895 805713 557054 753089 1070702
38143 1070702 972258 582737 462466 751404 1066267 1115993 969797 793380 694469 769095
38133 769095 996999 1168539 1155607 1113123 1190506 1273222 1276564 1392681 1678248 1727772 1266787
38122 1266787 793186 991240 1661656 1947168 1620371 1398383 1779355 2259144 2106709
38113 2106709 1417250 913496 984929 1357886 1580370 1486145 1218541 1026881 1045464 1183512
38103 1183512 1271749 1304853 1389854 1484700 1452180 1407784 1681758 2284553 2725509 2617168
38093B617168l83521m4080N28725Q18226P56572N47632K72726n0667k63056k23576
38083D576149o4918l6429j52126k18033j79181j91966k94010k48515R4992M55764
38073C741727M32823J18982M7857M11144O94605L97172j69009k49247L01042Q39524
38063F566620Q64538O33732O46622R02530J006443Q07609O10173P75298J292909
38054A4106474J791524J977005K055043K531308L444485M114247M081988M033019
38046C8135093N068436P092674Q773957R340786R500024R961683R823075P393284
38038A05089012K366184l623476q500718j1172055j1660300j0684412r265310
38031E2548925q118512p175069o013959m713883l778697l276468k736751k036110
$$ plain form
38093 2617168 2233647 2189567 2718292 3536518 4293090 4840722 5113448 5062781 4799725 4576149
38083 4576149 4511231 4474802 4322676 4104643 3925462 3733496 3439486 3190971 3285963 3741727
38073 3741727 4174550 4293532 4341389 4752533 5447138 5844310 5675301 5426054 5727096 6566620
38063 6566620 7431158 8064890 8711512 9614042 10620485 11428094 12038267 12813565 14106474
38054 14106474 15897998 17875003 19930046 22461354 25905839 30020086 34102074 38135093
38046 38135093 43203529 50296203 59070160 68410946 77910970 87872653 97695728 105089012
38038 105089012 107455196 103831720 95331002 84158947 72498647 61814235 52548925
38031 52548925 44430413 37255344 31241385 26527502 22748805 19472337 16735586 14699476
38023A4699476j674997j850167j918228j315038n05461l51601q24009j063172
38015E196803o73768k58107m50571r68405j029011m25062K54931M22766J41918
38006B211494j12276q1824Q2272J32716Q279j93697l45865l33397j07914K08740
37996A468528L73317K74174O3975n2369p9444j52484k61320k36634l6858J19072
37986A479957J7844k36486l21283j12296J27421O5496k69996n24307m68958k43868
37976d86476q8318l0270O572k2298j49667j72178J15708N01395N20038J01158
37966B95664k81631k39336M4036J30711r8662l85208m22518q8088M66332Q05344
37956B26644N20611k37631p47751m91906K12042O10934M10470j6753k21679j55311
$$ plain form
38023 14699476 13024479 11174312 9256084 7941046 7435585 7083984 6259975 5196803
38015 5196803 4523035 4264928 3814357 2845952 1816941 1391879 1646810 2069576 2211494
38006 2211494 2099218 2017394 2099666 2232382 2240661 2046964 1701099 1367702 1259788 1468528
37996 1468528 1841845 2116019 2179994 2127625 2048181 1895697 1634377 1397743 1360885 1479957
37986 1479957 1497801 1261315 940032 827736 955157 1020653 750657 226350 -242608 -486476
37976 -486476 -574794 -605064 -598492 -620790 -770457 -942635 -826927 -325532 194506 295664
37966 295664 14033 -225303 -181267 -50556 -149218 -534426 -956944 -1045032 -578700 226644
37956 226644 747255 509624 -238127 -730033 -517991 92943 503413 486660 264981 109670
37946A09670l5923K281K6929J74093M28257N25194J97474m07597p49432n16802
37936b45856n6521O6693k00992m18109l11821p5008K6340J0119J9553O6276J00593
37925a018733J59416K66320K99788J39142j12356k15019j05321K0307j3514j10510
37915f90480m5360J99054L87433L43196J51420k3141j69115l47010n03424n37308
37905a234735m51802k69249P4831N28598P63670N38697J20628l6313L6784o5377
37895E732l44308l08948J60907M53352J08244m12630l50444K58692O63038M35358
37885F68993o5494k74930o9294K40641K95794l590m20608n94800m15269j10911
37875g49468Q8639K04550L11877L28870K01875Q1423P2765J2538k33112m36722
$$ plain form
37946 109670 73747 76028 102957 277050 705307 1230501 1427975 1020378 270946 -245856
37936 -245856 -302377 -235684 -436676 -854785 -1166606 -1241614 -1215274 -1205155 -1185602 -1119326 -1018733
37925 -1018733 -859317 -592997 -293209 -154067 -266423 -481442 -586763 -566456 -579970 -690480
37915 -690480 -735840 -536786 -149353 193843 345263 322122 153007 -194003 -697427 -1234735
37905 -1234735 -1686537 -1955786 -1880955 -1352357 -588687 -49990 70638 34325 71109 5732
37895 5732 -338576 -647524 -486617 -33265 74979 -337651 -688095 -429403 233635 668993
37885 668993 603499 328569 259275 499916 795710 792120 371512 -223288 -638557 -749468
37875 -749468 -660829 -456279 -144402 184468 386343 467766 540531 553069 319957 -116765
37865a16765k99954N4809K22825Q3551r1805q7439j14O282l6007n202O2203j6699
37853b24315k68128l75556k4521N14415N11397k11169p83709l88104M54666N43646
37843b51378j68135m65828K04894Q64348N96430o9525k14556l0434j96897m82860
37833b13941j92844M37369N29129K7684k71380o5542J56573J18710L4483j04611
37823D55630n11560q65559n97392O3883L43167K10290L03189N53600J97524o44309
37813d91537p99717Q5876Q58197O53645J05716l448l6180m76627p52967k41337
37803a098379M55256M36658J341K5538M39452N08718J66193q9164k33175n40451
37793G1987p21238l50467J53231J02893j96726M8805O08743N13928k33507n79351
$$ plain form
37865 -116765 -416719 -361910 -139085 -55534 -147339 -234778 -234892 -228610 -264617 -269819 -207616 -224315
37853 -224315 -492443 -867999 -892520 -378105 133292 -77877 -861586 -1249690 -795024 -251378
37843 -251378 -419513 -885341 -680447 183901 780331 710806 496250 465816 268919 -213941
37833 -213941 -406785 30584 559713 587397 316017 250475 407048 525758 560241 455630
37823 455630 -55930 -921489 -1518881 -1454998 -1111831 -901541 -598352 -44752 152772 -491537
37813 -491537 -1291254 -1205378 -347181 306464 412180 408732 372552 -104075 -857042 -1098379
37803 -1098379 -643123 -206465 -205124 -179586 259866 768584 934777 845613 612438 71987
37793 71987 -649251 -999718 -846487 -743594 -940320 -891515 -282772 231156 -2351 -581702
37783e81702j43332K68689J18613j20128k7445Q1442k8510k9156J92337K09428
37773e9764o8400j22425J67774K18219j16689j49763L31699M75422j65046o53060
37763a42033j32295O89448O53073l7950l49388j50238j06546k66596j03171K51218
37753C05522J42281k88878k20268L45743M74828p7503m04860j7772L43053O4476
37743F66622k82728m5168L07798M9887m58856l72181J72096K99110r7264j93510
37733D5806L54957Q29671N75446p2461m22670m03541l86754m27344k61231Q6895
37723h1226K40176Q1284j4725K16295M18966R3930n61513p74571k65442K81600
37713c65226J59009l31217l33928K64740O79798M22041l4199o8954J88431K45452
$$ plain form
37783 -581702 -725034 -456345 -337732 -457860 -485305 -403863 -432373 -461529 -269192 -59764
37773 -59764 -128164 -250589 -82815 135404 18715 -131048 200651 676073 511027 -142033
37763 -142033 -274328 415120 1068193 1030243 680855 530617 424071 157475 54304 305522
37753 305522 447803 158925 -61343 284400 759228 681725 276865 259093 602146 666622
37743 666622 383894 338726 646524 696411 237555 -134626 37470 336580 239316 45806
37733 45806 400763 1230434 1805880 1733419 1310749 907208 520454 93110 -168121 -81226
37723 -81226 158950 240234 225509 441804 860770 954700 393187 -381384 -646826 -365226
37713 -365226 -206217 -537434 -871362 -606622 73176 495217 461018 392064 580495 825947
37703H25947Q1517K1371M0709j79625n71429o30898j68333L38621L54519l6066
37693G6333k94219j28472J88351K16190p6596k81679j14666J95085K80292K07466
37683B68085K86538M19839J97123k99649m34644k4428K45567j40949o74139o00341
37673g56998n9250K65083K24291J56556P4803k34644m92249k00335M20308O30315
37663B7880L03607N056o9888k95734o54313n70355K8067M39446L20373J58286
37653c07575K36415J17253l37895m56285O3671M41508J08062k38492J36923O14121
37643C77706K82221l42421j20787O46565N73405m80466j051391l58522N14576
37634D0886L61555m15193o59227j84016K75228K96713R3798j19192l37020m33551
$$ plain form
37703 825947 907464 928835 969544 789919 218490 -412408 -580741 -242120 112399 76333
37693 76333 -217886 -346358 -158007 58183 -18413 -300092 -414758 -219673 60619 268085
37683 268085 554623 974462 1171585 871936 437292 412864 658431 517482 -156657 -756998
37673 -756998 -816248 -551165 -326874 -170318 -95515 -330159 -822408 -1022743 -602435 27880
37663 27880 331487 336543 266655 -29079 -683392 -1253747 -1225680 -786234 -465861 -307575
37653 -307575 -71160 46093 -291802 -748087 -684416 -242908 -134846 -373338 -236415 377706
37643 377706 659927 317506 196719 843284 1416689 936223 -115168 -473690 40886
37634 40886 402441 -12752 -671979 -855995 -580767 -284054 -190256 -309448 -646468 -1080019
37624a080019k14523J78453L44335J60519o0172j5445K09991L10814J68552l4287
37614c1782q6980r875N8350J30090K96870M21565K49950q6484j06866K55011L98700
37603A488549l6408m92290l16885J34295K2984n57260o29597J28071Q10539N92120
37593A144118j56962n57148m30087k23705j30205N1165L19782L67301J46945N8551
37583E89755L18443M79576j5590r04428j225382n72923K42793K90492j05522R0098
37573h12688Q37746R06455j34193r86063m82965O20902Q37194J53741k72767j18462
37563E48900q7049l20937j89436K53128J43527n40685p06194k8879L52892k39016
37553h13749q10074l83806L49693K74698k88342k94372K29877M76473L86093N18296
$$ plain form
37624 -1080019 -1294542 -1116089 -771754 -611235 -671407 -686852 -476861 -166047 2505 -31782
37614 -31782 -118762 -128637 -70287 59803 356673 778238 1028188 941704 834838 1089849 1488549
37603 1488549 1452141 959851 642966 777261 800245 242985 -386612 -258541 551998 1144118
37593 1144118 987156 430008 -79 -223784 -353989 -302824 16958 384259 531204 589755
37583 589755 908198 1387774 1372184 467756 -757626 -1330549 -1087756 -797264 -902786 -812688
37573 -812688 25058 931513 797320 -188743 -671708 -50806 786388 940129 667362 548900
37563 548900 461851 140914 -48522 204606 348133 -192552 -898746 -927625 -574733 -813749
37553 -813749 -1623823 -2007629 -1657936 -1383238 -1671580 -1965952 -1736075 -1259602 -873509 -355213
37543c55213P66161N36920m156j45190N5019q5628m90378l99518J28359J63295
37533A69671m07726n26089K21701P60161K39782n72238n65324M815J74176q0092
37523e81163m4585L19904L87393J07820Q6372L97490M00834n9609k86992N6313
37513G83777K85024j91845q45990q30231k45675J59020J61290J28750J54306k0614
37503d62188k78507j54265L10197N05777K35220J4988J39307J97244q3257k49702
37493A74814O0258L73326J36291l10712k76123J66152L77178J67310j44763m07476
37483C16255o05745m56138J20755M36390o5192o32799j53855Q77127Q19058n04464
37473A51392j276523m05178P84757O57001k52505l15647N19310Q18430O7723o45636
$$ plain form
37543 -355213 410948 947868 943712 798522 853541 767913 277535 -121983 6376 169671
37533 169671 -238055 -764144 -542443 217718 457500 -114738 -680062 -675247 -501071 -581163
37523 -581163 -625748 -305844 81549 189369 275741 673231 1074065 1014456 727464 783777
37513 783777 1068801 876956 30966 -799265 -1044940 -885920 -724630 -595880 -441574 -462188
37503 -462188 -740695 -894960 -584763 -78986 156234 171222 310529 507773 424516 174814
37493 174814 235072 608398 744689 433977 157854 324006 701184 868494 723731 316255
37483 316255 -289490 -745628 -624873 -188483 -253675 -886474 -1040329 -163202 655856 151392
37473 151392 -1125131 -1530309 -745552 -88551 -341056 -656703 -137393 681037 748760 103124
37463A03124m84435j671K3989j84112J199M83136O22798K30579k09066k46969
37453C38572q542P7598j03151k09450K6256L21457J92030k79501m56846o4503
37443a66080L61271K33143k62817n05642l18512o4108k6275j15395j28549J6825
37433i76139K73193M73013M28614J70405n6930j37618j86011k03053J6169M35696
37423B37339O18499L03081j79425l54106j76046R1503K42458J37167k65867o35648
37413A8955m68118J56484N13120K54664p6408K7156K34790O0914k67329l08150
37403A46078k00554j94950M6337P52313J136473L12926j124582j611114p09534
37394a446607L72310N18250k4818l96104k83890N6905L11505K69098n9529k83572
$$ plain form
37463 103124 -381311 -382982 -358993 -543105 -541906 -58770 564028 794607 585541 338572
37453 338572 330030 407628 304477 95027 121283 442740 634770 355269 -101577 -166080
37443 -166080 195191 428334 165517 -340125 -658637 -722745 -749020 -864415 -992964 -976139
37433 -976139 -702946 -229933 198681 369086 312156 174538 -11473 -214526 -198357 237339
37423 237339 855838 1158919 979494 625388 449342 540845 783303 920470 654603 18955
37413 18955 -449163 -292679 220441 475105 398697 425853 660643 721557 454228 146078
37403 146078 -54476 -249426 -203089 549224 1685697 1998623 874041 -737073 -1446607
37394 -1446607 -1074297 -556047 -580865 -976969 -1260859 -1203954 -892449 -623351 -682880 -966452
37384i66452k3769M65445N65143K01942r8544r3429q4770k10804j98207q118j0790
37373d62353k51145k40441J83650M68782K36360q4211j7295J49660n7450l86546
37363d60989k57600K06519L24007k6240j76294K55548O95284M33589k96473o21430
37353G5921k64493J33294N9709j10786J57971N71431M46468j04956k90685O0959
37343G34833K19956k03962o33850n36508k03239q292K52570O41681N76591j32619
37333G07161n84046j05793N11456K53265l80401k50098L90848L30122m37087o58690
37323b23263L5146N62660K30989l17274l96765k13326p5373J31552K71897q2108
37313g5865o36323m91851L38724P51673L03252j45231j3058J35541q3081r7334
$$ plain form
37384 -966452 -990221 -524776 40367 242309 143765 50336 -34434 -245238 -443445 -451563 -462353
37373 -462353 -713498 -953939 -770289 -301507 -65147 -149358 -166653 -16993 -74443 -460989
37363 -460989 -718589 -512070 -188063 -214303 -390597 -135049 560235 993824 697351 75921
37353 75921 -188572 -55278 4431 -106355 51616 623047 1069515 964559 673874 734833
37343 734833 954789 750827 116977 -419531 -622770 -631062 -378492 263189 839780 707161
37333 707161 123115 17322 528778 782043 401642 151544 542392 872514 435427 -223263
37323 -223263 -188117 374543 605532 288258 -108507 -321833 -397206 -265654 6243 -75865
37313 -75865 -712188 -1204039 -865315 -113642 189610 44379 31321 166862 83781 -13553
37303a3553L07115L17162l54199o51129K0163N64784M4771n91828j36450P22012
37293B28848N96635j98525l27825J68177J07221n76871p39889j07918L42782J93449
37283c13916J23417M21132M77149P5053k04186j95380m31087q66819o80227J95922
37273a398942O65264J86410l43811j26158K94093J58135j74196q616L95823L59282
37263G284N44p3522J26477J03989j73535k93942j84689j41129j98016j23257N1616
37252h98180P2225l5185r740J56792K29591J55346P4017J3262m4255M6426L02370
37241F2669L18014j96773p38788n31227K91242P24391K82842l37606l17483J72646
37231b70073M06101J88529p4921j18483k4196J53077L79096L36077k45342r12986
$$ plain form
37303 -13553 293562 610724 256525 -394604 -374441 190343 235114 -356714 -493164 228848
37293 228848 825483 626958 299133 467310 574531 -2340 -742229 -850147 -507365 -313916
37283 -313916 -190499 230633 707782 782835 578649 383269 -47818 -914637 -1594864 -1398942
37273 -1398942 -733678 -547268 -891079 -1017237 -723144 -565009 -739205 -747821 -351998 7284
37263 7284 7828 -65694 60783 164772 -8763 -302705 -487394 -628523 -826539 -949796 -898180
37252 -898180 -825955 -861140 -870880 -714088 -484497 -329151 -255134 -241872 -286127 -239701 62669
37241 62669 380683 183910 -554878 -1086105 -794863 -70472 212370 -125236 -442719 -270073
37231 -270073 136028 324557 249636 131153 106957 260034 639130 975207 729865 -183121
37221a83121q20566O9513P54788N16185j22968k60021R1070K36307k9885k65118
37211a3816k28792j25829j5398K86265O14351M74769j37013n75075m65428j97664
37201c83630j91791k59125r2794J28839J13964K6022J79763M64506N39641L86826
37191I12221K44763J54503o0541m50926q21705q74887m11075L75443Q16836M27432
37181C12064l16563m39776J57505N14538Q7812m21151k47761K38610K82583O009
37171A73870J1101K29113J41294j85867k40744j8794O2335O944J16885K10536
37161E06673j09393n56377m93401n8179O2627q6602J87417Q03019P97642n2031
37151A001395o96924m07251J76768K14230q3754j19287J437j11629k55687m0665
$$ plain form
37221 -183121 -1003687 -934174 -179386 336799 213831 -46190 44880 281187 251302 -13816
37211 -13816 -242608 -368437 -383835 -97570 516781 991550 854537 279462 -185966 -383630
37201 -383630 -575421 -834546 -927340 -798501 -684537 -658515 -478752 -14246 525395 912221
37191 912221 1156984 1311487 1250946 800020 -21685 -896572 -1307647 -932204 -115368 312064
37181 312064 -4499 -444275 -286770 227768 315580 -105571 -353332 -114722 167861 173870
37171 173870 184971 414084 555378 369511 128767 109973 172308 179252 296137 506673
37161 506673 397280 -159097 -652498 -710677 -648050 -734652 -547235 255784 1053426 1001395
37151 1001395 304471 -102780 73988 288218 204464 85177 86614 -25015 -280702 -321367
37141c21367K77396J72262k55995m67745l25125j27491j3295J21810K78608L75236
37131b85706M28683L80105M6166m30855n22636j12416J61695j15011l74746J7073
37121h07648O17050N56071n8529l81366k15955r8335j11263K14273P04780M70188
37111H89266n67571j186264n56862M95213P11917J39764k57006j58323m6367r2745
37101f28978Q5069N43464P54256M11187j40769m50313m15330j02001L46839N23637
37091I27061P2844o25183o97328K0714O32318M14268j86941l29983l7417K8225
37081B18578k69122l82338l3019L74311L96196Q3674k47428l64592j71237J98599
37071a96378L20643o5500n50268m91106L4870L00216M4791j44789J61460N18894
$$ plain form
37141 -321367 -43971 128291 -127704 -595449 -920574 -1048065 -1061360 -939550 -660942 -285706
37131 -285706 142977 523082 569248 138393 -384243 -496659 -334964 -449975 -824721 -807648
37121 -807648 -190598 365473 306944 -74422 -290377 -388712 -499975 -285702 419078 889266
37111 889266 321695 -864569 -1421431 -926218 -214301 -74537 -331543 -489866 -536233 -628978
37101 -628978 -543909 -445 753811 1164998 1024229 573916 158586 56585 403424 927061
37091 927061 999905 374722 -322606 -301892 330426 744694 557753 227770 190353 218578
37081 218578 -50544 -432882 -465901 -91590 304606 388280 140852 -223740 -394977 -196378
37071 -196378 124265 58765 -491503 -982609 -947739 -647523 -602732 -747521 -586061 -67167
37061f7167L52746j19329k83012p3618P3095k325l1293J30752K82309K30950M1389
37050E34497r1453k2561K23254L85708K09805j27142j50271J58553J85756l65754
37040I40392q22246m26330M56549P48651J51547n10358m95210j7901K87853K28593
37030E41540O4937L4073J46149K43023R4588l67283q17782p67693j23753O63282
37020b88919J058615Q68377K35162m94673q57626n62682J21797M83759P7924p55243
37010a13509j210083q35398K4327O14833N77580K74160K09019K99022O4963n02265
37000e97351p88986m46465R6168L32878L74289M74203L80769j59776o34515l28891
36990a297677N03498Q76769M77208J0869J1968J12703j62431n52861n03124j8178
$$ plain form
37061 -67167 285579 166250 -116762 -190380 -117285 -119610 -150903 -20151 262158 493108 534497
37050 534497 443044 420483 643737 1029445 1239250 1112108 961837 1120390 1306146 940392
37040 940392 118146 -308184 148365 897016 1048563 538205 42995 25094 312947 541540
37030 541540 606477 640550 786699 1029722 1124310 757027 -60755 -828448 -952201 -288919
37020 -288919 769696 1638073 1873235 1378562 520936 -41746 80051 563810 641734 -113509
37010 -113509 -1323592 -2158990 -2134663 -1519830 -942250 -668090 -459071 -160049 -95086 -597351
37000 -597351 -1386337 -1832802 -1736634 -1403756 -1029467 -555264 -174495 -334271 -968786 -1297677
36990 -1297677 -794179 82590 559798 570667 582635 695338 532907 -19954 -523078 -541256
36980e41256L92853M00668J38514o7786m0908Q7788P208l41771n40265j93237
36970f98192M14405N84360J45718l28335l43677o5361J02387Q4623K9367j6698
36960i1403m3210N5331K83171M00039J95094k17089n19944n16723k60876K4307
36950f91303J30586O6916L1456Q8268L9039k00849l33785r3208K92986M22630
36940b47264K93281J43963l4518l20914m31432q9483L46261L17446Q212P7387
36930F2939M97069N29310l3211m88461l40005L4905J68108J72137K17897O8023
36920H88711l71694o52421m46764j02093p1936k64207l51957k52269M7705N88706
36910i88219J017576P20208j85172o82237k35813L64160K15699l25020l45446
$$ plain form
36980 -541256 -148403 252265 390779 322993 282085 369873 377081 35310 -504955 -698192
36970 -698192 -283787 300573 446291 117956 -225721 -291082 -188695 -104072 -74705 -91403
36960 -91403 -134613 -79282 203889 603928 799022 581933 61989 -454734 -715610 -691303
36950 -691303 -560717 -493801 -462345 -374077 -335038 -535887 -869672 -962880 -669894 -247264
36940 -247264 46017 189980 155462 -165452 -596884 -686367 -340106 -22660 -14448 62939
36930 62939 560008 1089318 1056107 567646 227641 262546 430654 602791 820688 888711
36920 888711 517017 -135404 -582168 -684261 -756197 -1020404 -1372361 -1624630 -1576925 -988219
36910 -988219 29357 749565 564393 -117844 -353657 10503 226202 -98818 -444264
36901d44264J18201K88860J5453j19204O1194P9170k21091l32270M5364M91695
36891a6892N25190K49288M4466M621l0640j20015j22604J39747O83353J227367
36881B583881J293816O11861n52559j544047j788196j170560j33130O03655O44876
36872E49597K67267m4329k63153o10685q54333n15372J98292M83313J71958R534
36862f07911L51045N24166P4219k98238J06048O93589M82048k99965o39192l59603
36852B6206j63357k74324j96295J94685L78234J35444j26587j35355o2394J0063
36842b13680J77791K25525j62081o41060m88807K35075O46811L44463p9993r8434
36832e4390J1513j32055l13286k00713M5229J15770O2741P4715J17231J00492
$$ plain form
36901 -444264 -326063 -37203 -21750 -140954 -79760 -590 -221681 -553951 -508587 -16892
36891 -16892 508298 757586 802052 806673 776033 656018 533414 673161 1356514 2583881
36881 2583881 3877697 4489558 3936999 2392952 604756 -565804 -698934 -95279 549597
36872 549597 816864 772535 509382 -101303 -955636 -1471008 -1272716 -789403 -617445 -607911
36862 -607911 -256866 267300 341519 43281 149329 842918 1324966 1025001 385809 26206
36852 26206 -137151 -411475 -607770 -413085 -34851 100593 -25994 -161349 -223743 -213680
36842 -213680 -35889 189636 27555 -613505 -1102312 -867237 -220426 124037 44044 -54390
36832 -54390 -42877 -174932 -488218 -688931 -643702 -527932 -465191 -390476 -273245 -172753
36822a72753P1757M2175l0259k003K64135M42750Q1079n38998o03923k2591L29988
36811a38643k7285m08879j04872M56200M35854p9163l13819o0193J28522r4257
36801b06535m13363m29602j67257J20591K99846L80586L87498K93008N5844k26166
36791I4450k72570M4527L84052L16835k089k5869K81661L47338l9456l44587k09942
36780E74350n2239k46914l92308n7735L19027R8357m24336m38682P9552L81181
36770a59747J45868j82868k52091j83786o0430K00878L85160J66679j42781J20995
36760C7877P53589O88330l69121j240902q71556J56025N33983P2453l30993k10257
36750g80572J3588L3548J37865M81992O63505L70296j07939l48421l35355k40645
$$ plain form
36822 -172753 -100996 -58821 -89080 -91083 173052 615802 696881 157883 -446040 -468631 -138643
36811 -138643 -165928 -574807 -679679 -223479 212375 133212 -180607 -240800 -112278 -206535
36801 -206535 -619898 -1049500 -1216757 -1096166 -796320 -415734 -28236 264772 320616 94450
36791 94450 -178120 -133593 250459 567294 565205 539336 820997 1168335 1128879 784292 574350
36780 574350 522111 275197 -117111 -174846 144181 242538 -181798 -620480 -540928 -159747
36770 -159747 -13879 -196747 -448838 -632624 -693054 -492176 -107016 59663 -83118 37877
36760 37877 791466 1479796 1110675 -130227 -1001783 -845758 -311775 -239322 -570315 -780572
36750 -780572 -766984 -733436 -595571 -113579 549926 920222 812283 463862 128507 -112138
36740a12138p5169J24508J18114j81057m38010l10216P6147L37497L22650J48855
36730A1181m8062j79478k30152l71248p30534r14618k91934R23632J514070P89142
36720D71999l11813m82477R7189K63359j22751o4677O31480Q32224J554p54666
36710E61421m39730K31924J05442n02544m86927J26698L85391J51665J69447M92604
36700G95391L11505m69386q44898l16519L08053K72293k8705L2115K16027J9985
36690B95861l47699l93702j91394o5896Q5229M27125N92672K26257k41703j60766
36680B25984K76553L47621k6537k62489j70632j58792l35347k67284J59293M14667
36670B03037J88420r2012k806J96252Q9879j66918j78795Q84O5878O4986K10658
$$ plain form
36740 -112138 -187307 -62799 55315 -125742 -563752 -873968 -797821 -460324 -137674 11181
36730 11181 -36881 -216359 -446511 -817759 -1548293 -2462911 -2754845 -1831213 -317143 471999
36720 471999 160186 -322291 -225102 38257 -84494 -149171 482309 1314533 1316087 561421
36710 561421 121691 353615 459057 -43487 -530414 -403716 -18325 133340 302787 795391
36700 795391 1106896 637510 -207388 -523907 -215854 56439 27734 59849 275876 295861
36690 295861 -51838 -445540 -636934 -702830 -617601 -190476 402196 628453 386750 225984
36680 225984 502537 850158 823621 561132 390500 231708 -103639 -370923 -211630 203037
36670 203037 391457 299445 296639 492891 582770 415852 237057 237941 303819 368805 579463
36659E79463K55664k42570r98383j053590p9436R42543Q77499n6019n93140j69748
36649e37717L67453R7801n60383m66686M79965J073848N04222m59022n76934Q9414
36639A1961L86169j17881n14233n4766O08885M01926m93092q54246j99325N58453
36629b66149M69704j72941l91370J24697P76905R28907N09046j54854o58676o91082
36619D74187k46897K82926M80400L40442J35621k5357j97356k99503k21216j38633
36609E84614k76992m24357k02599K11572K66586j1236Q740M25949M85250j56023
36599I11504o69254k91157L84916L10275l29229m57277R0838L45512j15516m72241
36589b91629q0796M66728L82296n0147r0121J72822J06502k17739q2631N77367
$$ plain form
36659 579463 835127 592557 -405826 -1459416 -1538852 -596309 281190 225171 -367969 -537717
36649 -537717 -170264 -72463 -632846 -1099532 -619567 454281 958503 499481 -77453 11961
36639 11961 398130 280249 -233984 -288750 320135 722061 228969 -625277 -824602 -266149
36629 -266149 203555 30614 -360756 -236059 540846 1469753 1978799 1823945 1165269 474187
36619 474187 227290 510216 990616 1331058 1466679 1441322 1243966 944463 723247 584614
36609 584614 307622 -116735 -319334 -107762 158824 147588 156328 582277 1067527 911504
36599 911504 242250 -48907 336009 646284 317055 -140222 -49384 296128 180612 -291629
36589 -291629 -372425 94303 476599 426452 336331 509153 615655 397916 315285 892652
36579H92652Q78920K73196o22871r22478o29495l51395k62225m4234K93373K85951
36569b08606j52777m20681j09340L18213K38977j21934n3271M52414O22735J01964
36559F67694m85841m64027j0357K69917K14506P4880l3274j43574j39760O1405
36549A1569J83606p9378m99753n29103n2657M48793M95901P8927m31317n86137
36539i59549j68513N38571R17852P02840L09797K13711K74717Q0960l23448n66553
36529A020385n80454n32272l10424K50985P25831M33834m67108r35919l70643
36520g65785N77774Q38930J71660p15779j012533n41660J70534M47140J85901
36511f43818o3632Q9973L02231J19754j81146m7718L13906K07766l18370m51313
$$ plain form
36579 892652 1771572 2044768 1421897 499419 -130076 -481471 -743696 -787930 -494557 -208606
36569 -208606 -361383 -782064 -891404 -573191 -334214 -456148 -509419 -57005 565730 667694
36559 667694 181853 -282174 -292531 -22614 191892 266772 233498 89924 -49836 11569
36549 11569 195175 115797 -383956 -913059 -965716 -516923 -21022 57905 -373412 -959549
36539 -959549 -1128062 -589491 328361 1031201 1340998 1554709 1829426 1910386 1586938 1020385
36529 1020385 439931 -92341 -402765 -151780 574051 1007885 540777 -395142 -765785
36520 -765785 -188011 650919 822579 106800 -905733 -1447393 -1276859 -829719 -643818
36511 -643818 -707450 -617477 -315246 -195492 -376638 -424356 -110450 97316 -221054 -672367
36501f72367L7356L67453J9338m41896l16730J75371L80405J96683l664l1458
36491b89509N0691J94786K99145J76871j09028k27392j15509q4563j90923q8805
36481c84236K20519J91782k93130m89819P4698P03195N07391k55871o44182m13715
36471g83368r4020L5491J74006L26309K15275j02387j97277P4698L86420M55594
36461D90741L30849J71827R3019J53191K10539k4210m95253o69204k70744K16219
36451B06974K47122J5194r907Q0426m4538j70394J07839N15953M53525L5225j11843
36440A325576M0150m0496l57334l60631n8122p8882m52914m38489J11195L52035
36430D2088p7621l35457J42449N38354M1200o04833k27607P39972Q26471j23766
$$ plain form
36501 -672367 -635011 -267558 -248220 -690116 -1006846 -831475 -451070 -254387 -258051 -289509
36491 -289509 -238818 -44032 255113 431984 322956 95564 -19945 -104508 -295431 -384236
36481 -384236 -163717 28065 -265065 -754884 -680186 23009 530400 274529 -369653 -783368
36471 -783368 -877388 -841897 -667891 -341582 -126307 -228694 -425971 -351273 35147 490741
36461 490741 821590 993417 1086436 1239627 1450166 1425956 930703 261499 -9245 206974
36451 206974 454096 469290 459383 539809 495271 324877 432716 948669 1402194 1437419 1325576
36440 1325576 1365726 1325230 967896 607265 549143 470261 17347 -421142 -309947 42088
36430 42088 -35533 -370990 -228541 309813 351013 -253820 -481427 258545 1085016 961250
36420I61250o70442k4444Q10905O84513n5574l61788j15911j4433k85932m63439
36410D64705k98766j02153j12847j57349o1593R1526K38834M26993N15330K52397
36400A257077j99299l11260L603J47822k42440o46546m36504J31040L49757J79153
36390B32403J72663M52960N91925N45042Q38154J532253J762435Q24781p60593
36381F192023j784540j674563r04944l01068k54128m96901m76983n0765K48859
36372D96990o8143o06980n40542J24136M90968J53725k18370o4827J55544j24443
36362b01942n13771l45508J34438J93746j28708j46695K56578M58971J71416j34464
36352b55939l9845K21956K15273q6035l39918k45843J47865M15215J74900l22038
$$ plain form
36420 961250 290808 266364 1077269 1761782 1706208 1344420 1228509 1214076 928144 464705
36410 464705 165939 63786 -49061 -206410 -268003 -176477 62357 489350 1004680 1257077
36400 1257077 1057778 746518 750121 897943 655503 8957 -427547 -296507 53250 232403
36390 232403 405066 858026 1449951 1994993 2833147 4365400 6127835 6952616 6192023
36381 6192023 4407483 2732920 1827976 1526908 1272780 775879 298896 248131 496990
36372 496990 428847 -178133 -718675 -594539 -103571 50154 -168216 -233043 -77499 -201942
36362 -201942 -715713 -1061221 -926783 -733037 -861745 -1008440 -751862 -292891 -121475 -255939
36352 -255939 -295784 -73828 141445 55410 -284508 -530351 -382486 32729 207629 -114409
36342a14409l68575J83954N60734J45798n63621o83256j84135K92440M75132N17981
36332B62043L33917k19799o66482l57603M35128P56914L32838j52675k10706j26851
36322C86724k15129k95367j83593m7624k6982l5407p5181k23817k75207L1183
36312i60400M44645M93719K66539J95666J95655j28346n25921l77153R5500L9771
36302b60325m91141m78419K89060P09103J71381m25336k14677K73435K19346p4823
36292b82396N1329L25497J57439j65317n6067J73406j31070o59632n74679M6182
36282a115308L54645J37707k4103Q6041P8804j04637k8664L24076L77783q6013
36272C31n56151n65560j96497K92773P01481O90319O7648o21478n41035K15193
$$ plain form
36342 -114409 -482984 -299030 261704 407502 -156119 -839375 -1023510 -731070 -255938 262043
36332 262043 595960 376161 -290321 -647924 -212796 544118 876956 724281 513575 386724
36322 386724 171595 -123772 -307365 -354989 -381971 -417378 -492559 -716376 -991583 -960400
36312 -960400 -515755 -22036 244503 440169 635824 507478 -18443 -395596 -300096 -260325
36302 -260325 -751466 -1229885 -940825 -231722 -60341 -485677 -700354 -426919 -207573 -282396
36292 -282396 -231067 94430 251869 86552 30485 203891 72821 -586811 -1161490 -1115308
36282 -1115308 -760663 -622956 -647059 -561018 -482214 -586851 -615515 -291439 86344 331
36272 331 -555820 -1121380 -1317877 -1025104 -323623 366696 434344 -187134 -728169 -512976
36262e12976O04522J18313m77130l28622K56019L83588o0019l48660n9429L87557
36252c6837M44157K10790J95951M98194N90611M4967p56637r64309l23993M51931
36242C54825N56303L3218m20177l67133r669K25087J63160l1389p3275R9699J75900
36231G06549j19329m74620k99910L12095N41416N9735l95750j94532J45737j21589
36221A59802o25233m80316J70368L94506O3456m0548K62500K30117l30911n53433
36211g49692k342N04548K97398m367L15262O77677J74598p56935r20369k45432
36201g09654K18710O9070k70L44568M30630j56545p24794n49620K0543K57624
36191g99738J96979K85811L92025P0694m50333m71056M8163M10741L14662K20175
$$ plain form
36262 -512976 91546 209859 -267271 -595893 -339874 43714 -16305 -364965 -424394 -36837
36252 -36837 407320 618110 814061 1312255 1902866 1947833 1191196 226887 -97106 354825
36242 354825 911128 944346 524169 157036 147367 372454 535614 504225 430950 530649 706549
36231 706549 587220 112600 -187310 124785 666201 725936 330186 135654 281391 159802
36221 159802 -465431 -945747 -775379 -380873 -317417 -357965 -95465 134652 -196259 -749692
36211 -749692 -752034 -247486 49912 45545 360807 1038484 1213082 456147 -464222 -709654
36201 -709654 -490944 -421874 -422144 -77576 353054 196509 -528285 -1077905 -1057362 -799738
36191 -799738 -602759 -316948 75077 145771 -304562 -775618 -727455 -316714 -2052 218123
36181B18123L76766L34526j45777m74479j62149K65824P6518m17062l44035K37967
36171c3778L84894j75413n63648j48426M84063N01529N9980r8124J92884M36769
36161A040730K97064o6522l43374l39810o0879J65267r5629p34915j026110n73190
36151a737368Q9308L19594L10509N49447P87624M34742k67017m45941L6604L67040
36141D44542O2684l96644m57956k14616N6199L15404L88852o5170q01339r51268
36131a619312k53623M02958K77609r4666J44870P26633P41906J81409j14425Q0541
36121D73900O8064m57989p93741l56670L50426M96753J22642o1310J88739L40357
36111C71171n8331o64387p25600m9203O51405N36171k89763p91984k89497N94400
$$ plain form
36181 218123 594889 929415 783638 309159 147010 412834 489352 72290 -271745 -33778
36171 -33778 351116 175703 -387945 -536371 -52308 449221 509201 411077 603961 1040730
36161 1040730 1337794 1271272 927898 588088 527209 692476 596847 -138068 -1164178 -1737368
36151 -1737368 -1648060 -1328466 -1017957 -468510 319114 753856 486839 40898 77502 444542
36141 444542 507226 110582 -347374 -561990 -505791 -190387 198465 133295 -668044 -1619312
36131 -1619312 -1872935 -1469977 -1192368 -1287034 -1142164 -415531 326375 507784 393359 473900
36121 473900 541964 83975 -709766 -1066436 -716010 -219257 -96615 -157925 30814 371171
36111 371171 312840 -351547 -1077147 -1126350 -474945 61226 -228537 -1020521 -1310018 -715618
36101g15618P15875k5290n41501q4375P26830P97159J7204p05467o62824p5241
36091e53248L68033K80245j80603n49141m47614O8789N22596N03913J12877k30471
36081a04624l05499j88644M6455L73498N78160L74096j36002m56340l15970P821
36071a27049J59278J81587K66168L10986R5491k62582m07175k63558j29860k15982
36061c92696l54447k53911J27799N37819O70882M42549O9096j57489j79334j46027
36051C64241j09601o415L3215k37970o31713n38466J51677O42699K95652l54305
36041c90986l77709J14948K49291r4233j38595L33512N41935J03711k34326J19778
36031B27326N59191L26302k16330l02946q4647j83980m36808k25942K35391J50444
$$ plain form
36101 -715618 257 -25033 -566534 -650909 75921 873080 890284 184817 -478007 -553248
36091 -553248 -185215 95030 -85573 -634714 -1082328 -1013539 -490943 12970 125847 -104624
36081 -104624 -410123 -598767 -552312 -178814 399346 773442 637440 181100 -134870 -127049
36071 -127049 32229 213816 479984 790970 886461 623879 216704 -46854 -176714 -392696
36061 -392696 -747143 -1001054 -873255 -335436 335446 777995 847091 689602 510268 364241
36051 364241 254640 248225 281440 43470 -588243 -1126709 -975032 -332333 -36681 -390986
36041 -390986 -768695 -653747 -404456 -498689 -637284 -303772 238163 341874 107548 227326
36031 227326 786517 1112819 896489 593543 508896 324916 -111892 -337834 -102443 48001
36021D8001m23310n71198o5355K30514j91373o73527n14536j3173K06591K02996
36011a764370L83929O77397O87961L69824J6186j93351k37628r1519J44598K12261
36001B05288P5069K6983J68539J72540j15619k95995n0975K70895K10845n7282
35991F10288j13418n8937k28616m20855j85962K61116K36329k82130n22549r8359
35981h03093M25740M48902J49007k2915p5322j83575j35019L03982P48295N84448
35971A440450p7170m52421j66975K45129J51478k94662m45356j03558K42991J34856
35961F74762k66327m76017l52414j74746j25746m7996J59731K34146m9099l75436
35951g99142k36514K68827M69578Q8330l10770j46323L16570L93149J2166k39750
$$ plain form
36021 48001 -375309 -946507 -1011862 -781348 -972721 -1646248 -2160784 -2173957 -1967366 -1764370
36011 -1764370 -1380441 -703044 -15083 354741 370927 177576 -60052 -151571 -6973 205288
36001 205288 280357 307340 475879 648419 532800 236805 185830 456725 667570 610288
35991 610288 496870 437933 209317 -211538 -397500 -136384 99945 -182185 -704734 -803093
35981 -803093 -377353 71549 220556 197641 122319 -61256 -196275 107707 856002 1440450
35971 1440450 1363280 910859 743884 989013 1140491 845829 400473 296915 539906 674762
35961 674762 408435 -67582 -419996 -594742 -720488 -768484 -608753 -374607 -423706 -799142
35951 -799142 -1035656 -766829 -297251 -208921 -519691 -666014 -349444 43705 55871 -183879
35941a83879m9280K04158Q8969k71442m60431l09836N6275M58343P00837N92014
35931H25728J77133k06542l24539l27500m23898m85765k93524O22N6895p2313
35921a073703J5619L94530N98734K87975k18453l71777j48726k6425k46793m41984
35911a231003j48319M90037P96483L89245k86005m77044q2057K50876M6064l61757
35901f13480l70551L3205L69183M09421L50869L22227K14171K9139o4389r9968
35891E79827k79848m85139l28020J45436L61166J04781p0651K41907N26608J14639
35881I10706o59346q42402k52427L02433K56597K730R9807L77067K98310j40171
35871C53304l98624j84693J75412K35686Q425j37211j7313J47870Q2715j58312
$$ plain form
35941 -183879 -233159 -29001 59968 -211474 -671905 -981741 -925466 -467123 233714 825728
35931 825728 1002861 796319 471780 144280 -279618 -765383 -1058907 -1058285 -1001390 -1073703
35921 -1073703 -1058084 -663554 -64820 223155 4702 -367075 -515801 -542226 -789019 -1231003
35911 -1231003 -1379322 -889285 -92802 296443 10438 -466606 -548663 -297787 -251723 -613480
35901 -613480 -984031 -950826 -581643 -172222 178647 500874 715045 744184 679795 579827
35891 579827 299979 -185160 -513180 -367744 -6578 98203 27552 269459 796067 910706
35881 910706 251360 -591042 -843469 -541036 -284439 -281709 -181902 195165 493475 353304
35871 353304 -45320 -230013 -54601 181085 189510 52299 34986 182856 265571 107259
35861A07259k93878j97846R396J91663K89055K04324j09224l97899k79655J85334
35851b91471M21215P3388m57037n17877m3581M32849M79298J74298j16334j26243
35841B8505J12543L02070J85970r9206j74431K194L6875k42647m39672k15998
35831e03797J40875K12366J25939J92515K17762j35402n37210l44827L02858N71218
35821B42297J98110j38849M8340L47660K49316m5207j29015j21170k92301m17763
35811e8582j75316J28747m6432n08668n03464J06808N50913K87982j81630j07027
35801e06669L48491L71689k14130o14135k06110N41073P25848K37093k37638k75528
35791A69984j64399k12058k19072O5345M25105M94501K76325J44k51156m39837
$$ plain form
35861 107259 -186619 -384465 -375069 -183406 105649 309973 200749 -197150 -476805 -291471
35851 -291471 129744 203132 -253905 -771782 -815363 -382514 96784 271082 154748 28505
35841 28505 141048 443118 629088 529882 355451 357645 394520 151873 -287799 -503797
35831 -503797 -362922 -150556 -24617 167898 385660 250258 -286952 -631779 -328921 242297
35821 242297 440407 301558 349898 697558 946874 901667 772652 651482 359181 -58582
35811 -58582 -233898 -105151 -151583 -660251 -1163715 -1056907 -505994 -218012 -399642 -506669
35801 -506669 -158178 213511 -619 -614754 -820864 -279791 446057 683150 445512 169984
35791 169984 5585 -206473 -425545 -360200 64905 559406 835731 835875 584719 144882
35781A44882l91307q1735J59463R9893k8092J5487J0586k53986m19434r0282L74575
35770d59950L31961q6436j78245J60147L12004L2372j84625j7960J90475J48892
35760B48635J02908K45072K73907k6603k97400j55340J72816K05151j02679l86954
$$ plain form
35781 144882 -246425 -328160 -168697 -68804 -96896 -81409 -70823 -324809 -744243 -834525 -459950
35770 -459950 -127989 -214425 -392670 -232523 79481 111853 -72772 -90732 99743 248635
35760 248635 351543 596615 870522 843919 546519 391179 563995 769146 666467 279513
$$ [...]
##END NTUPLES=NMR SPECTRUM
##END=
