##TITLE=31Pdec_2ABPA2804-1
 CDCl3, 124 sc
 28.04.2021
##JCAMPDX= 6.0         $$ Bruker NMR JCAMP-DX V2.0
##DATA TYPE= NMR SPECTRUM
##DATA CLASS= NTUPLES
##ORIGIN= UXNMR, Bruker Analytische Messtechnik GmbH
##OWNER= root
$$ XWIN-NMR		Version 3.5
$$ Wed Apr 28 12:00:22 2021 Russian Standard Time (UT+4h)  she@DPX200
##.OBSERVE FREQUENCY= 81.013821
##.OBSERVE NUCLEUS= ^31P
##.ACQUISITION MODE= SIMULTANEOUS
##.ACQUISITION SCHEME= undefined
##.AVERAGES= 124
##.DIGITISER RES= 16
##SPECTROMETER/DATA SYSTEM= spect
##.PULSE SEQUENCE= zgpg30
##.SOLVENT NAME= CDCl3
##.SHIFT REFERENCE= (INTERNAL, CDCl3, 0, 248.564)
##AUDIT TRAIL= $$ (NUMBER, WHEN, WHO, WHERE, WHAT)
$$ ##TITLE= Audit trail, XWIN-NMR		Version 3.5
$$ ##JCAMPDX= 5.01
$$ ##ORIGIN= Bruker BioSpin GmbH
$$ ##OWNER= she
$$ F:/spectra/data/she/nmr/P31/1/pdata/1/auditp.txt
$$ ##AUDIT TRAIL=  $$ (NUMBER, WHEN, WHO, WHERE, WHAT)
(   1,<2021-04-28 11:58:26.09 +0400>,<she>,<DPX200>,
      <continue with go, POWCHK disabled, PULCHK disabled
       configuration hash MD5:
       00 E9 B6 7A A2 85 ED C7 34 08 36 98 17 FE 4E 26
       data hash MD5: 32K
       FA 3B 53 23 DF F3 D8 89 89 FC 4F C8 DC 47 FD 81>)
(   2,<2021-04-28 11:58:37.56 +0400>,<she>,<DPX200>,
      <Start of raw data processing
       efp BC_mod = 2 LB = 1 FT_mod = 6 PKNL = 1 PHC0 = -6234.159 PHC1 = 836.2018 SI = 64K 
       data hash MD5: 64K
       CE 9F B1 08 A2 9B CC B6 8B 72 A4 0D E6 70 77 9D>)
(   3,<2021-04-28 11:59:22.89 +0400>,<she>,<DPX200>,
      <pk PHC0 = -503.8966 PHC1 = 630.9993 
       data hash MD5: 64K
       58 AE 7A 7B 04 8B A8 00 26 FE 6D D1 6F AD 34 A1>)
(   4,<2021-04-28 11:59:29.89 +0400>,<she>,<DPX200>,
      <abs ABSG = 5 
       data hash MD5: 64K
       BD 3A DA 31 5E 08 B4 2B 86 41 82 80 9B BE 31 B2>)
$$ ##END=
$$ 
$$ hash MD5
$$ 3E 01 13 A1 D0 DC 9C 3E CC A2 E4 12 74 FA 37 2E
##$RELAX= 
##$RELAX= 
##$RELAX= 
##$RELAX= 
##$RELAX= 
##$RELAX= 
##$RELAX= 
##$RELAX= 
$$ Bruker specific parameters
$$ --------------------------
##$DU= <F:/spectra>
##$EXPNO= 1
##$NAME= <P31>
##$PROCNO= 1
##$TYPE= <nmr>
##$USER= <she>
##$AMP= (0..31)
100 100 100 100 100 100 100 100 100 100 100 100 100 100 100 100 100 100 
100 100 100 100 100 100 100 100 100 100 100 100 100 100 
##$AQSEQ= 0
##$AQ_mod= 1
##$AUNM= <au_zg>
##$AUTOPOS= <>
##$BF1= 81.014009
##$BF2= 200.13
##$BF3= 200.13
##$BF4= 200.13
##$BF5= 200.13
##$BF6= 200.13
##$BF7= 200.13
##$BF8= 200.13
##$BYTORDA= 1
##$CFDGTYP= 0
##$CFRGTYP= 5
##$CHEMSTR= <none>
##$CNST= (0..31)
1 1 145 1 1 1 1 1 1 1 1 1 1 1 1 1 1 1 1 1 1 1 1 1 1 1 1 1 1 1 1 1 
##$CPDPRG= <waltz16>
##$CPDPRG1= <>
##$CPDPRG2= <waltz16>
##$CPDPRG3= <>
##$CPDPRG4= <mlev>
##$CPDPRG5= <mlev>
##$CPDPRG6= <mlev>
##$CPDPRG7= <mlev>
##$CPDPRG8= <mlev>
##$CPDPRGB= <>
##$CPDPRGT= <>
##$D= (0..31)
0 1 0 0 0 0 0 0 0 0 0 0.03 2e-05 3e-06 0 0 0 0 0 0 0 0 0 0 0 0 0 0 0 0 
0 0 
##$DATE= 1619596510
##$DBL= (0..7)
120 120 120 11 120 120 24 19 
##$DBP= (0..7)
150 150 150 150 150 150 150 150 
##$DBP07= 0
##$DBPNAM0= <>
##$DBPNAM1= <>
$$ [...]
##$SUBNAM3= <"">
##$SUBNAM4= <"">
##$SUBNAM5= <"">
##$SUBNAM6= <"">
##$SUBNAM7= <"">
##$SUBNAM8= <"">
##$SUBNAM9= <"">
##$SW= 501.771253377433
##$SWIBOX= (0..15)
0 1 3 0 0 0 0 0 0 0 0 0 0 0 0 0 
##$SW_h= 40650.406504065
##$TD= 32768
##$TD0= 1
##$TE= 0
##$TE2= 300
##$TE3= 300
##$TEG= 300
##$TL= (0..7)
0 120 53 12 22 120 120 120 
##$TP= (0..7)
150 150 150 150 150 150 150 150 
##$TP07= 0
##$TPNAME0= <>
##$TPNAME1= <>
##$TPNAME2= <>
##$TPNAME3= <>
##$TPNAME4= <>
##$TPNAME5= <>
##$TPNAME6= <>
##$TPNAME7= <>
##$TPOAL= (0..7)
0.5 0.5 0.5 0.5 0.5 0.5 0.5 0.5 
##$TPOFFS= (0..7)
0 0 0 0 0 0 0 0 
##$TUNHIN= 0
##$TUNHOUT= 0
##$TUNXOUT= 0
##$USERA1= <user>
##$USERA2= <user>
##$USERA3= <user>
##$USERA4= <user>
##$USERA5= <user>
##$V9= 5
##$VALIST= <valist>
##$VCLIST= <CCCCCCCCCCCCCCC>
##$VD= 0
##$VDLIST= <DDDDDDDDDDDDDDD>
##$VPLIST= <PPPPPPPPPPPPPPP>
##$VTLIST= <TTTTTTTTTTTTTTT>
##$WBST= 1024
##$WBSW= 4
##$XGAIN= (0..3)
0 0 0 0 
##$XL= 0
##$YL= 0
##$YMAX_a= 5661
##$YMIN_a= -23462
##$ZGOPTNS= <>
##$ZL1= 120
##$ZL2= 120
##$ZL3= 120
##$ZL4= 120
##$ABSF1= 248.5645
##$ABSF2= -253.2056
##$ABSG= 5
##$ABSL= 3
##$ALPHA= 0
##$AQORDER= 0
##$ASSFAC= 0
##$ASSFACI= 0
##$ASSFACX= 0
##$ASSWID= 0
##$AUNMP= <proc_1d>
##$AZFE= 0.1
##$AZFW= 0.5
##$BCFW= 0
##$BC_mod= 2
##$BYTORDP= 0
##$COROFFS= 0
##$CY= -3
##$DATMOD= 1
##$DC= 0
##$DFILT= <>
##$DTYPP= 0
##$F1P= 0
##$F2P= 0
##$FCOR= 1
##$FTSIZE= 65536
##$FT_mod= 6
##$GAMMA= 0
##$GB= 0
##$INTBC= 1
##$INTSCL= 5.30512e-09
##$ISEN= 30
##$LB= 1
##$LEV0= 0
##$LPBIN= 0
##$MAXI= 10000
##$MC2= 0
##$MEAN= 0
##$ME_mod= 0
##$MI= 50
##$NCOEF= 0
##$NC_proc= -9
##$NLEV= 6
##$NOISF1= 182.463
##$NOISF2= 159.3651
##$NSP= 0
##$NTH_PI= 0
##$NZP= 0
##$OFFSET= 248.5645
##$PC= 4
##$PHC0= -6738.056
##$PHC1= 1467.201
##$PH_mod= 1
##$PKNL= yes
##$PPARMOD= 0
##$PSCAL= 0
##$PSIGN= 0
##$REVERSE= no
##$SF= 81.014009
##$SI= 65536
##$SIGF1= 159.3651
##$SIGF2= -187.1042
##$SINO= 113.3802
##$SIOLD= 16384
##$SREGLST= <1H.CDCl3>
##$SSB= 0
##$STSI= 65536
##$STSR= 0
##$SW_p= 40650.406504065
##$SYMM= 0
##$S_DEV= 0
##$TDeff= 32768
##$TDoff= 0
##$TI= <>
##$TILT= no
##$TM1= 0
##$TM2= 0
##$TOPLEV= 0
##$USERP1= <user>
##$USERP2= <user>
##$USERP3= <user>
##$USERP4= <user>
##$USERP5= <user>
##$WDW= 1
##$XDIM= 65536
##$YMAX_p= 540484450
##$YMIN_p= -440820835
$$ End of Bruker specific parameters
$$ ---------------------------------
##NTUPLES= NMR SPECTRUM
##VAR_NAME=  FREQUENCY,     SPECTRUM/REAL,   SPECTRUM/IMAG
##SYMBOL=    X,             R,               I
##VAR_TYPE=  INDEPENDENT,   DEPENDENT,       DEPENDENT
##VAR_FORM=  AFFN,          ASDF,            ASDF
##VAR_DIM=   65536,         65536,           65536
##UNITS=     HZ,            ARBITRARY UNITS, ARBITRARY UNITS
##FACTOR=    0.620285442955139, 1,           1
##FIRST=     20137.2065510759, 0,            0
##LAST=      -20513.1999529892, 0,           0
##MIN=       -20513.1999529892, -440820835,  0
##MAX=       20137.2065510759, 540484450,    0
$$ Real data points
##PAGE= N=1
##DATA TABLE= (X++(R..R)), XYDATA
$$ [...]
32034A05743218Q734279l9192471p1761648m5553540R32187J4155792J5498671
$$ 105743218 114477497 75285026 3523378 -42030162 -41097975 -26942183 -11443512
32027a1443512M0624552M8248750q143283o9331863m8396372J8963042K8102385
$$ -11443512 29181040 77429790 69286507 -45356 -48441728 -29478686 -1376301
32020a376301j7549540j9770918L3333737M3544384k3416429p7234297n3411665
$$ -1376301 -18925841 -38696759 -5363022 38181362 14764933 -62469364 -115881029
32013a15881029k462218J6703895K2753094M1205948M6646512K6529099J3892830
$$ -115881029 -118343247 -101639352 -78886258 -37680310 8966202 35495301 49388131
32006D9388131J2807906j8091262o7447193n7793956J9777285O3070524J4368790
$$ 49388131 62196037 44104775 -23342418 -81136374 -61359089 1711435 16080225
31999A6080225m5121213l2017560R103080K984342k2303533m916729K5480145
$$ 16080225 -29040988 -61058548 -51955468 -48971126 -71274659 -76191388 -50711243
31992e0711243Q021641k4719537k556735M6774048L9717906j4657321k9465539
$$ -50711243 -42689602 -67409139 -69965874 -23191826 16526080 1868759 -27596780
31985b7596780J0288710L0318163L48913k6659796k2187143k4379913m6589907
$$ -27596780 -17308070 13010093 13359006 -13300790 -35487933 -59867846 -106457753
31978a06457753l9758466J4748120N7111046M1651596J0410966K1473055N5758233
$$ -106457753 -146216219 -131468099 -74357053 -32705457 -22294491 -821436 54936797
31971E4936797N2700395O985049k5901262j1458544J9190090J4786966k7422122
$$ 54936797 107637192 114622241 88720979 77262435 96452525 111239491 83817369
31964H3817369n5276577k8121465K2930247K8797500k0365147n4456978k5045447
$$ 83817369 28540792 419327 23349574 52147074 31781927 -22675051 -47720498
31957d7720498K0351388J5531293j5541829j626094M8408003N2130271r071702
$$ -47720498 -27369110 -11837817 -27379646 -29005740 19402263 71532534 62460832
31950F2460832n2450291k4425333J5922231k473277m7009969l8934109J6962608
$$ 62460832 10010541 -14414792 1507439 -965838 -47975807 -86909916 -69947308
31943f9947308M1326906M620813l4036096k2850796J1335324J6213804p294589
$$ -69947308 -28620402 -23999589 -58035685 -80886481 -69551157 -53337353 -60631942
31936f0631942j8689718m108949J2660660J5502528J2627701O794559j1287635
$$ -60631942 -79321660 -83430609 -70769949 -55267421 -42639720 -35845161 -47132796
31929d7132796k7512967m146329N6401723Q6631399L9463082l1491413m0157878
$$ -47132796 -74645763 -78792092 -22390369 64241030 103704112 72212699 32054821
31922C2054821J812158M243672m9913938o9351792o943871N0718271J9075374
$$ 32054821 33866979 38110651 -11803287 -81155079 -88098950 -37380679 -18305305
31915a8305305m2185697k5600622M2579440M2487715l8561600p7671136q242570
$$ -18305305 -60491002 -86091624 -43512184 -1024469 -39586069 -117257205 -125499775
31908a25499775P9181993P7129971O382388m2243361l7325243r660451J8643418
$$ -125499775 -46317782 30812189 37194577 -5048784 -42374027 -52034478 -33391060
31901c3391060L9317231L2454727j258516j5793813J5178482M2479595J2663411
$$ -33391060 5926171 38380898 37122382 21328569 36507051 78986646 91650057
31894I1650057l7269660k9769587K8880559N4958546J6232196k5827240j9528843
$$ 91650057 54380397 24610810 53491369 108449915 124682111 98854871 79326028
31887G9326028M643325q30857k2203896j8046840P127572J1567095j8432827n0501306
$$ 79326028 83969353 83138496 60934600 42887760 50015332 61582427 43149600 -7351706
31879g351706m8619637j0377382L3159184M2058838L544158m6217867n3100440
$$ -7351706 -55971343 -66348725 -33189541 8869297 12413455 -33804412 -86904852
31872h6904852r112386L5147167L5758133P855463p594217k161082N170690Q614457
$$ -86904852 -96017238 -60870071 -25111938 -17256475 -24850692 -27011774 -21841084 -13226627
31864a3226627J3436322R065347j4148697l1186924j0656089K6774411K7951653
$$ -13226627 209695 9275042 -4873655 -36060579 -46716668 -19942257 8009396
31857H009396r844735k9002656o90905L0804461K1951144m270019q916924o183558
$$ 8009396 -1835339 -30837995 -31528900 -724439 21226705 16956686 8039762 1856204
31849A856204k5270438l9858436n147880N3684819O3644017J2591944l4328521
$$ 1856204 -23414234 -63272670 -68420550 -14735731 48908286 61500230 27171709
31842B7171709l4502778j4481690p14401K2939974N6211482N2005862m924466
$$ 27171709 -7331069 -21812759 -22527160 412814 56624296 108630158 103705692
31835A03705692m9162509k5833378J9116117J0791072l2122972l0570362K0189706
$$ 103705692 54543183 28709805 47825922 58616994 26494022 -4076340 16113366
31828A6113366M0701345l556800m9581467l8990300L64887J3807986K807837J754709
$$ 16113366 56814711 53257911 3676444 -35313856 -34948969 -21140983 -18333146 -16578437
31820a6578437J3220573J4692779M520333j216256k226275j0238619k2634299
$$ -16578437 -3357864 11334915 15855248 14638992 12412717 2174098 -20460201
31813b0460201k6059917j6319444L629692L0180200M7456670L0970262j6495821
$$ -20460201 -46520118 -62839562 -59209870 -29029670 18427000 49397262 32901441
31806C2901441n4331549n1280548k1386794O853357K7429813L7179799J6295918
$$ 32901441 -21430108 -72710656 -94097450 -87244093 -59814280 -22634481 -6338563
31799f338563l0789468m9145061k100303N8695722N4645726l699742l2541669
$$ -6338563 -37128031 -86273092 -88373395 -29677673 24968053 21268311 -11273358
31792a1273358l826241J9881548m093776l1167181j0979902K9596126L7303538
$$ -11273358 -15099599 4781949 688173 -30479008 -41458910 -11862784 25440754
31785B5440754J6688708N913400M996291j1131820l1360690k1057666J3552388
$$ 25440754 42129462 48042862 53039153 41907333 10546643 -10511023 3041365
31778C041365K8139293O749576j9846070k3636943q042003J3109607K8585097
$$ 3041365 31180658 37930234 18084164 -5552779 -13594782 -485175 28099922
31771B8099922K2877596o925873k9155729j1099185K6341601K9357259j0602883
$$ 28099922 50977518 44051645 14895916 3796731 30138332 59495591 48892708
31764D8892708m3194973l1994712J956112K2005593K0407874N305923j8516545
$$ 48892708 5697735 -26296977 -24340865 -2335272 18072602 23378525 4861980
31757D861980l8273050l6708004k1477729j7107249j9335227m34324L1478649
$$ 4861980 -33411070 -70119074 -91596803 -108704052 -128039279 -128473603 -96994954
31750i6994954L4150127R467382J3649757N6009727O0280436j6067038r1214513
$$ -96994954 -62844827 -53377445 -39727688 16282039 76562475 60495437 -30719076
31743c0719076o7629670J8916524N3025588J1850511j9459425L420247K6506747
$$ -30719076 -98348746 -79432222 -26406634 -14556123 -34015548 -30595301 -4088554
31736d088554Q217343j0959678P413660K6210661N42957l9626370l6239912O339360
$$ -4088554 4128789 -6830889 582771 26793432 27336389 -12289981 -48529893 -42190533
31728d2190533L6046508L3769135K5248950K4656039J4667927j5628828m7340858
$$ -42190533 -6144025 27625110 52874060 77530099 92198026 76569198 29228340
31721B9228340n3829319k9255443O361016K2861557P524587j8260956k2701806
$$ 29228340 -24600979 -53856422 -47495406 -24633849 -17109262 -35370218 -58072024
31714e8072024o431673k24887j4403169j9660036N729581L7098896L6085522L602531
$$ -58072024 -64503697 -64728584 -79131753 -98791789 -93062208 -55963312 -19877790 -16275259
31706a6275259k3672951j8513980J2236628L7562574K6503445k1198739o0619563
$$ -16275259 -39948210 -58462190 -46225562 -8662988 17840457 -3358282 -63977845
31699f3977845m2479628J8994845M9878662J0453100m6289643m4241632J2705990
$$ -63977845 -106457473 -87462628 -37583966 -27130866 -73420509 -117662141 -104956151
31692a04956151N1303955L1439437r274375j9170131M11494J2896720N202065
$$ -104956151 -53652196 -22212759 -31487134 -50657265 -50245771 -37349051 -32146986
31685c2146986r69693Q591648J4032872p804716l9598440l8309421J122184K8550926
$$ -32146986 -33116679 -24525031 -10492159 -18296875 -57895315 -96204736 -95082552 -66531626
31677f6531626R041729j8908598J695382N3026338O2956518J6355129k1444839
$$ -66531626 -57489897 -76398495 -74703113 -21676775 41279743 57634872 36190033
31670C6190033r633336Q403211j2053652l7664915j7870212K2544023K0900015
$$ 36190033 26556697 34959908 22906256 -14758659 -32628871 -10084848 10815167
31663A0815167k0795180m0618390j3208249K2887520L3870500K8127975J7731700
$$ 10815167 -9980013 -50598403 -63806652 -40919132 -7048632 21079343 38811043
31656C8811043m507034l4091404m4056085k3733087L724897J6863561K0799377
$$ 38811043 34304009 212605 -43843480 -67576567 -63851670 -46988109 -26188732
31649b6188732K4775094K1902282N424958j5009964k4978194j9858460m578212
$$ -26188732 -1413638 20488644 25913602 10903638 -14074556 -33933016 -38511228
31642c8511228Q320013M733815j0425967q703548K2599063M8512996K5904121
$$ -38511228 -30191215 -25457400 -35883367 -44586915 -21987852 26525144 52429265
31635E2429265l2164049o7469289n0473646p554467K5522835L8909687L3165561
$$ 52429265 20265216 -47204073 -97677719 -105232186 -79709351 -40799664 -7634103
31628g634103Q771665j7000155j8320399O80125Q090382l767985m996698J7317674
$$ -7634103 1137562 -15862593 -34182992 -33502867 -25412485 -29180470 -34177168 -16859494
31620a6859494L0267013O814421k7428588l1970414j0606850L119395K263263
$$ -16859494 13407519 20221940 -7206648 -39177062 -49783912 -46664517 -44401254
31613d4401254R160566K7092634K7468636m289639l7003163k8305361J8825926
$$ -44401254 -35240688 -8148054 19320582 15030943 -21972220 -50277581 -31451655
31606c1451655N4538065M1691254R71097j9751713j0984079p468220k5962086
$$ -31451655 23086410 64777664 65748761 45997048 35012969 27544749 1582663
31599A582663l4968241q104438K7671464L3161561J8022496J6332470K3839807
$$ 1582663 -33385578 -41490016 -13818552 19343009 37365505 53697975 77537782
31592G7537782J2302608j0013160j2792787r215559l7879653p8727966o4870325
$$ 77537782 89840390 79827230 67034443 57818884 19939231 -58788735 -123659060
31585a23659060N626827N0739889K8938640J585298K3040245M7901496J6736207
$$ -123659060 -118032233 -67292344 -38353704 -36768406 -13728161 34173335 50909542
31578E0909542l4090301l4053451J481328P533580j0792836J732177L1080412
$$ 50909542 16819241 -17234210 -15752882 -8219302 -19012138 -17279961 13800451
31571A3800451P411814n8505421o7755686O590381N9823345J3421860n9361151
$$ 13800451 21212265 -37293156 -105048842 -98458461 -38635116 -25213256 -84574407
31564h4574407m5058691L9964835Q3491549M4501936o803100p773064K0013454
$$ -84574407 -129633098 -89668263 -6176714 38325222 31522122 23749058 43762512
31557D3762512K6400629K229780k9846584n0889385n0519631k7132672O99132
$$ 43762512 70163141 72392921 42546337 -8343048 -58862679 -85995351 -85296219
31550h5296219Q041264j616686j370319J3245620J6289496Q60365r82995K8053268
$$ -85296219 -77254955 -78871641 -80241960 -66996340 -50706844 -49846479 -50829474 -22776206
31542b2776206N0409026K3945822k9207357m6626266j0851663L1605940M0208200
$$ -22776206 27632820 51578642 22371285 -24254981 -35106644 -3500704 36707496
31535C6707496K7777236K1286790J3356760j3789551m0361408k9275028J0294523
$$ 36707496 64484732 85771522 99128282 85338731 44977323 15702295 25996818
31528B5996818K5002415l670873k4421747Q161765N5284683M1565423l0873962
$$ 25996818 50999233 47328360 22906613 31068378 86353061 127918484 97044522
31521I7044522p5359531m1006412J6979744K2862023j2178326k3834579k997403
$$ 97044522 21684991 -19321421 -2341677 20520346 8342020 -15492559 -18489962
31514a8489962J952352j8168086j3480683L1354668N8387492K8810146j1324703
$$ -18489962 -16537610 -34705696 -48186379 -16831711 41555781 70365927 59041224
31507E9041224j0517909P10310k8023857o2366830l0103667M7723437P0581172
$$ 59041224 48523315 49233625 21209768 -41157062 -71260729 -23537292 47043880
31500D7043880J1397380l9117077j3672328L2275782J8314938l3104332m1404834
$$ 47043880 58441260 19324183 5651855 37927637 56242575 23138243 -18266591
31493a8266591K448808L1814323J3976134j1080163o453439J0131474J0167917
$$ -18266591 -15817783 15996540 29972674 18892511 12439072 22570546 32738463
31486C2738463K529680J0490126L0069798L7356634K1988120n046837k7287156
$$ 32738463 35268143 45758269 75828067 113184701 135172821 130125984 102838828
31479A02838828l3899836k2764055l187416Q285644K380857j2719124j8742587
$$ 102838828 68938992 46174937 42987521 51273165 53654022 40934898 22192311
31472B2192311o404583J2155709J3001752j2377155m2290225m6087215j8850380
$$ 22192311 15787728 27943437 40945189 28568034 -13722191 -59809406 -78659786
31465g8659786J4757175K8910138J7820812o191159k0809132p232164K4910423
$$ -78659786 -63902611 -34992473 -17171661 -23362820 -44171952 -51404116 -26493693
31458b6493693L6358735Q031688k2198591j1225324J5282049k169404n1775998
$$ -26493693 9865042 17896730 -4301861 -15527185 -245136 -2414540 -54190538
31451e4190538n4106737J1164659O1151393L3496725j9543394k0069154J6502689
$$ -54190538 -108297275 -97132616 -35981223 -2484498 -22027892 -42097046 -25594357
31444b5594357K4616562n06187j6400740j9071242l0222767k8368642J8152058
$$ -25594357 -977795 -1483982 -17884722 -36955964 -67178731 -95547373 -77395315
31437g7395315O9241535N6190267l505160k6945293K550746K0253330m25684j4034012
$$ -77395315 -8153780 48036487 44531327 17586034 20136780 40390110 39964426 25930414
31429B5930414l059641q363091l3397940k2669871K5512458L0943336k9582770
$$ 25930414 22870773 14507682 -18890258 -41560129 -16047671 14895665 -14687105
31422a4687105o0557601J139451P1323536M8848651k2025909l0627453K0458257
$$ -14687105 -75244706 -74105255 -2781719 46066932 24041023 -6586430 13871827
31415A3871827L6721036l241966k8540016j2192716q125031l8100714m6609130
$$ 13871827 50592863 47350897 18810881 6618165 -1506866 -39607580 -86216710
31408h6216710q84622M8984052M9763833J8862465l17278k394367j744781M150613
$$ -86216710 -87101332 -38117280 11646553 30509018 30191740 27797373 26052592 30203205
31400C0203205J5621715J1393640j6725463l8533330k6026779M599839J9352553
$$ 30203205 45824920 57218560 40493097 1959767 -24067012 -19467173 -114620
31393a14620J3629392O294828M400290Q86259l707736j441634O025295Q454613
$$ -114620 13514772 19809600 24209890 25096149 21388413 19946779 25972074 34426687
31385C4426687K583157n253517r306752q651244l912526L555151R557267P067620
$$ 34426687 37009844 31756327 22449575 13798331 9885805 13440956 22998223 30065843
31377C0065843q822513l0711946l5361872n318569L9486625N1231636J2107713
$$ 30065843 21243330 -9468616 -44830488 -50149057 -10662432 40569204 52676917
31370E2676917l5213582l9452446p816708J1058552J342772m084793J4726209
$$ 52676917 17463335 -21989111 -29805819 -18747267 -17404495 -21489288 -6763079
31363f763079L0364524J4825116j3576706j9727835o718130p738164l0691455
$$ -6763079 23601445 38426561 24849855 5122020 -1596110 -9334274 -40025729
31356d0025729m3381095k0626899J7919134L3084194J6790774k486827l002850
$$ -40025729 -83406824 -104033723 -86114589 -53030395 -36239621 -38726448 -41729298
31349d1729298L791222R09154j311756J3644904K6784601K496236m6212907n5684232
$$ -41729298 -37938076 -37028922 -38340678 -24695774 2088827 4585063 -41627844 -97312076
31341i7312076L44319N8984557M5363623k3697072o2303202l0772930K3434067
$$ -97312076 -96967757 -37983200 7380423 -16316649 -78619851 -109392781 -85958714
31334h5958714M2673024K6835098Q395560K578126O772562J7570342K3396724
$$ -85958714 -43285690 -16450592 -8055032 -5476906 1295656 18865998 42262722
31327D2262722N962377k8035154m2113626k0747310K638479j946721r905199J4313342
$$ 42262722 48225099 20189945 -21923681 -42670991 -40032512 -41979233 -51884432 -37571090
31319c7571090M5751025K8588359k7769841m5520486J0428409P4072274O6450938
$$ -37571090 8179935 36768294 8998453 -36522033 -26093624 47978650 114429588
31312A14429588m12421n2578870n6964884m2416517l3106783j7658681R924196
$$ 114429588 114017167 61438297 4473413 -37943104 -71049887 -88708568 -78784372
31305g8784372K6259200J3301046j4142404k9769907k1466046Q551959M1573783
$$ -78784372 -52525172 -39224126 -53366530 -83136437 -104602483 -96050524 -54476741
31298e4476741M1455861n913743n1624580l2350547L2004131N1426774j106996
$$ -54476741 -13020880 -18934623 -70559203 -102909750 -70905619 -19478845 -20585841
31291b0585841m1535022m645415N0666331L7314512k0050174l3388884K765056
$$ -20585841 -62120863 -66766278 -16099947 21214565 1164391 -32224493 -29459437
31284b9459437J9099969L188075R624826L8876154K3541965m0765895o4819894
$$ -29459437 -10359468 -7171393 2453433 41329587 64871552 24105657 -40714237
31277d0714237j1214675L4760765L034482m6119371k5083152L9674560O1556895
$$ -40714237 -51928912 -17168147 -14133665 -60253036 -85336188 -45661628 15895267
31270A5895267L3784913J8434902K9101473J8917340k6061222o2587940o0125588
$$ 15895267 49680180 68115082 97216555 116133895 90072673 27484733 -32640855
31263c2640855l2460778K2443K7430575L4020983J2034901j4104189j7749496
$$ -32640855 -65101633 -65079190 -37648615 -3627632 8407269 -5696920 -23446416
31256b3446416j0835725j5943424k0095157k155013J8015077R606373j2339536
$$ -23446416 -34282141 -50225565 -70320722 -72475735 -54460658 -44854285 -57193821
31249e7193821j3747731j633249p82380L096075L2059703N3382448K2347821l2415205
$$ -57193821 -70941552 -72574801 -73357181 -70261106 -38201403 15181045 37528866 5113661
31241E113661m5645682k0760450j1920074j4940920K2163711P9318431O8079202
$$ 5113661 -40532021 -61292471 -73212545 -88153465 -65989754 13328677 81407879
31234H1407879j9921907p7924777m2338862J3997203O055937l5533766l3859066
$$ 81407879 61485972 -16438805 -58777667 -44780464 -38724527 -74258293 -108117359
31227a08117359R965587M0901848M2885579L1588840R33471m8191863o6045162
$$ -108117359 -98151772 -57249924 -14364345 17224495 18157966 -30033897 -96079059
31220i6079059j7413262M5424773M9240834J1632738O246664L7540716L9150512
$$ -96079059 -113492321 -68067548 -18826714 -7193976 -947312 36593404 75743916
31213G5743916o893399l9816362k4941588n745498j8334576k6442186Q931100
$$ 75743916 68850517 29034155 4092567 -1652931 -19987507 -46429693 -37498593
31206c7498593N0440822L6564240j9082546m4686735j6755485J1364301j756721
$$ -37498593 12942229 49506469 30423923 -14262812 -31018297 -19653996 -21410717
31199b1410717k3202670n375081L1406956K8336662j4334693k9489517J4245209
$$ -21410717 -44613387 -49988468 -18581512 9755150 -4579543 -34069060 -19823851
31192a9823851N8751265M1372386j1909917l0881223o865373J0249889L755671
$$ -19823851 38927414 80299800 68389883 37508660 30643287 40893176 44648847
31185D4648847N628165J9494962M993554m0858679n9938699k6091958M873300
$$ 44648847 50277012 69771974 74765528 33906849 -26031850 -52123808 -47250508
31178d7250508j3855783l9207138j0172694M6829684N7619436J6789879j0648043
$$ -47250508 -61106291 -100313429 -110486123 -63656439 -6037003 10752876 104833
31171A04833N975872K7039630J6530293q528973j8032009j1608042l480511J240805
$$ 104833 6080705 33120335 49650628 41121655 23089646 11481604 8001093 9241898
31163I241898M52624q113897j4569954m942464J3508337J8452969O497937l213378
$$ 9241898 9694522 1580625 -12989329 -17931793 -4423456 14029513 20527450 17314072
31155A7314072j528822o75476r555184k0174244k2310740j3254528N853635K5170720
$$ 17314072 15785250 15109774 5554590 -14619654 -36930394 -50184922 -44331287 -19160567
31147a9160567K4921684J721777j5048081k890331J1617812p499831l3724385
$$ -19160567 5761117 7482894 -7565187 -10455518 1162294 -6337537 -40061922
31140d0061922m809535O9487539R2471678J0782321r3803169j00835103r684545
$$ -40061922 -44871457 24616082 117087760 127870081 34066912 -66768191 -76452736
31133g6452736O3456504M1116777k7007172m9634149j4118526K0173344J7649723
$$ -76452736 -12996232 28120545 1113373 -48520776 -62639302 -42465958 -24816235
31126b4816235K633303K141319K580003j3496340k3168874M612632M8045540M9456351
$$ -24816235 -22182932 -20041613 -17461610 -30957950 -54126824 -49514192 -1468652 47987699
31118D7987699j970488m7183529l6996998J782368J2717945n502784n671659K7627791
$$ 47987699 46017211 -1166318 -38163316 -36380948 -23663003 -29165787 -34837446 -7209655
31110g209655N3061367L5983618l905667k7467513k8121373k4232351k0645320
$$ -7209655 45851712 81835330 77929663 50462150 22340777 -1891574 -22536894
31103b2536894o931193J3576996J8773270m144833l9514652n6765194l8004319
$$ -22536894 -29468087 -15891091 2882179 -1262654 -40777306 -97542500 -135546819
31096a35546819O341343M3736915M4734864R965869k8410353l7734011j6550888
$$ -135546819 -129205476 -85468561 -40733697 -30767828 -59178181 -96912192 -113463080
31089a13463080Q915340J7018865J1857109J1770150K4127784L6333837K9687704
$$ -113463080 -104547740 -87528875 -75671766 -63901616 -39773832 -3439995 26247709
31082B6247709n78819l7810141n5222265l7649362M270971M1822207N1915685
$$ 26247709 25668890 -12141251 -67363516 -105012878 -100741907 -58919700 -7004015
31075g004015L2684651l136909m1983524o9796902o7632594k5733167L3962393
$$ -7004015 25680636 22543727 -19439797 -89236699 -156869293 -182602460 -148640067
31068a48640067O6225724M6227468l108767l7115997l4693256q342430J9489700
$$ -148640067 -82414343 -36186875 -39295642 -76411639 -111104895 -119447325 -99957625
31061i9957625L3710501K7283406M215384j7565751k1086975r258207K534885
$$ -99957625 -66247124 -38963718 -34748334 -52314085 -73401060 -82659267 -80124382
31054h0124382J0251880K2416495L7703346L8681193J4805829j9233409l5757658
$$ -80124382 -69872502 -47456007 -9752661 28928532 43734361 24500952 -11256706
31047a1256706k1319396J0319418L1477335K9284388J8984008J9064377J8405163
$$ -11256706 -32576102 -22256684 9220651 38505039 57489047 76553424 94958587
31040I4958587q045052m9608051o1839475l3072668p890394j5466105j8998017
$$ 94958587 86913535 37305484 -24533991 -57606659 -65497053 -80963158 -99961175
31033i9961175J7465781N5062111L8998312k131568P91590L3840255J7922309
$$ -99961175 -82495394 -27433283 11565029 9433461 10225051 44065306 61987615
31026F1987615m6314653o0087224J3301676P4603646L7048032m0816490n3234089
$$ 61987615 15672962 -44414262 -31112586 43491060 80539092 39722602 -13511487
31019a3511487r058705J548824m0622728o5959733l5956078R447558K9024224
$$ -13511487 -22570192 -21021368 -61644096 -127603829 -163559907 -154112349 -125088125
31012a25088125L0786052L2096485K7571623J3040039o34198q229051j3327054
$$ -125088125 -94302073 -62205588 -34633965 -21593926 -22228124 -30457175 -43784229
31005d3784229j1432665L95556O386928l285625o162637J7193065M0682185K8960496
$$ -43784229 -55216894 -54821338 -48434410 -51720035 -57882672 -40689607 -7422 28953074
30997B8953074k796250j3522225k068561L233238Q94365M908192j448342l4046616
$$ 28953074 26156824 12634599 10566038 13799276 14693641 19601833 18153491 -15893125
30989a5893125n1025425o829912N1300653L3816827m4693287p1602871o621224
$$ -15893125 -66918550 -73748462 -22447809 11369018 -33324269 -104927140 -111548364
30982a11548364N8732342M8726457P419650r72418J170384k5503249m2903628
$$ -111548364 -52816022 -4089565 3330085 2357667 3528051 -21975198 -64878826
30975f4878826l609358M6302903L0823061k8361506m3966063L44011L8020114
$$ -64878826 -68488184 -22185281 8637780 -19723726 -63689789 -63345778 -25325664
30968b5325664L3762276K0655745K0774956J1683375j2705341k0267087k195034
$$ -25325664 8436612 29092357 49867313 61550688 48845347 28578260 26383226
30961B6383226N005881j5771355k9353844q285261K0840849K2136081L439430
$$ 26383226 31389107 15617752 -13736092 -22021353 -1180504 20955577 24395007
30954B4395007o998508n944796n658089l191325Q805835J6684121J561371k6574517
$$ 24395007 17396499 11451703 5793614 2602289 11408124 28092245 29653616 3079099
30946C079099l5457872j1085272K5050490M1433036K9065739N294242r979971
$$ 3079099 -32378773 -43464045 -18413555 23019481 52085220 57379462 47399491
30939D7399491j5931607k4216676l4814586l2714280j3246548O452077J2837519
$$ 47399491 31467884 7251208 -27563378 -60277658 -73524206 -67072129 -54234610
30932e4234610J5219397K3191807K4036383O675223r089220K093037K8910687
$$ -54234610 -39015213 -15823406 8212977 14888200 5798980 7892017 36802704
30925C6802704L9388429K8505422J3539992p329920m5827795p7127280n7347243
$$ 36802704 76191133 104696555 118236547 110906627 65078832 -12048448 -69395691
30918f9395691K691017L6268292J4596849j1430758M927559L2300071J7972549
$$ -69395691 -66704674 -30436382 -15839533 -27270291 -22342732 9957339 27929888
30911B7929888k2838425l3296627o247453J1790939q24800j5252006p375566J1377263
$$ 27929888 5091463 -28205164 -34452617 -22661678 -23486478 -38738484 -46114050 -34736787
30903c4736787K6132234L6726654L3718729L4215m7768715o1098643k3996471
$$ -34736787 -8604553 28122101 61840830 61875045 14106330 -46992313 -70988784
30896g0988784J9360896K5563895O779983l206147n394722k0661587m1325799
$$ -70988784 -51627888 -26063993 -19284010 -22490157 -27884879 -48546466 -89872265
30889h9872265l9709266j5338874M561395R429367J6388491L3830124M3499450
$$ -89872265 -129581531 -144920405 -140359010 -130929643 -114541152 -80711028 -37211578
30882c7211578K8623423N61568j2454800M692983L6031799M3316356M825593m7484864
$$ -37211578 -8588155 -8026587 -20481387 -15788404 20243395 63559751 68385344 20900480
30874B0900480n2159298L055791N4614348M4852684R5815j7506018p698129j7036000
$$ 20900480 -31258818 -28203027 26411321 71264005 71359820 53853802 46155673 29119673
30866B9119673m1558434k6065983L0267347N2343108N609084m4495160l8054274
$$ 29119673 -12438761 -38504744 -8237397 44105711 49714795 5219635 -32834639
30859c2834639j2256492k2070742l5763421L490181N9667145M9785542j4570942
$$ -32834639 -45091131 -67161873 -102925294 -99435113 -39767968 10017574 -4553368
30852d553368l7573645P344892L7935141J597317m1957253k3016388L0317334
$$ -4553368 -42127013 -34782121 3153020 4750337 -37206916 -60223304 -29905970
30845b9905970M6128153J5930413j2535871j3656300r23435J0509762J3991887
$$ -29905970 16222183 32152596 19616725 5960425 5036990 15546752 29538639
30838B9538639K805697j5315944j7343873n346588j5021808n2428710o3079393
$$ 29538639 32344336 17028392 -315481 -5662069 -20683877 -73112587 -136191980
30831a36191980j0251054N3482378N2396609r81961k6960256K225517L4255076
$$ -136191980 -146443034 -92960656 -40564047 -41546008 -68506264 -66280747 -32025671
30824c2025671K9215266J1383342J0347261J0491432r410492l1374361k8837591
$$ -32025671 -2810405 8572937 18920198 29411630 20001138 -11373223 -40210814
30817d0210814j0940810j963137J131153J6742449L7427101L3822527o64308l4480365
$$ -40210814 -51151624 -53114761 -51983608 -35241159 2185942 36008469 35344161 863796
30809H63796l5670697j0801334N745909k656556j4170291j985714K3190164K6409496
$$ 863796 -34806901 -45608235 -39862326 -42518882 -56689173 -58674887 -35484723 -9075227
30801i075227K760279j1759126M641911K4821067J6702110n876400r000177O270729
$$ -9075227 -6314948 -18074074 -13432163 11388904 28091014 22214614 13214437 19485166
30793A9485166J2465774M210094j104865p44782o069732j3398449j3257643j7015055
$$ 19485166 31950940 36161034 35056169 34311387 28241655 14843206 1585563 -15429492
30785a5429492l2914407l1625184J1925354N6847182M1859403j3316183k7704152
$$ -15429492 -48343899 -79969083 -68043729 -11196547 30662856 17346673 -10357479
30778a0357479J3735410L6461899K064318l0506422j1646745J5826552J798290
$$ -10357479 3377931 39839830 41904148 11397726 -249019 15577533 17375823
30771A7375823j8132147P725469M4870487K8025566k3836093l8947731j1656661
$$ 17375823 -756324 6969145 51839632 79865198 56029105 17081374 5424713
30764E424713L44160j8103796k5020568p561958J400101m393887M843410K5550660
$$ 5424713 5768873 -12334923 -37355491 -44917449 -43517348 -47911235 -43067825 -17517165
30756a7517165J9305133r353983j0305757K3224782L9633972J9320420J333644
$$ -17517165 1787968 -7566015 -17871772 5353010 44986982 64307402 65641046
30749F5641046O6064j9161998n2760618l9719911K5489993N4525888K794511m4218477
$$ 65641046 65707110 46545112 -6215506 -45935417 -20445424 34080464 36874975 -7343502
30741g343502n257703N6207658L1012042n4910637p9344752j4865102M1042800
$$ -7343502 -12601205 43606453 74618495 19707858 -59636894 -74501996 -33459196
30734c3459196K7081523m548435L276384K4474689J3701727j5054524k2857178
$$ -33459196 -6377673 -10926108 -7649724 16824965 30526692 15472168 -7385010
30727g385010q626398N048144J2552132J7824112J5329026L965734n598503j3543991
$$ -7385010 -16011408 -10963264 1588868 19412980 34742006 38707740 33109237 19565246
30719A9565246l1108521m6263179k7032428K3338115N4270904L5339987j036224
$$ 19565246 -11543275 -57806454 -84838882 -61500767 -7229863 28110124 27073900
30712B7073900j2588508o776662j1620789j8791311j826009K7235073K8482738
$$ 27073900 14485392 7708730 -3912059 -22703370 -24529379 2705694 31188432
30705C1188432j786025k2525015j1920858k54138j8114859m2534937k8124814
$$ 31188432 29402407 6877392 -5043466 -5297604 -23412463 -65947400 -94072214
30698i4072214K2147295N5968387M5155885K1659762J9544368J7308187k0227745
$$ -94072214 -71924919 -15956532 29199353 50859115 70403483 87711670 67483925
30691F7483925o6804494o0682265k110989L9965187L1558538J5292322K0763044
$$ 67483925 679431 -60002834 -62113823 -22148636 9409902 24702224 45465268
30684D5465268R496964l8573634n9037184l316767N6916168K7411861m9660473
$$ 45465268 54962232 16388598 -42648586 -45965353 10950815 38362676 -11297797
30677a1297797n3074124K1328422N3839166l67336m2277696k408604M4572654
$$ -11297797 -64371921 -43043499 10795667 10428331 -31849365 -34257969 10314685
30670A0314685J3422381m9274380n1229622m539922J2928533o907207p859737
$$ 10314685 23737066 -25537314 -76766936 -81306858 -68378325 -75285532 -83145269
30663h3145269J9796983K9219873N573520j5908516j5879387p242317Q929516
$$ -83145269 -63348286 -34128413 -28554893 -44463409 -60342796 -67585113 -58655597
30656e8655597M0533575O1802008L5476437k0700006m5506185j7233354K3005512
$$ -58655597 -18122022 43679986 79156423 58456417 12950232 -4283122 18722390
30649A8722390L4353376J7906502p512964k8586066l1481349r980329J5207370
$$ 18722390 53075766 70982268 63469304 34883238 3401889 -6578440 8628930
30642H628930J5368945p524606k6597565k7699092j5897261K698007J8467265
$$ 8628930 23997875 16473269 -10124296 -37823388 -53720649 -51022642 -32555377
30635c2555377J5191362k285553j625434K3905926K9497909j0862541m6113639
$$ -32555377 -17364015 -19649568 -21275002 2630924 32128833 21266292 -24847347
30628b4847347j9360297L5727965M1529991m081413l4350402k5826132j8045275
$$ -24847347 -44207644 -8479679 33050312 28968899 -5381503 -31207635 -49252910
30621d9252910k2900078m459646L6527566M4540880K683931l3670752k8636474
$$ -49252910 -72152988 -76612634 -40085068 4455812 7139743 -26531009 -55167483
30614e5167483j7486010k9019745k8635528J1280331M7104956K9682313j2814852
$$ -55167483 -72653493 -101673238 -130308766 -119028435 -71923479 -42241166 -55056018
30607e5056018j8613597J3284196K9726243N834875k7514323l0885667J574463
$$ -55056018 -73669615 -60385419 -30659176 -24824301 -52338624 -83224291 -81649828
30600h1649828M0661398M6041662O831679l3722678k2049298K9464536M9664034
$$ -81649828 -40988430 5053232 11884911 -21837767 -43887065 -14422529 35241505
30593C5241505P197447m3843263m2556237j289036K6879649K2655812M591925
$$ 35241505 42438952 -1404311 -43960548 -45249584 -18369935 4285877 8877802
30586H877802j1806027k2635406k4199105j9820436j8489420j3091792R779425
$$ 8877802 -2928225 -25563631 -49762736 -69583172 -88072592 -101164384 -91384959
30579i1384959L0710118J4993314j8573874q414563M5211828N9114957l810466
$$ -91384959 -60674841 -45681527 -64255401 -72669964 -27458136 31656821 27846355
30572B7846355n8959180k2319779N5698239O5944730M056711l8604301k1850081
$$ 27846355 -31112825 -53432604 2265635 68210365 72267076 33662775 11812694
30565A1812694M514296K948935m608911k275477r668070k5468779j3338314L0706237
$$ 11812694 16326990 19275925 14667014 12391537 2723467 -22745312 -36083626 -5377389
30557e377389N8171112M0817327R639060k402453n309813j5376575k2500065k0525466
$$ -5377389 52793723 93611050 103250110 100847657 95537844 80161269 57661204 37135738
30549C7135738k5137001l5482684k2994075J3237842K6409839o736032l8017436
$$ 37135738 11998737 -23483947 -46478022 -33240180 -6830341 -13566373 -51583809
30542e1583809j6265677L1379585L9227127K058750k1712264o71626K8151884
$$ -51583809 -67849486 -36469901 2757226 4815976 -16896288 -17567914 10583970
30535A0583970K0051003j4870543l1919457j2165346J9857443L0952712J4758231
$$ 10583970 30634973 15764430 -16155027 -28320373 -8462930 22489782 37248013
30528C7248013q982806k0483480j7875212j1158181p406526p484081j0586334
$$ 37248013 28265207 7781727 -10093485 -21251666 -28658192 -36142273 -46728607
30521d6728607j2986272p065269P915263J8550579J3572854L551715Q270716K5445585
$$ -46728607 -59714879 -66780148 -58864885 -40314306 -26741452 -23189737 -14919021 10526564
30513A0526564L0423571J1125517j3871825k0294393q044789K947260k545802
$$ 10526564 40950135 52075652 38203827 17909434 9864645 12811905 10266103
30506A0266103k1970431l9195810l6361144r359503K3177213L4058583J6644424
$$ 10266103 -11704328 -50900138 -87261282 -96620785 -73443572 -39384989 -22740565
30499b2740565o709692j1047826K538380J1899895L566360j1248111j2361746
$$ -22740565 -29450257 -40498083 -37959703 -26059808 -22493448 -33741559 -46103305
30492d6103305K651570J3221478k29399k9858601m4574612k4140880J4815568
$$ -46103305 -43451735 -30230257 -30459656 -60318257 -104892869 -129033749 -114218181
30485a14218181L3441167J3404615j9219838k0753604J6017418M5493038K3399329
$$ -114218181 -80777014 -67372399 -86592237 -107345841 -91328423 -45835385 -22436056
30478b2436056k8609564m2319975M433432N1193223L8935452m127633q743337
$$ -22436056 -51045620 -93365595 -88932163 -37738940 1196512 -2931121 -11674458
30471a1674458K7506491M2717914J4890113r232935l898326q543901m7050252
$$ -11674458 15832033 58549947 73440060 64207125 60308799 51764898 4714646
30464D714646p1177058l7993857J1837192J6941965p021683l252389K4563862
$$ 4714646 -66462412 -104456269 -92619077 -75677112 -82698795 -85951184 -61387322
30457f1387322K4101131q890942k4375162o390240O354953m935452j3914414j1190907
$$ -61387322 -37286191 -46177133 -70552295 -76942535 -70587582 -75523034 -89437448 -100628355
30449a00628355k2225873m1983314k1188040M7052761Q9576615N0375437k2848973
$$ -100628355 -122854228 -164837542 -186025582 -138972821 -49396206 979231 -21869742
30442b1869742m3159454j391298L6028631K5274976j1795522l5063113l0857210
$$ -21869742 -65029196 -66420494 -30391863 -5116887 -16912409 -51975522 -82832732
30435h2832732p090476K1523380L7337183L1864357J6570592O027468l240419
$$ -82832732 -89923208 -68399828 -31062645 801712 17372304 23399772 20159353
30428B0159353j8199082k4250462l238910K7151361K5476087j3043853l8800004
$$ 20159353 1960271 -22290191 -25529101 1622260 27098347 14054494 -24745510
30421b4745510j2093004L5942175L8702621j3835468n3494312k1236546M9738418
$$ -24745510 -36838514 -896339 37806282 23970814 -29523498 -50760044 -1021626
30414a021626P1772740J6354123m9154904n1029257r02624L0956795J2087465
$$ -1021626 70751114 87105237 37950333 -13078924 -13981548 16975247 29062712
30407B9062712k0397965k0255885J0161614L2061098J8798180j8465164m3960860
$$ 29062712 8664747 -11591138 -1429524 30631574 49429754 30964590 -12996270
30400a2996270l2702723J868327K1025000Q336544r464887k672630J8013264K1096279
$$ -12996270 -45698993 -43830666 -22805666 -14469122 -23934009 -26606639 -8593375 12502904
30392A2502904K020734j7003524k3247858j9237018l324078K1658389L0950084
$$ 12502904 14523638 -2479886 -25727744 -44964762 -48288840 -26630451 4319633
30385D319633Q056108j7053650n544085K2263144J3350939k3352392j8797050
$$ 4319633 12375741 -4677909 -10221994 12041150 25392089 2039697 -16757353
30378a6757353L9944323O9688805J3278183o2232411n6680085J6977617N5894146
$$ -16757353 23186970 92875775 106153958 43921547 -12758538 4219079 60113225
30371F0113225J8133294l0068417k4574131J1305990K1157306J607447q690098
$$ 60113225 78246519 48178102 23603971 34909961 56067267 57674714 48984616
30364D8984616L240953J1598566j462705k0228386k2034036q252457J547312l474868
$$ 48984616 52225569 63824135 62361430 42133044 20099008 11846551 13393863 9918995
30356I918995j3631723j1487600Q628849L3306945L9950252J6746109k2658596
$$ 9918995 -3712728 -15200328 -6571479 26735466 66685718 83431827 60773231
30349F0773231m7052756l7656239r007723R078139P460799j93456r286695l0331894
$$ 60773231 13720475 -23935764 -32943487 -23865348 -16404549 -16598005 -25884700 -56216594
30341e6216594n2890231l7844163K4805947P8194578O2323742J008402k4925096
$$ -56216594 -109106825 -146950988 -122145041 -43950463 18373279 19381681 -5543415
30334e543415J0001735M3434997J9419664l4208815n2596650k2104236J5025727
$$ -5543415 4458320 47893317 67312981 33104166 -19492484 -41596720 -26570993
30327b6570993K3985709J0286117l720950p692757n982040n615191n762326R59224
$$ -26570993 -2585284 7700833 3979883 -3712874 -9694914 -15310105 -21072431 -20113207
30319b0113207J3468061J6169007J344900j1755595k428206J5137991J0743080
$$ -20113207 -6645146 9523861 10868761 -886834 -3315040 11822951 22566031
30312B2566031j2080443k1709779j2802230j2497211k6415865k4705681L441340
$$ 22566031 10485588 -11224191 -24026421 -36523632 -62939497 -87645178 -84203838
30305h4203838K6435647K1442311O359189j53593o448095j3624064k915148J5774933
$$ -84203838 -57768191 -36325880 -29966691 -30120284 -36568379 -50192443 -53107591 -37332658
30297c7332658j186835n0884806o0024668N725889O9025924M8452525j3290546
$$ -37332658 -38519493 -89404299 -149428967 -143703078 -74677154 -26224629 -39515175
30290c9515175j6424051L7572580N5467061O067247l8874967k6826070P383136
$$ -39515175 -55939226 -18366646 37100415 43167662 4292695 -22533375 -15150239
30283a5150239J9902246K0078304K1118832L601207l2037742m2492135j3528868
$$ -15150239 4752007 24830311 45949143 49550350 17512608 -24979527 -38508395
30276c8508395N251530j7236499l4265885K487425N8073589O6146499K7288871
$$ -38508395 -33256865 -50493364 -84759249 -82271824 -24198235 41948264 69237135
30269F9237135n531148j0498187o187952k95643J1166068R592948k2809808n5572926
$$ 69237135 63705987 53207800 47019848 46724205 57890273 67483221 44673413 -10899513
30261a0899513m2403428M748328K9107144J3746427l370510j140519l332731k2185479
$$ -10899513 -53302941 -48554613 -19447469 -5701042 -9071552 -10212071 -13544802 -35730281
30253c5730281k8976836l322429L2046810M7460018L9966675J5803686j9005475
$$ -35730281 -64707117 -68029546 -35982736 11477282 51443957 67247643 48242168
30246D8242168l6193524m132794M8434446M4842706k7115186p5011670k8934939
$$ 48242168 12048644 7915850 56350296 101193002 74077816 -933854 -29868793
30239b9868793M6585397M4582382k1387429m3709863M226133K9157938k2996505
$$ -29868793 16716604 61298986 39911557 -3798306 427827 29585765 6589260
30232F589260p3371644l5229421M6239871O1547248j130444m9016147k5046024
$$ 6589260 -66782384 -102011805 -55771934 5775314 4644870 -44371277 -69417301
30225f9417301K5376955L7619488J2236129r774504j0691775l715199k431172
$$ -69417301 -44040346 -6420858 5815271 -3959233 -14651008 -18366207 -20797379
30218b0797379q514674j7267924k0428878j2809362j990865P31551L4274R498855
$$ -20797379 -29312053 -46579977 -67008855 -79818217 -81809082 -81077531 -81043257 -71544402
30210g1544402K3792348K1088423k24415j1487095O194314L1510821K9626972
$$ -71544402 -47752054 -26663631 -26888046 -38375141 -32180827 -670006 28956966
30203B8956966k857605l4791517l6033341p071103K1666148J7385209j9533567
$$ 28956966 26099361 -8692156 -44725497 -51796600 -30130452 -12745243 -32278810
30196c2278810m8376348l0368737K2845871O1253631N6775467K8311375M219253
$$ -32278810 -80655158 -111023895 -88178024 -26924393 29851074 58162449 62381702
30189F2381702j0768318k0476044j9100592p211310j575444q304993q447126P751089
$$ 62381702 51613384 31137340 12036748 4825438 3249994 -5054999 -13502125 -5751036
30181e751036J5824419n032464k9214999j5882932K6867050M6008727J4162058
$$ -5751036 10073383 5040919 -24174080 -40057012 -13189962 32818765 46980823
30174D6980823l3242773m0903390K883857N3279276N4202472j331550n6464355
$$ 46980823 13738050 -27165340 -24281483 28997793 83200265 81868715 25404360
30167B5404360n1705259j766050K0478977j1259239l3907057O960659O2913123
$$ 25404360 -26300899 -28066949 -7587972 -18847211 -52754268 -45793609 17119514
30160A7119514N0741353j4681214l8708473N009027L4444906o704251n8613015
$$ 17119514 67860867 53179653 14471180 19480207 53925113 47220862 -11392153
30153a1392153m2476257J6520379L3567136p826073m5768826m0432584j5737404
$$ -11392153 -53868410 -37348031 -3780895 -11606968 -57375794 -97808378 -113545782
30146a13545782j454493O313645J5735901J8147811J2167527J3074002K4730183
$$ -113545782 -115000275 -108686630 -92950729 -74802918 -62635391 -49561389 -24831206
30139b4831206L1583249K7174402K1282932J2952357j0081313l6755470l4374867
$$ -24831206 6752043 33926445 55209377 68161734 58080421 21324951 -13049916
30132a3049916j05417K4268312R143894k2919169l5894233k8141707j6264305
$$ -13049916 -13155333 11112979 20256873 -2662296 -38556529 -66698236 -82962541
30125h2962541j242783J8300678K5067292R911620j805568J3214813L2381135
$$ -82962541 -84205324 -65904646 -40837354 -30925734 -32731302 -19516489 12864646
30118A2864646J9300369j5638147k9235703j0057984J4034641K6112303L2764238
$$ 12864646 32165015 16526868 -12708835 -22766819 -8732178 17380125 50144363
30111E0144363K9445205J557425l5572997m4911743k4590335j1128783j6320936
$$ 50144363 79589568 81146993 45573996 662253 -23928082 -35056865 -51377801
30104e1377801j0141960J8308227L4875025J9079603j331459l586781p525720
$$ -51377801 -61519761 -43211534 -8336509 10743094 9411635 5824854 -1700866
30097a700866k4800159k2671016J3880899L3054325q743500o1487709m4943837
$$ -1700866 -26501025 -49172041 -35291142 -2236817 -10980317 -72468026 -117411863
30090a17411863K4695995N1376384O76235n2565594l6909763K0767366M7100672
$$ -117411863 -92715868 -41339484 -40663249 -93228843 -130138606 -109371240 -62270568
30083f2270568K2667883r736441j2670889O157919J6328716M851509j2082881
$$ -62270568 -39602685 -49339126 -62010015 -55852096 -39523380 -34671871 -46754752
30076d6754752j4323049p358666j1286520k0296816l794219L6908881N0548882
$$ -46754752 -61077801 -68436467 -79722987 -100019803 -103814022 -66905141 -16356259
30069a6356259Q043442m1088501l1530456K3291904N3295503L2024508k587390
$$ -16356259 -8312817 -49401318 -80931774 -57639870 -4344367 27680141 25092751
30062B5092751j8634511k1268123j4201972R748166L2614004K2025555j0706955
$$ 25092751 6458240 -14809883 -29011855 -19263689 13350315 35375870 24668915
30055B4668915j5348369K1756569N5908037N0166232J6296094k0434086m8739128
$$ 24668915 9320546 31077115 86985152 137151384 153447478 133013392 84274264
30048H4274264n3655444k2132667K1359622L3073062J2649541j560212j121132
$$ 84274264 30618820 8486153 29845775 62918837 75568378 74008166 72887034
30041G2887034j1558829k6826187j2375461J8265393J1421289k6058906k3873561
$$ 72887034 61328205 34502018 22126557 40391950 51813239 25754333 1880772
30034A880772K6818663M3452431q845733m8553009j2156720L7485381J9316375
$$ 1880772 28699435 72151866 63306133 14753124 2596404 40081785 59398160
30027E9398160l1438324l1776104J0774457K7326378P356910n791526l160770
$$ 59398160 27959836 -3816268 6958189 34284567 41641477 35849951 32689181
30020C2689181p489485j3302726n118269M29508j857277K6995980Q4152689P6164606
$$ 32689181 25199696 11896970 6778701 7208209 5350932 32346912 116499601 192664207
30012A92664207m2256285j49301025j04896257L2915197Q5703526J6690635m2552402
$$ 192664207 150407922 1106897 -103789360 -70874163 14829363 31519998 -11032404
30005a1032404j8997917J3738719k236879j5827407J2797647L2907525N512852
$$ -11032404 -30030321 -16291602 -18528481 -34355888 -21558241 11349284 16862136
29998A6862136k6638625k6977212k0981360j7860137J6748724O4120730M5066866
$$ 16862136 -9776489 -36753701 -57735061 -75595198 -58846474 5274256 50341122
29991E0341122l5517382o0020285J5559596P3290326K1941975n0740897l0375892
$$ 50341122 14823740 -45196545 -29636949 43653377 65595352 14854455 -15521437
29984a5521437L1653518J9121017m2782819l9066518L1432169O2007961K2659565
$$ -15521437 16132081 35253098 -7529721 -46596239 -15164070 46843891 69503456
29977F9503456j0400950m790031j1002879l9097426k8131741L0141113N4067093
$$ 69503456 59102506 54312475 43309596 4212170 -23919571 6221542 60288635
29970F0288635L601233m9976449l8392540K467379M532911k4561396k8602198
$$ 60288635 63889868 13913419 -24479121 -22011742 -17478831 -42040227 -70642425
29963g0642425M733397L6206156L7907819K0679692Q309158J0197118J4964809
$$ -70642425 -65909028 -29702872 8204947 28884639 37193797 47390915 62355724
29956F2355724L433233k3701948l7663504j9163796R257882J5813859O720383
$$ 62355724 65788957 42087009 4423505 -14740291 -5482409 10331450 17051833
29949A7051833L673936n385356m1097027p2885562m8699700J6000978M6360607
$$ 17051833 20725769 15340413 -25756614 -98642176 -147341876 -131340898 -84980291
29942h4980291J7460953j0431200J0360730M3868754L3614286j2785651m3904819
$$ -84980291 -67519338 -77950538 -67589808 -23721054 9893232 -2892419 -46797238
29935d6797238l5003970j819567K9277951L5187909N372313l6203281m1853483
$$ -46797238 -81801208 -83620775 -54342824 -19154915 -13782602 -49985883 -91839366
29928i1839366L420771N7508006P1437220M1430969k673886l2930515l3902712
$$ -91839366 -88418595 -30910589 40526631 81957600 79283714 46353199 12450487
29921A2450487r678358O218988j6522258n0767320l6415596K3662379M9885141
$$ 12450487 2772129 8991117 -7531141 -58298461 -94714057 -71051678 -21166537
29914b1166537J521976n4562787m2703946R317876K6185169R123250J7904195
$$ -21166537 -19644561 -74207348 -116911294 -107593418 -81408249 -72284999 -54380804
29907e4380804N1747365M3476677k1635450o9574512m8156613j119559Q517177
$$ -54380804 -2633439 40843238 19207788 -50366724 -98523337 -99642896 -91125719
29900i1125719r029949m290268K5221247L7267234J5369554r983077q870534J1715693
$$ -91125719 -100155668 -104445936 -79224689 -41957455 -26587901 -36570978 -45441512 -33725819
29892c3725819K3667131J1721007j2358932k2886592r113228R520112P114855
$$ -33725819 -10058688 1662319 -10696613 -33583205 -42696433 -33176321 -26061466
29885b6061466j1405380j4855753R312666L5029821L0897720k847286l7957537
$$ -26061466 -37466846 -52322599 -43009933 -7980112 22917608 20070322 -17887215
29878a7887215m5264498j6442159K5121699L7772465P232634k7076907k0150096
$$ -17887215 -63151713 -79593872 -54472173 -16699708 -9467074 -36543981 -56694077
29871e6694077J3105784K2525559O487630J1771537M2014174L7993379k0166621
$$ -56694077 -43588293 -21062734 -14575104 -2803567 39210607 77203986 57037365
29864E7037365o2880919l4610917J6303984J7628778j1939568q043145K2223529
$$ 57037365 -5843554 -40454471 -24150487 -6521709 -18461277 -26504422 -4280893
29857d280893K0421293j2012095j8822869N446216J0083205j2059011j3660432
$$ -4280893 16140400 4128305 -14694564 -9248348 834857 -11224154 -24884586
29850b4884586J1752082J7973550j03657O52038J2890798j5805741n9452184k7057753
$$ -24884586 -13132504 4841046 4737389 5389427 18280225 2474484 -56977700 -84035453
29842h4035453O1588606O7074998k7185624l3727041J41875404K81030715J33862845
$$ -84035453 -22446847 44628151 17442527 -16284514 125590890 406621605 540484450
29835E40484450j82559955l11636101j49252825M3120291M6729116m0345779l6480543
$$ 540484450 357924495 46288394 -102964431 -59844140 -13115024 -53460803 -89941346
29828h9941346L1533863L2136323k3589409k3567000L5799244N5135743J2761479
$$ -89941346 -58407483 -26271160 -49860569 -73427569 -37628325 17507418 30268897
29821C0268897j2561870P626861J3069195j8895430k8141586J2663036L7493642
$$ 30268897 17707027 25333888 38403083 19507653 -8633933 4029103 41522745
29814D1522745o288790o6175464o0982717J86779L9183022K4677341N149276K3419235
$$ 41522745 35233955 -30941509 -91924226 -91737447 -52554425 -27877084 -22727808 691427
29806F91427M9267633K7378812l3021976o1330589k4301220K2754313J6732963
$$ 691427 49959060 77337872 44315896 -17014693 -41315913 -18561600 -1828637
29799a828637j7334009q655060M0823593N7402215J9545901o442122J4246651
$$ -1828637 -19162646 -27817706 13005887 70408102 89954003 83511881 97758532
29792I7758532J9883449l3305449p4757542k7425154N0877982M4023842m0532011
$$ 97758532 117641981 84336532 9578990 -17846164 33031818 77055660 36523649
29785C6523649q5002704m5419707n07844k877535l644505L2146431M7400564r77589
$$ 36523649 -48479055 -93898762 -94406606 -97284141 -100928646 -68782215 -21381651 -22359240
29777b2359240m9680827k7236344K4750419K1063385k6194125l4760278P922548
$$ -22359240 -72040067 -99276411 -74525992 -53462607 -79656732 -114417010 -106494462
29770a06494462L2187576Q140029j4210454q43966J4529068L881522k016359K4664459
$$ -106494462 -74306886 -66166857 -80377311 -81221277 -66692209 -62810687 -64827046 -40162587
29762d0162587N0959471L5670331j513730j3953165k513085m540433k4178302
$$ -40162587 10796884 46467215 44953485 31000320 28487235 23946802 -231500
29755b31500k4953580P806302L9985995L5758486K598185k4789517k7316520j5202971
$$ -231500 -25185080 -17378778 22607217 58365703 60963888 36174371 8857851 -6345120
29747f345120p884788j0098058q571973P148041K4289674K0083116k725078j4313355
$$ -6345120 -14229908 -24327966 -32899939 -25751898 -1462224 18620892 15895814 1582459
29739A582459k433783N929485j1289581k9783830j4122997K3876373M2106663
$$ 1582459 -851324 5078161 -6211420 -35995250 -50118247 -26241874 15864789
29732A5864789L2429445K2673750J8124544p685804n4677512p9129431n5704679
$$ 15864789 48294234 70967984 89092528 81406724 26729212 -52400219 -108104898
29725a08104898j4222294Q554558J4099045J4651301K909209j8196291j5305173
$$ -108104898 -122327192 -113772634 -99673589 -85022288 -82113079 -100309370 -115614543
29718a15614543K5381832O1260229M9553693J0736078r769838j4016438l1579416
$$ -115614543 -90232711 -28972482 20581211 31317289 21547451 7531013 -24048403
29711b4048403n0157213k9118648K4836780N5448103L4648035o756273l0500209
$$ -24048403 -74205616 -103324264 -78487484 -23039381 11608654 4852381 -25647828
29704b5647828k8477239p147370K0527190K5553609q694421m6498799l6788889
$$ -25647828 -54125067 -61272437 -40745247 -15191638 -23886059 -70384858 -107173747
29697a07173747P407803K1553651r877153k6625992J1489355O0373795N8755651
$$ -107173747 -99765944 -78212293 -88089446 -114715438 -103226083 -42852288 15903363
29690A5903363J2879951k5746620l1945102j7111608M950838K4749169K7770520
$$ 15903363 28783314 3036694 -28908408 -46020016 -41069178 -16320009 11450511
29683A1450511J0337620o999529m551085R807151J4903755L374086j6917040l2634301
$$ 11450511 21788131 14788602 10237517 20044668 34948423 38322509 21405469 -11228832
29675a1228832k9265940n061504J6266544J0875150p658655p506231O915623J937652
$$ -11228832 -40494772 -45556276 -29289732 -18414582 -26073237 -33579468 -26663845 -24726193
29667b4726193k1260225k1215883J1718688L2317736J3891430p839245K005769
$$ -24726193 -45986418 -67202301 -55483613 -23165877 -9274447 -17113692 -15107923
29660a5107923J8126431J140942l4721929m4986450k0168083J1651676K7771358
$$ -15107923 3018508 4159450 -30562479 -75548929 -95717012 -84065336 -56293978
29653e6293978K4725661P903912p057469j360847J9917571K9816125J9231218
$$ -56293978 -31568317 -23664405 -30721874 -32082721 -12165150 17650975 36882193
29646C6882193M323487j1334513l8042329n5954214k7986309K5977835L5115224
$$ 36882193 41205680 29871167 -8171162 -64125376 -92111685 -66133850 -31018626
29639c1018626j2306891l7547753N728821N1712722K7916899k7205849l0005238
$$ -31018626 -43325517 -80873270 -75144449 -23431727 4485172 -22720677 -52725915
29632e2725915J7229807M4603419K7702093J477829j3430325k4194539k5347182
$$ -52725915 -35496108 9107311 36809404 38287233 24856908 662369 -24684813
29625b4684813r342810L452590L3244O802815L1782700K4679769l5587895p1053104
$$ -24684813 -34027623 -30575033 -30541789 -23738974 8043726 32723495 -2864400 -73917504
29617g3917504j3574381O9700042O8718456L378892k1982513l215168k8097680
$$ -73917504 -87491885 -17791843 50926613 54305505 32322992 29107824 1010144
29610A010144r1986964q3017102J9635111Q7630643M3233217k0781083j780046
$$ 1010144 -90976820 -173993922 -154358811 -66728168 -23494951 -44276034 -46056080
29603d6056080N1486481L8070146k6871764n1343880j3505905L0612750M6456914
$$ -46056080 5430401 43500547 16628783 -34715097 -48221002 -17608252 28848662
29596B8848662M1187937J4119379l6068098p4738637o5837364k5963259N686215
$$ 28848662 70036599 84155978 48087880 -26650757 -92488121 -118451380 -112765165
29589a12765165K5743634M7263260N4145970K9343011j96564k876856p06420l0168460
$$ -112765165 -87021531 -39758271 14387699 43730710 43534146 40657290 39950870 9782410
29581I782410o8144916o0138930q665413K9070642K6275343J0091171M11798j5200551
$$ 9782410 -58362506 -118501436 -127166849 -98096207 -71820864 -61729693 -61317895 -76518446
29573g6518446l4957212k6547383J8907556N8149919M9872812J0251946j3471660
$$ -76518446 -111475658 -138023041 -119115485 -60965566 -11092754 -840808 -14312468
29566a4312468p590695j685796j8529330m0113290l4132778q1382K9377660L1567752
$$ -14312468 -21903163 -23588959 -42118289 -82231579 -116364357 -116445739 -87068079 -55500327
29558e5500327J8313637R229574J716837j3672895k6526054k2602727j3476257
$$ -55500327 -37186690 -27957116 -26240279 -39913174 -66439228 -89041955 -102518212
29551a02518212j8428345k5813967p848319L0798864N6051986N3844602L8952697
$$ -102518212 -120946557 -146760524 -154608843 -123809979 -67757993 -13913391 25039306
29544B5039306J7910828j3286756l5541827k1487502J0179091R447985k3936305
$$ 25039306 42950134 29663378 -5878449 -27365951 -17186860 -7738875 -31675180
29537c1675180l3063747J072413K0191045j7257337n9687683l4384269M3113995
$$ -31675180 -64738927 -63666514 -43475469 -60732806 -120420489 -154804758 -111690763
29530a11690763Q9425948O2037249k599311m7429585m8597705j7766617J4158664
$$ -111690763 -22264815 39772434 37173123 -10256462 -58854167 -76620784 -62462120
29523f2462120J8456122k205563j2952580P119870L2907703K8060803m539422
$$ -62462120 -44005998 -46211561 -59164141 -52044271 -19136568 8924235 4384813
29516D384813l0620711k9788053j0785184P762309J2579487J097705j3208860
$$ 4384813 -26235898 -56023951 -66809135 -59046826 -46467339 -45369634 -58578494
29509e8578494j0645041Q391566J9162332M212746k3696609l7660306k3377638
$$ -58578494 -69223535 -60831969 -41669637 -37456891 -61153500 -98813806 -122191444
29502a22191444J1855493M2233230L9866513Q010999j1594089Q393965L5286221
$$ -122191444 -110335951 -68102721 -28236208 -20225209 -31819298 -23425333 11860888
29495A1860888K2523961j3718520j7841791J2558615K1746104j0479587l6610215
$$ 11860888 34384849 20666329 2824538 15383153 37129257 26649670 -9960545
29488i960545k0699398J1628368K4278398J5289420q222514m1163775n1857183
$$ -9960545 -30659943 -19031575 5246823 20536243 12313729 -28850046 -80707229
29481h0707229r800267M3152060K9890952l2815076l9008974L5237861P4864329
$$ -80707229 -90507496 -47355436 -17464484 -50279560 -89288534 -54050673 20813656
29474B0813656N478969p8687038o0949217J7805026M0851737L955402o889455
$$ 20813656 26292625 -52394413 -113343630 -95538604 -54686867 -50731465 -57620920
29467e7620920K3583779L4540676J7884636K2436055L8764811N409273o3523483
$$ -57620920 -34037141 503535 18388171 40824226 79589037 84998310 21474827
29460B1474827p5928284q380263N1225549L7649506r328291k9607773k3806525
$$ 21474827 -54453457 -62833720 -11608171 26041335 16713044 -12894729 -36701254
29453c6701254j2910205N591945K2451057O218695l5014236m5337713r023147
$$ -36701254 -49611459 -44019514 -21568457 -15349762 -50363998 -95701711 -104724858
29446a04724858J7585190p49214j8994809P449099M4120095L7790364P121923
$$ -104724858 -87139668 -87888882 -106883691 -99434592 -55314497 -17524133 -10402210
29439a0402210P469190L4962432L1844716k0614675p0065145o2795716r324671
$$ -10402210 -2933020 32029412 63874128 43259453 -26805692 -89601408 -98926079
29432i8926079L4498891L3889092Q063818j295563J5725199K8520875J3643828
$$ -98926079 -64427188 -30538096 -22474278 -23769841 -8044642 20476233 34120061
29425C4120061j0643731j4270739N33633J0266341Q396173L981974k163926q998193
$$ 34120061 23476330 9205591 9739224 20005565 28401738 32383712 30219786 21221593
29417B1221593J99030K9533497M3596298R433036m7923587p3726010n5558947
$$ 21221593 21420623 50954120 94550418 103983454 56059867 -17666143 -73225090
29410g3225090k5459893l952795J2538982K1707653K0644402K7687496N0285731
$$ -73225090 -98684983 -102637778 -90098796 -68391143 -47746741 -20059245 30226486
29403C0226486N0004409k741833n9201588m8012843J2486506L6448633J568175
$$ 30226486 80230895 77489062 18287474 -29725369 -17238863 19209770 20777945
29396B0777945k6346583p812672J7701470J4556776L999330M081392p531269l4985575
$$ 20777945 -5568638 -13381310 4320160 18876936 22876266 26957658 19426389 -15559186
29388a5559186l8516357o021410J4731765m392113k2380468j621817K8834187
$$ -15559186 -54075543 -60096953 -45365188 -49757301 -72137769 -73759586 -44925399
29381d4925399K7774166O497508m915403o897637o597425M871365J6111867o071095
$$ -44925399 -17151233 -10653725 -15569128 -22466765 -29064190 -24192825 -8080958 -14152053
29373a4152053m5553326l2831557M0468262P8321828J7630779o3155767n7443816
$$ -14152053 -59705379 -92536936 -52068674 26253154 43883933 -19271834 -76715650
29366g6715650Q106914K6706809j5174196k9721027J9436006O4875112N0514869
$$ -76715650 -68608736 -41901927 -57076123 -86797150 -67361144 -2486032 48028837
29359D8028837Q436838r151006m833582p363225j7769949j7888384k226343K0343389
$$ 48028837 56465675 47314669 42481087 35117862 17347913 -540471 -2766814 17576575
29351A7576575L5110090K4675797j1676260m0883940k7973484J3689564L4818112
$$ 17576575 52686665 77362462 65686202 24802262 -3171222 10518342 45336454
29344D5336454J5190592j4578748k0127523k296192J7237363K2538090Q721441
$$ 45336454 60527046 45948298 25820775 23524583 40761946 63300036 72021477
29337G2021477j6130801k8766048j2127367J6301471J9468420q849568k9831247
$$ 72021477 55890676 27124628 14997261 31298732 50767152 41917584 12086337
29330A2086337r158627L3232728M1329956q064681o8201464o9386455l670605
$$ 12086337 2927710 36160438 77490394 69425713 1224249 -68162206 -71832811
29323g1832811N8751608N3716364J570690k9961790k2193439j4481661k2120203
$$ -71832811 -13081203 40635161 42205851 12244061 -9949378 -24431039 -46551242
29316d6551242r252056L6724986O4464239L1728679k6691257m9451168l3131320
$$ -46551242 -55803298 -19078312 45385927 77114606 50423349 972181 -32159139
29309c2159139j9925674k5385650k4715709K9656L4207549M6792475J6196070
$$ -32159139 -52084813 -77470463 -102186172 -102156516 -67948967 -21156492 -4960422
29302d960422m3503713p5965478l7852664L0398814M2093000q023026k2905469
$$ -4960422 -48464135 -124429613 -162282277 -131883463 -89790463 -97813489 -120718958
29295a20718958M7985025J14525660P3069603l3906399p8450844k9034105K7958482
$$ -120718958 -72733933 41791727 114861330 80954931 2504087 -26530018 1428464
29288A428464L1386903J0141060R60228p047888k4071803k8309228q935566J3326061
$$ 1428464 32815367 42956427 43916655 36868767 12796964 -15512264 -24447830 -11121769
29280a1121769K4908882L1270855K4165831j1143239n1205205n1015323j1787839
$$ -11121769 13787113 45057968 69223799 58080560 6875355 -44139968 -55927807
29273e5927807J9677239K2258904J7291504J4415838Q56945j3475998m306977
$$ -55927807 -36250568 -13991664 3299840 17715678 18572623 5096625 789648
29266G89648R981612j2291671n4752250n5767371j1994158J3044266J067431R710220
$$ 789648 10771260 -1520411 -56272661 -112040032 -124034190 -110989924 -109922493 -100212273
29258a00212273N9620190Q3191849L5664059k6469686l8044599k1397490k4448578
$$ -100212273 -40592083 42599766 78263825 51794139 13749540 -7647950 -32096528
29251c2096528l1695663j0626445J2404962P25280j7412792N22376K9508938K4106482
$$ -32096528 -63792191 -74418636 -62013674 -61288394 -78701186 -78178810 -48669872 -24563390
29243b4563390O381975K3667948N3535949L8589093j0309090l4038563k7633160
$$ -24563390 -18181415 5486533 59022482 97611575 87302485 53263922 25630762
29236B5630762l2477822m2989500j7968592K2528644J4498356l0275793k7249455
$$ 25630762 -6847060 -49836560 -67805152 -45276508 -30778152 -61053945 -88303400
29229h8303400L7317948P1069623K2678192l4702353k3547661K0736673K2817417
$$ -88303400 -50985452 20084171 42762363 8060010 -15487651 5249022 28066439
29222B8066439j0956854k1808724j375827J0502829r2543j5044619k7917091l6730232
$$ 28066439 17109585 -4699139 -6074966 4427863 4335320 -10709299 -38626390 -75356622
29214g5356622j8965052K9510896N7666869K3961365k5544113j3749382M6564761
$$ -75356622 -94321674 -64810778 -7143909 16817456 -8726657 -22476039 24088722
29207B4088722O4383428N071551o1094030o3107466j6857822J9665615K4707314
$$ 24088722 88472150 93543701 32449671 -30657795 -47515617 -27850002 -3142688
29200c142688J1991378o259989j9604604j2566494J1890322K5787633J5388452
$$ -3142688 8848690 2588701 -17015903 -29582397 -17692075 8095558 23484010
29193B3484010K67639o116911j9592577m2133653l5488154J9496864O9723040
$$ 23484010 23751649 17634738 -1957839 -44091492 -79579646 -60082782 9640258
29186I640258N0875319j5976301m7351928j3282045K8548358K4783933l835495
$$ 9640258 60515577 44539276 -2812652 -16094697 12453661 37237594 33402099
29179C3402099j0856312L855594Q340209n185837j8041622k2143765k2990613
$$ 33402099 22545787 26401381 34741590 29555753 11514131 -10629634 -33620247
29172c3620247j5580184P976786L0937218K5967505r36791j2907193K905536J4130851
$$ -33620247 -49200431 -41223645 -10286427 15681078 14744287 1837094 4742630 18873481
29164A8873481o042922l4214853k9895951M170014K7382279K1266635R877203
$$ 18873481 12830559 -21384294 -51280245 -47110231 -19727952 1538683 11415886
29157A1415886J3693695J5871432m805334l1211950k8904963K51477J8374669
$$ 11415886 25109581 40981013 36175679 4963729 -23941234 -23689757 -5315088
29150e315088P115321q873358n764486J675944j0392316k9214460k1817856J1257283
$$ -5315088 1800233 -7073125 -12837611 -11161667 -21553983 -50768443 -72586299 -61329016
29142f1329016L2313048J9974535l674566j0287541l043040P95291L190287J5113240
$$ -61329016 -29015968 -9041433 -12715999 -23003540 -26046580 -25251289 -22061002 -6947762
29134f947762K5609878J2010162j8750668k8418699J191664L8181043M1525673
$$ -6947762 18662116 30672278 11921610 -16497089 -15305425 22875618 64401291
29127F4401291J5834971j784750k275025j6298752n4659161p3051529k9808585
$$ 64401291 80236262 78451512 76176487 59877735 5218574 -67832955 -97641540
29120i7641540M1455742O2463353J3889626l7330599l0714630J0730590K8147126
$$ -97641540 -56185798 6277555 20167181 -17163418 -47878048 -37147458 -9000332
29113i000332J4990856Q838680J5736194J846378l7470621n6957724l0551181
$$ -9000332 5990524 14829204 30565398 32411776 -5058845 -62016569 -92567750
29106i2567750M745573N249969j4230664r880825K0043481L6780206K4405423
$$ -92567750 -87822177 -82572208 -96802872 -106683697 -86640216 -49860010 -25454587
29099b5454587R054847J0325652J0915670p848762k7106035j4230794K4501868
$$ -25454587 -16399740 -6074088 4841582 -3007180 -30113215 -44344009 -19842141
29092a9842141M3032856J4675002k7542107k9280342J2568580M1214143J4252470
$$ -19842141 23190715 37865717 10323610 -18956732 -6388152 34825991 49078461
29085D9078461l5980865m2213756P782472N3827274M1414026j2402688m8185213
$$ 49078461 13097596 -29116160 -21333688 32493586 73907612 61504924 13319711
29078A3319711l8223232q096187O629476J402753m215526j15099P50956j4907976
$$ 13319711 -24903521 -32999708 -26370232 -24967479 -29183005 -29298104 -28547148 -43455124
29070d3455124l2917390k2817398J7984267M9928428L8121448j497200k5407513
$$ -43455124 -76372514 -99189912 -81205645 -31277217 6844231 5347031 -20060482
29063b0060482j8717457n0750J7212754L2043276L1871873M784956k5394201k2378293
$$ -20060482 -38777939 -38828689 -21615935 10427341 42299214 47084170 21689969 -688324
29055f88324K065955L042096j6871047o885573L4300705L6069283k7858314p5924648
$$ -688324 1377631 4419727 -12451320 -19336893 14963812 51033095 23174781 -52749867
29047e2749867l6028481L7737432M7569550J707175j4448346J3624649J7056260
$$ -52749867 -88778348 -51040916 -3471366 -1764191 -16212537 -2587888 14468372
29040A4468372k5674562n0786764k1209882J6255187J7900593O427532Q710168
$$ 14468372 -11206190 -61992954 -83202836 -66947649 -49047056 -42619524 -33909356
29033c3909356L443654k3095756l3496337k935358K8646979K1533381L978366
$$ -33909356 -30465702 -53561458 -87057795 -89993153 -61346174 -39812793 -35834427
29026c5834427J7933231M1483185K9558643k617733n758721J6001520J3743277
$$ -35834427 -17901196 23581989 53140632 50522899 44764178 60765698 74508975
29019G4508975j9057715l4837870j1332082J6083703J4190088m115488j2292829
$$ 74508975 55451260 20613390 9281308 25365011 39555099 35439611 23146782
29012B3146782q323889l017874P97474K481476j533201p828534q429062n055319
$$ 23146782 14822893 11805019 12602493 15083969 13550768 5722234 -2706828 -7762147
29004g762147k863884N417314K5383668L7240794J6288391k5197834m7570664
$$ -7762147 -10626031 -5208717 20174951 57415745 73704136 48506302 935638
28997I35638l4589252m042853K7951382N5126402N6341885J1462142m9074067
$$ 935638 -33653614 -37696467 -9745085 45381317 101723202 113185344 64111277
28990F4111277o1375289j4791246K6667836J6232502j1146291l945288K2594675
$$ 64111277 2735988 -12055258 14612578 30845080 19698789 15753501 38348176
28983C8348176K0633150p047989j8357898o355499p07353m402935P598923K5204292
$$ 38348176 58981326 51933337 33575439 27219940 26512587 22109652 29708575 54912867
28975E4912867L723839n5691541q5575326m2330253L0101158O1451460M2195950
$$ 54912867 58636706 2945165 -82630161 -124960414 -94859256 -33407796 8788154
28968H788154J2667399k995789j0193819j1949376m987221J584013l737054j3160051
$$ 8788154 21455553 18459764 8265945 -3683431 -8670652 -7086639 -10823693 -23983744
28960b3983744j3329415r897588j3485904j4199107L018254K9947935M7889982
$$ -23983744 -37313159 -47210747 -60696651 -74895758 -71877504 -41929569 5960413
28953E960413N4019005M8876756J9178518l2373033o3242715m1630651j268610
$$ 5960413 59979418 108856174 128034692 95661659 32418944 -9211707 -10480317
28946a0480317N837195p034394J1251565N0817071M8257502j342006k5349147
$$ -10480317 -4643122 -11677516 -425951 50391120 98648622 97306616 71957469
28939G1957469P417330L2874408J581381l6498231k0666694J4283912J2754m5893899
$$ 71957469 79374799 112249207 113830588 77332357 56665663 70949575 70962329 25068430
28931B5068430n0234356o295313K1361478M319692j7482681j3030826J063796
$$ 25068430 -25165926 -31461239 -10099761 -5780069 -23262750 -36293576 -35229780
28924c5229780P607235J2679020J2506839p377489l0541183k1084703J4294572
$$ -35229780 -27622545 -14943525 -2436686 -9814175 -40355358 -61440061 -47145489
28917d7145489K9519323J3980808P580910K6520433L2092031k392656m4600024
$$ -47145489 -17626166 -3645358 3935552 30455985 62548016 60155360 15555336
28910A5555336n1395641k3360692J1874660L3382429K7527120n240297l1277224
$$ 15555336 -35840305 -59200997 -47326337 -13943908 13583212 8342915 -22934309
28903b2934309j5184057K0885586K1883143q729918r660138L0211697M5355568
$$ -22934309 -38118366 -17232780 4650363 -4079555 -13739693 16472004 61827572
28896F1827572Q263399j6856348J0863716K7722533k3075126p7591787m8831043
$$ 61827572 70090971 53234623 64098339 91820872 68745746 -8846041 -57677084
28889e7677084K3032805L4056434r925454j0631551M6364100O5754483Q840499
$$ -57677084 -34644279 -587845 -10513299 -21144850 25219250 90973733 99814232
28882I9814232m0894200k1429941J0488296j0922988m7132356l1540114J1083617
$$ 99814232 58920032 37490091 47978387 37055399 -10076957 -41617071 -30533454
28875c0533454J0521097k7102705l2133115J2605203M8208768L3349404k608331
$$ -30533454 -20012357 -47115062 -79248177 -66642974 -18434206 14915198 12306867
28868A2306867j3225678M891150K2795077K0155160J303859j3135676n868910
$$ 12306867 -918811 3972339 26767416 46922576 48226435 35090759 29221849
28861B9221849J4671533J7251290j2304507m4498796m0410866n097353J7310478
$$ 29221849 43893382 61144672 48840165 4341369 -36069497 -41166850 -23856372
28854b3856372Q80087l1193202l7335808n379799L5243854M4054523J3459046
$$ -23856372 -22976285 -54169487 -91505295 -96885094 -61641240 -17586717 -4127671
28847d127671j7999938p576136L5065860N3668877J7071143l9138878o0854101
$$ -4127671 -22127609 -29703745 5362115 59030992 76102135 36963257 -23890844
28840b3890844m1976739j6958501p096246p028289j1010823j6187718o644870
$$ -23890844 -65867583 -82826084 -89922330 -96950619 -107961442 -124149160 -130794030
28833a30794030K8073212N9969236M7319939k248897l2717510j6519248P713529
$$ -130794030 -102720818 -42751582 4568357 2319460 -30398050 -46917298 -39203769
28826c9203769l842767l5067602l7693955k468500L2563560L6368146J7037796
$$ -39203769 -43046536 -78114138 -115808093 -118276593 -85713033 -49344887 -32307091
28819c2307091o9333k499036N265107J2075118R849389J297765k688107O59779
$$ -32307091 -32376424 -34875460 -29610353 -17535235 -7685846 -6388081 -9076188 -8416409
28811h416409r19075j5501436k9097173k1565677M384645K5355608K6389854J4039272
$$ -8416409 -9335484 -24836920 -53934093 -75499770 -71115125 -45759517 -19369663 -5330391
28803e330391J907314l068714q26575J893958o681522k7129181l6897345j4264736
$$ -5330391 -3423077 -6491791 -7318366 -5424408 -12105930 -39235111 -76132456 -90397192
28795i0397192K4191881L3763613J6719l4438012k1388720K8083431N4999425
$$ -90397192 -66205311 -32441698 -32424979 -66862991 -88251711 -60168280 -5168855
28788e168855K7293178k0185503l0712230M654723M0324909L5751936K165655
$$ -5168855 22124323 1938820 -28773410 -24118687 16206222 51958158 54123813
28781E4123813k0056684j5815262o347035j0765817k2591014l0653841l6601291
$$ 54123813 34067129 18251867 11904832 1139015 -21451999 -52105840 -88707131
28774h8707131l6770132j3715284K9812228N3846394L2229467j134294m64076
$$ -88707131 -125477263 -139192547 -109380319 -55533925 -23304458 -24438752 -24902828
28767b4902828J5834701m970109n1441668n1562334J0100586N4017476K3256336
$$ -24902828 -9068127 -14038236 -65479904 -117042238 -106941652 -52924176 -29667840
28760b9667840k8540663k4071331J9573290L2654434J0705984N589146K1374711
$$ -29667840 -58208503 -82279834 -62706544 -30052110 -19346126 -13756980 7617731
28753G617731J1060633k3749759k1879455K8013741N1814480L528335n6294936
$$ 7617731 18678364 -5071395 -26950850 1062891 52877371 56405706 110770
28746A10770m8143929J4065475N5202758M4658113J2189700j5015449l3401279
$$ 110770 -48033159 -33967684 21235074 65893187 78082887 63067438 29666159
28739B9666159l5227995j3123649J0992277O802161j3814345p742619L2511421
$$ 29666159 -5561836 -18685485 -7693208 -891047 -14705392 -22448011 10063410
28732A0063410O0132859L5301374k2588954o0448534n2131337j8418181N340878
$$ 10063410 70196269 105497643 82908689 22460155 -29671182 -48089363 -42748485
28725d2748485Q551774R039152K0635126K8452251J1193367j7644661j8607160
$$ -42748485 -34196711 -25157559 -4522433 23929818 35123185 17478524 -1128636
28718a128636J5556808M0665250K1012559j7043137k1394972J2720354L9362850
$$ -1128636 14428172 55093422 76105981 59062844 37667872 50388226 89751076
28711H9751076K4513215j8442305n4107223n9599952l3595991N066787K5524898
$$ 89751076 114264291 95821986 41714763 -17885189 -51481180 -46414393 -20889495
28704b0889495J2533401j1084939q292077K2545964M0304305J1875307m1746531
$$ -20889495 -8356094 -19441033 -27733110 -5187146 35117159 46992466 5245935
28697E245935o2435578j9792016M6342274O1523488M858008n5544802m3888710
$$ 5245935 -57189643 -76981659 -30639385 30884103 35742111 -19802691 -63691401
28690f3691401J9349755M3257835j891393m3440017k3795372J0762778l935302
$$ -63691401 -44341646 -1083811 -2975204 -46415221 -70210593 -59447815 -63383117
28683f3383117l5727460j2566616M4934043M8899916p239770l1530007J6049612
$$ -63383117 -99110577 -111677193 -66743150 -17843234 -25083004 -56613011 -40563399
28676d0563399N6307097J8745790m8720026o0693740j9420078J2161232J5531961
$$ -40563399 15743698 34489488 -14230538 -74924278 -94344356 -82183124 -66651163
28669f6651163K0443673L2701945K9435659J1902545N29294j2035717m3267451
$$ -66651163 -46207490 -13505545 15930114 27832659 28361953 16326236 -26941215
28662b6941215o5701678l4872698K7507547M7038713P833646j7061320K2684861
$$ -26941215 -92642893 -127515591 -100008044 -52969331 -45135685 -62197005 -39512144
28655c9512144P2937925N3642265k3465789p3452557n3504632m006326K0890776
$$ -39512144 33425781 87068046 63602257 -9850300 -63354932 -67361258 -46470482
28648d6470482J3723974l447144j5288149j4674419K659243K5545228L0024525
$$ -46470482 -32746508 -36193652 -51481801 -66156220 -63496977 -37951749 -7927224
28641g927224J1310335n124877m97188Q672133o24373j8652220j9118141j439277
$$ -7927224 3383111 -1741766 -2238954 6433179 5808806 -12843414 -31961555 -33400832
28633c3400832J2775291J6287626J6971162R230160j6186746l4927665q124188
$$ -33400832 -20625541 -4337915 12633247 21863407 5676661 -29251004 -37375192
28626c7375192M9844048O9967410J8953009n0496007o9258779l3865504J3037021
$$ -37375192 12468856 82436266 101389275 50893268 -18365511 -52231015 -39193994
28619c9193994M4252720M9906232J8171299l4415157m9261657k399953L7650829
$$ -39193994 5058726 54964958 73136257 38721100 -10540557 -12940510 24710319
28612B4710319l71547p1014557o9676934N199810M9540394K0527925l897849L1669791
$$ 24710319 24338772 -46675785 -116352719 -111152909 -61612515 -41084590 -44982439 -13312648
28604a3312648O3680913K2310707m6454215n5640501j2408996J0677222j609427
$$ -13312648 50368265 72678972 26224757 -29415744 -41824740 -31147518 -32756945
28597c2756945k243247K1769578L1105711P885309j9749587k8169098k0939650
$$ -32756945 -35000192 -13230614 17875097 25760406 6010819 -22158279 -43097929
28590d3097929m409441J4016830J3526697j0127929j9784972R955054L7870738
$$ -43097929 -47507370 -33490540 -19963843 -30091772 -49876744 -39921690 -2050952
28583b050952J2554231l8297285m3479255J363107L2737994K1512528q08641j6435648
$$ -2050952 10503279 -27794006 -71273261 -69910154 -37172160 -15659632 -16468273 -32903921
28575c2903921l9333145n1616713j0064754O2204316P8004970J5110191l9341814
$$ -32903921 -72237066 -123853779 -133918533 -71714217 6290753 21400944 -17940870
28568a7940870j8113391L1174909L6062954J0372738N282038J1044417j1046586
$$ -17940870 -36054261 -4879352 31183602 41556340 46838378 57882795 46836209
28561D6836209m1834818l3128613L079903J3668760l135594j123824K3805496
$$ 46836209 5001391 -28127222 -25047319 -11378559 -14514153 -15637977 8167519
28554H167519K2417727j9823470n0382691k7508885K0394192L9655934K0524151
$$ 8167519 30585246 10761776 -39620915 -67129800 -46735608 -7079674 13444477
28547A3444477k940049p36895K3180124L8915802K2929481j2855637l3312869
$$ 13444477 10504428 9767533 32947657 71863459 94792940 81937303 48624434
28540D8624434k8454187k6108057l9004352l2782778J6799235O5328740N1722678
$$ 48624434 20170247 -5937810 -44942162 -77724940 -60925705 4403035 56125713
28533E6125713p725674l6610735p450579K5464148J2395077k7009411m6101067
$$ 56125713 48400039 11789304 4338725 29802873 42197950 15188539 -30912528
28526c0912528l4007813j0382016Q867931J5926018O801722p141315n242993J0218713
$$ -30912528 -64920341 -75302357 -66434426 -50508408 -43706686 -50848001 -56090994 -45872281
28518d5872281J1611742j0199542k5508530p676348K6951050M1656399K5895345
$$ -45872281 -34260539 -44460081 -69968611 -77644959 -50693909 -9037510 16857835
28511A6857835J106833q294037M031502K4156240K7221588l37676m0804052n8308039
$$ 16857835 17964668 9670631 13702133 37858373 65079961 64742285 23938233 -34369806
28503c4369806l7024495L706862L2862490L4014275J0980332j6195832k3056917
$$ -34369806 -71394301 -67687439 -34824949 -810674 10169658 -6026174 -29083091
28496b9083091n411166J1934508Q166256k253727M888961K0035290J5519741m988403
$$ -29083091 -34494257 -22559749 -14393493 -16647220 -11758259 8277031 23796772 18808369
28488A8808369j2766536m700447l730711j0527606l849906Q527183m708882l1903477
$$ 18808369 6041833 1341386 -2389325 -12916931 -16766837 -8239654 -12948536 -44852013
28480d4852013k0105505L3141715N3885339j960275p2996157p5785307j9441956
$$ -44852013 -64957518 -31815803 22069536 20109261 -52886896 -128672203 -148114159
28473a48114159K2602762K2906415J7517428K9328646L6694481K0242177p831799
$$ -148114159 -125511397 -102604982 -85087554 -55758908 -19064427 1177750 -6654049
28466f654049k8998313l7591790k9179035J212863M2417251O7935601N7879456
$$ -6654049 -35652362 -73244152 -102423187 -101210324 -58793073 9142528 67021984
28459F7021984J3611704m0037504o2321911k9520771K7100060M4370661O189429
$$ 67021984 80633688 40596184 -21725727 -51246498 -24146438 20224223 26413652
28452B6413652l2778383k5181567N934643J6053823J0579161J8235523K5872886
$$ 26413652 -6364731 -31546298 -25611655 -9557832 1021329 19256852 45129738
28445D5129738J2639m4006523n4688922k1074088J6176436K8613022K5765641
$$ 45129738 45142377 1135854 -53553068 -74627156 -58450720 -29837698 -4072057
28438d072057J7203931k292165k3504486k1895022M160460K7252138K7917598
$$ -4072057 13131874 10839709 -12664777 -34559799 -30399339 -3147201 24770397
28431B4770397J0153706j5994631l7093723l0346134R698327M6497452L9819445
$$ 24770397 34924103 18929472 -18164251 -48510385 -38812058 7685394 47504839
28424D7504839L37084k8586909k9650919j5169722P105992K7009180J6065287
$$ 47504839 47841923 19255014 -10395905 -25565627 -18459635 8549545 24614832
28417B4614832k6590882m0267051J6393810P6675366M4850971n0769160q5604752
$$ 24614832 -1976050 -42243101 -25849291 50826075 95677046 44907886 -40696866
28410d0696866k3562884L5724660K0365983j4428914j926259K2971523P16029
$$ -40696866 -64259750 -28535090 -8169107 -22598021 -24524280 -1552757 -836728
28403h36728m2082677m2447601n925460J6942314J6568013J5145639Q731194j2901458
$$ -836728 -42919405 -85367006 -91292466 -74350152 -57782139 -42636500 -33905306 -46806764
28395d6806764k1681978N976580L1449811P201310l7323492l3874281J7035779
$$ -46806764 -68488742 -62512162 -31062351 -23861041 -61184533 -95058814 -78023035
28388g8023035M7171786K3486848j4689129k4393159r802319M019902N744620
$$ -78023035 -30851249 -7364401 -22053530 -46446689 -56249008 -52229106 -46484486
28381d6484486j210646l377752J4123885M0763200L9474483M0370l2137974j7457063
$$ -46484486 -47695132 -51072884 -36948999 3814201 43288684 43329054 11191080 -6265983
28373f265983J5877658J7055444p209816j3020213J148700k158703k5898796l1488730
$$ -6265983 9611675 26667119 19457303 6437090 7585790 5427087 -20471709 -51960439
28365e1960439p182723J3330595R056403l08373N252369J8763644K7924422K9184002
$$ -51960439 -59143162 -45812567 -36756164 -37064537 -31812168 -13048524 14875898 44059900
28357D4059900J6619797j0059145k7354695j2429997J6909466K2217778O85132
$$ 44059900 60679697 50620552 23265857 10835860 27745326 49963104 50648236
28350E0648236j5210027j0402924k166855n017406j5643283k8323702l3338334
$$ 50648236 35438209 25035285 22868430 17851024 2207741 -26115961 -59454295
28343e9454295j1727258L3077825N6306183K7652704j3729790j1463317K0358592
$$ -59454295 -71181553 -38103728 18202455 45855159 32125369 20662052 41020644
28336D1020644K3194813p489203k2013563j0182901j6140345m8266462n1997359
$$ 41020644 64215457 56726254 34712691 24529790 8389445 -39877017 -91874376
28329i1874376k20571N5386263N8475099K1152001j0515480k0239562j9228239
$$ -91874376 -92094947 -36708684 21766415 42918416 32402936 12163374 -7064865
28322g064865j5169744r587388j134518J8078879M2126413L5431704j7637071
$$ -7064865 -22234609 -31821997 -32956515 -14877636 27248777 62680481 45043410
28315D5043410o0564128k8492974M1183822M5427965k7201007p0882138k6196772
$$ 45043410 -15520718 -44013692 -2829870 42598095 15397088 -55485050 -81681822
28308h1681822K8957544J1146734l4650875j6955809N0630618P5753965L1328448
$$ -81681822 -52724278 -41577544 -76228419 -93184228 -42553610 33200355 64528803
28301F4528803j7484418j9812250M313281J8137402J8477836J8179398J8362635
$$ 64528803 47044385 27232135 31545416 49682818 68160654 86340052 104702687
28294A04702687J2382585j922858j8000128k2310935j0169756k23515j0281411
$$ 104702687 117085272 115162414 97162286 74851351 64681595 64458080 54176669
28287E4176669k1710254n572800J7909141L12192m8142803n9720153j6934077
$$ 54176669 32466415 26893615 44802756 45114948 -3027855 -62748008 -79682085
28280g9682085J4666215n036718k6731337l685466K9441285L0330098K6328746
$$ -79682085 -65015870 -70052588 -96783925 -100469391 -71028106 -40698008 -14369262
28273a4369262M5579038M4172931j1185828n6109816k5641529K1805608n462590
$$ -14369262 31209776 75382707 64196879 8087063 -17554466 4251142 -1211448
28266a211448o6717287m7608354M1523778P1856410M580366n0291455j5612655
$$ -1211448 -67928735 -115537089 -74013311 -2156901 2423465 -47867990 -63480645
28259f3480645M3548535M5779798J5142865Q729043J4381987m133511k9502384
$$ -63480645 -19932110 25847688 40990553 49719596 64101583 59968072 30465688
28252C0465688k9766004k0412871k4331924j8523688J8336175M8476345K6625159
$$ 30465688 699684 -19713187 -44045111 -62568799 -44232624 4243721 30868880
28245C0868880k4261543m5111627k1901792J3894108L9140519M6987980K7988519
$$ 30868880 6607337 -38504290 -60406082 -46511974 -7371455 39616525 67605044
28238F7605044r028421k1224354J4163250M9687124K2325026n3597539r7435282
$$ 67605044 58576623 37352269 51515519 101202643 123527669 69930130 -27505152
28231b7505152o3723957R545625N6225378M9643314R449790k8746353l9195108
$$ -27505152 -91229109 -81683484 -25458106 24185208 33634998 4888645 -34306463
28224c4306463j9825014Q943571K4322287K0462493N778807j0128470k0479815
$$ -34306463 -54131477 -45187906 -20865619 -403126 5375681 -4752789 -25232604
28217b5232604k1088048j3149239p19529J4915207K9785816L1292275J3137832
$$ -25232604 -46320652 -59469891 -60189420 -45274213 -15488397 15803878 28941710
28210B8941710r078745j6149157j2714480j4512229j7707739q907016M653493
$$ 28941710 19862965 3713808 -9000672 -23512901 -41220640 -50127656 -45474163
28203d5474163Q365874J1721922K6365856K7438553j0379988n0092172l2375926
$$ -45474163 -37108289 -25386367 979489 28418042 18038054 -32054118 -64430044
28196f4430044K3795933L7434542p289012l4672774l823993K7544766R701262
$$ -64430044 -40634111 -3199569 -10488581 -45161355 -48985348 -21440582 -11739320
28189a1739320j5586662o6724K1313275J635659k5214968q601765J9720994L587334
$$ -11739320 -27325982 -27392706 -6079431 -4443772 -29658740 -38260505 -18539511 -14952177
28181a4952177k8757570j4771244K1711370J0146748l0931971j6977978M8416356
$$ -14952177 -43709747 -58480991 -36769621 -26622873 -57554844 -74532822 -26116466
28174b6116466O5069500Q57803n2184999k6561354K0983940J5659255j8592307
$$ -26116466 38953034 39810837 -12374162 -38935516 -17951576 -2292321 -20884628
28167b0884628j9017727P200026J0221834j1194989j7111526J204558J6126248
$$ -20884628 -39902355 -32702329 -22480495 -33675484 -50787010 -49582452 -33456204
28160c3456204J4859249Q578606L125880k468805j661222N926141L611834j3957536
$$ -33456204 -18596955 -10018349 -6892469 -9361274 -11022496 -5096355 -1484521 -15442057
28152a5442057k3824625j2549725m579636k0991743l6201787j5304844K4643479
$$ -15442057 -39266682 -51816407 -56396043 -77387786 -113589573 -128894417 -104250938
28145a04250938L4381654N948341j4438211Q674195N2575055O5137358K6145840
$$ -104250938 -69869284 -63920943 -78359154 -69684959 -17109904 48027454 74173294
28138G4173294k9030242m6590160j5918264J5089792J635892l3912460l3554219
$$ 74173294 45143052 -1447108 -17365372 -2275580 -639688 -34552148 -68106367
28131f8106367O817285K9519322P057546j5097331K350534K4976739M122385l8631944
$$ -68106367 -61289082 -31769760 -24712214 -39809545 -37459011 -12482272 -8359887 -46991831
28123d6991831m4787790r531263K0291792K2525273J6343944J1360844l178744
$$ -46991831 -91779621 -101310884 -81019092 -58493819 -42149875 -30789031 -33967775
28116c3967775j9123545j2424117R661475J2388284q948547k1298924j1342077
$$ -33967775 -53091320 -65515437 -55853962 -43465678 -52414225 -73713149 -85055226
28109h5055226l697895r868893o721611J5151618K6690614R420613j0568352o794311
$$ -85055226 -88753121 -98622014 -105343625 -90192007 -63501393 -54080780 -64649132 -71443443
28101g1443443N297284L337747K840170K6233006N0834750L4592253j5264378
$$ -71443443 -66146159 -62808412 -59968242 -33735236 17099514 51691767 36427389
28094C6427389m4079447k4197509R907036J3667339q988216j8666242L895974
$$ 36427389 -7652058 -31849567 -21942531 -8275192 -17263408 -35929650 -32033676
28087c2033676L5640840M1308286J2256693k7220283m6001213l5109768j1895134
$$ -32033676 3607164 44915450 57172143 29951860 -16049353 -51159121 -63054255
28080f3054255K141012M417631R171180K3506065L2849946J7768893j7128152
$$ -63054255 -60913243 -56495612 -47324432 -23818367 9031579 26800472 9672320
28073I672320m2972755m0054893j9055911J127829K1388542M6933727N6836285
$$ 9672320 -33300435 -73355328 -92411239 -91283410 -69894868 -22961141 33875144
28066C3875144K4829412k8477659m4756369n276795L7846887L2091276p944979
$$ 33875144 58704556 30226897 -14529472 -19806267 18040620 50131896 42186917
28059D2186917l4633710l5766029k7954608j0760778K1089457L9891677J7423913
$$ 42186917 7553207 -28212822 -56167430 -66928208 -45838751 -5947074 11476839
28052A1476839j5877583o670766L0199323K7017065k1619448l8090453J2492223
$$ 11476839 -4400744 -11071510 19127813 46144878 24525430 -13565023 -1072800
28045a072800N3936402J4163886n4654582n0844111J9247303M9373888n729937
$$ -1072800 52863602 67027488 12372906 -38471205 -19223902 30149986 24420049
28038B4420049o5080791m4280363K5025673M8458451K393766m3233410k7326786
$$ 24420049 -40660742 -84941105 -59915432 -11456981 -9063215 -52296625 -79623411
28031g9623411K6296497N0250415J9867322k7351772m5325007k5829151Q250001
$$ -79623411 -53326914 -3076499 16790823 -10560949 -55885956 -81715107 -73465106
28024g3465106L1930011L2025603J1819552o314950m19005J7470907R478041l0359176
$$ -73465106 -41535095 -9509492 2310060 -4004890 -4423895 13047012 22525053 -7834123
28016g834123n4810748k6884062K4494535M9358987M8056301M8053422L7152727
$$ -7834123 -62644871 -89528933 -65034398 -15675411 32380890 80434312 117587039
28009A17587039j1894916o4883476n5615453L716301K5722299j9102769n7713893
$$ 117587039 105692123 40808647 -14806806 -11090505 14631794 -4470975 -62184868
28002f2184868l6248554L68088J015577l794027K3946845M3358545Q886825l0054144
$$ -62184868 -98433422 -98065334 -97049757 -100843784 -76896939 -33538394 -24651569 -54705713
27994e4705713k171202N6507231N1845007j5168182n1328063j9742851J8332450
$$ -54705713 -56876915 -369684 51475323 36307141 -15020922 -34763773 -16431323
27987a6431323J7320747M762664N023828m394492l0016881l4216404m011328J9821544
$$ -16431323 889424 5652088 10675916 6281424 -23735457 -57951861 -61963189 -42141645
27979d2141645J4390822J0981469K8184135L3556286Q226045j2537071l665669
$$ -42141645 -27750823 -16769354 11414781 44971067 53197112 40660041 36994372
27972C6994372M162884j2712215k0978190M856971K1426237j7078996p1871982
$$ 36994372 41157256 28445041 7466851 12323822 33750059 16671063 -55200919
27965e5200919o6415000K236470O0517847N7197664J4137747j9202900k1601436
$$ -55200919 -121615919 -119379449 -58861602 -1663938 12473809 -6729091 -28330527
27958b8330527p179794j304261j1106724j4068838J0103263L8295655K9244106
$$ -28330527 -35510321 -36814582 -47921306 -61990144 -51886881 -13591226 15652880
27951A5652880o728291j3373315K0543082L5238787m118996m6935065l8785298
$$ 15652880 8924589 -4448726 16094356 51333143 47214147 279082 -38506216
27944c8506216n109981M964980M217962K5347840L9521067J324812n5166396n4412387
$$ -38506216 -43616197 -38651217 -34433255 -9085415 30435652 31760464 -23405932 -77818319
27936g7818319J282979L7279108K5414884J0246921J3916083M595152k3376686
$$ -77818319 -76535340 -39256232 -13841348 -3594427 10321656 14916808 -8459878
27929h459878k4857188J0348343K6233917n724829l3474693j1961268K1020306
$$ -8459878 -33317066 -22968723 3265194 -2459635 -35934328 -47895596 -26875290
27922b6875290J2614185j5675794r609702K6509945M4339825L0357895R714459
$$ -26875290 -14261105 -29936899 -39546601 -13036656 31303169 61661064 71375523
27915G1375523r232535l5132290n0828569k9162314J1370128K1850244k292345
$$ 71375523 62142988 27010698 -23817871 -52980185 -41610057 -19759813 -22052158
27908b2052158j3957384P648043K2972282j428972l6593703l5555778m084731
$$ -22052158 -36009542 -28361499 -5389217 -6818189 -43411892 -78967670 -83052401
27901h3052401J2514022o37114j0506778Q500576L3669699K6389929j0193050
$$ -83052401 -70538379 -71175493 -81682271 -73181695 -39511996 -13122067 -23315117
27894b3315117k9895512l825263L6465109L5507500j1372332m6706769k5860298
$$ -23315117 -53210629 -57035892 -20570783 14936717 3564385 -43142384 -69002682
27887f9002682K2888266M0954565K2718490J2815165K4466697J5920883k9956690
$$ -69002682 -46114416 -5159851 17558639 30373804 54840501 70761384 40804694
27880D0804694n6373859j2311327N3963724M7764146l5059215r4141098o2182388
$$ 40804694 -15569165 -27880492 26083232 73847378 38788163 -55352935 -117535323
27873a17535323Q722939L3476806J1556807L819142K6996581L6362339N629044
$$ -117535323 -108812384 -75335578 -63778771 -59959629 -32963048 3399291 9028335
27866I028335l3570867m2041200k1036151M105311J7802781J7927366P826313
$$ 9028335 -24542532 -66583732 -87619883 -83514572 -65711791 -47784425 -39958112
27859c9958112l418462o081242N85750J2466101K6823705L2721695J3153252k2134995
$$ -39958112 -43376574 -49457816 -48872066 -36405965 -9582260 23139435 36292687 14157692
27851A4157692k9540280R532864M6958490L0051743j6594870k8672505m402007
$$ 14157692 -15382588 -5849724 41108766 71160509 54565639 25893134 21491127
27844B1491127J930176j7643442j2776212K2658226K5503527k5334427n7665181
$$ 21491127 23421303 5777861 -6998351 15659875 41163402 15828975 -41836206
27837d1836206j7834217M1458658M7807068J7084577L250853m99953k7059819
$$ -41836206 -59670423 -18211765 29595303 46679880 49930733 49430780 22370961
27830B2370961m8519073j6350216M0149687M7687156O221524j6465636q39042
$$ 22370961 -26148112 -42498328 -2348641 45338515 51560039 35094403 34255361
27823C4255361L364717k2456428l2850756p093331Q180272k1302744n8450496
$$ 34255361 37620078 15163650 -17687106 -24780437 -16600165 -37902909 -96353405
27816i6353405n2753637r854671K8832802L8448341J9030461j3738472k8938020
$$ -96353405 -149107042 -158961713 -130128911 -91680570 -72650109 -86388581 -115326601
27809a15326601n768953L0494756L4883874J0446766L830547K6044809L2003098
$$ -115326601 -121095554 -90600798 -55716924 -45270158 -41439611 -15394802 16608296
27802A6608296l791614m5165760n2111168l1153569k789253L1248066N9499098
$$ 16608296 12816682 -32349078 -84460246 -115613815 -118403068 -87155002 -27655904
27795b7655904N0727758P848416j5887605O181186K7126237M24758m3573137m7077018
$$ -27655904 23071854 30920270 15032665 21213851 48340088 48764846 5191709 -41885309
27787d1885309j2322711J7603512L3167564N0665786N4163559J4428006m3681945
$$ -41885309 -54208020 -36604508 -3436944 47228842 101392401 115820407 72138462
27780G2138462o0280830k8709957k477222p183038q933438J2267955K1415526
$$ 72138462 11857632 -16852325 -19329547 -26512585 -35446023 -23178068 -1762542
27773a762542n790481l1318198j5507345J3051805M321810k5321175j7170202
$$ -1762542 -7553023 -38871221 -54378566 -41326761 -37004951 -62326126 -79496328
27766g9496328K7799412M0943462o039535m9947315k8818339K5795205M0564352
$$ -79496328 -51696916 -10753454 -16792989 -66740304 -95558643 -69763438 -29199086
27759b9199086Q788285j4048280m187669P755909O074304J3402869L0607018J9591950
$$ -29199086 -20410801 -34459081 -38646750 -30890841 -24816537 -11413668 19193350 38785300
27751C8785300k5215138m9569333k2737839R242535K297663r916354J7127383
$$ 38785300 13570162 -35999171 -58737010 -49494475 -47196812 -57113166 -39985783
27744c9985783M6441447J6637953m1583632m0580733K2367468N4022162Q371912
$$ -39985783 6455664 23093617 -18490015 -59070748 -36703280 17318882 25690794
27737B5690794m7276038l8921154J5881669N4528620N3102347K3286239k2768287
$$ 25690794 -21585244 -60506398 -44624729 9903891 63006238 86292477 63524190
27730F3524190o2318035n8688593r265478L5228097L3331177M599013j0118439
$$ 63524190 1206155 -57482438 -66747916 -31519819 1811358 6410371 -3708068
27723c708068o943578n376764o317354J844761J5950388K4457160K3982471J2254129
$$ -3708068 -10651646 -16028410 -22345764 -20501003 -4550615 19906545 43889016 56143145
27715E6143145j2959302l4907587k6946542N731883K5478400J6147809J676261
$$ 56143145 43183843 8276256 -18670286 -12938403 12539997 28687806 30364067
27708C0364067r89867m229998j0386129j81191J8800107P037394l5138964m9084720
$$ 30364067 29374200 25144202 14758073 14576882 33376989 40414383 5275419 -43809301
27700d3809301r236337K6373101O395213k9632136j8582306K3584983L6892314
$$ -43809301 -53045638 -26672537 -20277324 -49909460 -68491766 -44906783 -8014469
27693h014469J7929817J0817026K2467449K0601367J908498o786545o236924j8603269
$$ -8014469 9915348 20732374 43199823 63801190 65709688 58923143 52686219 34082950
27685C4082950l1070588j1189731K4595025K4436565j2614704k8735862K013265
$$ 34082950 3012362 -8177369 16417656 40854221 28239517 -496345 1516920
27678A516920L5482663K9182445o24820j7270322j5065673p610241l88398J934913
$$ 1516920 36999583 66182028 65557208 48286886 33221213 25610972 25222574 27157487
27670B7157487j0269315l0446409l3086627q086776K2486269L3485360K4180241
$$ 27157487 16888172 -13558237 -46644864 -54731640 -32245371 1239989 25420230
27663B5420230R274590k98692l164775p862711k4250608m1239666k8121129J8869668
$$ 25420230 34694820 34396128 31231353 23368642 -881966 -42121632 -70242761 -51373093
27655e1373093N1803042K9479788j6527403k1205046J8604819M2902031K2487778
$$ -51373093 429949 29909737 13382334 -7822712 10782107 53684138 76171916
27648G6171916n210678p322602l226208j3702799j5684613J1433333L4562070
$$ 76171916 70961238 63638636 60412428 46709629 31025016 42458349 77020419
27641G7020419J0642309m1415534o0079991k4563061K1364835L0382901M507040
$$ 77020419 87662728 46247194 -13832797 -38395858 -17031023 13351878 17858918
27634A7858918k0706211k1706271n081710P350587J758094j4631853j9838956
$$ 17858918 -2847293 -24553564 -29635274 -22284687 -20526593 -35158446 -54997402
27627e4997402j333149K4254940K4028609j0862954m4731671l3255580J8455718
$$ -54997402 -56330551 -32075611 -8047002 -18909956 -63641627 -96897207 -78441489
$$ [...]
##END NTUPLES=NMR SPECTRUM
##END=
