##TITLE=31Pdec_2ABPA2704
 , 24 sc
 27.04.2021
##JCAMPDX= 6.0         $$ Bruker NMR JCAMP-DX V2.0
##DATA TYPE= NMR SPECTRUM
##DATA CLASS= NTUPLES
##ORIGIN= UXNMR, Bruker Analytische Messtechnik GmbH
##OWNER= root
$$ XWIN-NMR		Version 3.5
$$ Tue Apr 27 13:59:33 2021 Russian Standard Time (UT+4h)  she@DPX200
##.OBSERVE FREQUENCY= 81.013821
##.OBSERVE NUCLEUS= ^31P
##.ACQUISITION MODE= SIMULTANEOUS
##.ACQUISITION SCHEME= undefined
##.AVERAGES= 24
##.DIGITISER RES= 16
##SPECTROMETER/DATA SYSTEM= spect
##.PULSE SEQUENCE= zgpg30
##.SOLVENT NAME= D2O
##.SHIFT REFERENCE= (INTERNAL, D2O, 0, 248.564)
##AUDIT TRAIL= $$ (NUMBER, WHEN, WHO, WHERE, WHAT)
$$ ##TITLE= Audit trail, XWIN-NMR		Version 3.5
$$ ##JCAMPDX= 5.01
$$ ##ORIGIN= Bruker BioSpin GmbH
$$ ##OWNER= she
$$ F:/spectra/data/she/nmr/P31/1/pdata/1/auditp.txt
$$ ##AUDIT TRAIL=  $$ (NUMBER, WHEN, WHO, WHERE, WHAT)
(   1,<2021-04-27 13:57:43.68 +0400>,<she>,<DPX200>,
      <created by zg, POWCHK disabled, PULCHK disabled
       configuration hash MD5:
       00 E9 B6 7A A2 85 ED C7 34 08 36 98 17 FE 4E 26
       data hash MD5: 32K
       0D BE E7 76 4D 46 1E 42 B8 A3 DD 4F 1B 59 50 DC>)
(   2,<2021-04-27 13:58:05.71 +0400>,<she>,<DPX200>,
      <Start of raw data processing
       efp BC_mod = 2 LB = 1 FT_mod = 6 PKNL = 1 PHC0 = -5542.391 PHC1 = 153.4015 SI = 64K 
       data hash MD5: 64K
       72 01 30 91 5F 86 7F BE 79 5B F6 77 1B 6E B9 D3>)
(   3,<2021-04-27 13:58:50.64 +0400>,<she>,<DPX200>,
      <pk PHC0 = -514.6855 PHC1 = 455.0001 
       data hash MD5: 64K
       64 75 F8 66 3C 76 AA A6 5D A9 0B 49 09 13 46 92>)
(   4,<2021-04-27 13:58:54.00 +0400>,<she>,<DPX200>,
      <abs ABSG = 5 
       data hash MD5: 64K
       44 E6 CF D2 0D F6 D9 12 1C B9 24 CC 51 4A 5C ED>)
(   5,<2021-04-27 13:59:06.14 +0400>,<she>,<DPX200>,
      <abs ABSG = 5 
       data hash MD5: 64K
       03 DB 37 3C 80 DF 95 9B 21 56 05 85 15 C8 54 3E>)
$$ ##END=
$$ 
$$ hash MD5
$$ 07 67 91 75 19 FE 1C 9D A3 24 E5 8F F9 28 1D B3
##$RELAX= 
##$RELAX= 
##$RELAX= 
##$RELAX= 
##$RELAX= 
##$RELAX= 
##$RELAX= 
##$RELAX= 
$$ Bruker specific parameters
$$ --------------------------
##$DU= <F:/spectra>
##$EXPNO= 1
##$NAME= <P31>
##$PROCNO= 1
##$TYPE= <nmr>
##$USER= <she>
##$AMP= (0..31)
100 100 100 100 100 100 100 100 100 100 100 100 100 100 100 100 100 100 
100 100 100 100 100 100 100 100 100 100 100 100 100 100 
##$AQSEQ= 0
##$AQ_mod= 1
##$AUNM= <au_zg>
##$AUTOPOS= <>
##$BF1= 81.014009
##$BF2= 200.13
##$BF3= 200.13
##$BF4= 200.13
##$BF5= 200.13
##$BF6= 200.13
##$BF7= 200.13
##$BF8= 200.13
##$BYTORDA= 1
##$CFDGTYP= 0
##$CFRGTYP= 5
##$CHEMSTR= <none>
##$CNST= (0..31)
1 1 145 1 1 1 1 1 1 1 1 1 1 1 1 1 1 1 1 1 1 1 1 1 1 1 1 1 1 1 1 1 
##$CPDPRG= <waltz16>
##$CPDPRG1= <>
##$CPDPRG2= <waltz16>
##$CPDPRG3= <>
##$CPDPRG4= <mlev>
##$CPDPRG5= <mlev>
##$CPDPRG6= <mlev>
##$CPDPRG7= <mlev>
##$CPDPRG8= <mlev>
##$CPDPRGB= <>
##$CPDPRGT= <>
##$D= (0..31)
0 1 0 0 0 0 0 0 0 0 0 0.03 2e-05 3e-06 0 0 0 0 0 0 0 0 0 0 0 0 0 0 0 0 
0 0 
##$DATE= 1619517463
$$ [...]
##$SUBNAM3= <"">
##$SUBNAM4= <"">
##$SUBNAM5= <"">
##$SUBNAM6= <"">
##$SUBNAM7= <"">
##$SUBNAM8= <"">
##$SUBNAM9= <"">
##$SW= 501.771253377433
##$SWIBOX= (0..15)
0 1 3 0 0 0 0 0 0 0 0 0 0 0 0 0 
##$SW_h= 40650.406504065
##$TD= 32768
##$TD0= 1
##$TE= 0
##$TE2= 300
##$TE3= 300
##$TEG= 300
##$TL= (0..7)
0 120 53 12 22 120 120 120 
##$TP= (0..7)
150 150 150 150 150 150 150 150 
##$TP07= 0
##$TPNAME0= <>
##$TPNAME1= <>
##$TPNAME2= <>
##$TPNAME3= <>
##$TPNAME4= <>
##$TPNAME5= <>
##$TPNAME6= <>
##$TPNAME7= <>
##$TPOAL= (0..7)
0.5 0.5 0.5 0.5 0.5 0.5 0.5 0.5 
##$TPOFFS= (0..7)
0 0 0 0 0 0 0 0 
##$TUNHIN= 0
##$TUNHOUT= 0
##$TUNXOUT= 0
##$USERA1= <user>
##$USERA2= <user>
##$USERA3= <user>
##$USERA4= <user>
##$USERA5= <user>
##$V9= 5
##$VALIST= <valist>
##$VCLIST= <CCCCCCCCCCCCCCC>
##$VD= 0
##$VDLIST= <DDDDDDDDDDDDDDD>
##$VPLIST= <PPPPPPPPPPPPPPP>
##$VTLIST= <TTTTTTTTTTTTTTT>
##$WBST= 1024
##$WBSW= 4
##$XGAIN= (0..3)
0 0 0 0 
##$XL= 0
##$YL= 0
##$YMAX_a= 6820
##$YMIN_a= -9729
##$ZGOPTNS= <>
##$ZL1= 120
##$ZL2= 120
##$ZL3= 120
##$ZL4= 120
##$ABSF1= 248.5645
##$ABSF2= -253.2056
##$ABSG= 5
##$ABSL= 3
##$ALPHA= 0
##$AQORDER= 0
##$ASSFAC= 0
##$ASSFACI= 0
##$ASSFACX= 0
##$ASSWID= 0
##$AUNMP= <proc_1d>
##$AZFE= 0.1
##$AZFW= 0.5
##$BCFW= 0
##$BC_mod= 2
##$BYTORDP= 0
##$COROFFS= 0
##$CY= -3
##$DATMOD= 1
##$DC= 0
##$DFILT= <>
##$DTYPP= 0
##$F1P= 0
##$F2P= 0
##$FCOR= 1
##$FTSIZE= 65536
##$FT_mod= 6
##$GAMMA= 0
##$GB= 0
##$INTBC= 1
##$INTSCL= 5.30512e-09
##$ISEN= 30
##$LB= 1
##$LEV0= 0
##$LPBIN= 0
##$MAXI= 10000
##$MC2= 0
##$MEAN= 0
##$ME_mod= 0
##$MI= 50
##$NCOEF= 0
##$NC_proc= -6
##$NLEV= 6
##$NOISF1= 182.463
##$NOISF2= 159.3651
##$NSP= 0
##$NTH_PI= 0
##$NZP= 0
##$OFFSET= 248.5645
##$PC= 4
##$PHC0= -6057.077
##$PHC1= 608.4016
##$PH_mod= 1
##$PKNL= yes
##$PPARMOD= 0
##$PSCAL= 0
##$PSIGN= 0
##$REVERSE= no
##$SF= 81.014009
##$SI= 65536
##$SIGF1= 159.3651
##$SIGF2= -187.1042
##$SINO= 113.3802
##$SIOLD= 16384
##$SREGLST= <1H.CDCl3>
##$SSB= 0
##$STSI= 65536
##$STSR= 0
##$SW_p= 40650.406504065
##$SYMM= 0
##$S_DEV= 0
##$TDeff= 32768
##$TDoff= 0
##$TI= <>
##$TILT= no
##$TM1= 0
##$TM2= 0
##$TOPLEV= 0
##$USERP1= <user>
##$USERP2= <user>
##$USERP3= <user>
##$USERP4= <user>
##$USERP5= <user>
##$WDW= 1
##$XDIM= 65536
##$YMAX_p= 431968942
##$YMIN_p= -15021582
$$ End of Bruker specific parameters
$$ ---------------------------------
##NTUPLES= NMR SPECTRUM
##VAR_NAME=  FREQUENCY,     SPECTRUM/REAL,   SPECTRUM/IMAG
##SYMBOL=    X,             R,               I
##VAR_TYPE=  INDEPENDENT,   DEPENDENT,       DEPENDENT
##VAR_FORM=  AFFN,          ASDF,            ASDF
##VAR_DIM=   65536,         65536,           65536
##UNITS=     HZ,            ARBITRARY UNITS, ARBITRARY UNITS
##FACTOR=    0.620285442955139, 1,           1
##FIRST=     20137.2065510759, 0,            0
##LAST=      -20513.1999529892, 0,           0
##MIN=       -20513.1999529892, -15021582,   0
##MAX=       20137.2065510759, 431968942,    0
$$ Real data points
##PAGE= N=1
##DATA TABLE= (X++(R..R)), XYDATA
$$ [...]
44237b877028K53344L513456L707474J276061p82573j040252l98803k98039j226805
44228B126835k251531j980658o09307q2650j204206k054093r00783R34419J267856
44219d754118N69376O75684J227524L96181j435971j715683M49095K900535L239923
44210A552546J345808j026540j903219n92173J463207J942271N33974o52616l85759
44201B277499q1852r21224j534449p03698r2325j463622l065396k025699R67903
44192f642863K661615K006049P83835J41395m06659q61405m81393M79882J086904
44183a232640J347929J488153O25545j456508k511393o63795K156395K725624
44175B479310J284764L54200J5787j501603l252787k233745J179576K950049J437819
$$ plain form
44237 -2877028 -2623684 889772 4597246 5873307 5090734 4050482 3651679 3353640 2126835
44228 2126835 -124696 -2105354 -2714661 -2797311 -4001517 -6055610 -6956393 -6021974 -4754118
44219 -4754118 -4184742 -3509058 -2281534 -1885353 -3321324 -5037007 -4587912 -1687377 1552546
44210 1552546 2898354 1871814 -31405 -623578 839629 2781900 3315874 2663258 2277499
44201 2277499 2195647 1274423 -260026 -963724 -1056049 -2519671 -5585067 -7610766 -6642863
44192 -6642863 -3981248 -1975199 -1191364 -1049969 -1456628 -2318033 -2799426 -2319544 -1232640
44183 -1232640 115289 1603442 2228987 772479 -1738914 -2402709 -246314 2479310
44175 2479310 3764074 4118274 4134061 2632458 -620329 -2854074 -1674498 1275551 2713370
44166B713370l93887j39865N46947n23541k316302k545925j105809M10050J000491
44157b354471P70109M70291J099794K544743K752381K83111k700868k731996j48773
44148a5679J300665J57533j016735l72078M54293k00591j086406n50904O12712
44139g17190Q09603J49769k92563j09415N49869J131381M61685j534956k196187
44130a748004O88604M229824L176671k038578m788560j592332K822518K699184
44122C449327q44697k870841k046833p18700n4343O01627J075240P97891P20907
44113A09578J644058J932833o2150k653421k982452j353257l46386o27845o43584
44104d982626K81099J288210J789623J639032M34117j299289j608134J06108J612389
$$ plain form
44166 2713370 2319483 2179618 2726565 2203024 -113278 -2659203 -3765012 -3354962 -2354471
44157 -2354471 -1584362 -1114071 -14277 2530466 5282847 5565958 2865090 133094 -15679
44148 -15679 1284986 1442519 425784 53706 507999 307408 -778998 -1329902 -717190
44139 -717190 92413 242182 -50381 -159796 390073 1521454 1983139 448183 -1748004
44130 -1748004 -1059400 3170424 6347095 4308517 -480043 -2072375 750143 3449327
44122 3449327 2604630 -266211 -2313044 -3031744 -3086087 -2484460 -1409220 -611329 109578
44113 109578 1753636 3686469 3624319 970898 -2011554 -3364811 -3711197 -4339042 -4982626
44104 -4982626 -4701527 -3413317 -1623694 15338 449455 -849834 -2457968 -2351860 -739471
44095g39471J375488J104729J992596J486862k126704m894191k346633K638339
44087a508985L396431j76411j726101R34194K620145Q0717k545710j209667J092678
44078I57291k58565l532715l562603O0684K939406K631509Q66069l74337r28189
44069a201450o45357R63621K748008K403646k61383k609819k443905m17775J371090
44060i3324J802888J060649l68569k004199k968555k188054K93902K329081J257401
44051h78780k513434m725265k080698K867456M397456J209276j939844j143868
44043d807701J601493K338539R35706j61584n11714j272984j735964k27441K081888
44034a759762K068940m64713k172153r71073J492676K830949K505944O73979k572476
$$ plain form
44095 -739471 636017 1740746 3733342 5220204 3093500 -1800691 -4147324 -1508985
44087 -1508985 1887446 1711035 -15066 919128 3539273 3619990 1074280 -135387 957291
44078 957291 698726 -2833989 -6396592 -6335908 -3396502 -764993 101076 -273261 -1201450
44069 -1201450 -1846807 -883186 1864822 4268468 4007085 1397266 -1046639 -1464414 -93324
44060 -93324 1709564 2770213 2401644 397445 -2571110 -4759164 -4465262 -2136181 -878780
44051 -878780 -3392214 -8117479 -10198177 -7330721 -2933265 -1723989 -3663833 -4807701
44043 -4807701 -3206208 -867669 68037 -93547 -605261 -1878245 -3614209 -3841650 -1759762
44034 -1759762 309178 -155535 -2327688 -3298761 -1806085 1024864 3530808 4204787 1632311
44025A632311n513067n153727j137356K862956L509260J682720K34300j34866
44017b017469m46236n72727L80651J642070J445015m0181q12628j75916M07646
44008a89775l2639n07352k4672O66528L83155n79703r64282l36702N94222J144652
43998A53432J370631J550149J386378J66520j965942l217630j750480J461995
43990h44947K765332J91355l382076l515403j56525K262886J024410j352076j227615
43981d234659Q86697J641145R8129j209479m27320R78374P48188o99042r21605
43972c139572R33581K664073J740541j214136k837198j256957J216855R77955
43964i14858j841872l264233q85537K677481L292030P71022j282587m73142J697027
$$ plain form
44025 1632311 -3880756 -9034483 -10171839 -7308883 -3799623 -2116903 -1882603 -2017469
44017 -2017469 -2463705 -3036432 -2655781 -1013711 431304 391123 -421505 -597421 -189775
44008 -189775 -222414 -729766 -754438 -87910 295245 -284458 -1248740 -1585442 -991220 153432
43998 153432 1524063 3074212 4460590 4627110 2661168 -556462 -2306942 -844947
43990 -844947 1920385 2111740 -1270336 -4785739 -4942264 -2679378 -1654968 -3007044 -4234659
43981 -4234659 -3347962 -1706817 -1608688 -2818167 -3245487 -2267113 -1518925 -2217967 -3139572
43972 -3139572 -2205991 458082 2198623 984487 -1852711 -3109668 -1892813 -914858
43964 -914858 -2756730 -6020963 -6906500 -4229019 -936989 -165967 -1448554 -1921696 -224669
43955b24669K327168O24857j699130k540209j386838L27095P83438m5774l63744
43946b197806P63087J777053R83304n48391m86967R45168J167281o35614k170972
43937d03857j611034j32175L94936J84235L62762P20610N15285K37122O16413
43928H84297Q60518q0798j232370p90407P46025R82597o32033j771855p60397
43919a794423Q73014P77757p04883j204509J63277J763871J985568J223940O73678
43910C757290L33600o49116k195564l082981k532231j020532O45890K068622K736816
43901F1794J927673o1218j512418j174851J14069P13946L67337j05194n14965
43892a83827j112634j287271l82678N08996k35138j747136j345310J218316K787706
$$ plain form
43955 -224669 2102499 2727356 1028226 -1511983 -2898821 -2571726 -1788288 -1834062 -2197806
43946 -2197806 -1434719 342334 1325638 777247 290280 1235448 2402729 1767115 -403857
43937 -403857 -2014891 -2147066 -1752130 -1567895 -1205133 -484523 30762 267884 884297
43928 884297 1744815 1664017 431647 -358760 387265 1369862 737829 -1034026 -1794423
43919 -1794423 -921409 -143652 -848535 -2053044 -1889767 -125896 1859672 3083612 3757290
43910 3757290 4090890 3441774 1246210 -1836771 -4369002 -5389534 -4743644 -2675022 61794
43901 61794 1989467 1928249 415831 -759020 -644951 68995 436332 331138 -183827
43892 -183827 -1296461 -2583732 -2966410 -2457414 -2692552 -4439688 -5784998 -4566682 -1778976
43883a778976J308020j102045j393663J10295R25655M46208J72048O08472N28819
43874a75167n55795j319842o47214P15128J287523P93346K36482L15308L46668
43865I96437p62322k459006k471052J60460K901617K566499j23386j479007m21336
43856a091096K46882q79962j177838J011254K594422O88125j842959p11711K176833
43847A013950J345539k864851m082311j02878L169354R71959k698070j426221
43839d673529L521407N172260J289165k836019k474515M11397J139133q92968
43831F56331k309809j174608P02310J041907L01465K25606O33576j63355j975463
43822b062040k219273K37839K861753K848838R99736r4168k41135j015899j894625
$$ plain form
43883 -1778976 -470956 -1573001 -2966664 -2856369 -1930714 -1484506 -1312458 -703986 -175167
43874 -175167 -730962 -2050804 -2698018 -1982890 -695367 97979 334461 649769 996437
43865 996437 234115 -2224891 -4695943 -4535483 -1633866 932633 809247 -669760 -1091096
43856 -1091096 -844214 -1724176 -2902014 -1890760 703662 1391787 -451172 -1162883 1013950
43847 1013950 2359489 -505362 -4587673 -4690551 -1521197 -549238 -3247308 -4673529
43839 -4673529 -1152122 4020138 5309303 2473284 -1231 410166 1549299 656331
43831 656331 -1653478 -2828086 -2125776 -1083869 -782404 -556798 76778 -86577 -2062040
43822 -2062040 -4281313 -4043474 -1181721 1667117 2666853 2572685 2331550 1315651 -578974
43813e78974p34175J813958K217766n35468k967829k227679q652P84350L87085
43804a849618N28710Q75872K16120n96520o6895Q58688K95991r85462p54680N66712
43794i11082N03341r05331q56509J268655K378471N95548j561548j175987N65304
43785i9138P67003j95898L83961K375328K351617r37083l892759k844727P27700
43776a363996K345598P11742j164401q47598N04753R03705O09543O21021J96317
43767B516684j600272l189219k160736P91029K359269J163839o93925j020358
43759a833689j33718N73566N44511k17397j384368j650653J02645K438753K514321
43750I53971K71616j210124m86483K45287o04349j194510k2959Q62421l47635
$$ plain form
43813 -578974 -1313149 500809 2718575 2183107 -784722 -3012401 -3021053 -2236703 -1849618
43804 -1849618 -1320908 -445036 -228916 -825436 -892331 -33643 262348 -723114 -1477794 -911082
43794 -911082 -407741 -1313072 -2169581 -900926 1477545 2073093 511545 -664442 -99138
43785 -99138 667865 471967 855928 3231256 5582873 4645790 753031 -2091696 -1363996
43776 -1363996 981602 1693344 528943 -318655 186098 1089803 1699346 2320367 2516684
43767 2516684 916412 -2272807 -4433543 -3642514 -1283245 -119406 -813331 -1833689
43759 -1833689 -1967407 -1393841 -849330 -1066727 -2451095 -4101748 -3999103 -1560350 953971
43750 953971 1225587 15463 -471020 -225733 -830082 -2024592 -2047551 -1185130 -1532765
43741a532765j232333J006499M008613L236167q23232l220720j879054K80592
43733a56233P81460O68860J154754J221125J54998p89388q63853j179169k141468
43724a148914k184690n76421R51680R45411M09484P33387J453529J541749J076513
43715C201728L42695q81159j978511j438359O37973J995557J384701J32465n51660
43706B845430j263815j957991p90420K337484L909304J449793k225542k747619
43698A556624l87505J105348N61681K76961J223537J398230l26927k033938j792618
43689A581393m59892M939o32244j066292m44050Q47556J844163J891448J132041
43680D699062J92682o82772j634432k155275j262835O48197J625583R32595K98139
$$ plain form
43741 -1532765 -2765098 -1758599 2250014 5486181 4662949 1442229 -436825 -156233
43733 -156233 625227 1294087 2448841 3669966 3824964 3035576 2171723 992554 -1148914
43724 -1148914 -3333604 -3910025 -2958345 -2012934 -1603450 -870063 583466 2125215 3201728
43715 3201728 3544423 2663264 684753 -753606 -115633 1879924 3264625 3397090 2845430
43706 2845430 1581615 -376376 -1166796 1170688 5079992 6529785 4304243 1556624
43698 1556624 1169119 2274467 2836148 3113109 4336646 5734876 5407949 3374011 1581393
43689 1581393 1121501 1126440 494196 -572096 -1016146 -168590 1675573 3567021 4699062
43680 4699062 4891744 4208972 2574540 419265 -843570 -195373 1430210 2362805 2660944
43671B660944Q38608P28004j609859l798395k420202J323207K705588K74881k185723
43662a482947j352966J353245K649143J754079J00410j146090j471228n70904
43654a67258Q41454J072146l57863j674439j101805Q89073K419989K248097M33507
43645D602901j801913k536776r49246J136380J261591j29026n63034M2674p96867
43636B66684l167388l641727j027149R17747m34336j747236P02004L965275K602802
43627a563324k041876l182813R38450M305554K414267j388543j829360N28907
43619a818738J375586l77795j807325q94079J145224K170105J469568j22262j087672
43610E2612n70303L74829q7000j527541j208340J616341L560851J574725k265575
$$ plain form
43671 2660944 3499552 4227556 2617697 -1180698 -3600900 -2277693 427895 702776 -1482947
43662 -1482947 -2835913 -1482668 1166475 2920554 3020964 1874874 403646 -167258
43654 -167258 674196 1746342 1388479 -285960 -1387765 -498692 1921297 4169394 4602901
43645 4602901 2800988 264212 -685034 451346 1712937 1583911 1020877 1063551 266684
43636 266684 -2900704 -6542431 -7569580 -6651833 -7086169 -8833405 -8131401 -4166126 -1563324
43627 -1563324 -3605200 -6788013 -5849563 -1544009 870258 -518285 -2347645 -1818738
43619 -1818738 -443152 -820947 -2628272 -3522351 -2377127 -207022 1262546 1140284 52612
43610 52612 -517691 -142862 -229862 -1757403 -2965743 -1349402 2211449 3786174 1520599
43601A520599l406230j126238J101410J101048L04576J69779j68519j237648j262425
43592c003648Q89759K983474K256490l29144j338894K29234J855642J341684o07867
43583D276730k176664k713732k245195n48022J798123K766489J112320j445881
43575H24168k078122n82265N54978r2338j008425k88286J607633K791819K433060
43566D162222J082411n42508j837161k111168j367593p01126q02126q02384J65418
43557b754015J219856J178813P83660J320077J782312J57550k657983l325215
43549b294945j002486J232849J024277j52110j41658M38862R9033o01594n31213
43540a928985l43447p95770o91685P31122J433370j02508j228454J034572M098868
$$ plain form
43601 1520599 -1885631 -3011869 -1910459 -809411 -504835 -335056 -503575 -1741223 -3003648
43592 -3003648 -2113889 869585 3126075 2796931 1458037 1687271 3542913 4884597 4276730
43583 4276730 2100066 -613666 -2858861 -3406883 -1608760 1157729 2270049 824168
43575 824168 -1253954 -1836219 -1281241 -1373579 -2382004 -2670290 -1062657 1729162 4162222
43566 4162222 5244633 4702125 2864964 753796 -613797 -1314923 -2117049 -2919433 -2754015
43557 -2754015 -1534159 -355346 428314 1748391 3530703 3688253 1030270 -2294945
43549 -2294945 -3297431 -2064582 -1040305 -1192415 -1334073 -895211 -796178 -1397772 -1928985
43540 -1928985 -2272432 -3068202 -3759887 -3028765 -1595395 -1697903 -2926357 -1891785 2207083
43531B207083K799676k247212m761669j972441J735577K085511O35095M42351
43523I23971O64753o99846k275229j700296Q755M60027J15442O68440J208674
43514f25309Q0551j211333l23356J217178L83531j446420l06214L123557L917399
43505D809584J009553j122584k89893Q8228j919702k537822P06200L294815O16897
43496D655276l737313l095650J673755L636507O24092k420880k092465p70243
43488a526921p54209l59319J471775J962428o16377l084744k129584M71963J246891
43479c318097O81536J270229K259084R93345j798858k631778p37312J139628J288586
43470h53637N97775l62575j913412k709927p37629K427096K614097m18883j883212
$$ plain form
43531 2207083 5006759 2759547 -2002122 -3974563 -2238986 -153475 481620 923971
43523 923971 1588724 888878 -1386351 -3086647 -3077892 -2617865 -2502423 -1833983 -625309
43514 -625309 -544758 -1756091 -2079447 -862269 -478738 -1925158 -2231372 892185 4809584
43505 4809584 5819137 4696553 4406660 4494888 2575186 37364 743564 4038379 4655276
43496 4655276 917963 -2177687 -503932 3132575 3756667 1335787 -756678 -1526921
43488 -1526921 -2281130 -2640449 -1168674 793754 177377 -2907367 -5036951 -4564988 -3318097
43479 -3318097 -2636561 -1366332 892752 1886097 87239 -2544539 -3281851 -2142223 -853637
43470 -853637 -255862 -618437 -2531849 -5241776 -5979405 -3552309 -938212 -1357095 -3240307
43461c240307O26750L190378K122724P1390J068652L072803J250825l264047m306210
43452E92958l16795L046726J489850j971130k321117L07586K136987J543056n4648
43443D453473j326128j988389j698298n04196L79466J88648k6836N74896P26623
43434G79259o19765j659649l24000J730536J175255j516176k424486k56773J779780
43425a336019J276839J30641P42877J845079Q99676j483888k520366j404811J89480
43416a660492R87090J054842M43062p66322j383372l27072J262357J332570K15836
43407A158499J85472J521633J695320o16238l159679l250692j367933J20485L52508
43398c360625K50912M15155N51494M89511L31828K3037j57375N49083J849365
$$ plain form
43461 -3240307 -2613557 576821 2699545 2770935 3839587 6912390 8163215 4899168 592958
43452 592958 276163 3322889 4812739 2841609 520492 828078 2965065 4508121 4453473
43443 4453473 3127345 1138956 -559342 -1063538 -684072 -495424 -522260 52636 779259
43434 779259 159494 -1500155 -1824155 -93619 1081636 -434540 -2859026 -3115799 -1336019
43425 -1336019 -59180 71461 814338 2659417 3559093 2075205 -445161 -1849972 -1660492
43416 -1660492 -673402 381440 824502 58180 -1325192 -1652264 -389907 942663 1158499
43407 1158499 1343971 2865604 4560924 3944686 785007 -2465685 -3833618 -3713133 -3360625
43398 -3360625 -3109713 -2694558 -2143064 -1653553 -1321725 -1298688 -1456063 -906980 942385
43389I42385J792461o21164l136707k651360N53613L149630L101930J432442k72679
43380D290551j542592j801282j82663K353146L123676J323409o39877q54587o51458
43371E418323j764819l068286k672934j322129p53644l45028J216018K315706
43363i76793O10457j851943n42261L992607N579288J417680l176758k492806J094400
43354C653871J171202k668604m478942j258411K817654K926257P6263j512392
43346G26898o01132N37310K66058o48996j063320r62827o97210k98929L8747m7970
43336b751371k75319J27812J065103J344131L76009p74715q63290k69233k28753
43327b249626p28935n59617N45499J309027R19828K68209L60049P15645M28591
$$ plain form
43389 942385 2734846 2113682 -1023025 -3674385 -3120772 28858 3130788 4563230 4290551
43380 4290551 2747959 946677 764014 3117160 6240836 7564245 6924368 6069781 5418323
43371 5418323 3653504 585218 -2087716 -3409845 -4163489 -4508517 -3292499 -976793
43363 -976793 -366336 -2218279 -2760540 1232067 6811355 8229035 5052277 2559471 3653871
43354 3653871 4825073 2156469 -2322473 -3580884 -763230 2163027 2239290 726898
43346 726898 125766 663076 929134 280138 -783182 -1746009 -2443219 -2742148 -2703401 -2751371
43336 -2751371 -3026690 -2898878 -1833775 -489644 -113635 -888350 -1751640 -2020873 -2249626
43327 -2249626 -2978561 -3538178 -2992679 -1683652 -763824 -495615 -135566 580079 1008670
43318A008670k03891l43663o9047M7691k0525l08967j294610k371373j512330
43309e068045J418277K870376L45359k683453j048839L658686M448176n13176
43301C427361m679299k929626J154137J834318m0704k30195R40874K30998j428151
43292a720287l44779K486035K146915j794302m056447j956116R67584J417395
43284b854002R29045J602606K207867J415841O23909O65390k89051k625475l161306
43275a485176m61426J730589K94026j825335o10620J907858J027210k385310k964841
43266d773025O59494M030815L782227J549212R0965m43188j099821j999170k695173
43257h97664k562777p21256K351341L856888K021151o26040o51387P64845l7312
$$ plain form
43318 1008670 804779 461116 392069 439760 419235 110268 -1184342 -3555715 -5068045
43309 -5068045 -3649768 -779392 -434033 -3117486 -4166325 -507639 3940537 3427361
43301 3427361 -1251938 -4181564 -3027427 -1193109 -1233813 -1464008 -523134 -292136 -1720287
43292 -1720287 -2065066 420969 2567884 773582 -3282865 -5238981 -4271397 -2854002
43284 -2854002 -1924957 -322351 1885516 3301357 3925266 4590656 4301605 1676130 -1485176
43275 -1485176 -1946602 -216013 78013 -1747322 -2357942 -450084 577126 -1808184 -4773025
43266 -4773025 -4113531 -82716 3699511 5248723 5339688 4896500 3796679 1797509 -897664
43257 -897664 -3460441 -4181697 -1830356 2026532 4047683 3421643 2770256 3535101 3497789
43248C497789k446078k301309N27060J282286j482321k942730j31600K719506
43240a277397J260195j468932j63875L603471L697781p94952m301462l203084
43232b648255o6535J480762J357999Q24906l64289k208981k723929n86763K200796
43223b734289K651709P99689o42833j20982J072859J035596k27432j189930j009633
43214c65246m04821k41033j57588N31758J141331L05839j582609k373626j211419
43205d357414K24183N69403Q62554K064447K514525N06312k061831j873845O42992
43196i08674J832101M74363p26237o8033M94152o48260j526407j7312K169918
43187A075611K092521K85601n06949q0273n88964k037505j757169R25934K892028
$$ plain form
43248 3497789 1051711 -1249598 -722538 559748 -922573 -3865303 -3996903 -1277397
43240 -1277397 -17202 -1486134 -1650009 1953462 5651243 4856291 554829 -2648255
43232 -2648255 -2714790 -1234028 123971 948877 584588 -1624393 -4348322 -4935085 -2734289
43223 -2734289 -82580 717109 74276 -46706 1026153 2061749 1834317 644387 -365246
43214 -365246 -770067 -1011100 -1168688 -636930 504401 810240 -772369 -3145995 -4357414
43205 -4357414 -4133231 -3563828 -2701274 -636827 1877698 2384010 322179 -1551666 -908674
43196 -908674 923427 1397790 671553 603520 1097672 449412 -1076995 -1094307 1075611
43187 1075611 3168132 3453733 2946784 2866511 2277547 240042 -1517127 -591193 2300835
43178B300835J648218j051993j907235m68821J131453J404413M38850j291256
43170B204464k965156l005111p58268J829679K315217J207402R62685J666368
43162C457280P37998k248856l720401j226584K232787K092759j228169l160699
43154c063885j615316Q79151J760625J482683J055135M9367j238718q06130J547635
43145E0547K510554o5610l151127k643994L62022J433850k08425j084903K91704
43136b505382J336277O13663M88314K280056K878483l87674m511411m463890l49734
43127d621298L083714L224280J935611J160019J24285j847445k912694j258714
43119a112242J696191K720155O87819k349707l678323k497573j31531J576387
$$ plain form
43178 2300835 3949053 2897060 989825 521004 1652457 3056870 3495720 2204464
43170 2204464 -760692 -3765803 -4524071 -2694392 -379175 828227 1790912 3457280
43162 3457280 4195278 1946422 -1773979 -3000563 -767776 1324983 96814 -3063885
43154 -3063885 -4679201 -3800050 -2039425 -556742 498393 547760 -690958 -1497088 50547
43145 50547 2561101 2495491 -655636 -3299630 -2937608 -1503758 -1712183 -2797086 -2505382
43136 -2505382 -1169105 -555442 -67128 2212928 5091411 4703737 192326 -4271564 -4621298
43127 -4621298 -1537584 1686696 3622307 4782326 4906611 3059166 146472 -1112242
43119 -1112242 583949 3304104 3991923 1642216 -2036107 -4533680 -4665211 -3088824
43111c088824J857862J197322K64774o92852j216474m48391J443276K525791J270387
43102C112871j048326j841136q58657l48558j356490k107105j004258Q02389J400239
43093c249031J071906J287336J742604P38013j568342k523619n31708K245313
43085g87528K238904r31005l700880k835473O78175L094155K593074Q27455k14009
43076I62868o87182j139425m94183J868264L524729J626259k406181m096642k065736
43067b907229L48097M26854m18373o4347P44368O37214N34182J368749J351812
43058B021327j070385l487671k597038L45294J259135k97690p84421J113347K383717
43049a114385R25202j097465j025018L53715Q01963J42215l52331k40899J73571
$$ plain form
43111 -3088824 -1230962 -33640 231134 -461718 -1678192 -2126583 -683307 1842484 3112871
43102 3112871 2064545 223409 -635248 -983806 -2340296 -4447401 -5451659 -4649270 -3249031
43093 -3249031 -2177125 -889789 852815 1590828 22486 -2501133 -3032841 -787528
43085 -787528 1451376 520371 -3180509 -6015982 -5337807 -2243652 349422 1176877 962868
43076 962868 275686 -863739 -1357922 510342 4035071 5661330 3255149 -841493 -2907229
43067 -2907229 -2559132 -2132278 -2550651 -2614998 -1870630 -1233416 -699234 669515 2021327
43058 2021327 950942 -2536729 -5133767 -4788473 -3529338 -3827028 -4611449 -3498102 -1114385
43049 -1114385 -189183 -1286648 -2311666 -1957951 -1155988 -1013773 -1366104 -1607003 -1433432
43040a433432O66083N69218p77289k039498p28571K586753L683887M93184l153524
43031a33189k576398J042071K560656K41361k558683k742900r65212P22117J660343
43022b749834J970042J462167M05850j73539N8579J81937m14107r90600o18937
43013h68442M64761J173351P13595o77850j676003r06291J245759K478223J264574
43004C211677j001197j892515j214059n92903m42656L48236J764945K172506J025018
42995C379052j66998m30001p79019j886416k269530n35673J954382K603833J049658
42986B919288o51508j028589p41202q64757r95596j3105J761978K323823M77189
42977C187521k096349k546832o76173N70286p62166k728815k320632K72157K446626
$$ plain form
43040 -1433432 -767349 -198131 -975420 -3014918 -3743489 -1156736 2527151 3020335 -133189
43031 -133189 -2709587 -1667516 893140 1134501 -1424182 -4167082 -5132294 -4410177 -2749834
43022 -2749834 -779792 682375 1088225 914686 973265 1155202 741095 -249505 -868442
43013 -868442 -403681 769670 1483265 805415 -870588 -1776879 -531120 1947103 3211677
43004 3211677 2210480 317965 -896094 -1488997 -1931653 -1583417 181528 2354034 3379052
42995 3379052 3212054 2782053 2003034 116618 -2152912 -2688585 -734203 1869630 2919288
42986 2919288 2267780 1239191 497989 -366768 -1362364 -1375469 386509 2710332 3187521
42977 3187521 1091172 -1455660 -2131833 -1561547 -2323713 -5052528 -7373160 -7101003 -4654377
42968d654377L075241K879363J745499r53770l463341k818890L04602J635734
42960b249939l66980j979344k20842K287731J762607n53618q51879O96119O18360
42951h57785j488947k135139P6241K038643J212691n04336j67260J586938J839839
42942A600885j67897k259398k457407j118622J19166M40195N19328J296960K343222
42933C16432K071169K8737j876383j561083M61994J893743J703354P31139l01996
42924C467106j354809j785198p81895O71338N59371r38192j367249J05401J288258
42915a35869O64006j55140N04134J306819L21539j492414j961383j330109j270501
42906c548918j418629j41208J833327J932836j8198j270108m14207P95873P62772
$$ plain form
42968 -4654377 -1579136 1300227 3045726 2091956 -1371385 -4190275 -3885673 -2249939
42960 -2249939 -2616919 -4596263 -4817105 -2529374 -766767 -1320385 -2172264 -1476145 -857785
42951 -857785 -2346732 -4481871 -4405630 -2366987 -1154296 -1658632 -1825892 -238954 1600885
42942 1600885 1432988 -826410 -3283817 -4402439 -4283273 -3843078 -3323750 -2026790 316432
42933 316432 2387601 2416338 539955 -1021128 -559134 1334609 3037963 3769102 3467106
42924 3467106 2112297 327099 -454796 216542 775913 -162279 -1529528 -1424127 -135869
42915 -135869 528137 372997 877131 2183950 2505489 1013075 -948308 -2278417 -3548918
42906 -3548918 -4967547 -5108755 -3275428 -1342592 -1360790 -2630898 -3045105 -2249232 -1486460
42897a486460L38998N54558P04368K89916M34208J486244J498880o37052k594647
42888E89013j859904J19087K14078j146206p28143J834721L080129J227519j050070
42879B280224j097226k92819j030899k214326j093143J758298K821698Q17225
42871A949032j610728j943935q63556k27769k32336r6795J04791R129J69254R68161
42861a774752J259223k23j394861n74308J924330K826579Q47921j106655j51988
42852A855266K085987J768085j307679l210273j544953J286577J875579M62641
42844C271230l81040m1072m9586p50625p58247J11015K08213q53936j146108K08996
42834a81160J154197J13442j070984k61937R20718l37427k683884k023341J717225
$$ plain form
42897 -1486460 -1147462 -592904 111464 401380 835588 2321832 3820712 3183660 589013
42888 589013 -1270891 -1151804 -937726 -2083932 -2812075 -977354 2102775 3330294 2280224
42879 2280224 1182998 890179 -140720 -2355046 -3448189 -1689891 1131807 1949032
42871 1949032 338304 -1605631 -2469187 -2696956 -2929292 -3026087 -2921296 -2912167 -2742913 -1774752
42861 -1774752 -515529 -515752 -1910613 -2484921 -560591 2265988 3113909 2007254 1855266
42852 1855266 3941253 5709338 4401659 1191386 -353567 933010 2808589 3271230
42844 3271230 2890190 2849118 2799532 2048907 1290660 1401675 1609888 755952 -390156 -181160
42834 -181160 973037 1086479 15495 -246442 674276 336849 -2347035 -4370376 -2653151
42825b653151L674068J195100k201820k386210n24623o0396o54072M62468K621508
42816e27128K124122j370460l430231j274549K118401K549351L84289q84774Q4608
42807b26371J508992J751318R60751j51847j021968r43497O6631M32780j022780
42798A354009k632011j695768J261116K705706J219646l60460N87628K405239
42790D845105J938660m39889j565542m09449P45555J09118j381108k285881k722559
42781a165990l058324k521541o27810J375762J992245J455200R24793N91335r173
42772a043503m59162J95002J697025K439132J279540j119809k788133k115764
42764a915672M50073K292462J273557j277773j889491J03566J256309p08639k866539
$$ plain form
42825 -2653151 1020917 2216017 14197 -2372013 -2896636 -2957032 -3611104 -3148636 -527128
42816 -527128 1596994 226534 -3203697 -4478246 -2359845 189506 573795 -310979 -226371
42807 -226371 1282621 3033939 3994690 3842843 2820875 1877378 1944009 2376789 1354009
42798 1354009 -1278002 -2973770 -1712654 993052 2212698 1852238 2439866 4845105
42790 4845105 6783765 6343876 4778334 4368885 5114440 5223558 3842450 1556569 -1165990
42781 -1165990 -4224314 -6745855 -7373665 -5997903 -4005658 -2550458 -1625665 -1034330 -1043503
42772 -1043503 -1502665 -1307663 389362 2828494 4108034 2988225 200092 -1915672
42764 -1915672 -1465599 826863 2100420 822647 -1066844 -963278 293031 -415608 -3282147
42755c282147j329189K413931L432408Q27395j229024k93571J072672L46643r06544
42746A052574n64769J11531o93205j543573m97012O89515o54662k676648j103055
42737e879304L577688N819361K815747j654429k989759j757667j306138k119048
42729c493549j877862J25670J841108J729753P76534N80544J025403Q16920m14834
42720A109687j503736j276203j57666K65623o62842j659600j172834M27074J320057
42711c310440P43999j34421p5179O42164J013233P49258K40135j57855q5905Q26908
42701D51897K055396J942726l75333l105295l350505q63474J202789K96162j941692
42692c687329j814390J149960L318940K016654p66399j481352q3530O68556M232
$$ plain form
42755 -3282147 -4611336 -2197405 1235003 2062398 833374 539803 1612475 1959118 1052574
42746 1052574 487805 599336 -93869 -1637442 -2134454 -1444939 -2099601 -4776249 -5879304
42737 -5879304 -2301616 3517745 6333492 4679063 1689304 -68363 -1374501 -3493549
42729 -3493549 -5371411 -5245741 -3404633 -1674880 -898346 -317802 707601 1524521 1109687
42720 1109687 -394049 -1670252 -1827918 -1562295 -2225137 -3884737 -5057571 -4630497 -3310440
42711 -3310440 -2566441 -2700862 -2776041 -2133877 -1120644 -371386 -131251 -289106 -375011 451897
42701 451897 2507293 4450019 4074686 969391 -2381114 -3244588 -2041799 -1745637 -3687329
42692 -3687329 -5501719 -4351759 -1032819 983835 217436 -1263916 -1347446 -678890 -674658
42683f74658p1493J135099J628379N37140m3227J067626J560099l70467k308333
42674B460165j403243M83408k73541k560160j986862J593890L358493J151336
42666B823486j250850m63554J491003J278812n12207j542581j919205k582861
42658b677957k164003N22612K843164J512064j851155k693222m14102J216933
42650c705666N86847M42648K328583L280949O72503k966311l244298j03673K432672
42641b75746J796778n66912j893100j088036J025822K618154J867629j226570
42633B258019l797275k661551J428745L887412J901899j684427k152515N11396
42625c08297J769855n52795k861880j237020K412664L014199j18974k391671q81760
$$ plain form
42683 -674658 -746151 388948 2017327 2554467 2511240 3578866 5138965 4768498 2460165
42674 2460165 1056922 1540330 1266789 -1293371 -3280233 -1686343 1672150 2823486
42666 2823486 1572636 1109082 2600085 3878897 3366690 1824109 -95096 -2677957
42658 -2677957 -4841960 -4319348 -1476184 35880 -1815275 -4508497 -4922599 -3705666
42650 -3705666 -3118819 -2676171 -347588 2933361 3605864 639553 -2604745 -2708418 -275746
42641 -275746 1521032 954120 -938980 -2027016 -1001194 1616960 3484589 2258019
42633 2258019 -1539256 -4200807 -2772062 1115350 3017249 1332822 -819693 -308297
42625 -308297 1461558 908763 -1953117 -3190137 -777473 2236726 2117752 -273919 -1155679
42616a155679J698271J696915o0970l38265J155600J715387P7103k053761k813462
42607g8861k095677n16537J367982K439316J563652n90349j824601j125416K06948
42598f53543O54266L48154J25481o3781p57244j622459j455569M18889K983149
42589b2657L917116J747280j996021l663228j522469J926349L038327J556944
42581D981641J38179K4609j60266j180347j599094m47113R56458J265973J100109
42572E080149J186401N52163j379672k636580j208293J372175J702206o17542
42564D051007k418611j496907O44472J324661Q8604j453031j904198j170637m0145
42555b374785N31035J72512m49374l91518K51114N08231J13668m3842N88078J269789
$$ plain form
42616 -1155679 542592 2239507 2178537 1840272 2995872 4711259 4788362 2734601 -78861
42607 -78861 -2174538 -2691075 -1323093 1116223 2679875 2089526 264925 -860491 -653543
42598 -653543 723 348877 474358 410577 -346667 -1969126 -3424695 -3005806 -22657
42589 -22657 3894459 5641739 3645718 -17510 -1539979 386370 3424697 4981641
42581 4981641 5119820 5144429 4984163 3803816 2204722 1757609 2714067 3980040 5080149
42572 5080149 6266550 6818713 5439041 2802461 1594168 2966343 4668549 4051007
42564 4051007 1632396 135489 779961 2104622 2193226 740195 -1164003 -2334640 -2374785
42555 -2374785 -1843750 -1671238 -2120612 -2512130 -2261016 -1752785 -1639117 -1682959 -1094881 174908
42545A74908J164304O75607P12802J128641Q90988k70394j275822j085068j47213
42536A968753J10858p76889j464961m38162J722659K668419J243267q80847j443850
42527B709247n86236j28589m46290j43199J003817J139613n22385j787788o30737
42518F07453J352185J118592j123411k235537r94070L92746K67216K0741R85832
42509C91747J466677n04969l147800k821696N64436L075185K117492l36893j007519
42500b03340L16770J313025P10840n08005j024741p25944k33487K5596j4437j45372
42490d89095J32134J195752K504253K589388N05033k592657l998962k311067O24720
42481a840501J667281K38206j184851q10840O9878l18244j067434k23926J621980
$$ plain form
42545 174908 1339212 2014819 2727621 3856262 4747250 4476856 3201034 2115966 1968753
42536 1968753 2079611 1302722 -162239 -600401 1122258 3790677 5033944 4153097 2709247
42527 2709247 2123011 1994422 1548132 1404933 2408750 3548363 3025978 1238190 607453
42518 607453 1959638 3078230 1954819 -280718 -1274788 -882042 -614826 -594085 391747
42509 391747 1858424 1353455 -1794345 -4616041 -4051605 -976420 1141072 804179 -203340
42500 -203340 113430 1426455 2137295 1629290 604549 -121395 -354882 -329286 -343723 -489095
42490 -489095 -356961 838791 3343044 5932432 6437465 3844808 -154154 -2465221 -1840501
42481 -1840501 -173220 64986 -1119865 -1930705 -1860827 -2179071 -3246505 -3470431 -1848451
42472a848451K091310Q39589j65556n7365J56780L75717J699247L291509K489965
42463H872745n76751k051319j03919J856535N33902j950224j722281N64581J344312
42454F767581R8183p98901r19560j797267k737870j402227J363464J949948j52694
42445B370657j405350j34374J031102J15388j107571r59963p61150j477082j231541
42436c559884J015717K678883J536668m58411n85395J86176l73604j361924o36905
42427a558679Q70669P34281n60496p47842j09058n54573j257919L53796L395687
42418E65866L795887N20218k525300k205151k86889O915j211895j438125J90694
42409b587780J906056J761477j27113j662252r65194J217267K093400O67057m79005
$$ plain form
42472 -1848451 242859 1082448 916892 859527 1016307 1392024 3091271 6382780 8872745
42463 8872745 8295994 6244675 6140756 7997291 8531193 6580969 4858688 5423269 6767581
42454 6767581 6865764 6066863 5147303 3350036 612166 -790061 573403 2523351 2370657
42445 2370657 965307 830933 1862035 1977423 869852 -90111 -851261 -2328343 -3559884
42436 -3559884 -2544167 134716 1671384 1212973 627578 813754 440150 -921774 -1558679
42427 -1558679 -688010 46271 -514225 -1262067 -1371125 -1925698 -3183617 -2829821 565866
42418 565866 4361753 4881971 2356671 151520 -135369 -128454 -1340349 -2778474 -2587780
42409 -2587780 -681724 1079753 952640 -709612 -1674806 -457539 1635861 2302918 1823913
42400A823913Q98189K646082J172236k550923l828405j143979J785790J805848
42392B608751L71335J56715J023650J511555J457304Q52192j220699l970212l832297
42383a041706P57074N498820M821345o58588m856480m144476j084055L15902j64664
42374e56828j78543Q99795J341620K36905p79951J28337J969907J845881r05778
42365D001345l251254k471389q0939N98359l37778R632J674568J052557k741165
42356a546064m974818j819131L550425N260736K769383K50258l85614q89882j613188
42347F02105l56893K623382L236985m56544m500694m139213j00981L066816L023618
42338B998581J068035j083629k802527l286218j736715P86188J939265J195893
$$ plain form
42400 1823913 2722102 5368184 6540420 3989497 161092 -982887 802903 2608751
42392 2608751 2980086 3136801 4160451 5672006 7129310 7981502 6760803 2790591 -1041706
42383 -1041706 -284632 5214188 10035533 9376945 4520465 375989 -708066 -392164 -556828
42374 -556828 -735371 164424 1506044 1742949 962998 1091335 3061242 4907123 4001345
42365 4001345 750091 -1721298 -1802237 -1203878 -1541656 -1532024 142544 1195101 -1546064
42356 -1546064 -6520882 -8340013 -4789588 471148 3240531 3490789 3105175 2215293 602105
42347 602105 245212 2868594 6105579 5649035 1148341 -2990872 -3091853 -25037 2998581
42338 2998581 4066616 2982987 180460 -3105758 -4842473 -4056285 -2117020 -921127
42330i21127N54688J353350K092986P94788j689339k550178q85314J094997J165480
42321A010331j26266q23830n70167n89339j128175r31226L18422R55810j13118
42312a997558j359179p93576Q81795J287663J8000q89205k27635P53901O94462
42303a631332K23444N25086J198886J044774J44603l76088k91208m69039j025137
42294f56011p02338J149896K875110J979376j689291n159330n292640k088835
42286i584063J591366L295816L028328K003961O88404r63508k160826j643095
42278c743617N15806K514815K628306Q61704j354518k585486k337676j117611
42270d618277R6067O09461M03781j58122o71742n54190P98281K985264M170361
$$ plain form
42330 -921127 -366439 986911 3079897 3874685 2185346 -364832 -1250146 -155149 1010331
42321 1010331 884065 60235 -509932 -1099271 -2227446 -3158672 -2840250 -1884440 -1997558
42312 -1997558 -3356737 -4150313 -3268518 -1980855 -1962855 -2852060 -3079695 -2325794 -1631332
42303 -1631332 -1407888 -882802 316084 1360858 1505461 1129373 838165 369126 -656011
42294 -656011 -1358349 -208453 2666657 4646033 2956742 -2202588 -7495228 -9584063
42286 -9584063 -7992697 -4696881 -1668553 335408 1023812 60304 -2100522 -3743617
42278 -3743617 -3227811 -712996 1915310 2777014 1422496 -1162990 -3500666 -4618277
42270 -4618277 -4522210 -3912749 -3508968 -3667090 -4338832 -4893022 -4094741 -1109477 3060884
42261C060884K794710j85994j860032o93720J500285J753034l61594k294456j894998
42252A818119r1239O57108j98732r43314o25492m59780j242044j336230P23978
42243a697626L078097K788758N00704m42048N43035N15532j430034k025431N61925
42234B392912K878581J311949k061213k823944j078648m05717j466842j511527
42226b764449K32524J384176Q64717K61901K49743k94433j009969l2801J924660
42217H16069J755200o23212j464978N94365K141412R95969j09733J098047J963690
42208G166829k03617k772561k061658K49204J62512j635046j383797P02926Q53354
42199A078146j237313j557597J270511L367210J680813j484649k315584p88525
$$ plain form
42261 3060884 5855594 5669600 3809568 3115848 4616133 6369167 6007573 3713117 1818119
42252 1818119 1726880 2383988 2185256 1241942 616450 156670 -1085374 -2421604 -1697626
42243 -1697626 1380471 4169229 4669933 4227885 4770920 5286452 3856418 1830987 2392912
42234 2392912 5271493 6583442 4522229 1698285 619637 213920 -1252922 -2764449
42226 -2764449 -2531925 -1147749 -283032 -21131 228612 -65821 -1075790 -1108591 816069
42217 816069 2571269 1948057 483079 1077444 3218856 4214825 4105092 5203139 7166829
42208 7166829 6963212 4190651 2128993 2378197 2540709 905663 -478134 224792 1078146
42199 1078146 -159167 -1716764 -446253 2920957 4601770 3117121 801537 13012
42191A3012K86244m00889j365306n99013J847773L265951Q04685m404820p029543
42182g581906l679586K000310L535961J47347k708759j310357J896229K862277
42174d838484J264146m48606n24669J159242L364714L664362P85415k554663k184177
42165c12720J358957K870678P3201k941919k190161M12064J087492K95811M95501
42156A148904Q30843q68536k769880j253034K353281K864949n47387k680622m03704
42147a325186K532753J585030j693255k588696m45185J162748L44794r04751n66723
42138a898471N83867J046393J054873J437131J663368Q39828k88565k48874N79018
42129D768568K81894j427308k396123j300204J96036J26135o25537j16579R82055
$$ plain form
42191 13012 299256 -101633 -1466939 -2065952 -218179 3047772 3852457 -552363 -7581906
42182 -7581906 -11261492 -9261182 -5725221 -5577874 -8286633 -9596990 -7700761 -4838484
42174 -4838484 -3574338 -4022944 -4547613 -3388371 -23657 3640705 4426120 1871457 -312720
42165 -312720 1046237 3916915 3990116 1048197 -1141964 -729900 357592 653403 1148904
42156 1148904 1979747 1111211 -1658669 -2911703 -558422 2306527 1759140 -921482 -1325186
42147 -1325186 1207567 2792597 1099342 -1489354 -1934539 -771791 -426997 -1331748 -1898471
42138 -1898471 -1314604 -268211 786662 2223793 3887161 4726989 4438424 4189550 4768568
42129 4768568 5050462 3623154 1227031 -73173 122863 248998 -376539 -493118 488937
42120D88937M03982j596174k364245j184556j37215l5692P76766K262821J448141
42111F2765k100240l585643K24189M768300L469200k211365m446995m56823L852403
42102d24209L056467n22389j623688K55103J786136J526128P26284O4863q14765
42093D029930j330337o30935K43120l35136j456165p01553J647774K364700O1802
42084C893200k371749j690930J144659K255634j10216l526831m375134j769952
42076f551319J816984L345445K216941L94839k84678j73745n85502j290944p62663
42067a874642J099279K252862J327239l29117o67595J74997O22877M29309O83132
42058C718341J331088Q64971j108447k891535l048417k120460j187542l61253
$$ plain form
42120 488937 892919 -703255 -3067500 -4252056 -4389271 -4424963 -3648197 -1385376 62765
42111 62765 -2037475 -5623118 -5398929 -630629 2838571 627206 -3819789 -4276612 -424209
42102 -424209 2632258 2109869 486181 741284 2527420 4053548 4779832 4844695 4029930
42093 4029930 2699593 2068658 2311778 1976642 520477 -181076 1466698 3831398 3893200
42084 3893200 1521451 -169479 975180 3230814 3120598 -406233 -4781367 -6551319
42076 -6551319 -4734335 -1388890 828051 1222890 938212 764467 178965 -1111979 -1874642
42067 -1874642 -775363 1477499 2804738 2475621 1808026 1983023 2605900 3035209 3718341
42058 3718341 5049429 5914400 4805953 1914418 -1133999 -3254459 -4442001 -4803254
42050d803254K80202j5076j050437r92075R87778K913696K806235J683027J370727
42041C180823J026507q91477k574769j048086K080883J952498j777579l654841
42033a706041q38311K316107J341415j354811j142475J013745J024489o15146
42025C8972O1462K736716K723729q52779k970257o33945K507752K178874m36650
42016E353874j885454j947092k185533j890813L84994K949301K634421k92278
42008C121420k241823j254958Q71455J596632N74549q37486j429453j028376l75868
41999a003908k32962l50609P2426P94233P29862P8115L11074J281581P94407j463227
41989A010992k277826L95223L575799L273945L69804j207623o82317o03312j571816
$$ plain form
42050 -4803254 -4523052 -4538128 -5588565 -6580640 -5592862 -2679166 127069 1810096 3180823
42041 3180823 4207330 3315853 741084 -307002 1773881 3726379 1948800 -1706041
42033 -1706041 -2544352 -228245 1113170 -241641 -1384116 -370371 654118 38972
42025 38972 100434 2837150 5560879 4708100 1737843 1103898 3611650 5790524 5353874
42016 5353874 3468420 1521328 -664205 -2555018 -2170024 779277 3413698 3121420
42008 3121420 879597 -375361 496094 2092726 2667275 1829789 400336 -628040 -1003908
41999 -1003908 -1236870 -1587479 -1515053 -720820 9042 87157 398231 1679812 2474219 1010992
41989 1010992 -1266834 -871611 2704188 5978133 6347937 5140314 4457997 3854685 2282869
41980B282869j335543N85096J651369O53354m92612m96833o59243j611920j556341
41971i79804L69684K038334J644768L14907m52818j077637j697235q54952J224112
41962E29359J360020j555852l539827j292136K064654J688127j045679r20423
41954b711757K210766L138715O3282k512507j273357R94583P01022q21306l49388
41945e59947J682671K286682O22479j483130k467056k096458o84135Q71026J304477
41936e23391O36620L00506O33853K25814j102898j293335K45618Q53261r81905
41927a005857k414434p46535J647569J139918o72705M86331L754952L740808o68790
41918E261257l862694j777951K278346K929833M2977k526347k700947j353309
$$ plain form
41980 2282869 947326 1532422 3183791 3837145 3344533 2847700 2188457 576537 -979804
41971 -979804 -610120 1428214 3072982 3387889 2935071 1857434 160199 -694753 529359
41962 529359 1889379 333527 -3206300 -4498436 -2433782 -745655 -1791334 -2711757
41954 -2711757 -500991 2637724 2701006 188499 -1084858 -90275 610747 -210559 -559947
41945 -559947 1122724 3409406 4031885 2548755 81699 -2014759 -2698894 -1827868 -523391
41936 -523391 113229 413735 1047588 1273402 170504 -1122831 -877213 -23952 -1005857
41927 -1005857 -3420291 -4166826 -2519257 -1379339 -2052044 -1565713 2189239 5930047 5261257
41918 5261257 1398563 -379388 1898958 4828791 4871768 2345421 -355526 -1708835
41910a708835L93194J871606K012688M65453j131783j099489j64413r2645p83128
41901b37352p12233M36189J547405J990424J961788J321240k14236j973819k899930
41892A219476k908555k416477j144787J038075K673936K025343l05188j828835
41884a647012j317408Q1347R58305J234920J297279J059210N41999K86274N56080
41875C050994Q93469Q53443M83267j74611j295023k629396l219247k148282M86549
41866c698837L203045L752410J039934k940772m217708j220868K797799L428563
41858B143566N54737j978012j828234n89847k03133J29740J593815K619139R16052
41849C357823k346118l351609q14631K174628K401202N68575m71375o8996j42405
$$ plain form
41910 -1708835 -1315641 555965 2568653 3034106 1902323 802834 638421 545776 -237352
41901 -237352 -949585 -513396 1034009 3024433 4986221 6307461 6093225 4119406 1219476
41892 1219476 -1689079 -4105556 -5250343 -4212268 -1538332 487011 181823 -1647012
41884 -1647012 -2964420 -2883073 -1924768 -689848 607431 1666641 2208640 2494914 3050994
41875 3050994 3944463 4797906 5281173 5106562 3811539 1182143 -2037104 -4185386 -3698837
41866 -3698837 -495792 3256618 4296552 1355780 -2861928 -4082796 -1284997 2143566
41858 2143566 2698303 720291 -1107943 -1697790 -1900923 -1771183 -177368 2441771 3357823
41849 3357823 1011705 -2339904 -3154535 -979907 1421295 1989870 1518495 1449499 1307094
41840A307094j563200k474588j044267J696149L107600K214755M13640o33787
41832C023396n24778K62870R94717Q78877k03897j074064m97678Q64807J066963
41823D791213l31488j525783j030794M13849J212760R23940J42811m46466k20227
41814C929815R46955J793758P09527j657759k614533j180304L83454R4944q99850
41805A506007p77429o9397J09573O99004K551554L467471J005674k812449l472541
41796B207467l58067K480427K116849j03191j631679j673179m07199J676241K859262
41787G166931J472636j141122j717010K80861K076921K141923J807077J550262
41779A3638479j90267k912357l126388p3590J813792m67044l297048k106266J139565
$$ plain form
41840 1307094 -256106 -2730694 -3774961 -2078812 1028788 3243543 3657183 3023396
41832 3023396 2498618 2761488 3756205 4635082 4431185 3357121 2859443 3724250 4791213
41823 4791213 4459725 2933942 1903148 2316997 3529757 4453697 4596508 4150042 3929815
41814 3929815 4876770 6670528 7380055 5722296 3107763 1927459 2310913 2405857 1506007
41805 1506007 728578 659181 768754 1467758 4019312 7486783 8492457 5680008 2207467
41796 2207467 1849400 4329827 6446676 6343485 4711806 3038627 2631428 4307669 7166931
41787 7166931 8639567 7498445 5781435 6062296 8139217 10281140 12088217 13638479
41779 13638479 13448212 10535855 7409467 7335877 9149669 8682625 5385577 3279311 4418876
41770D418876J352109j135676j406996J507446K991998M79640k661977k726406
41762B819014p44363M40791O30141J039617J284182M64368n60926o10856m95825
41753D266143j428161k296981j154990J279324K297975J232436J94989M54220
41745D844955O74527j86137o35749P66986K294974J073719k413354m430017k912110
41736i22206o1632Q97662k46943j262787q00026M21945J143282R34270K55043
41727C58608r614O22428J405040J101950k7148k49170Q49051J189956p85710l432906
41717A022485l982896k050280O94006K921444L752720K209834q78054k165064
41709A524195p9791J919773J34679l066072k541394J174781K539763R3167j458220
$$ plain form
41770 4418876 5770985 4635309 3228313 4735759 7727757 8207397 5545420 2819014
41762 2819014 2074651 2515442 3145583 4185200 5469382 5933750 5372824 4761968 4266143
41753 4266143 2837982 541001 -613989 665335 2963310 4195746 4390735 4844955
41745 4844955 5519482 5333345 4697596 5464582 7759556 8833275 6419921 1989904 -922206
41736 -922206 -983838 -86176 -333119 -1595906 -2395932 -1973987 -830705 103565 358608
41727 358608 348994 971422 2376462 3478412 3451264 3202094 4051145 5241101 4455391 1022485
41717 1022485 -2960411 -5010691 -4316685 -1395241 2357479 4567313 3689259 1524195
41709 1524195 1444404 3364177 3498856 432784 -2108610 -933829 1605934 1699101 240881
41700B40881M60053K292092J212407o9826R73289J622049q57947l468189k091953
41691C12856J648867L248755K184637J001719J37529j262995j610884P44510L090434
41682I495428J626287k006475k684407L93380K833119J705151j426841l918939
41674F016703m388508k102864J964900M143754K113979j077835j200722N83759
41666F053166L19290j354865o47098J663810J079220k065326k405792J015822
41658C658227K725709L69646j236663J077802L088510P46969k641081k080220
41650E708899J157252K606009J767803J061593P88159m1692m94773L55344P91790
41641A3700384m09143j036106M90565J293421j294265m296934l342909J90103
$$ plain form
41700 240881 700934 2993026 4205433 4135607 5108896 6730945 5872998 2404809 312856
41691 312856 1961723 5210478 7395115 8396834 8534363 7271368 5660484 6404994 9495428
41682 9495428 11121715 9115240 6430833 6824213 9657332 11362483 9935642 6016703
41674 6016703 1628195 -474669 1490231 5633985 7747964 6670129 5469407 6053166
41666 6053166 6372456 5017591 4370493 6034303 7113523 5048197 2642405 3658227
41658 3658227 6383936 6753582 5516919 6594721 9683231 10430200 7789119 5708899
41650 5708899 6866151 9472160 11239963 12301556 13089715 13048023 12553250 12908594 13700384
41641 13700384 13291241 12255135 12745700 14039121 12744856 8447922 5105013 5295116
41633E295116J562005K26571m27864N04637P95213J76877P95835K530892K629416
41624A4088698N12082j108821m68098J290405K669738L318042L047592K185660
41616B5535298K396569M297035N272489K998487n3188M52764M244229P174049
41608E2317732P696502Q007856R141433R937293J1075255J4938208K0590644K3984398
41600A57689321K4531563K6333159L0622589L1717089K3680268P664536j0048753
41593B92189772k4193356l2210980l3237633k9017882k3943916k1119936j9376331
41586A09089738j6018134j1057407o959868n547519o575910q100961p438192l490992
41578D3900755J265662L226429K403169J894633K238561K24671n160983r693153
$$ plain form
41633 5295116 6857121 7083692 6655828 7160465 7955678 8132555 8928390 11459282 14088698
41624 14088698 14600780 13491959 13023861 14314266 16984004 20302046 23349638 25535298
41616 25535298 27931867 32228902 37501391 40499878 40446690 40899454 45143683 52317732
41608 52317732 60014234 68022090 77163523 87100816 98176071 113114279 133704923 157689321
41600 157689321 182220884 208554043 239176632 270893721 294573989 302238525 292189772
41593 292189772 267996416 235785436 202547803 173529921 149586005 128466069 109089738
41586 109089738 93071604 82014197 75054329 69506810 62930900 54829939 47391747 43900755
41578 43900755 45166417 48392846 50796015 52690648 54929209 55153880 49992897 40299744
41570D0299744r406388n746036k481284p05820R7251p32392l121974m310241k574310
41561A1318550m70482o20411r91019J180108L409397J482912k780293l520624
41553I008138j57361J632296r28462l654249k481608P66770K485139K570925K347614
41544A1589202J083755j713964l565238k410254m38228p68741k235161j468292
41536G3079J206372K264064Q43406k15375M49859O72769q43118j855101m83584
41527B112371J278133P88302p19728j39797K192393K712450J19414k576777k416386
41518C350375k94230J054329Q76433L95572L05524J88059j90311n69707q33515
41509D282529q27157j38894Q64856P49278q06752j670695j13177K028237J722812
$$ plain form
41570 40299744 30893356 25147320 22666036 21960216 22057467 21325075 18203101 13892860 11318550
41561 11318550 10848068 10227657 9236638 10416746 13826143 15309055 12528762 9008138
41553 9008138 8850777 10483073 9554611 5900362 3418754 4185524 6670663 9241588 11589202
41544 11589202 12672957 10958993 7393755 4983501 4545273 3776532 1541371 73079
41536 73079 1279451 3543515 4386921 4171546 4621405 5294174 4451056 2595955 2112371
41527 2112371 3390504 4178806 3459078 3319281 5511674 8224124 8343538 5766761 3350375
41518 3350375 3056145 4110474 4986907 5382479 5688003 5876062 5685751 5116044 4282529
41509 4282529 3455372 3316478 4181334 4930612 4123860 2453165 2339988 4368225 6091037
41500F091037l43511n64716J715450K866725P75531j646250j116649R03274R38278
41491I619169q36034j335647J24515R65994k60128j843767j936575j075644p20683
41482B701200j087305j406291j163157m15587L57162N41272J75840J17648N99561
41473D20343M16654j111376k269027r99828J717199K824727J425366k68760m82122
41464A673176m844n7726k21439L08441J044476J050837L64760l68938p82302o80442
41454B325999K9811Q75123J184362J058589R06993K11300j634730l349515k727552
41445a119620N1901K228629K201620J270905Q39923L12419q92200j576304q49028
41436B468245k5708m69635j223623q48929o6467k85766q06173J3360J654973K025044
$$ plain form
41500 6091037 5747526 5182810 6898260 9764985 10540516 8894266 7777617 8680891 9619169
41491 9619169 8783135 7447488 7572003 8537997 8277869 6434102 4497527 3421883 2701200
41482 2701200 1613895 207604 -955553 -1371140 -1013978 -472706 -296866 -179218 420343
41473 420343 836997 -274379 -2543406 -3543234 -1826035 998692 2424058 2155298 1673176
41464 1673176 1668332 1610606 1389167 1697608 2742084 3792921 4157681 3788743 3006441 2325999
41454 2325999 2355810 3230933 4415295 5473884 6380877 6592177 4957447 1607932 -1119620
41445 -1119620 -1067719 1160910 3362530 4633435 5473358 5785777 4893577 3317273 2468245
41436 2468245 2442537 1972902 749279 -99650 -166117 -451883 -1258056 -1244696 410277 2435321
41426B435321P38384m62571m75597m1744q1863m30885m05620L96838J657185K013536
41416E342984J63785k771065l558991j129370J252749M36817j707212j058282
41408c028585K257268M045305K475097K13111n40252j063818k531517l123118
41400a296509j286802R34897Q39411n67802j71562K388718M308736L645086J303545
41391A0097718r37086k276685k543908j790101p58987m83164r14406r05061O5150
41382d46530R98490O96473o24239j541280j016514N07098J509812Q70991q73308
41373H0993j789359m37830K277109L491878J256082k834906m661256k044963K322950
41364b339302L742342J181742j671710j539074M02191J089638K33228r3693O50490
$$ plain form
41426 2435321 3173705 2711134 2235537 2193793 2111930 1681045 1275425 1672263 3329448 5342984
41416 5342984 5506769 2735704 -823287 -1952657 -699908 -263091 -1970303 -3028585
41408 -3028585 -771317 3273988 5749085 5962196 5421944 4358126 1826609 -1296509
41400 -1296509 -2583311 -1648414 -809003 -1376805 -1548367 840351 5149087 8794173 10097718
41391 10097718 9160632 6883947 4340039 2549938 1790951 1307787 393381 -511680 -446530
41382 -446530 551960 1248433 624194 -917086 -1933600 -1426502 83310 954301 80993
41373 80993 -1708366 -2146196 130913 3622791 4878873 2043967 -2617289 -4662252 -2339302
41364 -2339302 1403040 2584782 913072 -626002 -223811 865827 1099055 1005362 1655852
41355A655852R45888L09563J4748L36223j94625j902343k794011j558461L14101
41346b873065Q76974M90344O81326J594973K137489J685026L65410j443665k783537
41337G31275k313965o6643J906706J841624M11694n32527m90476l02987l35936
41328H48765q8717O32021J255398J173822L51116o71893j159028r27141o83646
41319G30697r83357j130181k18896J056082J241288O13959P97944J752739J539554
41310E399829k94013j623473j119907k39724m23879p16783L7492Q15088K39682
41301B074312j073834j893982k235363k053720k48885K889000M458430K708223
41293D624181J6324n19111N51986Q76397L54306R6718n63249k231942k522206
$$ plain form
41355 1655852 2601740 2911303 2926051 3262274 3067649 1165306 -1628705 -3187166 -2873065
41346 -2873065 -1996091 -1505747 -824421 770552 2908041 4593067 4958477 3514812 731275
41337 731275 -1582690 -1649333 257373 2098997 2510691 1978164 1487688 1184701 848765
41328 848765 760048 1392069 2647467 3821289 4172405 3500512 2341484 1414343 730697
41319 730697 -252660 -1382841 -1601737 -545655 695633 1309592 2107536 3860275 5399829
41310 5399829 5105816 3482343 2362436 2122712 1698833 982050 1019542 1834630 2074312
41301 2074312 1000478 -893504 -3128867 -5182587 -5431472 -2542472 1915958 4624181
41293 4624181 4640505 4121394 4673380 5549777 5904083 6000801 5437552 3205610 683404
41284F83404O63316M298183L502117j006784l641565k053115M69384J166965J205588
41275E287493J533384L80338k634510m134456j844110J392246J705471q6935k19810
41266A379111K036890L407501J385118k440667m365831k704720O45688K559925
41258A903015K093876P55544l95081j856619l068554j603079K531270M607787
41250D968159J167917l855357l989889J17645J772967j189159l384569r12362
41242e304648K848166L380931J593733N25561m7841j514615k377226o54835J983309
41233D32535K339112K86434j824511k703517k403005q76038J193015J853962M69675
41224a232338r29878p08386J74949O98740J645822K953954K503514K0354j303314
$$ plain form
41284 683404 1346720 5644903 9147020 8140236 4498671 2445556 2914940 4081905 5287493
41275 5287493 6820877 7201215 4566705 432249 -1411861 -19615 1685856 1598921 1379111
41266 1379111 3416001 6823502 8208620 5767953 1402122 -1302598 -656910 1903015
41258 1903015 3996891 4752435 4357354 2500735 -567819 -2170898 360372 4968159
41250 4968159 6136076 2280719 -1709170 -1591525 181442 -1007717 -4392286 -5304648
41242 -5304648 -2456482 924449 2518182 3043743 2995902 1481287 -895939 -1550774 432535
41233 432535 2771647 3058081 1233570 -1469947 -3872952 -4748990 -3555975 -1702013 -1232338
41224 -1232338 -2162216 -2870602 -2695653 -1996913 -351091 2602863 5106377 5126731 3823417
41215C823417L8270Q45030j184368k786545n15426K819837K363224j000604k652886
41206A749949j770141j060501p73450R16165K663224J357734j586215j492172
41198D593J772268L221943Q17861j626661j023436P97562J314556R74951N92315
41189F845952o07621k185001j645631J344160L356228J989627q13961k181034
41181F102719k046463j574480o98380P32163J720727J752562J580416J317919
41173H887183J26899j416501j467595k32486m067j011511p95967J088194J694554
41164F868703j84330j479832J07625K209639J815167j18854j192977j632276k398789
41155C994076j996180R57814L998711L589377L38501k101697k340987k058884
$$ plain form
41215 3823417 3861687 4706717 3522349 735804 220378 3040215 5403439 4402835 1749949
41206 1749949 -20192 -1080693 -1854143 -937978 1725246 3082980 1496765 4593
41198 4593 1776861 4998804 5816665 4190004 3166568 3964130 5278686 6253637 6845952
41189 6845952 6238331 4053330 2407699 3751859 7108087 9097714 8283753 6102719
41181 6102719 4056256 2481776 1783396 2515559 4236286 5988848 7569264 8887183
41173 8887183 9014082 7597581 6129986 5897500 5893433 4881922 4085955 5174149 6868703
41164 6868703 6684373 5204541 5312166 7521805 9336972 9218118 8025141 6392865 3994076
41155 3994076 1997896 2955710 6954421 10543798 10882299 8780602 6439615 4380731
41147D380731k192774j631000K87634K532374L760645L222671P85283k293829
41139H851735l470079j613933J248324K595748K625305K875398L093996K091793
41131A8298287P01128R44046K575705L213387K049035J000067J719061L528773
41123C4029489N013733O032806P278433Q832362R983057J0267487J0416699J1946292
41115A03800358J5161917J7771928J6760055J1755335M994695k085448r743024
41108A58415816j6750060j9590567j7111328j3362737j2765572j4230974j3302103
41101E1302475q857267m198157k037347j842218k264540l033294l727220l303255
41093B2039177j901605j201388k032888l103146k866499j499321l73945l67786
$$ plain form
41147 4380731 2187957 556957 844591 3376965 7137610 10360281 11145564 8851735
41139 8851735 5381656 3767723 5016047 7611795 10237100 13112498 16206494 18298287
41131 18298287 18999415 19943461 22519166 25732553 27781588 28781655 30500716 34029489
41123 34029489 39043222 45076028 52354461 61186823 71169880 81437367 91854066 103800358
41115 103800358 118962275 136734203 153494258 165249593 170244288 168158840 158415816
41108 158415816 141665756 122075189 104963861 91601124 78835552 64604578 51302475
41101 51302475 42445208 38247051 36209704 34367486 32102946 29069652 25342432 22039177
41093 22039177 20137572 18936184 16903296 13800150 10933651 9434330 9060385 8692599
41085H692599j082296j325456m86468L79985k72429j815741j585415J178186L441074
41076G124039K406922l21854j257089k66168m0884j151995j332687J74497J120122
41067F454903J7126j581259j783062q56191J64198J101042J624951P33224j350804
41058D524128k546965j572928K84281J231623J262474J200752J029549N50101
41050E963015L33902O15941M63093n86759j278940n56851L76439l29405k210620
41041B789815k939189j500048O17035J447357N79444r54275j831332j300116L19221
41032b772088J689047J507877j52321j712476j502250N69690K758387L130069
41024C515935J572196k33537r72634j008229j059771q14639q1359o4766j442898
$$ plain form
41085 8692599 7610303 6284847 5798379 6178364 5905935 4090194 2504779 3682965 7124039
41076 7124039 9530961 9209107 7952018 7685850 7644966 6492971 5160284 5334781 6454903
41067 6454903 6472029 4890770 3107708 2251517 2415715 3516757 5141708 5874932 4524128
41058 4524128 1977163 404235 688516 1920139 3182613 4383365 5412914 5963015
41050 5963015 6296917 6912858 7375951 6789192 5510252 4953401 5329840 5000435 2789815
41041 2789815 -149374 -1649422 -1032387 414970 994414 40139 -1791193 -3091309 -2772088
41032 -2772088 -1083041 424836 272515 -1439961 -2942211 -2372521 385866 3515935
41024 3515935 5088131 4854594 3881960 2873731 1813960 999321 917962 853196 -589702
41015e89702k090749M52780M413830N003813J104444k577340j939411Q81457J111717
41006E770839j668169l638435k689773o28003M48244O59350O16368M050r88851
40997b114380j009500M31950J916725K176597J720060J399913Q72466k84339j248911
40988C860581j161478o19974n80629o68830q2195N44854j33602j846030k644654
40979c331957j304591J305963L319299L502010J952433N14q22230m42661l40204
40970C838576j179018j423680J59739J765369P57484j939580k669899n09641J343005
40961A42355P23597k65703P25615K032375Q53299j697325k114327r8311J082986
40952A384561k01007j777474j393141K81424J464701J712904J263500j11636k080479
$$ plain form
41015 -589702 -2680451 -2227671 2186159 7189972 8294416 5717076 3777665 4659122 5770839
41006 5770839 4102670 464235 -2225538 -2853541 -2405297 -1745947 -1129579 -1125529 -2114380
40997 -2114380 -3123880 -2691930 -775205 1401392 3121452 4521365 5393831 5109492 3860581
40988 3860581 2699103 2079129 1498500 829670 747475 1292329 1158727 -687303 -3331957
40979 -3331957 -4636548 -3330585 -11286 3490724 5443157 5443671 4621441 4178780 3838576
40970 3838576 2659558 1235878 1395617 3160986 3918470 1978890 -691009 -1200650 142355
40961 142355 865952 600249 1325864 3358239 4211538 2514213 399886 301575 1384561
40952 1384561 1183554 -593920 -1987061 -1705637 -240936 1471968 2735468 2623832 543353
40943E43353k950246j411337J566635L547351K950018K69246k349023k702055
40935e36058o23307J555328J632370K50332m45370k60775p92422j951765j522045
40926b693712J004146K890058J963287l07692j289799p94070k99325k41368j63594
40917F7931k81236q17294p83810N63019J874280J329123m64430j162887n7420
40908B67276J010818K29995j943933l333522k232601P46019K822773J894108o40957
40899a180024j422529J57149J088027l23748j467699K92150K869777K413381n90777
40890A835707k108137q72951J29695j041954k293445j271048Q39026J331625q3190
40881c534672j306271p54269J203899L016223L185883J399809q75289j582539
$$ plain form
40943 543353 -2406893 -3818230 -2251595 1295756 4245774 4515020 2165997 -536058
40935 -536058 -1159365 395963 2028333 2278665 1833295 1572520 780098 -1171667 -2693712
40926 -2693712 -1689566 1200492 3163779 2856087 1566288 772218 472893 231525 67931
40917 67931 -213305 -1030599 -1814409 -1251390 622890 1952013 1487583 324696 267276
40908 267276 1278094 1508089 -435844 -3769366 -6001967 -5255948 -2433175 -539067 -1180024
40899 -1180024 -2602553 -2445404 -1357377 -1681125 -3148824 -2856674 13103 2426484 1835707
40890 1835707 -272430 -1145381 -1015686 -2057640 -4351085 -5622133 -4783107 -3451482 -3534672
40881 -3534672 -4840943 -5595212 -4391313 -1375090 1810793 3210602 2335313 752774
40873G52774l83320R26393P26575n15525j183240o25116L60894P56922M11938
40864A228295q9775l38162n92830j122737j327004l44860J383896K306054J933506
40855C036383J492894J600398Q75914j616756l931317l396413n31737J427432
40847a043202Q41515n26648l79459J115579J949773R61061p79575j143209M76058
40838A471893K002815J081719j435856k273178n41615P36704n70378k114962r20574
40829b563432J560038J780214j69882j157164l45749K60284J66456Q50993J757709
40820B139467M79308k218986k306780R31344K877355O58740k116518j155076J737884
40811A026738K003821k52037j101518K94095N82025j819283l938766k710624Q23227
$$ plain form
40873 752774 369454 1295847 2022422 1506897 323657 -301459 59435 816357 1228295
40864 1228295 1138520 800358 207528 -915209 -2242213 -2587073 -1203177 1102877 3036383
40855 3036383 4529277 6129675 7005589 5388833 1457516 -1938897 -2470634 -1043202
40847 -1043202 -201687 -728335 -1107794 7785 1957558 2918619 2139044 995835 1471893
40838 1471893 3474708 4556427 3120571 847393 305778 1042482 472104 -1642858 -2563432
40829 -2563432 -1003394 776820 606938 -550226 -895975 -635691 -469235 381758 2139467
40820 2139467 2618775 399789 -1906991 -975647 1901708 2560448 443930 -711146 1026738
40811 1026738 3030559 2778522 1677004 1971099 2553124 733841 -3204925 -5915549 -5092322
40802e092322L307288L069428J030247r18542j344288j46268J167012R25085m88103
40793A509537r46690L11659J263675J1924k009997j703064J100108K949751J475156
40784C962059j262396j822136k63546N25800l59411p66812M40575J336718K87799
40775B078650j315809j521011p21703n8260Q95460K429353K762157O91787j563333
40766C677291j300149L97008O47849l68778k88633Q23855Q31284j87235k44266
40757C988226L45717n13778k121754j651749L91023M46257j677032k018934N54528
40748b257496K143505O67338o51446M58306J049119j235893l107498j082712K154012
40739a862765J981630p57883j732094m8460J691126K289657K289040J163695j385785
$$ plain form
40802 -5092322 -1785034 1284394 2314641 1396099 51811 -94457 1072555 1997640 1509537
40793 1509537 562847 874506 2138181 2150105 140108 -1562956 -462848 2486903 3962059
40784 3962059 2699663 877527 613981 1139781 780370 13558 454133 1790851 2078650
40775 2078650 762841 -758170 -1479873 -1538133 -642673 1786680 4548837 5240624 3677291
40766 3677291 2377142 2774150 3421999 3053221 2764588 3588443 4419727 4232492 3988226
40757 3988226 4333943 3820165 1698411 46662 437685 883942 -793090 -2812024 -2257496
40748 -2257496 -113991 553347 -98099 360207 1409326 173433 -2934065 -4016777 -1862765
40739 -1862765 118865 -639018 -2371112 -2419572 -728446 1561211 3850251 5013946 3628161
40730C628161k967509j589140M88978K20688r09834K46692K310787J479947j568668
40721A340102k661150j270907p89636j828301j259252J458613K811673J342990
40713h55868o6540M91646J300068J156334J291535J605777J1710k677595k481921
40704b24854Q51420K169474q65632l447390j535889J252060l9166k970914j718678
40695f529569L054306N080682K108219j570389k251497j075760l49911j74309
40687a708228l6299k10852l12326P31402K324640K325228K50811j879820k380076
40678h95520j456862J58978J803906K125234L71411j494565q18432J484740J895704
40669C174594j60999j446213m75086J58936j152276j812005K09585K100449N98640
$$ plain form
40730 3628161 660652 -928488 -439510 -218822 -1128656 -881964 1428823 2908770 1340102
40721 1340102 -1321048 -2591955 -3381591 -5209892 -6469144 -5010531 -2198858 -855868
40713 -855868 -922408 -430762 869306 2025640 3317175 4922952 4934662 2257067 -224854
40704 -224854 626566 2796040 1930408 -1516982 -3052871 -1800811 -1839977 -4810891 -6529569
40695 -6529569 -3475263 1605419 3713638 2143249 -108248 -1184008 -1533919 -1708228
40687 -1708228 -1744527 -1955379 -2267705 -1536303 788337 3113565 3364376 1484556 -895520
40678 -895520 -2352382 -2193404 -389498 1735736 2107147 612582 -205850 1278890 3174594
40669 3174594 3013595 1567382 1092296 1251232 98956 -1713049 -1503464 596985 1195625
40660A195625k207738j968056R42588K288637Q41994m65960j27689M1113o78878
40651a38364k78652J552420J688415j232306l540219j664680K272083L522199
40643B180896J401793p54550j118771j075531j636279j625073j80442J496762
40635a311195J922341J176043K08606m22760n64991k11833L25762N64614J95836
40626A882423r70020k677381l411428j387073K464050M201593J590804k323867
40618f30899k891103O671K402992K077946O15607j91745n13474n61849K42982
40609E57128J318143J055053k07186k38290J178090J539347j7281j024726n4170
40600D106108O14016r50289k665036j759095O75638J556465M14856q23044j184744
$$ plain form
40660 1195625 -1012113 -2980169 -2037581 251056 1093050 627090 499401 540514 -138364
40651 -138364 -417016 1135404 2823819 1591513 -1948706 -3613386 -1341303 2180896
40643 2180896 3582689 2828139 1709368 633837 -1002442 -2627515 -2807957 -1311195
40635 -1311195 611146 1787189 1995795 1573035 1008044 796211 1121973 1686587 1882423
40626 1882423 912403 -1764978 -5176406 -6563479 -4099429 102164 1692968 -630899
40618 -630899 -3522002 -3515331 -1112339 965607 1581214 1389469 875995 314146 557128
40609 557128 1875271 2930324 2723138 2484848 3662938 5202285 5185004 4160278 4106108
40600 4106108 4720124 3769835 1104799 -654296 21342 1577807 1992663 1169619 -15125
40591a5125r94513j47239J299950J925497Q05273n30502l24980N17785K17216
40582B753362o33655l81620L98780k2752j149838j100354j33235j52872j137316
40573a559500j251372l09976O8673k05111N69898K424976L067463J420099q65256
40564C359894k133558k428330j852734L1675K198755K246440o1953j655925k76874
40555e72610K128464K063770p31096l115120k665136l40169J126004N28595o91203
40546b268501n78060O71536J089944m5679j059143m43216R94392J760063J848477
40537A969813J691033O21348j469972k509663q90809J502773J769233L91780J9833
40528C095369P92555N30856q27911r25038O00242J159548n10533k472398k886235
$$ plain form
40591 -15125 -1009638 -1156877 143073 2068570 2873843 2343341 2018361 2536146 2753362
40582 2753362 2119707 1738087 2136867 2114115 964277 -136077 -269312 -422184 -1559500
40573 -1559500 -2810872 -3120848 -3052175 -3257286 -2687388 -262412 2805051 4225150 3359894
40564 3359894 1226336 -1201994 -3054728 -3023053 -824298 1422142 1360189 -295736 -572610
40555 -572610 1555854 3619624 2888528 -226592 -2891728 -3231897 -2105893 -1577298 -2268501
40546 -2268501 -2846561 -2175025 -1085081 -1130760 -2189903 -2633119 -1638727 121336 1969813
40537 1969813 3660846 4282194 2812222 302559 -588250 914523 2683756 3075536 3095369
40528 3095369 3887924 4418780 3590869 2665831 3266073 4425621 3915088 1442690 -1443545
40519a443545k133778r19998O47133J454986J98258j551614p45498J899173K243514
40510c51369m33583j685787P62512K803341O07163k797597k206789J642258L652496
40501A992645K110128p0084q34623j136937j786243k091500j904480j874515j564971
40492g160580q5436J555565J503445K48654n6009P55590Q84461J19852J05150
40483b129308Q01505J53384j863204k292991J52152K574396K125352K08950p4047
40474c43811J262634J710921N71642l22459L9866M46704r1350o89398l69948J77419
40464B392220n5195m43879K53229J465210J148334j215463l468543l380538j298610
40455d603235P47521J659328J738564J223652k834j303382j469052m56179K98682
$$ plain form
40519 -1443545 -3577323 -4497321 -3850188 -2395202 -2196944 -3748558 -4494056 -2594883 -351369
40510 -351369 -784952 -2470739 -1708227 1095114 1702277 -1095320 -3302109 -1659851 1992645
40501 1992645 4102773 4032689 3198066 2061129 274886 -1816614 -3721094 -5595609 -7160580
40492 -7160580 -7246016 -5690451 -4187006 -3938352 -3994361 -3238771 -2354310 -2234458 -2129308
40483 -2129308 -1327803 -1174419 -3037623 -5330614 -5178462 -2604066 -478714 -269764 -343811
40474 -343811 918823 2629744 3201386 2878927 2918793 3365497 3274147 2584749 2214801 2392220
40464 2392220 2337025 1893146 2146375 3611585 4759919 3544456 75913 -3304625 -4603235
40455 -4603235 -3855714 -2196386 -457822 765830 762996 -540386 -2009438 -2465617 -2166935
40446b166935j29156q78747o72659M14823J316643J475874J211444Q84667L57228
40437A813182o15810j630402j560959J62422K128043J987468k46845j356119R15948
40428A596928M060585L745708l6254k934510k593959j496284k076230k488252
40420b222268k5603L702237M556799J837864q74405r08113K62563k02120k488076
40411C638878m178423l391572p52218J646707K583252K575724K479135K025295
40403F626778N96633j143954j851555j592588j668634k197696j787338j36181
40395c154535J112016J031963Q21333J270394J027654p69068k152261j022173
40387a834677J315901J940223O18593l67636p3800K20048j35647j18737O61629
$$ plain form
40446 -2166935 -2296091 -3174838 -3847497 -3432674 -2116031 -640157 571287 1455954 1813182
40437 1813182 1197372 -433030 -1993989 -1831567 296476 2283944 2037099 680980 1596928
40428 1596928 5657513 9403221 9366967 6432457 3838498 2342214 265984 -2222268
40420 -2222268 -2247871 1454366 6011165 7849029 6974624 6066511 6329074 6126954 3638878
40411 3638878 -539545 -3931117 -4683335 -3036628 -453376 2122348 4601483 6626778
40403 6626778 7223411 6079457 4227902 2635314 966680 -1231016 -3018354 -3154535
40395 -3154535 -2042519 -1010556 -189223 1081171 2108825 1339757 -812504 -1834677
40387 -1834677 -518776 1421447 2040040 1672404 1598604 1818652 1683005 1564268 2225897
40378B225897Q95240l22668j920603k201664p41556J402228K477671J189299j720292
40369A283552l345745j693817J308573J886370l51976j648699M85132L431275
40361A354665L034863m79422k693460q48690K762303L966197J675462j519284
40353G252634k833994j931684k53316Q57561Q24499k86650j597304j705910j58050
40344A67786J634628J819373K45483j595251k437071k152174j190796j87797K10885
40335c484934K05193R76752K697008L284575J082086k029171k757361j168296
40327a194148k41980p50432l12634J699717K416197M51332j291468m83641N67536
40318H60479q12985k508779j038426K160592K721061M09459p10479J019533K642137
$$ plain form
40378 2225897 3121137 2798469 877866 -1323798 -2065354 -663126 1814545 3003844 1283552
40369 1283552 -2062193 -3756010 -2447437 -561067 -913043 -2561742 -2076610 1354665
40361 1354665 4389528 3910106 1216646 367956 3130259 7096456 8771918 7252634
40353 7252634 4418640 2486956 2233640 3091201 3915700 3629050 2031746 325836 167786
40344 167786 1802414 3621787 3867270 2272019 -165052 -2317226 -3508022 -3695819 -3484934
40335 -3484934 -3279741 -2302989 394019 3678594 4760680 2731509 -25852 -1194148
40327 -1194148 -1436128 -2186560 -2499194 -799477 1616720 2068052 776584 292943 860479
40318 860479 47494 -2461285 -3499711 -1339119 1381942 1791401 1080922 2100455 4742592
40309D742592J756674j97731j086684j093411j103777q98350m59899p17252j582254
40300f40092j377144L85556J598907M61151j773876k444042p77229J675109L060780
40291A69120K750332J459474M10519l4972p38908k071767k642794j306799L87069
40282a618726J08884j343362r97600J299140K233818L64251j375041m17922J395400
40273c51158J261060J45174N41728J492422J01558k777141k932778N00975L011690
40264I93530J283900j784177j619530J107014J990600L1952j135815M83327K028679
40255C379480P74628j220788o41457J420141J346522p48615j179523Q39537J536936
40246E506861j087802l485510j885308J804434K875068N26785j828618j792714
$$ plain form
40309 4742592 6499266 6301535 5214851 4121440 3017663 2119313 1659414 942162 -640092
40300 -640092 -2017236 -1631680 -32773 428378 -1345498 -3789540 -4566769 -2891660 169120
40291 169120 2919452 4378926 4789445 4754473 4015565 1943798 -698996 -2005795 -1618726
40282 -1618726 -1509842 -2853204 -3850804 -2551664 -317846 46405 -1328636 -1746558 -351158
40273 -351158 909902 1055076 1596804 3089226 3190784 413643 -2519135 -2018160 993530
40264 993530 2277430 493253 -1126277 -19263 1971337 2003289 867474 1350801 3379480
40255 3379480 4154108 2933320 2291863 3712004 5058526 4309911 3130388 3969925 5506861
40246 5506861 4419059 933549 -951759 852675 3727743 4254528 2425910 633196
40238F33196k15252J197199J559538L84125j896151l152027j680260J090709K238280
40229A59357J311987K94461M1634m73458j406049j383303p9049J013284R40808
40220D19672L27431k37372p45747o36976N91920J666505R69142m08940k4382J534090
40210C455343J217306j074017j772761L64818J844336K47687j672557q70214P48467
40201B488408L959j637976o41465K031498K135013p54795k465853r94979P03672
40192H67482O5573j174460o36158O08890M41609l52205K63987J570477J062593
40183B717788j208646k442163j436363k69862o98124j315609k138K443970L187556
40174I76409J226858j391633k135229m89195K012400L207608J990173l91453j169624
$$ plain form
40238 633196 417944 1615143 3174681 3558806 1662655 -1489372 -3169632 -2078923 159357
40229 159357 1471344 1765805 1807439 1333981 -72068 -1455371 -1534420 -521136 419672
40220 419672 747103 509731 -236016 -872992 -281072 1385433 2354575 1945635 1921253 3455343
40210 3455343 4672649 3598632 1825871 2190689 4035025 4282712 2610155 1739941 2488408
40201 2488408 2492367 854391 212926 2244424 4379437 3624642 1158789 163810 867482
40192 867482 933055 -241405 -877563 -268673 172936 -179269 84718 1655195 2717788
40183 2717788 1509142 -933021 -2369384 -2639246 -3337370 -4652979 -4655117 -2211147 976409
40174 976409 2203267 811634 -1323595 -1812790 199610 3407218 5397391 5005938 3836314
40165C836314N76770K137428O21024k509431l098376m63565J426114o1850k429381
40156C5047k221910J0399J596575K045083K274509J597342q58043l029356k051208
40147f01562J060289K431579Q53878j083513j376791p83415l15829K10605M97638
40138H92879m38400k023308k254220p26792Q11794J289430J275862J001672Q8693
40129h2390o20377J95313J675873J845429J180087J612999K196495J36021l491904
40120D647546m044111o08256K066248R40424j039271o94672L62076o7621k54523
40111A307840J523087K653755N40238k217503j946804j50551m06929j726975p09954
40102a133796J717270J749023l33430o94422J064089J416431m33571j272097o8466
$$ plain form
40165 3836314 4413084 6550512 7171536 4662105 1563729 1100164 2526278 2464428 35047
40156 35047 -2186863 -2176464 -579889 1465194 3739703 5337045 4479002 1449646 -601562
40147 -601562 458727 2890306 3744184 2660671 1283880 500465 184636 395241 892879
40138 892879 454479 -1568829 -3823049 -4549841 -3738047 -2448617 -1172755 -171083 -82390
40129 -82390 -702767 -507454 1168419 3013848 4193935 5806934 8003429 8139450 4647546
40120 4647546 603435 -4821 2061427 3001851 1962580 1267908 1629984 1562363 1307840
40111 1307840 2830927 5484682 6024920 3807417 1860613 1710062 1303133 -423842 -1133796
40102 -1133796 583474 2332497 1999067 1304645 2368734 3785165 3351594 2079497 2011031
40093B011031J96363j601359k311587j16109K141382J774559K78207k18896p47781
40084A405810k558145l594168j554294J747995K632251P40204j178734j607152
40076c966233j332309p86206O41344K411239K525211L40233j964752j846858N07402
40067c470929K505111K289786P38642J5570O70370J077070j07337j969613k609275
40058h60605j624540k86511L06553K04219L2485L43989J213128J798879J000355
40049B127952p06875j225671K23308J524702P62834n86997m7802J472734R48161
40040D492346j516828k372713k26999J774439Q54145j038014k90336K754327M039701
40031H470068J239531l204738n004057k895330J93127Q22581p93738j404236M81321
$$ plain form
40093 2011031 2207394 606035 -1705552 -1821661 319721 2094280 2372487 2153591 1405810
40084 1405810 -1152335 -4746503 -6300797 -4552802 -1920551 -1180347 -2359081 -3966233
40076 -3966233 -5298542 -6084748 -5443404 -3032165 -506954 -166721 -2131473 -3978331 -3470929
40067 -3470929 -965818 1323968 2062610 2078180 2748550 3825620 3718283 1748670 -860605
40058 -860605 -2485145 -2771656 -2465103 -2260884 -2228399 -1884410 -671282 1127597 2127952
40049 2127952 1421077 195406 418714 1943416 2706250 2119253 2071451 3544185 4492346
40040 4492346 2975518 602805 375806 2150245 3004390 1966376 1676040 4430367 8470068
40031 8470068 9709599 6504861 1500804 -1394526 -1201399 -378818 -1172556 -2576792 -2095471
40022b095471K344346J536763n41955o91495R70559J432552o7818q96093M25257
40013B416645J854255J259809n82148j828174j965405j052794R62834K719916
40005C784938J793668j598428l662407j919769J206116K054536Q15703J09473
39997B583830L09036k85043j576864j523728J83855J397815R71280L12039O52510
39988C024730J001738K8859j615959k206448j276679O0817P34048Q29414J063329
39979A643849J508775J221383m42556k282920k081107M70734K708385J978496
39971D725039r76798k875739j788309J055099L156875L180771J412396r72756
39963F916578k612300k702185j550167j10747J030228J773890J849785R29949
$$ plain form
40022 -2095471 248875 1785638 1243683 552188 1522747 2955299 2887481 1991388 2416645
40013 2416645 4270900 5530709 4948561 3120387 1154982 102188 1065022 3784938
40005 3784938 5578606 3980178 317771 -1601998 -395882 1658654 2474357 2583830
39997 2583830 2892866 2607823 1030959 -492769 -308914 1088901 2060181 2372220 3024730
39988 3024730 4026468 4055327 2439368 232920 -1043759 -982942 -248894 580520 1643849
39979 1643849 3152624 4374007 3931451 1648531 -432576 38158 2746543 4725039
39971 4725039 3748241 872502 -915807 139292 3296167 6476938 7889334 6916578
39963 6916578 4304278 1602093 51926 -58821 971407 2745297 4595082 5525031
39955E525031m61189j064229m16543M18501L23181k28131L2011R91349J157190
39946F277171J94304j17992J246618K148714Q2769l302557l687797n64860J391569
39937C667939p17508l317096j984601J303887J406174j339848j596569J930683
39929f46939M101916J714249j430592r88524J206134J056554q77379j171826K59058
39920C222651O92745j37705j05260O63081j75091k405834k834825m41406J775204
39911B53560J365350k45998n03303O47785J439913Q93278n21660j698632j711098
39902h0805p37057j24001m34888j84996J655258K945211J022198k520580l299429
39893a759089o74375J028432r03043l414613k324477J768657M829975M635348
$$ plain form
39955 5525031 5063842 3999613 3583070 4001571 4324752 4096621 4128632 5119981 6277171
39946 6277171 6471475 6353483 7600101 9748815 9831584 6529027 2841230 2276370 3667939
39937 3667939 2950431 -366665 -2351266 -1047379 358795 -981053 -2577622 -646939
39929 -646939 3454977 5169226 3738634 2750110 3956244 5012798 4135419 2963593 3222651
39920 3222651 3915396 3777691 3672431 4335512 4160421 1754587 -1080238 -1521644 253560
39911 253560 1618910 1372912 869609 1517394 2957307 3850585 3328925 1630293 -80805
39902 -80805 -817862 -941863 -1376751 -1561747 93511 3038722 4060920 1540340 -1759089
39893 -1759089 -2433464 -1405032 -2308075 -5722688 -8047165 -6278508 -1448533 3186815
39885C186815K219932m29162j898802j624911m10970J99211Q1760N74809J535317
39876C433999P79165j986528l439313j357905J433127J052756j499878k139765
39868c724342r9832J489981Q74109m35492j032393j096111k41805K219339M226655
39859B180109K333078k458170m365386o69607L908069L808827L05070j442212
39851C599778m74963k89888k086225k922580j181800O88974N67749L5957J031221
39842a031777K146377J197005o83023q08035M71140L97092j374431k045328k86646
39833b017626J595621J366823m627o52543p80973j056222k65963K315274L816390
39824D316154R25142m263628n701979j512098L231466L597654J081820J8506P28901
$$ plain form
39885 3186815 5406747 4977585 3078783 1453872 1042902 1242113 1323873 1898682 3433999
39876 3433999 4213164 2226636 -1212677 -2570582 -1137455 -84699 -1584577 -3724342
39868 -3724342 -3824174 -2334193 -1460084 -1895576 -2927969 -4024080 -4265885 -2046546 2180109
39859 2180109 4513187 2055017 -2310369 -2979976 928093 4736920 5041990 3599778
39851 3599778 3124815 2834927 748702 -2173878 -3355678 -2666704 -2098955 -2062998 -1031777
39842 -1031777 1114600 2311605 1628582 820547 1291687 1688779 314348 -1730980 -2017626
39833 -2017626 -422005 944818 940191 287648 -493325 -1549547 -1815510 499764 4316154
39824 4316154 5241296 977668 -4724311 -6236409 -3004943 592711 1674531 1693037 2421938
39815B421938J71282k153873l193913j263143J505208K426240J424498M1929p16173
39806F63993o89588k12299J4055r8007O90386L014239M689264K936647j097957
39797I910733k987607r78215J664331J624926j21845j051339j408482k745793
39789C906709m027550k747590O82242K880058K060880J11626m51114M42182J168943
39780D026386P57548m14265j424841j643570j100432k93567L93595Q65799J009328
39771B175981Q98962J161087J938128J678984j037159m262745m053772j80986
39763a681520K662666J414168q72629k19369J791018J227804r24460m26601K329942
39754E301019K383407j291827l535613j260763J667504R17115j766104k375878
$$ plain form
39815 2421938 2593220 439347 -2754566 -4017709 -2512501 -86261 1338237 1380166 663993
39806 663993 -25595 -237894 -223839 -321846 368540 3382779 8072043 11008690 9910733
39797 9910733 6923126 5944911 7609242 9234168 9112323 8060984 6652502 3906709
39789 3906709 -120841 -2868431 -2186189 693869 2754749 2866375 2415261 2857443 4026386
39780 4026386 4783934 4369669 2944828 1301258 200826 -92741 300854 1166653 2175981
39771 2175981 3074943 4236030 6174158 7853142 6815983 2553238 -1500534 -1681520
39763 -1681520 981146 2395314 1522685 1303316 3094334 4322138 3397678 2971077 5301019
39754 5301019 7684426 6392599 2856986 1596223 3263727 4180842 2414738 38860
39746C8860j083926m81450l78750R68930K449127J552723q65274j594854l06732
39737B98654J89942j194830k371466j710421N9776J864792L220782K976726K34909
39728C568864l027489l358699o01517J656937J190887l61504j101235j577550
39720c611306k150719j029863K320265M563493K687606j031833j894951M83663
39712C36355K097292R18518n70324m967J269820R89594m08571j133472r83663
39703B510582o96947l169J280825J634755M5311j335773O80K209918J174552k589665
39693D231069l717496j51952L215770K013497r19864p55757J068908k32295l806261
39684I45619m021000o2602K382357M93254j388549K35397J973456k8981k811242
$$ plain form
39746 38860 -1045066 -1526516 -1905266 -936336 1512791 3065514 2200240 605386 298654
39737 298654 488596 -706234 -3077700 -4788121 -4728345 -2863553 357229 3333955 3568864
39728 3568864 541375 -2817324 -3418841 -1761904 -571017 -932521 -2033756 -3611306
39720 -3611306 -5762025 -6791888 -4471623 91870 2779476 1747643 -147308 336355
39712 336355 2433647 3352165 2781841 2776874 4046694 5036288 4627717 3494245 2510582
39703 2510582 1813635 1810466 3091291 4726046 4771357 3435584 3436264 5646182 6820734 4231069
39693 4231069 513573 361621 3577391 5590888 4671024 3915267 4984175 4751880 945619
39684 945619 -3075381 -3137983 -755626 -262372 -1650921 -1415524 557932 528951 -2282291
39675b282291j438695K495811L369556M34210j820765j271670l60888o42812m62870
39666a980414R63018J699405P16121l67034m83328p15012j429992j097782N47486
39657b147532J238426j46400j346002j78082J968916K215246K00849j857159k112284
39648b164022p42050O57126O86115j73429K35216K548277L814644J179191l073637
39639B967431l838399p04423J183215r38221l238859j698130J443569J568686
39631c255131j032460k295065r63403N56146J103788K057468L540482L379544
39623C091369R32319j230888r55797N32325Q18736l04271j212593j077387n44890
39614D8923k06205L00906J342764K133979J357065q26017k203948j035223J294577
$$ plain form
39675 -2282291 -3720986 -1225175 2144381 2578591 757826 -513844 -874732 -1517544 -1980414
39666 -1980414 -1017396 682009 1398130 1031096 547768 -167244 -1597236 -2695018 -2147532
39657 -2147532 -909106 -1055506 -2401508 -2579590 -610674 1604572 1805421 -51738 -2164022
39648 -2164022 -2906072 -2248946 -1562831 -1736260 -1501044 1047233 4861877 6041068 2967431
39639 2967431 -870968 -1575391 -392176 -1330397 -4569256 -6267386 -4823817 -3255131
39631 -3255131 -4287591 -6582656 -7546059 -6989913 -5886125 -3828657 -288175 3091369
39623 3091369 4023688 2792800 1837003 2369328 3188064 2883793 1671200 593813 48923
39614 48923 -157282 143624 1486388 3620367 4977432 4151415 1947467 912244 2206821
39605B206821J739263k52535k003753j560303j64715L61447M18036R69990J175845
39596B890096J45474n49770R61230L156016K664272p72297l750125l769801j793445
39587h18350Q5171J066786J103888J39119j162145j535798p19724L26737J002403
39578e11913J362726R20454p85558k265257j212287J722848K896776P30194j716733
39569A141250j216549P79274N32671k102542l421510j387130J540410K063027
39561b071099L69128q08016k60597M54796j84460j223209o09046J610328K870555
39552A48380J329057j526055k587037r63824J169668J548364L19040q47208r61052
39543b370667k35802P40687J371898J061120j68017j179834o90466J115154K509163
$$ plain form
39605 2206821 3946084 3693549 1689796 129493 -35222 326225 744261 1714251 2890096
39596 2890096 3035570 2485800 3447030 6603046 9267318 8495021 4744896 975095 -818350
39587 -818350 -733179 333607 1437495 1576614 414469 -1121329 -1841053 -1514316 -511913
39578 -511913 850813 1771267 985709 -1279548 -2491835 -768987 2127789 2857983 1141250
39569 1141250 -75299 703975 1236646 -865896 -4287406 -5674536 -4134126 -2071099
39561 -2071099 -1701971 -2509987 -2770584 -2315788 -2500248 -3723457 -4332503 -2722175 148380
39552 148380 1477437 -48618 -2635655 -3599479 -2429811 -881447 -562407 -1409615 -2370667
39543 -2370667 -2606469 -1865782 -493884 567236 399219 -780615 -1471081 -355927 2153236
39534B153236K083894L90224o97634k74019M01163m89143k687526l728457j869517
39525d717779J592742L710317L108968J013675n48069o57596J16861M03272o38584
39516C383807j971276j405637J261667K945045J060765k257221k559535M57859
39508I15474K348757O93678j258538q5811K035808R07082k479800l113609j5525
39499e2484J793856j055293m754738l573125J780505M860110K126969k538256
39491a412456l230588L62509L139459J780064r88615p07377K226533L271798P28867
39482E170194j596198l34760K039733R82221k972854m921243k813813K36098J310073
39473b900549J258509J551976J342523j26976j289972r35539m86678j084296j048087
$$ plain form
39534 2153236 4237130 4627354 3929720 3655701 4056864 3567721 880195 -2848262 -4717779
39525 -4717779 -3125037 585280 3694248 4707923 4159854 3502258 3619119 4022391 3383807
39516 3383807 1412531 6894 1268561 4213606 5274371 3017150 457615 915474
39508 915474 3264231 3957909 2699371 2613560 4649368 5556450 3076650 -36959 -52484
39499 -52484 1741372 686079 -4068659 -7641784 -5861279 -1001169 1125800 -1412456
39491 -1412456 -4643044 -4280535 -1141076 638988 -349627 -1057004 1169529 4441327 5170194
39482 5170194 3573996 3239236 5278969 6261190 3288336 -1632907 -4446720 -4210622 -2900549
39473 -2900549 -1642040 -90064 1252459 1125483 -164489 -1100028 -1586706 -2671002 -3719089
39464c719089Q51747K241618Q46921r79377L21096L305044L504085N88612j521954
39455E438703j393934j543454k645366j883730J257110K889502R97517r98997
39447B117351j27363J157297k68484k468060k076348l79979o13965j640854L9555
39438d260850L369804L657584K36988k325197j486078j40299j119449k654748
39430d722245j797670Q30208K344831J647856L1249r30842n84549O84446J631861
39421h64855J382680O93977P51731R91016K7420j515414j617534l84745j46129
39412f81853j508466k220377r25931P82743J326303J407464J768722J333025m52927
39403H28703j709032p47262J183518J827579J031406K8348q23458j605553j552533
$$ plain form
39464 -3719089 -2867342 -625724 221197 -758180 -437084 2867960 6372045 6960657 5438703
39455 5438703 4044769 2501315 -144051 -2027781 -770671 2118831 3116348 2117351
39447 2117351 1989988 3147285 2878801 410741 -1665607 -2045586 -2659551 -4300405 -4260850
39438 -4260850 -891046 2766538 3003526 678329 -807749 -948048 -2067497 -4722245
39430 -4722245 -6519915 -5689707 -3344876 -1697020 -1665771 -2596613 -3181162 -2496716 -864855
39421 -864855 517825 1211802 1963533 2954549 2981969 1466555 -150979 -535724 -681853
39412 -681853 -2190319 -4410696 -5336627 -4553884 -3227581 -1820117 -51395 1281630 828703
39403 828703 -880329 -1627591 -444073 1383506 2414912 2443260 1619802 14249 -1538284
39394a538284k70816Q58559M30032p48050r05975N7934Q35575Q32484N40023M09179
39384E00661N26840P94323P15238m8233n79324K08858J115411k16423k928766
39375H8585k951330P95218L589253J303686l284512m416632j468037J183774J179478
39366c980517N11734R96355J659108J374633O56218j34039j473888k683655j895387
39357d969438R23678L142574K670150K06458k273433l418959k538861P4750K288249
39348c894832J812054n31815j464088J4421J071386l69411k033481o55018K810615
39339c240169M229922K005102r73943j536483j53985O06332J6742m08387o126
39330E39005j55129j514917k136023l22215K047963J872690j89293n60734J255650
$$ plain form
39394 -1538284 -1809100 -950541 -520509 -1268559 -2174534 -2116600 -1281025 -448541 91482 500661
39384 500661 1027501 1821824 2537062 2488829 1909505 2118363 3233774 3017351 88585
39375 88585 -2862745 -2067527 1521726 2825412 -459100 -4875732 -6343769 -5159995 -3980517
39366 -3980517 -3468783 -2472428 -813320 561313 1217531 1083492 -390396 -3074051 -4969438
39357 -4969438 -4045760 -903186 1766964 1973422 -300011 -3718970 -6257831 -6183081 -3894832
39348 -3894832 -2082778 -2614593 -4078681 -4064260 -2992874 -3362285 -5395766 -6050784 -3240169
39339 -3240169 989753 2994855 2020912 484429 330444 936776 953518 545131 539005
39330 539005 383876 -1131041 -3267064 -3589279 -1541316 331374 142081 -418653 836997
39321H36997J611003r50591k629947n60555J903770L95928k976508k681452J317156
39312c734199L415882J022021k077298k027420J22390J463625J354561N58278
39304I7840o04514j436707q32101N48980O35843n47297p21923L49934N9936k000507
39294d450516k222007J174292M224506K754813j118158k163724K73466K121283
39286E93955J161502m75172n04505M26005O88600O5377q00030j510220j702854
39277b057342j055147J8399O63244O92897N17888K20686k34079k25436P83391
39268f75499J909503J614444q5385j329351o38475J341015K563567J631380q58339
39259E472860k738218k328938k82755J173179R87480K89083K20970J31640r55731
$$ plain form
39321 836997 2448000 1497409 -1132538 -1693093 210677 606605 -2369903 -5051355 -3734199
39312 -3734199 -318317 703704 -1373594 -3401014 -3278624 -1814999 -460438 97840
39304 97840 -506674 -1943381 -2775482 -2226502 -1590659 -2137956 -2859879 -2509945 -2450009 -4450516
39294 -4450516 -6672523 -5498231 -1273725 1481088 362930 -1800794 -1527328 593955
39286 593955 1755457 1280285 775780 1201785 1890385 1955762 1155732 -354488 -2057342
39277 -2057342 -3112489 -3094090 -2430846 -1737949 -1220061 -999375 -1233454 -1458890 -675499
39268 -675499 1234004 2848448 2763063 1433712 795237 2136252 4699819 6331199 5472860
39259 5472860 2734642 405704 122949 1296128 2283608 2572691 2793661 2925301 1969570
39250A969570k209272j962580l19779Q61863O33890J74365Q35048J968648J639377
39241C591130o33351k681686k006086Q73059K627904J380079o49725l97973J306113
39232C409464R34551k096723m150869k571636P94322K799922L047014K687564
39224D853609J582091o80787k661349k774249j912231j709095j387970O21540
39216d068441K855399K225628q00047k132396p733K463112K273232Q68847J029362
39207D706963J935875P99326j841125k331968K33013J944241l19877l917410l954697
39198b745659k92260K464008J817326M30762J014849J835013K54681k017585j343976
39189A417159J598209K549360M35088j250633o12710j93163j744804k659189o87186
$$ plain form
39250 1969570 -239702 -2202282 -2522061 -1660198 -1026308 -851943 -16895 1951753 3591130
39241 3591130 2957779 276093 -1729993 -856934 1770970 3151049 2501324 2103351 3409464
39232 3409464 4344015 2247292 -1903577 -4475213 -3680891 -880969 2166045 4853609
39224 4853609 6435700 5754913 3093564 319315 -1592916 -3302011 -4689981 -4068441
39216 -4068441 -1213042 1012586 212539 -1919857 -1927590 535522 2808754 3677601 4706963
39207 4706963 6642838 7442164 5601039 3269071 3502084 5446325 5126448 1209038 -2745659
39198 -2745659 -3037919 -573911 1243415 1674177 2689026 4524039 4778720 2761135 1417159
39189 1417159 3015368 5564728 5999816 4749183 4136473 3943310 2198506 -460683 -1147869
39180a147869J542439O06188j937433k093106K12956J642730J045447K58347K6059
39171A55758o49004j297206k42887J725817J893892K42009m36128L36670k06345
39162A522576k568608l082523N1251K906819J463073k087863k723638j66788J328771
39153c356930p3578j377425J23548K754892L068608N26102k045608j902347P03767
39144a578971K916264K351034k53928j949196j250611K12478L81975l23681k28590
39135B76774O50302Q60413J09033m90179n49427o85730o29922O80766K601069
39126B823099K639912j7414k722432k632662m12520R60860J69304j263188j249104
39117a704145P11659L290182M262016K281321j315117l291486k182380j12364
$$ plain form
39180 -1147869 394570 1000758 -936675 -3029781 -2816825 -1174095 -128648 129699 155758
39171 155758 -493246 -1790452 -2033339 -307522 1586370 1828379 1392251 1728921 1522576
39162 1522576 -1046032 -4128555 -4077304 -1170485 292588 -1795275 -4518913 -4685701 -3356930
39153 -3356930 -3430508 -4807933 -4684385 -1929493 1139115 1665217 -380391 -2282738 -1578971
39144 -1578971 1337293 3688327 3434399 1485203 234592 447070 829045 505364 276774
39135 276774 927076 1787489 1896522 1406343 856916 171186 -458736 222030 2823099
39126 2823099 5463011 5445597 2723165 90503 -322017 638843 808147 -455041 -1704145
39117 -1704145 -992486 2297696 6559712 8841033 7525916 4234430 2052050 1939686
39109A939686M12163O9653Q47483J915419O70818k425923l754691k006968j91624
39100b523984o69430j557575l45504J881604K661397K095507J432019N133k670462
39091C08705l698241l12358M380307M293099p18547l969749j509940K291625J643955
39082B708856k143417l194047Q5540L158815K139525j229212k577855p11239J435132
39073c27902J153018m15381j73704K091218L038120Q24719j662941j031899J225760
39064D721008J110529j418189k704988j706850j122534j657344m84313K766365
39056d96316L774162L48837l209622k453490N26685J153907l61594p40942J12847
39047a345526q8077q30585K27945K217416K156420M62521L33075J879124J872296
$$ plain form
39109 1939686 2351849 2421502 3268985 5184404 5855222 3429299 -325392 -2332360 -2523984
39100 -2523984 -3193414 -4750989 -5096493 -3214889 -553492 1542015 2974034 2979167 308705
39091 308705 -3389536 -3701894 678413 4971512 4252965 283216 -1226724 1064901 2708856
39082 2708856 565439 -2628608 -2543068 615747 2755272 1526060 -1051795 -1763034 -327902
39073 -327902 825116 409735 236031 2327249 5365369 6190088 4527147 3495248 4721008
39064 4721008 5831537 4413348 1708360 1510 -1121024 -2778368 -3262681 -496316
39056 -496316 3277846 3626683 417061 -2036429 -1509744 -355837 -717431 -1458373 -1345526
39047 -1345526 -1433603 -2264188 -2036243 181173 2337593 2800114 3133189 5012313 6884609
39038F884609m32584k068151j606013j061244j572567j486832k343J226867J424072
39029A305814J910345K751772J891549r94397l310622l505874k724704j519801
39021d195918R68298L291200J943291k453974m046176K4755M756872M498980R43697
39012E731025o58746K29299K99168r23501r89228O0447l64450k276263k803659
39003a695908j241845M4036K13353J061832K652589K228670p88876k692288q94663
38994a113100J745293J082324k032424l030737k64948K823436K525611m51732
38986A283723k264270p97306K003210K713704N41224j944358k101831j63440J719782
38977I90438K294244J795950N20340j370307k725353j996386N08223K461916K290841
$$ plain form
39038 6884609 6452025 4383874 2777861 1716617 144050 -1342782 -1345125 -118258 1305814
39029 1305814 3216159 5967931 7859480 6865083 3554461 48587 -2676117 -4195918
39021 -4195918 -3227620 63580 2006871 -447103 -4493279 -4468524 288348 4787328 5731025
39012 5731025 5072279 5301578 5600746 4677245 3688017 3748464 3384014 1107751 -1695908
39003 -1695908 -2937753 -2893717 -2680364 -1618532 1034057 3262727 2473851 -218437 -1113100
38994 -1113100 632193 1714517 -317907 -3348644 -3613592 -790156 1735455 1283723
38986 1283723 -980547 -1777853 225357 2939061 3480285 1535927 -565904 -729344 990438
38977 990438 3284682 5080632 5600972 4230665 1505312 -491074 17149 2479065 4769906
38968D769906Q02018o15440j885520l159209l251808j104996J778316K466954
38960a99779M41640j505331j002498Q28166J376686M28145L7677R11996J244015
38951B560717j79853j789119j601568k40863L01968j36406j12004O04471Q03678
$$ plain form
38968 4769906 5571924 4956484 3070964 -88245 -3340053 -4445049 -2666733 -199779
38960 -199779 241861 -1263470 -2265968 -1437802 -61116 367029 404706 1316702 2560717
38951 2560717 2380864 591745 -1009823 -1250686 -948718 -1085124 -1197128 -592657 211021
$$ [...]
##END NTUPLES=NMR SPECTRUM
##END=
