##TITLE=31Pdec_2ABPA2604
 , 24 sc
 26.04.2021
##JCAMPDX= 6.0         $$ Bruker NMR JCAMP-DX V2.0
##DATA TYPE= NMR SPECTRUM
##DATA CLASS= NTUPLES
##ORIGIN= UXNMR, Bruker Analytische Messtechnik GmbH
##OWNER= root
$$ XWIN-NMR		Version 3.5
$$ Mon Apr 26 16:25:48 2021 Russian Standard Time (UT+4h)  she@DPX200
##.OBSERVE FREQUENCY= 81.013821
##.OBSERVE NUCLEUS= ^31P
##.ACQUISITION MODE= SIMULTANEOUS
##.ACQUISITION SCHEME= undefined
##.AVERAGES= 24
##.DIGITISER RES= 16
##SPECTROMETER/DATA SYSTEM= spect
##.PULSE SEQUENCE= zgpg30
##.SOLVENT NAME= D2O
##.SHIFT REFERENCE= (INTERNAL, D2O, 0, 248.564)
##AUDIT TRAIL= $$ (NUMBER, WHEN, WHO, WHERE, WHAT)
$$ ##TITLE= Audit trail, XWIN-NMR		Version 3.5
$$ ##JCAMPDX= 5.01
$$ ##ORIGIN= Bruker BioSpin GmbH
$$ ##OWNER= she
$$ F:/spectra/data/she/nmr/P31/1/pdata/1/auditp.txt
$$ ##AUDIT TRAIL=  $$ (NUMBER, WHEN, WHO, WHERE, WHAT)
(   1,<2021-04-26 16:24:05.56 +0400>,<she>,<DPX200>,
      <created by zg, POWCHK disabled, PULCHK disabled
       configuration hash MD5:
       00 E9 B6 7A A2 85 ED C7 34 08 36 98 17 FE 4E 26
       data hash MD5: 32K
       B1 2E 27 4D 8E B9 19 9B BA 41 F2 4F C4 30 A3 A5>)
(   2,<2021-04-26 16:24:36.64 +0400>,<she>,<DPX200>,
      <Start of raw data processing
       efp BC_mod = 2 LB = 1 FT_mod = 6 PKNL = 1 PHC0 = -5547.076 PHC1 = 197.8015 SI = 64K 
       data hash MD5: 64K
       28 57 21 DC B3 37 A8 E7 9E 37 1F BC 1A 0B 4B 56>)
(   3,<2021-04-26 16:25:00.93 +0400>,<she>,<DPX200>,
      <pk PHC0 = 1.699654 PHC1 = -3.8 
       data hash MD5: 64K
       08 23 AC BC EC 51 CA 04 46 57 84 D5 B8 FD 15 BC>)
(   4,<2021-04-26 16:25:04.34 +0400>,<she>,<DPX200>,
      <abs ABSG = 5 
       data hash MD5: 64K
       4E A8 34 BA DD F4 EE 82 77 FC 81 D8 A6 3E 5E 4F>)
$$ ##END=
$$ 
$$ hash MD5
$$ E6 43 5D D8 AC 81 87 E3 CE 76 11 7D 36 44 B0 2E
##$RELAX= 
##$RELAX= 
##$RELAX= 
##$RELAX= 
##$RELAX= 
##$RELAX= 
##$RELAX= 
##$RELAX= 
$$ Bruker specific parameters
$$ --------------------------
##$DU= <F:/spectra>
##$EXPNO= 1
##$NAME= <P31>
##$PROCNO= 1
##$TYPE= <nmr>
##$USER= <she>
##$AMP= (0..31)
100 100 100 100 100 100 100 100 100 100 100 100 100 100 100 100 100 100 
100 100 100 100 100 100 100 100 100 100 100 100 100 100 
##$AQSEQ= 0
##$AQ_mod= 1
##$AUNM= <au_zg>
##$AUTOPOS= <>
##$BF1= 81.014009
##$BF2= 200.13
##$BF3= 200.13
##$BF4= 200.13
##$BF5= 200.13
##$BF6= 200.13
##$BF7= 200.13
##$BF8= 200.13
##$BYTORDA= 1
##$CFDGTYP= 0
##$CFRGTYP= 5
##$CHEMSTR= <none>
##$CNST= (0..31)
1 1 145 1 1 1 1 1 1 1 1 1 1 1 1 1 1 1 1 1 1 1 1 1 1 1 1 1 1 1 1 1 
##$CPDPRG= <waltz16>
##$CPDPRG1= <>
##$CPDPRG2= <waltz16>
##$CPDPRG3= <>
##$CPDPRG4= <mlev>
##$CPDPRG5= <mlev>
##$CPDPRG6= <mlev>
##$CPDPRG7= <mlev>
##$CPDPRG8= <mlev>
##$CPDPRGB= <>
##$CPDPRGT= <>
##$D= (0..31)
0 1 0 0 0 0 0 0 0 0 0 0.03 2e-05 3e-06 0 0 0 0 0 0 0 0 0 0 0 0 0 0 0 0 
0 0 
##$DATE= 1619439845
##$DBL= (0..7)
120 120 120 11 120 120 24 19 
##$DBP= (0..7)
150 150 150 150 150 150 150 150 
##$DBP07= 0
##$DBPNAM0= <>
##$DBPNAM1= <>
##$DBPNAM2= <>
$$ [...]
##$SUBNAM3= <"">
##$SUBNAM4= <"">
##$SUBNAM5= <"">
##$SUBNAM6= <"">
##$SUBNAM7= <"">
##$SUBNAM8= <"">
##$SUBNAM9= <"">
##$SW= 501.771253377433
##$SWIBOX= (0..15)
0 1 3 0 0 0 0 0 0 0 0 0 0 0 0 0 
##$SW_h= 40650.406504065
##$TD= 32768
##$TD0= 1
##$TE= 0
##$TE2= 300
##$TE3= 300
##$TEG= 300
##$TL= (0..7)
0 120 53 12 22 120 120 120 
##$TP= (0..7)
150 150 150 150 150 150 150 150 
##$TP07= 0
##$TPNAME0= <>
##$TPNAME1= <>
##$TPNAME2= <>
##$TPNAME3= <>
##$TPNAME4= <>
##$TPNAME5= <>
##$TPNAME6= <>
##$TPNAME7= <>
##$TPOAL= (0..7)
0.5 0.5 0.5 0.5 0.5 0.5 0.5 0.5 
##$TPOFFS= (0..7)
0 0 0 0 0 0 0 0 
##$TUNHIN= 0
##$TUNHOUT= 0
##$TUNXOUT= 0
##$USERA1= <user>
##$USERA2= <user>
##$USERA3= <user>
##$USERA4= <user>
##$USERA5= <user>
##$V9= 5
##$VALIST= <valist>
##$VCLIST= <CCCCCCCCCCCCCCC>
##$VD= 0
##$VDLIST= <DDDDDDDDDDDDDDD>
##$VPLIST= <PPPPPPPPPPPPPPP>
##$VTLIST= <TTTTTTTTTTTTTTT>
##$WBST= 1024
##$WBSW= 4
##$XGAIN= (0..3)
0 0 0 0 
##$XL= 0
##$YL= 0
##$YMAX_a= 8656
##$YMIN_a= -10796
##$ZGOPTNS= <>
##$ZL1= 120
##$ZL2= 120
##$ZL3= 120
##$ZL4= 120
##$ABSF1= 248.5645
##$ABSF2= -253.2056
##$ABSG= 5
##$ABSL= 3
##$ALPHA= 0
##$AQORDER= 0
##$ASSFAC= 0
##$ASSFACI= 0
##$ASSFACX= 0
##$ASSWID= 0
##$AUNMP= <proc_1d>
##$AZFE= 0.1
##$AZFW= 0.5
##$BCFW= 0
##$BC_mod= 2
##$BYTORDP= 0
##$COROFFS= 0
##$CY= -3
##$DATMOD= 1
##$DC= 0
##$DFILT= <>
##$DTYPP= 0
##$F1P= 0
##$F2P= 0
##$FCOR= 1
##$FTSIZE= 65536
##$FT_mod= 6
##$GAMMA= 0
##$GB= 0
##$INTBC= 1
##$INTSCL= 5.30512e-09
##$ISEN= 30
##$LB= 1
##$LEV0= 0
##$LPBIN= 0
##$MAXI= 10000
##$MC2= 0
##$MEAN= 0
##$ME_mod= 0
##$MI= 50
##$NCOEF= 0
##$NC_proc= -6
##$NLEV= 6
##$NOISF1= 182.463
##$NOISF2= 159.3651
##$NSP= 0
##$NTH_PI= 0
##$NZP= 0
##$OFFSET= 248.5645
##$PC= 4
##$PHC0= -5545.376
##$PHC1= 194.0015
##$PH_mod= 1
##$PKNL= yes
##$PPARMOD= 0
##$PSCAL= 0
##$PSIGN= 0
##$REVERSE= no
##$SF= 81.014009
##$SI= 65536
##$SIGF1= 159.3651
##$SIGF2= -187.1042
##$SINO= 113.3802
##$SIOLD= 16384
##$SREGLST= <1H.CDCl3>
##$SSB= 0
##$STSI= 65536
##$STSR= 0
##$SW_p= 40650.406504065
##$SYMM= 0
##$S_DEV= 0
##$TDeff= 32768
##$TDoff= 0
##$TI= <>
##$TILT= no
##$TM1= 0
##$TM2= 0
##$TOPLEV= 0
##$USERP1= <user>
##$USERP2= <user>
##$USERP3= <user>
##$USERP4= <user>
##$USERP5= <user>
##$WDW= 1
##$XDIM= 65536
##$YMAX_p= 414786473
##$YMIN_p= -13459259
$$ End of Bruker specific parameters
$$ ---------------------------------
##NTUPLES= NMR SPECTRUM
##VAR_NAME=  FREQUENCY,     SPECTRUM/REAL,   SPECTRUM/IMAG
##SYMBOL=    X,             R,               I
##VAR_TYPE=  INDEPENDENT,   DEPENDENT,       DEPENDENT
##VAR_FORM=  AFFN,          ASDF,            ASDF
##VAR_DIM=   65536,         65536,           65536
##UNITS=     HZ,            ARBITRARY UNITS, ARBITRARY UNITS
##FACTOR=    0.620285442955139, 1,           1
##FIRST=     20137.2065510759, 0,            0
##LAST=      -20513.1999529892, 0,           0
##MIN=       -20513.1999529892, -13459259,   0
##MAX=       20137.2065510759, 414786473,    0
$$ Real data points
##PAGE= N=1
##DATA TABLE= (X++(R..R)), XYDATA
$$ [...]
13117B713410O65104J102259L26102j143743j912762j106784O07743J517236P00572
13108C469137r02725j706897j291866l80713L38212M61119l13124j385040j051081
13099b762978J250039L135404J845922j636912l463824k124720j52527J64328
13091c745268l5533R88088K045881R94189j198758j362553J142145L214857K144989
13082D188037r33336k720945j779848K05981Q38506k26299j277735r53019K01068
13073b457590R80159J351340J748133J311967r67020l387489k593791J434875
13065b579416M177963K369375j322678k090901L70720K259098J505296l78067
13057D311390j835286k893990k971126q02070K378720L030850L17517k083681
$$ plain form
13117 2713410 3378514 4480773 4806875 3663132 1750370 643586 1251329 2768565 3469137
13108 3469137 2566412 859515 -432351 -813064 -474852 -13733 -326857 -1711897 -2762978
13099 -2762978 -1512939 1622465 3468387 1831475 -1632349 -3757069 -3909596 -3745268
13091 -3745268 -3780801 -2792713 -746832 247357 -951401 -2313954 -1171809 2043048 4188037
13082 4188037 3254701 533756 -1246092 -1040111 -201605 -427904 -1705639 -2658658 -2457590
13073 -2457590 -1477431 -126091 1622042 2934009 1966989 -1420500 -4014291 -2579416
13065 -2579416 1598547 3967922 2645244 554343 925063 3184161 4689457 4311390
13057 4311390 2476104 -417886 -3389012 -4191082 -1812362 1218488 1536005 -547676
13049e47676j114151J447902K170766R17588r8540k77544o58999j203567r11370
13040b75591K3205O19157J029547J783976J889892K00503j909087j934124j11220
13031A316258P46683n98615k310296k454329j201585L53465J473766J485318J87554
13022a001781j128998r84587o1865q5618n34312O62270K950429L108665L88661
13013C312864j789467j074812J74884r62552l018688k569951K83161K298883J968261
13004a377417Q61690M86588N69880N40089M45298J21088p66877j599757j217477
12995a936895K82929J370477J013784l7151j97131J048490K280880J497918j146685
12986D176616k686556r36845J893618J673075j640369l647097j943065O07408
$$ plain form
13049 -547676 -1661827 -213925 1956841 2874429 2775889 2498345 1839346 635779 -275591
13040 -275591 -252386 366771 1396318 3180294 5070186 5270689 3361602 1427478 1316258
13031 1316258 2062941 1464326 -845970 -3300299 -4501884 -4148419 -2674653 -1189335 -1001781
13022 -1001781 -2130779 -3115366 -3177231 -3262849 -3797161 -3134891 -184462 2924203 3312864
13013 3312864 1523397 448585 623469 -339083 -3357771 -5927722 -5644561 -3345678 -1377417
13004 -1377417 -515727 -29139 540741 1080830 1526128 1647216 880339 -719418 -1936895
12995 -1936895 -1653966 -283489 730295 693144 496013 1544503 3825383 5323301 4176616
12986 4176616 1490060 553215 2446833 4119908 2479539 -1167558 -3110623 -2503215
12978b503215P32987n68591p07805K44375R28961J560858K272386J305588j647487
12969A618057l012600l06960K976864K139945j211027j717265J141941K724231
12961D353186R04814j569187k476696k478978j704925O76349K772754J190692
12953A668009k970035m508515j785906J138241J413983J026202J645605J408384
12945i64032n52355j544478k45800O38937l56238m45910J820951K933368L35875
12936A620318k661116k248765j56876K29276k36308P02321J710667Q14439p5321
12927c01365J186053K107171j28371k688126j514193J122534J79831l208995l488988
12918f734449j69218J686936K34700q53555N40673K038599J997308J864583K009377
$$ plain form
12978 -2503215 -1770228 -2338819 -3046624 -2802249 -1873288 -312430 1959956 3265544 1618057
12969 1618057 -1394543 -1701503 1275361 3415306 2204279 487014 1628955 4353186
12961 4353186 5258000 3688813 1212117 -1266861 -2971786 -2295437 477317 1668009
12953 1668009 -1302026 -5810541 -7596447 -6458206 -5044223 -4018021 -2372416 -964032
12945 -964032 -1516387 -3060865 -3306665 -2667728 -3023966 -3469876 -1648925 1284443 1620318
12936 1620318 -1040798 -3289563 -3446439 -3217163 -3453471 -2751150 -1040483 -226044 -301365
12927 -301365 884688 2991859 2863488 175362 -1338831 -216297 -36466 -3245461 -6734449
12918 -6734449 -6903667 -5216731 -4982031 -5835586 -5294913 -3256314 -1259006 605577 2614954
12909B614954N72124k144460l124652j750950o76905n93754P53191L143097K993250
12900A785895k12267j982265J63485K640163J632599j399916l010230k591881
12892b974417j065973J437831L695271K901367q90099l316814j683411J071744
12884h24501J376296K82786K74769N30564m78776r27175J198611L477759K412402
12875G322735o08387j537286k74145o1900j349050j438298P857K29692j287063
12866A004155j492686Q71906K778425J677085o64129j291061l39350J59104k39567
12857B463882m41231j14901J07357N6888N9790k0513n15186j046292r35724l15124
12847g01054L9940j14934k25014J07758M98066L59897j93962l87821K15485R70341
$$ plain form
12909 2614954 3187078 1042618 -2082034 -3832984 -4509889 -5103643 -4350452 -1207355 1785895
12900 1785895 1573628 -408637 -245152 2395011 4027610 2627694 -382536 -2974417
12892 -2974417 -4040390 -2602559 1092712 3994079 3103980 -212834 -1896245 -824501
12884 -824501 551795 834581 1109350 1639914 1161138 233963 1432574 4910333 7322735
12875 7322735 6714348 5177062 4902917 4841017 3491967 2053669 2061526 2291218 1004155
12866 1004155 -488531 383375 3161800 4838885 4174756 2883695 2544345 2703449 2463882
12857 2463882 2022651 1907750 2015107 2071995 2131785 2111272 1596086 549794 -385930 -701054
12847 -701054 -661114 -776048 -1001062 -893304 -395238 -35341 -229303 -617124 -401639 568702
12837E68702P47011o36058j931759j776894l12923R91124J190380R54968J323443
12828A117994J809866Q28785j722047l510276k510038J13268J455642Q22733K23825
12819a370248P95671J100444o9403j467503j548458q75301m81322L08475K051798
12810a555847K815928N78429k945484l943708j666625Q81323J379818O20576K20882
12801c614708L95586O31705O95621M92249K86882R15811K394852L024283J594528
12792F816809n16293j430651j549820j787160r15156J827660L315990L80009m063107
12783B078281m130272J9590K197466m6341j919008K12416K902787J680617j812929
12774A182607k964453j034113J129875J727731R75482n01235j512504n66938J563733
$$ plain form
12837 568702 1315713 679655 -1252104 -3028998 -3341921 -2350797 -1160417 -205449 1117994
12828 1117994 2927860 3756645 2034598 -1475678 -3985716 -3872448 -2416806 -1594073 -1370248
12819 -1370248 -574577 525867 456464 -1011039 -2559497 -3434798 -3916120 -3607645 -1555847
12810 -1555847 1260081 1838510 -1106974 -5050682 -6717307 -5835984 -4456166 -3835590 -3614708
12801 -3614708 -3219122 -2587417 -1891796 -1399547 -1112665 -196854 2197998 5222281 6816809
12792 6816809 6300516 4869865 3320045 1532885 617729 2445389 5761379 6141388 2078281
12783 2078281 -2051991 -2032401 165065 118724 -1800284 -1587868 1314919 2995536 1182607
12774 1182607 -1781846 -2815959 -1686084 41647 1017129 515894 -996610 -1563548 185
12765A85J879145m29380k407104j942676o02067O2482J101444K619246J977756
12756B259031j203121k610386J89074K930765J171451k202787j580276K258858
12748A212609L721493J243830j410069j779728j176650q25589l25252N2754m71037
12739B42361r29036O2737J450825J461561Q85984J264593J507533M4744j616253
12730D375049j502165j056277j956283j799556J598508M383683J799840l041938
12722B800861l145294R46090K107283j186129k675376K92857K280006k23078k654724
12713a457504p28623K264334J717660o63743r50516J73257L9275o12391l6403
12704b54654K59762j380253k600745q38499J655294J463425n2696N13413K337338
$$ plain form
12765 185 1879330 1449950 -957154 -2899830 -3501897 -3439415 -2337971 281275 2259031
12756 2259031 1055910 -1554476 -1365402 1565363 2736814 534027 -1046249 1212609
12748 1212609 4934102 6177932 4767863 2988135 1811485 985896 660644 713398 242361
12739 242361 -686675 -623938 826887 2288448 3174432 4439025 5946558 5991302 4375049
12730 4375049 2872884 1816607 -139676 -1939232 -340724 4042959 5842799 2800861
12722 2800861 -344433 601657 2708940 1522811 -1152565 -859708 1420298 1197220 -1457504
12713 -1457504 -2186127 78207 1795867 1132124 181608 354865 394140 -218251 -254654
12704 -254654 5108 -1375145 -3975890 -4814389 -3159095 -1695670 -1748366 -1234953 1102385
12695A102385K110795K14601k84302M05237o53658l026755k771824R67422L981558
12686B045459K991038j32472j722972r76030L37697O42244l63043j883450k337550
12677a399079o95159J913563L034439J717244m99994j665764j467637q71199n08494
12668d42080k3243J009838J805507P60673k177910m350770l155330M27166K979741
12659c166408L053164K095642J195108j6187q83745J53123J841835N19904l721051
12650A071385n410367j437421L359278K676404k037445l960589r43399K179030
12642d503124J331580j468726j812636J288115M759671M940124J135016l253650
12634B416370l751975j44861K770679J543283j112770q10792J561372J730080
$$ plain form
12695 1102385 3213180 3427781 3143479 3548716 2895058 -131697 -2903521 -1936099 2045459
12686 2045459 5036497 4904025 3181053 2205023 2542720 3184964 2821921 938471 -1399079
12677 -1399079 -2094238 -180675 2853764 4571008 4071014 2405250 937613 66414 -442080
12668 -442080 -465323 544515 2350022 3110695 932785 -3417985 -6573315 -6146149 -3166408
12659 -3166408 -113244 1982398 3177506 3161319 2277574 2430697 4272532 4792436 1071385
12650 1071385 -4338982 -5776403 -2417125 259279 -1778166 -5738755 -6682154 -4503124
12642 -4503124 -3171544 -4640270 -6452906 -5164791 -405120 4535004 5670020 2416370
12634 2416370 -1335605 -1480466 1290213 2833496 1720726 909934 2471306 4201386
12626D201386o30607j627245K539J022169l66098j570865m46948J071751N59183
12617B215265r81620j275382l27349M18243M58694j3023q90765j376605m31256
12608b203798R98759O48412j183229j392837R20070K550870J277561n97351m39457
12599E79000L71848l22494j004874N38886K288889R18934j942770j662355J710466
12590A475530L062878J70368k996566k597206k15261O20811k17870n23726J46911
12581a074131L51306m34321j119222n47047J468130L832449M278381J291604l256740
12572D790409n193363k870035Q51495K574070K277192J722004J109962l79988
12564D881746k206423k954131k329248r26160Q81284K250912J660713p06609k094368
$$ plain form
12626 4201386 3570779 1943534 1946073 2968242 2602144 1031279 584331 1656082 2215265
12617 2215265 1233645 -41737 -369086 49157 507851 494828 -395937 -1772542 -2203798
12608 -2203798 -1205039 -556627 -1739856 -3132693 -2212623 338247 1615808 1018457 579000
12599 579000 950848 628354 -376520 162366 2451255 3370189 1427419 -234936 1475530
12590 1475530 4538408 4708776 1712210 -884996 -1100257 -479446 -697316 -1221042 -1074131
12581 -1074131 -722825 -1157146 -2276368 -2823415 -1355285 2477164 6755545 8047149 4790409
12572 4790409 -402954 -3272989 -2421494 152576 2429768 4151772 5261734 4881746
12564 4881746 2675323 -278808 -2608056 -3534216 -2652932 -402020 1258693 552084 -1542284
12555a542284q83718P38261M25251k23024J287049L211228K008950j302674k283675
12546A435364k06518J190246M12729J63324J419737J236714j332348k574953m79364
12537A264931J314304k38277k068039l81232K482791J991160q73427j631543L7976
12528A898644M87584j190162k179826j227793Q4925J089527K367738K688641L99815
12519D419093k347632j757890J207869J795547q46819k460470j052238K52282
12511g90258o00672j169343L27953J676408J289521J213118K412315J975688j331518
12502E003212l490157j506512J140326K37924j978052j026214J739297J593362
12494A713186j171117j874503M98968K157111J277402M7455m58642j736791l211161
$$ plain form
12555 -1542284 -2426002 -1687741 -1262490 -1485514 -198465 3012763 5021713 3719039 1435364
12546 1435364 1228846 2419092 2831821 2995145 4414882 5651596 4319248 1744295 1264931
12537 1264931 2579235 2340958 272919 -108313 2374478 4365638 3492211 1860668 1898644
12528 1898644 2386228 1196066 -983760 -2211553 -2126628 -1037101 1330637 4019278 4419093
12519 4419093 2071461 313571 1521440 3316987 2470168 9698 -1042540 -790258
12511 -790258 -1390930 -2560273 -2232320 -555912 733609 1946727 4359042 6334730 5003212
12502 5003212 1513055 6543 1146869 1384793 -593259 -1619473 119824 1713186
12494 1713186 542069 -1332434 -833466 1323645 2601047 2648502 2189860 453069 -2758092
12485b758092j733765K441197M302699J276364k603891k695753j85274Q50949
12477a105566j74385o75811K79384J063229O11424l75686j027532j082692m70235
12468b957870L75507M41036l23260l75234J089858K366263J543905m87191j349017
12459C23997o42705R7128L10341P98431J317618L97528j818838k866337j255243
12450c338080J268876K091358J038422o2507j48634K18514K38085j73957o32306
12441D99771o21507J20502Q84583K61159j949011l711101k841251K35115K949296
12432d172444L493458K140154J26185j383938j566324o84769k69871j008221j093882
12423d419652J147912L664435K834988p76507k590518q48101Q25116l58824j817385
$$ plain form
12485 -2758092 -4491857 -2050660 2252039 3528403 924512 -1771241 -1956515 -1105566
12477 -1105566 -1279951 -1955762 -1676378 -613149 -1725 -377411 -1404943 -2487635 -2957870
12468 -2957870 -2582363 -2141327 -2464587 -2839821 -1749963 616300 2160205 1673014 323997
12459 323997 -318708 -221580 88761 887192 2204810 2602338 783500 -2082837 -3338080
12450 -3338080 -2069204 22154 1060576 998069 849435 1067949 1306034 1132077 499771
12441 499771 -121736 -1234 883349 1144508 -804503 -4515604 -7356855 -7121740 -4172444
12432 -4172444 -678986 1461168 1587353 203415 -1362909 -2047678 -2317549 -3325770 -4419652
12423 -4419652 -3271740 392695 3227683 2451176 -139342 -987443 -162327 -521151 -2338536
12414b338536n46870J282994K28374j898261q54307K412980K897836r7864j650731
12405e64385Q01348L576943K804170j91360k016214k041015j487326o26279N59303
12396H15185J151424Q23880O70389J037874P14730m81271q79345q1114q5504j649816
12386B036432k440138q09745J325351J534619K49549r37601j699654j685306K36922
12377b189571L124319L462017K42922k564323j695412M16522r3861k301241k706189
12368d304817j095719K81264J226961K648626L009076O43498j911758j052373
12360e55242J614987J554257r24227j077560J999131L601866J144381j974203
12352E383390k288284j126623r98907j329994p06863m3038n95402j351775r38911
$$ plain form
12414 -2338536 -2885406 -1602412 -1374038 -3272299 -4126606 -1713626 1184210 1086346 -564385
12405 -564385 236963 3813906 6618076 6426716 4410502 2369487 882161 255882 815185
12396 815185 1966609 2790489 3460878 4498752 5213482 4732211 3852866 3771752 3686248 2036432
12386 2036432 -403706 -1213451 111900 1646519 1896068 958467 -741187 -2426493 -2189571
12377 -2189571 934748 4396765 4639687 2075364 379952 796474 702613 -1598628 -4304817
12368 -4304817 -5400536 -5119272 -3892311 -1243685 1765391 2408889 497131 -555242
12360 -555242 1059745 2614002 1689775 612215 2611346 6213212 7357593 5383390
12352 5383390 3095106 1968483 969576 -360418 -1067281 -1110319 -1705721 -3057496 -3996407
12343c996407q3010k1509k58267K56837J246768J830290J733987R14738m62397
12334A161030j230394l37387J038740Q28884m50419m83993N36969J14914j524418
12325c46074j023702J968796K906025o77387m493736l477293R32059L567200K965046
12316B320934J619584O59734j032652l052964l156773j059026Q28789J034696
12308a837678O85552R47690J161715L58944j050815j879966j481526k14739P39541
12299b571282L20652r95549j428342k89036R51767R90573O58645J103131J515035
12290B55594O77164n01521l63676N38343M32067l90382r2015J132006R89635r85168
12280A692047k305345j302455M95084J079706Q13727Q71374P93602k19233r99129
$$ plain form
12343 -3996407 -4079417 -4100926 -4359193 -4102356 -2855588 -1025298 708689 1623427 1161030
12334 1161030 -69364 -406751 631989 1460873 1010454 526461 1063430 1178344 -346074
12325 -346074 -1369776 599020 3505045 2827658 -1666078 -5143371 -4211312 -644112 2320934
12316 2320934 3940518 4600252 3567600 514636 -2642137 -3701163 -2872374 -1837678
12308 -1837678 -1152126 -204436 957279 1316223 265408 -1614558 -3096084 -3310823 -2571282
12299 -2571282 -2250630 -3246179 -4674521 -4963557 -4011790 -3021217 -2362572 -1259441 255594
12290 255594 932758 431237 67561 605904 1037971 647589 555574 1687580 2677215 1692047
12280 1692047 -613298 -1915753 -1420669 -340963 472764 1344138 2137740 1918507 919378
12271I19378K0433J629250J055023j509844k520718l90684J569850q5605l311898
12262b624815l217660N04964K981496J623244k08559P51686K118976L01791k660569
12253d29446j995949J671546K963991M33696j398152J4561J174109q00971k773806
12244a140421r76551K355271K581942q910j475094q81068o29670j172735l70436
12235a717672J904189K947864J585324l23444j299014j804508j857149m74555
12227a038965J609838J876923j15587j612344p24621R23458J057029M379n12899
12218A467211o0925N68936Q07293N20086j86196o82604m02920L5990l91407j266239
12208D09225j329117p52849o98923q29348P3899J078216J4451k133666j615762
$$ plain form
12271 919378 939811 2569061 3624084 2114240 -406478 -797162 772688 687083 -2624815
12262 -2624815 -5842475 -5337511 -2356015 -732771 -941330 -189644 1929332 2231123 -429446
12253 -429446 -2425395 -753849 2210142 2643838 1245686 1260247 2434356 1633385 -1140421
12244 -1140421 -2116972 238299 2820241 2811331 1336237 455169 -174501 -1347236 -1717672
12235 -1717672 186517 3134381 4719705 4396261 3097247 1292739 -564410 -1038965
12227 -1038965 570873 2447796 2332209 719865 -4756 918702 1975731 1980110 1467211
12218 1467211 1406286 1975222 2782515 3302601 3116405 2433801 2030881 2066871 1675464 409225
12208 409225 -919892 -1672741 -2371664 -3201012 -3127113 -2048897 -2034446 -4168112 -5783874
12199e783874J995805M128407J900094j330412j260584Q78329J110473o22419
12191A015819j158088N9184N33002l98744o16309N59773J083434r3948j308484
12182c24361j150359l18926M05989J400811K410653K031800J60413j253099j076373
12173B286548n87662j047825j676937j340504m35510K25425P43229J104502N71605
12164a57129n37369l01211J833062L229515J397052k076291l334810j405603Q36181
12155e16603Q79419l94886o18676O42407J583831Q29209o61084r05241K20018
12146A058394N72725j106945k864826k035202P00550K118557J151208J9779K19223
12137a66537M47150k39391l68244P86734R58520j345182l311949j544149K429521
$$ plain form
12199 -5783874 -3788069 340338 2240432 910020 -350564 527765 1638238 1015819
12191 1015819 -142269 -83085 449917 51173 -565136 -5363 1078071 984123 -324361
12182 -324361 -1474720 -1793646 -1387657 13154 2423807 4455607 4616020 3362921 2286548
12173 2286548 1698886 651061 -1025876 -2366380 -2801890 -2576465 -1833236 -728734 -157129
12164 -157129 -694498 -995709 837353 4066868 5463920 3387629 52819 -1352784 -516603
12155 -516603 362816 -32070 -650746 -8339 1575492 2404701 1743617 838376 1058394
12146 1058394 1631119 524174 -2340652 -4375854 -3675304 -1556747 -405539 -385760 -166537
12137 -166537 280613 41222 -327022 459712 1418232 73050 -3238899 -4783048 -2353527
12128b353527M079704K266651J5401n30615k49853j81093p751K09051j79034n15856
12118B553078M37118J732437J176981q50450j794884j303063j467149k229804
12110a745736r06515K364647L275334r3572l538074k820449J19606R30728j95827
12101b609858N0573J700999J541875j003789k635263j358698Q16697J385143N83559
12092a528762q7645k24739l6571P69173K183599K973048J801342r69241l257850
12083A622354l197063j088022P96827Q21597K240K96935J305471P69987j395541
12074f5215k264125l07706J967728J720367k31459j411100j493914j429349p97388
12065d312161Q14070J554865m2110j641735k49085K410558K133302p40888j579938
$$ plain form
12128 -2353527 1726177 3992828 4008229 3477614 3227761 3046668 3038917 3247968 3068934 2553078
12118 2553078 2990196 4722633 5899614 5049164 3254280 1951217 484068 -1745736
12110 -1745736 -2652251 -287604 2987730 2894158 -643916 -3464365 -3344759 -2414031 -2609858
12101 -2609858 -2559285 -858286 683589 -320200 -2955463 -4314161 -3497464 -2112321 -1528762
12092 -1528762 -1616407 -1841146 -1877717 -1108544 1075055 4048103 5849445 4880204 1622354
12083 1622354 -1574709 -2662731 -1865904 -1044307 -1042067 -745132 560339 1330326 -65215
12074 -65215 -2329340 -2637046 -669318 1051049 819590 -591510 -2085424 -3514773 -4312161
12065 -4312161 -3498091 -1943226 -1985336 -3627071 -3876156 -1465598 667704 -73184 -1653122
12056a653122Q91281K472948O02271j496894n81443J127909J23513k082311j500928
12047b096776J361804J977508j011897l495156j926899J721913L053446J153424
12039G37367r40765q14565N50819R14434l940o62174l37506j12178r49972k002263
12029c620743j692782J32551J998951K476010J456649J3962n81102L6323J000515
12020A220334J363710J333298J425634Q49139j362505l670141l229411n63809
12012b633751J84922k460787m143553r29751M140806N003401J213317k056949
12004a682345j788552p2305O77824P34071N20596n61026j546231j53702K930012
11995i41658L842217J292658j256890j121419k32467q69712j334068N80677K819369
$$ plain form
12056 -1653122 -761841 1711107 2313378 816484 235041 1362950 1486463 -595848 -2096776
12047 -2096776 -734972 1242536 230639 -3264517 -5191416 -3469503 -416057 737367
12039 737367 -203398 -1017963 -467144 447290 443350 -218824 -556330 -668508 -1618480 -3620743
12029 -3620743 -5313525 -5180974 -3182023 -706013 750636 764598 183496 219819 1220334
12020 1220334 2584044 3917342 5342976 6192115 4829610 1159469 -2069942 -2633751
12012 -2633751 -2448829 -4909616 -9053169 -9982920 -5842114 -838713 374604 -1682345
12004 -1682345 -3470897 -3543202 -2865378 -2131307 -1610711 -2171737 -3717968 -3871670 -941658
11995 -941658 2900559 4193217 2936327 1814908 1582441 712729 -621339 -40662 2778707
11986B778707J933745j157282k420072p89903Q40369M95241n26402o67173n35864
11977d8634j179598j973420j600609p8739J299247J641437J329109J179100J172467
11968A740360N45226p34979j355373k96566J498317K147772J111316n84031j780727
11959B291315j692491M3507K202275K089601r48447l455263k225381N90858N96271
11950e07755j676819j686405J126646K114187m56082k096544K12572K662926J081412
11941G74138k053329k059998K95808J067160J54742L66042J469221R68594m06022
11932E76356K79051K190362J462297j894476l331233r80505J577332J344633K4301
11923A248118j7641K94762m47754q54957N72098J968191N99439k624813m074101
$$ plain form
11986 2778707 4712452 3555170 1135098 345195 1185564 1680805 1154403 487230 -48634
11977 -48634 -1228232 -3201652 -4802261 -4881000 -3581753 -1940316 -611207 567893 1740360
11968 1740360 2285586 1550607 195234 -101332 1396985 3544757 4656073 4072042 2291315
11959 2291315 598824 642331 2844606 4934207 3985760 530497 -1694884 -1104026 -507755
11950 -507755 -2184574 -3870979 -2744333 -630146 -1086228 -3182772 -2970200 -307274 774138
11941 774138 -1279191 -3339189 -3043381 -1976221 -1821479 -1455437 13784 982378 576356
11932 576356 855407 3045769 4508066 2613590 -717643 -1698148 -120816 1223817 1248118
11923 1248118 1230477 1525239 1077485 222528 794626 2762817 3362256 737443 -3336658
11914c336658k198344R01555K485188J979033O86414n2336r894J68954N8115k2852
11904F59175J68437J05241n09601p08858L99233J681904J102668j217039k842301
11895a161141k275417o77758K34096M01369O14886Q24606M88187j09919l0558
11886a691649R64418J909040J609703l0905j759458k245964j565423q59565n34248
11877d204051J16314J128544J231810L3530o97729L82603J622204O06282j840677
11868a621170k437164j19057K504242K779600J000512q85768j765061j703261
11860b247127j170471p35229o50818l81494O29066J772311J944439J185441L42917
11851F89035m85092j421483j210797J317138M101622L245790j317678m536683
$$ plain form
11914 -3336658 -5535002 -4633447 -2148259 -169226 517188 464852 454958 623912 682027 659175
11904 659175 827612 932853 423252 -285606 113627 1795531 2898199 1681160 -1161141
11895 -1161141 -3436558 -4114316 -3880220 -3478851 -2863965 -2039359 -1551172 -1661091 -1691649
11886 -1691649 -727231 1181809 2791512 2760607 1001149 -1244815 -2810238 -3669803 -4204051
11877 -4204051 -4087737 -2959193 -1727383 -1693853 -2391582 -2008979 -386775 219507 -1621170
11868 -1621170 -4058334 -4177391 -1673149 1106451 2106963 1221195 -543866 -2247127
11860 -2247127 -3417598 -4152827 -4803645 -5185139 -4556073 -2783762 -839323 346118 689035
11851 689035 203943 -1217540 -2428337 -1111199 2990423 6236213 4918535 381852
11843C81852k714479J203224J735672j377097l105106n48859L132079L439786
11835B147072N20339j734223j174267M34850O05501o08122j447635j241929r20815
11826c419229j075051q76910N94060K731868L780221K630552o6010k419589k840918
11817i61006j383105L33222Q22617K93216J1755L16459K73736m89593q35346J97181
11807a420864J657958J756187K48605j266391j321631j5247J513186K280750J960584
11798E393137Q13605m27316q68957k16156O16076J85025j587768k676063j294346
11789f2763J159378J345733j248883l036060j409222J142165O93998k059318k950844
11780f425816o86104J869236K703076K903440L179208K174584k42528j653781
$$ plain form
11843 381852 -2332627 -1129403 606269 -770828 -3875934 -4424793 -1292714 2147072
11835 2147072 2667411 933188 -241079 193771 799272 191150 -1256485 -2498414 -3419229
11826 -3419229 -4494280 -5371190 -4777130 -2045262 1734959 4365511 4299501 1879912 -961006
11817 -961006 -2344111 -2010889 -1188272 -895056 -883301 -566842 -293106 -782699 -1618045 -1420864
11807 -1420864 237094 1993281 2241886 975495 -346136 -361383 1151803 3432553 5393137
11798 5393137 6206742 5779426 4910469 4694313 5310389 5495414 3907646 1231583 -62763
11789 -62763 1096615 2442348 1193465 -1842595 -3251817 -2109652 -1415654 -3474972 -6425816
11780 -6425816 -7111920 -5242684 -2539608 363832 3543040 5717624 5475096 3821315
11772C821315r27635r7189n12808n49629O01578M91532k204245m220531k370549
11763e968161J069457J793581J40174j50666J540518K112482L13381j386155r77654
11754a513043M82858J207243R44308K70690l40712m23121p1571l15495j398919
11745a157762j573889M14261K664051K340826k48961k288334k429812j578374
11737c857994l59409J404390K936739K844508J291519j88222q49369r63579n46777
11728A711806L00567O48361J73424J65754J204117J477291k83922k121129j847455
11719A428814o79680o80659p90554P39087K126500Q78797j011202N1506K510873
11710D573482J666161k092360l317351l06815K288373J121849j311481j903977
$$ plain form
11772 3821315 2893680 2796491 2283683 1734054 2335632 2827164 622919 -3597612 -5968161
11763 -5968161 -4898704 -3105123 -2964949 -3115615 -1575097 537385 850766 -535389 -1513043
11754 -1513043 -1030185 177058 1121366 1392056 1051344 628223 556652 241157 -1157762
11745 -1157762 -2731651 -2317390 346661 2687487 2438526 150192 -2279620 -3857994
11737 -3857994 -4217403 -2813013 123726 2968234 4259753 4071531 3222162 2258583 1711806
11728 1711806 2012373 2660734 2834158 2999912 4204029 5681320 5397398 3276269 1428814
11719 1428814 749134 68475 -722079 17008 2143508 3022305 2011103 2062609 4573482
11710 4573482 6239643 4147283 829932 523117 2811490 3933339 2621858 717881
11702G17881j477889j491660q15735J240206K496541J409280j41611j09063N29567
11693B357517R0761r66772j501979j521033r95108N53130K056184J410322q76954
11684F06068j728112k94042Q08534K55271M0712J096951J059875j266591l068703
11675b490037j805383J015538K818766L448774L320488J531572j555929l107891
11667C175898j836726j74344j26309l59772K48664N1771j566153j842348N76276
11658a853043K389744Q84373j351628r82839M63380J2470j138567l41676J089265
11649h28521L61603j291168p99228J018144J099722j25229J76001J728299J843731
11640C183354O28623M89159J218213N24435j120334j114138J36347l17243k323093
$$ plain form
11702 717881 -760008 -2251668 -3067403 -1827197 669344 2078624 1937013 1827950 2357517
11693 2357517 2448278 1481506 -20473 -1541506 -2536614 -1983484 72700 1483022 606068
11684 606068 -1122044 -1416086 -607552 -352281 -311569 785382 1845257 578666 -2490037
11675 -2490037 -4295420 -3279882 -461116 2987658 6308146 7839718 6283789 3175898
11667 3175898 1339172 1164828 1038519 678747 927411 979182 -586971 -2429319 -1853043
11658 -1853043 536701 1421074 69446 -913393 -450013 -437543 -1576110 -1917786 -828521
11649 -828521 -466918 -1758086 -2557314 -1539170 -439448 -564677 -388676 1339623 3183354
11640 3183354 3811977 4301136 5519349 6043784 4923450 3809312 3945659 3628416 1305323
11631A305323k344783O38101L387670L335852J388889p35139k319848k491849
11623B164216q88545L43812j117876l493518k926075K64592J791117K13609j137398
11614d786066j6313J533009J356034M40401K24509K78108K89754R64934J586941
11605A871311K53045k148659k118887P01083K156602J24110j847258l88872K166121
11596G68596J857519n21314j314595k3762P76523J77435k97379N3750M72796R41351
11586B890920K022127K750049J444678j343115l078992k573445j056520P9534
11578A135236O40301O20821k39122j452891j846272j068617P1594R20128J444156
11569B25334J329224N0766j701226k018453j13864K189864K380459L21935j629671
$$ plain form
11631 1305323 -1039460 -401359 2986311 6322163 7711052 6975913 4656065 2164216
11623 2164216 1275671 1619483 501607 -2991911 -5917986 -5653394 -3862277 -3648668 -4786066
11614 -4786066 -4802379 -3269370 -1913336 -1472935 -1248426 -970318 -680564 284370 1871311
11605 1871311 2124356 -24303 -2143190 -1442107 714495 838605 -1008653 -1397525 768596
11596 768596 2626115 2104801 790206 766444 1542967 1720402 1423023 1476773 1949569 2890920
11586 2890920 4913047 7663096 9107774 7764659 4685667 2112222 1055702 1135236
11578 1135236 1775537 2396358 2157236 704345 -1141927 -2210544 -2138950 -1218822 225334
11569 225334 1554558 1605324 -95902 -2114355 -2228219 -38355 2342104 2664039 1034368
11560A034368j654828n78553k33560n16417L54357K481897L106619L11461l355729
11551I49615l428506L63348L151225J280979k567127k884241J101899M198150
11543B165342K127238k741334m446991j120172K866426K819526m56349k438731
11535a225045j047845J440752K302053J507105K88099r93777k101972j999585
11527a830215n13685N19938l17410j656471j366842J65244J008241R92858J488894
11518a509448K385336K004114P6996j672007k198519k116902j725284m18857J388005
11509c786566K056570J199131K65602j8175n52840j409634r83650J087520K551108
11500D09066J783072K55893j18191R336o30839r72769M58337K111799J292287
$$ plain form
11560 1034368 -620460 -1199013 -1432573 -1948990 -1594633 887264 3993883 4305344 949615
11551 949615 -2478891 -2115543 1035682 2316661 -250466 -3134707 -2032808 2165342
11543 2165342 4292580 1551246 -2895745 -4015917 -1149491 1670035 1213686 -1225045
11535 -1225045 -2272890 -832138 1469915 2977020 3265119 2271342 169370 -1830215
11527 -1830215 -2343900 -1823962 -2141372 -3797843 -5164685 -4999441 -3991200 -2998342 -1509448
11518 -1509448 875888 2880002 2956998 1284991 -913528 -3030430 -4755714 -5174571 -3786566
11509 -3786566 -1729996 -530865 -265263 -283438 -836278 -2245912 -3229562 -2142042 409066
11500 409066 2192138 2448031 2329840 2339176 1708337 735568 1193905 3305704 4597991
11491D597991j185844j776057K25144J438123k14314k193231j463880O79795P66288
11482H74015j349987k290558k81539K311914K403032J35335j854141j901077o78523
11473b631529L44765N78734M15784M04185N49161L07656n73162j261062n61713
11464b427181J251901K193134R57228j079809j369366N74746K603907K641223
11456E345783Q99951q75827j471694j019184l67996j81994m59088p09957o45759
11447E14235n17752n89656o53202m45261j04382K46836Q17431J494138J576946
11438B339333Q65638J79778k6570n04326j580520j993250q96751L24094K27666
11429a064908o9796J033396K233802J184200j162714j756478n65361l98308j532276
$$ plain form
11491 4597991 3412147 1636090 1861234 3299357 3085043 891812 -572068 107727 874015
11482 874015 -475972 -2766530 -3048069 -736155 1666877 1802212 -51929 -1953006 -2631529
11473 -2631529 -2286764 -1708030 -1292246 -888061 -338900 -31244 -604406 -1865468 -2427181
11464 -2427181 -1175280 1017854 1975082 895273 -474093 100653 2704560 5345783
11456 5345783 6245734 5369907 3898213 2879029 2511033 2329039 1869951 1159994 514235
11447 514235 -3517 -593173 -1246375 -1691636 -1796018 -1549182 -731751 762387 2339333
11438 2339333 3204971 3384749 3358179 2853853 1273333 -719917 -1616668 -1292574 -1064908
11429 -1064908 -1134704 -101308 2132494 3316694 2153980 397502 -167859 -566167 -2098443
11420b098443j086289J334643K168902l4963j701378j33423J885060Q74566j586316
11411c77641j912617m19374J06883m22469K4981J334605J645931J017266R58125
11402A955690J166714K88080q94088o01646K91773n53249k482352k319153N26656
11393b621575K853140K172214l83522k257638k266065p77743R83237J637700J077678
11384D17426P04146J018517N04787j291376j823878M56024K494634R01425k175043
11375A206662k163460L53162O88276j751946k315234Q94716L591656K108230j140223
11366A471839j834747K30986K124373K074962M64550j380670j823754l84996O92709
11357A635252r94670l549598k578204J753001L933186J165830k369309k063270
$$ plain form
11420 -2098443 -3184732 -1850089 318813 283850 -1417528 -1550951 334109 1208675 -377641
11411 -377641 -2290258 -2709632 -2602749 -3025218 -3000237 -1665632 -19701 997565 1955690
11402 1955690 3122404 3410484 2516396 1914750 2206523 1653274 -829078 -3148231 -2621575
11393 -2621575 231565 2403779 2020257 -237381 -2503446 -3281189 -2297952 -660252 417426
11384 417426 1121572 2140089 2644876 1353500 -470378 -14354 2480280 3381705 1206662
11375 1206662 -956798 -603636 84640 -1667306 -3982540 -3087824 503832 2612062 1471839
11366 1471839 -362908 -131922 1992451 4067413 4531963 3151293 1327539 942543 1635252
11357 1635252 640582 -2909016 -5487220 -3734219 198967 1364797 -1004512 -3067782
11349c067782N93683J561275N78825j60593n89242j574169j562428R33582L272533
11340a4316J900966j497291k006893P37569J860878q98872l451858j577622K804947
11331b142492M476136J847187j762838k809621j134033R88853J675650P99092
11323A937934n70853j359509j185780l43417N25551Q52367O71043O59670J126495
11314B313501J169719j62661j883962j677043Q68425K983906J895672j570607
11306C936950l865500k811368L02323K548322K287917K02880j790693k279617
11298a468786j281526K02127J224093J317767L89052j062170j803642r14497Q71526
11289b526056J716954Q58011n08194q25795J6507Q87095R07810L25806Q0987O67201
$$ plain form
11349 -3067782 -2474099 -912824 -333999 -494592 -1083834 -2658003 -4220431 -3286849 -14316
11340 -14316 1886650 389359 -1617534 -879965 980913 82041 -3369817 -4947439 -2142492
11331 -2142492 2333644 4180831 2417993 -391628 -1525661 -536808 1138842 1937934
11323 1937934 1367081 7572 -1178208 -1521625 -996074 -143707 527336 1187006 2313501
11314 2313501 3483220 3320559 1436597 -240446 627979 3611885 5507557 3936950
11306 3936950 71450 -2739918 -2437595 110727 2398644 2601524 810831 -1468786
11298 -1468786 -2750312 -2548185 -1324092 -6325 382727 -679443 -2483085 -3397582 -2526056
11289 -2526056 -809102 48909 -459285 -1285080 -1268573 -381478 526332 852138 933125 1600326
11279A600326J423143J228543Q158j061980j178442r46336j224561j803119j955742
11270c910010j405391m8065K047898L527538K369076r54138k835104j119660J521192
11261h06664J427443o32743j244935j18631M6921j125265r69872J220803K661942
11252D58999J560251n58748k044387k986017k812605n0024L857204M520415P36783
11243B681871l009423k746541j78464J199600J456977K027883J562611j369190
11235A625324l868773k126610K080043L409624R86388o86842P28145J994656J69922
11226D311877k440950k099316N01772J495665m08534k424822j788140Q41586K640803
11217F29941K057605K14559p68367k67989L61994j98610j298717j104287P48213
$$ plain form
11279 1600326 3023469 4252012 4260170 3198190 2019748 1073412 -151149 -1954268 -3910010
11270 -3910010 -5315401 -5363466 -3315568 211970 2581046 1626908 -1208196 -2327856 -806664
11261 -806664 620779 -11964 -1256899 -1375530 -1328609 -2453874 -3423746 -2202943 458999
11252 458999 2019250 1460502 -583885 -3569902 -6382507 -6432531 -2575327 1945088 2681871
11243 2681871 -327552 -3074093 -3252557 -2052957 -595980 1431903 2994514 1625324
11235 1625324 -2243449 -4370059 -2290016 1119608 2105996 1419154 2147299 4141955 4311877
11226 4311877 1870927 -228389 273383 1769048 1360514 -1064308 -2852448 -2010862 629941
11217 629941 2687546 2902105 2133738 1865749 2227743 2029133 730416 -373871 374342
11208C74342K235218J347067j120472k297955r77274O33453K7213j706997j290014
11199b775419J485618K762633K76566k775202k254157O57453J462661n32242j529490
11190c221579K32469J863915J111169j4106O91112J563403K70284j756701j683607
11181i43641p5385L80827m00066k81333P22248M18101j153665j214703Q83091
11172a664526J913148k32710k821171k186182P61421K084870Q08930o1539J328688
11163f9071K802356J820825n03703j342227n07337k21544j233261j897462j172290
11154b323714J9761Q41505J486130J504792p4328j994912j219314K189418L802282
11145D231620R59139k789298k643181N71469K334431J241242l54594j059272j342493
$$ plain form
11208 374342 2609560 3956627 2836155 538200 -439074 194379 221592 -1485405 -2775419
11199 -2775419 -1289801 1472832 1749398 -1025804 -3279961 -2622508 -1159847 -1692089 -3221579
11190 -3221579 -2989110 -1125195 -14026 -28132 662980 2226383 2496667 739966 -943641
11181 -943641 -1019026 -638199 -1038265 -1319598 -597350 -179249 -1332914 -2547617 -1664526
11172 -1664526 248622 15912 -2805259 -4991441 -4230020 -2145150 -1336220 -1397759 -69071
11163 -69071 2733285 4554110 4050407 2708180 2200843 1979299 746038 -1151424 -2323714
11154 -2323714 -2303953 -1462448 23682 1528474 1454146 -540766 -1760080 429338 4231620
11145 4231620 5190759 2401461 -241720 329749 2664180 3905422 3550828 2491556 1149063
11136A149063p19123J371582K554588K37182l067651k431711J415297K566076
11128C075303o05278k762296n43190K098369J067745j014345K1696K353291J471168
11119E162463j877927k829314j14070K508754K166811j9716j792896k241067j281629
11110c18591M46650J127490k57763j686427m28401K528277L231222L07338l021151
11101A928644l464994j785551p13992n69509N88442K943712L757866J376752j589217
11092B472153j448585J134291J979067j78817j791389n32429P44089q22008k604953
11083a048581p79693K606114K498505p19473j825772N06379J913823R8383j794165
11074A455520j306985m46232r17060q04939J163907K665341J934727O94918L62009
$$ plain form
11136 1149063 429940 1801522 4356110 4593292 1525641 -906070 509227 3075303
11128 3075303 2470025 -292271 -835461 1262908 2330653 1316308 1338004 3691295 5162463
11119 5162463 3284536 455222 341152 2849906 5016717 4997001 3204105 963038 -318591
11110 -318591 128059 1255549 997786 -688641 -1117042 1411235 4642457 4949795 1928644
11101 1928644 -1536350 -3321901 -4035893 -4605402 -4016960 -1073248 2684618 4061370 2472153
11092 2472153 1023568 2157859 4136926 3958109 2166720 1634291 2378380 1556372 -1048581
11083 -1048581 -1828274 777840 3276345 2556872 731100 1237479 3151302 3249685 1455520
11074 1455520 148535 -297697 -1214757 -2019696 -855789 1809552 3744279 4439197 4801206
11065D801206m08720j904966j683449N15636R59694j787214l578144j283359K068407
11056b300909K675804J746742J577306O74550k163851l422263k41802L601939
11048B147516L027612l04885j241126M55906J017089l88138j563458k137870k912606
11039a899960k411278M63562K611134J134863j030689J36501K302874R65143j746003
11030E26147m94284L091713K633566j521210k542454P77177J997333r64675j691797
11021A811516K983411O216334J952392m874510n847742j459528J205762k12512
11013A775123j485045M4383J715523O54442j774529k255495p2730K066254J367099
11004B035025j429207k527686Q6434L464655L280816l27523l177011k775690n84932
$$ plain form
11065 4801206 4392486 2487520 804071 1319707 2279401 492187 -3085957 -4369316 -2300909
11056 -2300909 374895 2121637 3698943 4373493 2209642 -1212621 -1454423 2147516
11048 2147516 5175128 4870243 3629117 4085023 5102112 4713974 3150516 1012646 -1899960
11039 -1899960 -4311238 -3847676 -1236542 -101679 -1132368 -995867 1307007 2272150 526147
11030 526147 31863 3123576 5757142 4235932 1693478 2470655 4467988 3503313 1811516
11021 1811516 4794927 11011261 12963653 8089143 2241401 781873 1987635 1775123
11013 1775123 290078 334461 2049984 2704426 929897 -1325598 -1398328 667926 2035025
11004 2035025 605818 -1921868 -1835434 1629221 4910037 4582514 1405503 -1370187 -1955119
10995a955119J268728K190143J777579k97148k419009k213155k60461M70460n94871
10986b032853q54908P68598K044454J499888O42645O42097L07625q75889j083982
10977A057675M56156J571970Q09006n4447M64607N18573j654322l869501k996869
10968c697152o1694J231590J77188k42536J563776L161454J762484j513810k940284
10959e58984j140464J101685P06326j398709j711168N42183K178426R76610r37916
10950b42011o33907J070749J380728P5214q47934p91774n83203O0981J658115
10941A146958K441006M80391k241550j962355P65002J474934j128602k953275
10933a977491r37327K289471K528179j54927k275293j762575K16218J266970K51646
$$ plain form
10995 -1955119 -686391 1503752 3281331 2984183 565174 -1647981 -1908442 -1437982 -2032853
10986 -2032853 -2887761 -2119163 -74709 1425179 2067824 2709921 3017546 2141657 1057675
10977 1057675 1513831 3085801 3894807 3840360 4304967 4823540 3169218 -700283 -3697152
10968 -3697152 -3758846 -2527256 -2350068 -2592604 -1028828 2132626 3895110 2381300 -558984
10959 -558984 -1699448 -597763 108563 -1290146 -3001314 -2459131 -280705 695905 -242011
10950 -242011 -875918 194831 1575559 1650773 802839 11065 -572138 -511157 1146958
10941 1146958 3587964 4068355 1826805 -135550 629452 2104386 975784 -1977491
10933 -1977491 -2914818 -625347 1902832 1747905 -527388 -2289963 -2073745 -806775 -555129
10924e55129j665171k144023n70394Q15188J19321j016921J47144K808079L565995
10915A504089J595757n14939j106609j164448j346566q21772J45679j70174j635405
10906c514388j700250N25177K501026K031241K98780l66019L83166J387262J791614
10897C337609J236124k26022j596394j688231p63962k3938L70491R86573J231066
10888B863316M7745j680808j847567k70753J146829J373248J106835P90614O7405
10879C596864q05616j062208p89174m81687L0471N49356j44676j887050k093504
10870c087224K68380K077930P04872j379359o43532J562565J884851J093588J702313
10861D184384J951247j212795n023762m128328J54283J602014l24558n7762L406318
$$ plain form
10924 -555129 -2220300 -4364323 -4934717 -4119529 -4000208 -5017129 -4869985 -2061906 1504089
10915 1504089 3099846 2584907 1478298 313850 -1032716 -1854488 -1708809 -1878983 -3514388
10906 -3514388 -5214638 -4689461 -2188435 -157194 141586 -224433 158733 1545995 3337609
10897 3337609 4573733 4347711 2751317 1063086 299124 275186 645677 1632250 2863316
10888 2863316 2911061 1230253 -617314 -888067 258762 1632010 2738845 3529459 3596864
10879 3596864 2791248 1729040 939866 458179 488650 1038006 893330 -993720 -3087224
10870 -3087224 -2818844 -740914 -36042 -1415401 -2058933 -496368 1388483 2482071 4184384
10861 4184384 6135631 4922836 -100926 -4229254 -4074971 -2472957 -2797515 -2855277 551041
10852E51041M281181L77138k855619j726274J62830n74661j500393m33308j69358
10843a887423k377219l101413M80450M333257L835170R70610J71705J240561J323480
10834D989178K40292n83871j148375j243071M93425K819303J741290k692914m738675
10825a23418j803481R14901p62138k755176k40509L427483K542896r31657j095244
10816h26343J601503J902674o88283j850894p52935q49520k653442k662748p071
10807f787059J928749J405815N95759R47317R10433n01005j649348j007345P20050
10798c436634J839343J202097j058462k721682j007011L102908M541180R48593
10790C410332l119895k502475J016568K173234O29519K21021J488542J206755
$$ plain form
10852 551041 4832222 5209360 2353741 627467 790297 215636 -1284757 -1718065 -1887423
10843 -1887423 -4264642 -7366055 -6885605 -2552348 1282822 2253432 2425137 3665698 4989178
10834 4989178 5229470 4645599 3497224 2254153 2747578 5566881 7308171 4615257 -123418
10825 -123418 -1926899 -1011998 -1774136 -4529312 -4769821 -1342338 1200558 268901 -826343
10816 -826343 775160 2677834 1989551 138657 -614278 -1463798 -4117240 -6779988 -6787059
10807 -6787059 -4858310 -3452495 -2856736 -1909419 -998986 -1499991 -3149339 -4156684 -3436634
10798 -3436634 -1597291 -395194 -1453656 -4175338 -5182349 -2079441 2461739 3410332
10790 3410332 290437 -2212038 -1195470 977764 1607283 1828304 3316846 4523601
10782D523601j031459j824184j75250P64530o26584j897352j203837j48729r4697
10773a713961M15718K319705L433278J730009j231397k597327k142423j635116
10765a421514j586793r46979M25759J046481M2105j161284m61524J885366L074845
10756H96462J254707j791862k793111j159457P43181J162992P45953O48321R04097
10747F11283J036203N97996q65629k647955k386725P22001L177963J250460k823827
10738a328230l231921P43218L586356K064266o19248j170517j134016k315686
10730c405778k407080O09029L727813L117668P4039j405792n81942L36238L87914
10721D52109K00535j94054q94716j003393k12280L03980K39290R06107K173034
$$ plain form
10782 4523601 3492142 1667958 1492708 2257238 1630654 -266698 -1470535 -1619264 -1713961
10773 -1713961 -1298243 1021462 4454740 6184749 4953352 2356025 213602 -1421514
10765 -1421514 -3008307 -3955286 -3529527 -2483046 -2440941 -3602225 -4063749 -2178383 896462
10756 896462 2151169 359307 -2433804 -3593261 -2850080 -1687088 -941135 -292814 611283
10747 611283 1647486 2245482 1379853 -1268102 -3654827 -2932826 245137 1495597 -1328230
10738 -1328230 -4560151 -3816933 -230577 1833689 1214441 43924 -1090092 -3405778
10730 -3405778 -5812858 -5203829 -1476016 1641652 1715691 309899 -272043 64195 452109
10721 452109 652644 458590 -436126 -1439519 -1651799 -1347819 -1108529 -202422 1970612
10712A970612J871268j26364j029628j91057o30614l118198l646585j01815L402803
10703a599578K844345L87162j71097L72306k91424q97650J95478O24821j647427
10694a83064l236610m84162L476810L104889o03011j998157J33513J749727Q90327
10685B850262j46888J77664N80280J31183n11813r85084j242915n78313O59503
10676I33879K29760k136141k649112J012051M830461L621751j200773l826685
10668H15191k283044K35564R71688J48121j123589j722486l65613K339383L326794
10659B342009J315013p93970n54323K27826l75829l88258J762109K887689R3700
10650F515966l402594l068091m81589j31230j664639j480655L48165R95239P54508
$$ plain form
10712 1970612 3841880 3715516 2685888 2494831 1864217 -1253981 -4900566 -5002381 -1599578
10703 -1599578 1244767 1631929 1460832 1833138 1541714 644064 839542 1464363 -183064
10694 -183064 -3419674 -3903836 -427026 2677863 2074852 76695 210208 1959935 2850262
10685 2850262 2703374 2881038 3461318 3592501 3080688 2095604 852689 274376 933879
10676 933879 1163639 -972502 -3621614 -2609563 2220898 5842649 4641876 815191
10668 815191 -1467853 -1232289 -260601 -112480 -1236069 -2958555 -3324168 -984785 2342009
10659 2342009 3657022 2863052 2308729 2536555 2160726 1772468 3534577 6422266 6515966
10650 6515966 3113372 45281 -436308 -567538 -2232177 -3712832 -3364667 -2369428 -1614920
10641a614920J814229K852765J063335j786323j541882J005009J077570k165495
10633G04288m408309l031989j90996J317620J150541K23999l25705O05686K349999
10624a604866K398900L67184n84102J014020J822076n88655k806233r67122K536632
10615A587834K929164N42702q83554p05352q82973j297724n87862L30587l955
10606A028867m60972K86161Q57228J30254j21979J095908J483061j54249j343123
10597B801156q71486j099374k325599j146972K181199K195916j861540l057136
10589c183836J176434L329632j259229n477569k550694K407656K237755K284J221781
10580b095786K608872m00829l084455N2669L972474K038941j551345l64498J403944
$$ plain form
10641 -1614920 199309 3052074 4115409 2329086 787204 1792213 2869783 704288
10633 704288 -3704021 -6736010 -6927006 -5609386 -4458845 -4234846 -4560551 -3954865 -1604866
10624 -1604866 794034 1161218 577116 1591136 3413212 2824557 18324 -948798 1587834
10615 1587834 4516998 5059700 4176146 3470794 2587821 1290097 702235 1032822 1028867
10606 1028867 567895 854056 1711284 1841538 1719559 2815467 4298528 4144279 2801156
10597 2801156 1929670 830296 -1495303 -2642275 -461076 1734840 -126700 -3183836
10589 -3183836 -2007402 1322230 63001 -5414568 -7965262 -5557606 -3319851 -3317567 -2095786
10580 -2095786 513086 112257 -2972198 -2919529 1052945 3091886 1540541 1176043 2579987
10571B579987k297961n908226j764441M540286L293502j935794j557223K149142
10563i00728O45934l608121k335465J813961P80913k171888J134363O147027K897842
10554D403838m140802l022106L385679K549402m023673l689899L182840L972545
10546B617824k302758l754747J592159L247036p51020j250956K607401K014905
10538D019844k618153j881680L062578J882410m006747l407184K244410J056245
10530C51723n273788l594695M708145N106453k332188k922948M068604M282948
10522D394254k945560l262384L421256K240746n778487l808133O894161O658318
10514G814171n033592o941845L810980O184758l759404n424445M856057O026746
$$ plain form
10571 2579987 282026 -5626200 -7390641 -2850355 443147 -1492647 -3049870 -900728
10563 -900728 -254794 -3862915 -6198380 -4384419 -3603506 -5775394 -4641031 1505996 4403838
10554 4403838 263036 -2759070 626609 3176011 -847662 -4537561 -1354721 2617824
10546 2617824 315066 -3439681 -1847522 1399514 648494 -602462 2004939 4019844
10538 4019844 1401691 -479989 2582589 4464999 458252 -2948932 -704522 351723
10530 351723 -4922065 -8516760 -3808615 1297838 -1034350 -3957298 111306 4394254
10522 4394254 1448694 -1813690 1607566 3848312 -1930175 -5738308 1155853 7814171
10514 7814171 2780579 -4161266 -350286 5834472 2075068 -3349377 1506680 7533426
10506G533426m843189n290937O763401O420413p756456p447513Q458163P198784
10498A1036092j2029296r834932J5377247J4929422j6007896j6929896K3157741
10491I698482K7818845k3004039j8997983J03097314K03784231J12389623j02226176
10484C12560297k01820099j06553813J7775591K4397683k9298057k8197405J3793861
10477B658058J7524570j2082189j4382468R634058J1418286r377821j1810208
10470f417714N858680Q734951n946089q646297L526760N523225m823962n811343
10462h001789L626219M174912l877199k659601N941124L892854o449076o228661
10454i581217L551406M699783k816319k269828N952833N113691m702858o131536
$$ plain form
10506 7533426 2690237 -2600700 4162701 10583114 2826658 -4620855 3837308 11036092
10498 11036092 -993204 -10828136 4549111 19478533 3470637 -13459259 9698482
10491 9698482 37517327 14513288 -4484695 98612619 302396850 414786473 312560297
10484 312560297 110740198 4186385 21961976 46359659 17061602 -11135803 2658058
10477 2658058 20182628 8100439 -6282029 3352029 14770315 5392494 -6417714
10470 -6417714 -559034 8175917 2229828 -6416469 -2889709 2633516 -2190446 -8001789
10462 -8001789 -4375570 -200658 -4077857 -6737458 -796334 3096520 -3352556 -9581217
10454 -9581217 -6029811 -1330028 -4146347 -6416175 -463342 4650349 -52509 -6184045
10446f184045K793772N769024r64126l538027J927561L552787j849717l592724
10438b085495P46844J304932l287524l109318K694590L827729q33681j290426
10430b032349L396849L210887k590068l406290K125771L207638k479570m458039
10422c025171N48795K909177j198132l046726J515650M592169J396353j919596
10414A772519q14363P22331K16982J001081K897853R69692l598435l639310Q21626
10405C49976K064446j018599j343749J964814J603962l109261l814206J235192
10397b067425L351654o30971k629367J400599L982498K6021m209382k720125P45667
10388b750831J344434J195261K527970K182640j026842k205100P49606K487144
$$ plain form
10446 -6184045 -3390273 2378751 1414625 -2123402 -195841 3356946 1507229 -2085495
10438 -2085495 -1338651 -33719 -3321243 -6430561 -3735971 91758 -741923 -2032349
10430 -2032349 1364500 4575387 1985319 -1420971 704800 3912438 1432868 -3025171
10422 -3025171 -2476376 432801 -765331 -3812057 -2296407 2295762 3692115 1772519
10414 1772519 958156 1680487 1897469 2898550 5796403 6766095 3167660 -471650 349976
10405 349976 2414422 1395823 52074 2016888 3620850 511589 -3302617 -2067425
10397 -2067425 1284229 653258 -1976109 -575510 3406988 3433009 -776373 -3496498 -2750831
10388 -2750831 -1406397 -211136 2316834 4499474 3472632 1267532 2017138 4504282
10380D504282l61429l236979k164896k45039o69475r85676P11598J267877r28965
10371b108702j847328Q66370L036117J065938k143083k591017q86297R12480K570496
10362a125026L013346K95743l439428l266417L68285J795483O7892N13061M029264
10353B252203M109491j499122n346961j936222L400656L501862N1815j393439
10345C140283q46522j389661k173191p06513J491611J479714J98609K26156J023351
10336B443837P32529r531J70881M94614L5473k66580j80641j361149l513424l330325
10326d784316L4948K578377J536419k79031M58946K219639J963803K91415n23228
10317C496972o30474j195468j474332m68586P62604J023938R23750Q44991l59941
$$ plain form
10380 4504282 4142853 905874 -1259022 -1504061 -2173536 -3159212 -2447614 -1179737 -2108702
10371 -2108702 -3956030 -3089660 -53543 1012395 -1130688 -3721705 -4608002 -3695522 -1125026
10362 -1125026 1888320 2184063 -1255365 -4521782 -4153497 -2358014 -2290122 -1777061 2252203
10353 2252203 6361694 4862572 -484389 -2420611 980045 4481907 4533722 3140283
10345 3140283 2293761 904100 -1269091 -1975604 -483993 995721 1194330 1420486 2443837
10336 2443837 3176366 3166835 3337716 3832330 3867803 3601223 3420582 2059433 -1453991 -4784316
10326 -4784316 -4749368 -2170991 -634572 -913603 -454657 1764982 3728785 4020200 3496972
10317 3496972 2866498 1671030 196698 -271888 490716 1514654 2438404 3283395 2923454
10308B923454k699656l901408k822180j152137j30441J215730K967098L044421
10300e55119R71352o18863k26516K84531l53124l97965J074594J721016K3245
10291A923151j585086n98025J479883J759109K23733j126625j271340l50969J078802
10282A532633J613751J44395j685739j011559J591574K460862O54933o43424K61071
10273D918497R52799l32854j699620j539267j290687j868285j484979L61459Q79753
10264a103184j112094k303764j76610K592627K517374O42939j40123N1529k62808
10255G05886k62702J221188K373922Q95483j897024k906698j669157O7167J496828
10246B4893K564781K292727K58799j675652j805845j294592j911570k691049j619052
$$ plain form
10308 2923454 223798 -3677610 -6499790 -7651927 -7782368 -6566638 -3599540 -555119
10300 -555119 416233 -202630 -429146 -144615 -497739 -895704 178890 1899906 1923151
10291 1923151 338065 -259960 1219923 2979032 3202765 2076140 804800 453831 1532633
10282 1532633 3146384 3290779 1605040 593481 2185055 4645917 5300850 4657426 4918497
10273 4918497 5871296 5538442 3838822 2299555 1008868 -859417 -2344396 -1982937 -1103184
10264 -1103184 -2215278 -4519042 -4695652 -2103025 414349 1057288 917165 968694 705886
10255 705886 443184 1664372 4038294 4933777 3036753 130055 -1539102 -1471935 24893
10246 24893 2589674 4882401 5141200 3465548 1659703 365111 -1546459 -4237508 -5856560
10237e856560O88494J764700Q32689p51422j700122j463495K44576K696913L945075
10228D00848L013548J262237K91821q0485n42451p72747n89757p33630j111951
10219A137433l71349J308104J453190p90074k565028j489209N55779O45391m47994
10210e63757r9113J332936J288960k67994p12275O65809J381964j73620k169145
10201F83765k122781l37438R15637N42557m47769q00572n76761m62488k99287
10192b905137O53479K034483K254933P19158j036564j473243j120919j162279
10184b036089j239321m99801L76812L85308L05467J128599J532298o7576j922684
10175b036987r88565J926861K920391R32851j034818j082152p07372j029383p92284
$$ plain form
10237 -5856560 -5168066 -3403366 -2570677 -3322099 -5022221 -6485716 -6241140 -3544227 400848
10228 400848 3414396 4676633 4968454 4887969 4345518 3572771 2983014 2249384 1137433
10219 1137433 766084 2074188 3527378 2737304 172276 -1316933 -761154 -115763 -563757
10210 -563757 -662870 670066 1959026 1691032 978757 1644566 3026530 2852910 683765
10201 683765 -1439016 -1776454 -860817 -318260 -766029 -1566601 -2143362 -2605850 -2905137
10192 -2905137 -2251658 -217175 2037758 2756916 1720352 247109 -873810 -2036089
10184 -2036089 -3275410 -3775211 -3398399 -3013091 -2707624 -1579025 -46727 -114303 -2036987
10175 -2036987 -3025552 -1098691 1821700 2754551 1719733 637581 -69791 -1099174 -1891458
10166a891458M05223P14420l87012p29158M58439P08882j176561k335444l86773
10157d619442K343452K386500M45180k97119N89068P17165q11111k109802j465182
10148b821291N36698K006155J695016M1785j189386q03657K32598J46687q59601
10139a014996r08721M02147J226071L21546j258655j897602j140867N66200K163687
10130a541190K110744J42820j559720j142409n9199m73524j111030K80973J673347
10121a679188o13882m449839l535368K448372O108911L256469j032709j029503
10113e26737J151216P85128r54700l615K644924K552593m71885k277714j226653
10104A672557j2962p06720k146952k466187j090003J554907L762966K917588j107074
$$ plain form
10166 -1891458 -1486235 -771815 -1158827 -1887985 -1429546 -720664 -1897225 -4232669 -4619442
10157 -4619442 -2275990 110510 555690 258571 847639 1564804 753693 -1356109 -2821291
10148 -2821291 -2284593 -278438 1416578 1458363 268977 -534680 -302082 -155395 -1014996
10139 -1014996 -1923717 -1521570 -295499 26047 -1232608 -3130210 -4271077 -3704877 -1541190
10130 -1541190 569554 712374 -847346 -1989755 -2048954 -2522478 -3633508 -3352535 -1679188
10121 -1679188 -2293070 -6742909 -10278277 -7829905 -1720994 1535475 502766 -526737
10113 -526737 624479 1409607 454907 451292 3096216 5648809 5176924 2899210 1672557
10104 1672557 1659595 952875 -1194077 -3660264 -4750267 -3195360 567606 3485194 2378120
10095B378120m117205k297446K290569M167888J595553k031737l386832k437977
10087c839067n99116J154667J948856J353267M39794N08631Q99844J72509r24257
10078A115128k51322J896063K484608N7015k896579l144714p85267J262609J053572
10069G91113l96517r14169k1666P42400J93736q31460q53312N8326O47163M78552
10059a05834K24927L07778O09640J141111J646535J183605m18968j620112j373353
10050A595329r00795j173880o18959J620673K462884o54398m077082k379144K644065
10041a481307M030837N79994j593580M36096K096790J68332j682604k99159J055481
10032C310880o77537k107062K64580K937342J301306j926605j300396J836154
$$ plain form
10095 2378120 -1739085 -4036531 -1745962 2421926 4017479 1985742 -1401090 -3839067
10087 -3839067 -4438183 -3283516 -1334660 18607 458401 967032 1866876 2039385 1115128
10078 1115128 863806 2759869 5244477 5301492 2404913 -739801 -1525068 -262459 791113
10069 791113 394596 -519573 -541239 201161 394897 -436563 -1289875 -1231549 -584386 -105834
10059 -105834 119093 426871 1036511 2177622 3824157 5007762 4588794 2968682 1595329
10050 1595329 694534 -479346 -1098305 522368 2985252 2330854 -1746228 -4125372 -1481307
10041 -1481307 2549530 3129524 1535944 1972040 4068830 4237162 2554558 2255399 3310880
10032 3310880 2633343 526281 790861 3728203 5029509 3102904 1802508 3638662
10024C638662J862513j422147k959703j097164P48497P23252O36664J188419N49757
10015C868750j579194k921766k284754q16068M35316J233650J059894J31137K48915
10006f24120J799099J996418n36440k199738J89551L231967J652927l012712m607217
9997b110265j876397O21634O05396N91034J965366K631622J592351N42153q7612
9988D475282j671577l221043j853357J558007K396389o27041l339938k638855
9980d922133m49333N71002P57451R34001L87042o90996n75492N02285J24884j597080
9970d958369j376817J440757K983744J096400r85224r4313J876353J828585O28509
9961B439625N96698Q07392r65692l547492l554181m25265K773658L146070N68829
$$ plain form
10024 3638662 5501175 4079028 1119325 22161 770658 1493910 2130574 3318993 3868750
10015 3868750 2289556 -632210 -2916964 -3733032 -3297716 -2064066 -1004172 -873035 -624120
10006 -624120 1174979 3171397 2634957 435219 624770 3856737 5509664 2496952 -2110265
9997 -2110265 -3986662 -3365028 -2759632 -2168598 -203232 2428390 4020741 4562894 4475282
9988 4475282 2803705 -417338 -2270695 -712688 1683701 1056660 -2283278 -4922133
9980 -4922133 -5371466 -4800464 -4043013 -3109012 -2721970 -3412966 -3988458 -3486173 -3361289 -4958369
9970 -4958369 -6335186 -4894429 -1910685 -814285 -1799509 -1893822 -17469 1811116 2439625
9961 2439625 3036323 3843715 2878023 -669469 -4223650 -4648915 -1875257 1270813 1839642
9952A839642k776783m030615j922705J366507K077785k51938j697134P15552M510017
9943a69672M786886O14038l691865l459872J271608N565966M459696j459324o101436
9934A816025m810092k5668K329164Q15514q30360l90639R3416q41240j086017
9925b929897R86395L092956K318462p15956l198801l561138j889759R34285L056820
9916a906633K757380Q68311j31688K8072n72165j764334j008678J537783K113544
9907A921592o16700l033467k350290m68898N09836J788852L696150L144665n64665
9898D027075k430858P01761M037212K135868k106278k593170k63200m11019k721583
9889C75808k466513J44892N70393j013647k09640K323210J499612j894006j761470
$$ plain form
9952 1839642 -937141 -4967756 -6890461 -5523954 -3446169 -3698107 -5395241 -4679689 -169672
9943 -169672 4617214 5231252 1539387 -1920485 -648877 4917089 9376785 7917461 1816025
9934 1816025 -2994067 -3019735 -690571 124943 -705417 -1096056 -1002640 -1843880 -2929897
9925 -2929897 -1943502 1149454 3467916 2751960 -446841 -4007979 -5897738 -4963453 -1906633
9916 -1906633 850747 1719058 1587370 1615442 1043277 -721057 -1729735 -191952 1921592
9907 1921592 1304892 -1728575 -4078865 -4547763 -4037927 -2249075 1447075 4591740 4027075
9898 4027075 1596217 2297978 6335190 8471058 6364780 3771610 3508410 3097391 375808
9889 375808 -2090705 -1945813 -1375420 -2389067 -2598707 -275497 1224115 -669891 -2431361
9880b431361J172779n38453n664420k316759J1520306J8654718N807639j4040600
9872A2163849j7499439l076867Q706101N704476k172778k571233J574617J436183
9864D264909k313936l241304r28365L21962O6850Q86648K015317R49828q25133
9855A196776j65884J531613O10784j869259j615623J296255K398890L05834j561648
9846B127738j208046o17743j062230q29844Q38309J847782R59390k47026n46529
9837A261801q13800j370369r77760K73913L86532r65781j476082n2343J469239
9828b264650J536848P42907k86640j526337j606641Q02835L184130J495368k812093
9819g34273l611406M05167L139101P53773k401560j601076O36221J05339j295182
$$ plain form
9880 -2431361 -1258582 -1797035 -7461455 -9778214 1742092 20396810 26204449 12163849
9872 12163849 -5335590 -8412457 293644 5998120 3825342 1254109 2828726 4264909
9864 4264909 1950973 -1290331 -2218696 -1896734 -1829884 -943236 1072081 2021909 1196776
9855 1196776 1030892 2562505 3173289 1304030 -311593 984662 3383552 3689386 2127738
9846 2127738 919692 301949 -760281 -1590125 -751816 1095966 2055356 1808330 1261801
9837 1261801 448001 -922368 -1900128 -1626215 -1239683 -2205464 -3681546 -3733889 -2264650
9828 -2264650 -727802 15105 -271535 -1797872 -3404513 -2601678 582452 2077820 -734273
9819 -734273 -4345679 -3940512 -801411 -47638 -2449198 -4050274 -3414053 -3308714 -4603896
9810d603896K51232K778970J963709q77397j174886Q02972J145896j22505L65597
9801E29692K160967J371060j970507l438609j513421O09902J013616J198602J666848
9792A628150R25874l42452M67567K609734K305506o97899k271933q12571L76406
9783D188382q45882k202659j654060m80080J00843Q14264J285455j66358k274247
9774a234342j442683J846105K724042r6188j906616R82K016370J081898j77593
9765B811975Q45820J704162J49740r95363O49652J713743j029290m035631k501746
9756f86938J400556K342290N89820J15643O89406q87332l455389k810963M41684
9747b261223J479610l77130q10861J390555K153658m04117k535512j291589Q91987
$$ plain form
9810 -4603896 -4352664 -1573694 390015 -487382 -1662268 -859296 286600 164095 529692
9801 529692 2690659 4061719 2091212 -1347397 -2860818 -2250916 -1237300 -38698 1628150
9792 1628150 2554024 2211572 2679139 5288873 7594379 6896480 4624547 3811976 4188382
9783 4188382 3342500 1139841 -514219 -994299 -893456 -79192 1206263 1039905 -1234342
9774 -1234342 -2677025 -830920 1893122 1796934 -109682 -108700 1907670 2989568 2811975
9765 2811975 3657795 5361957 5511697 4516334 5165986 6879729 5850439 1814808 -686938
9756 -686938 713618 3055908 3645728 3761371 4450777 3563445 108056 -2702907 -2261223
9747 -2261223 -781613 -1158743 -1969604 -579049 1574609 1170492 -1365020 -2656609 -1764622
9738a764622Q33629m95247o11360L45023Q25275O32042K82051k78994q11760o48848
9728a692811k94170q58345j488183l19167J585212R72844j889477k429244J263180
9719e150161M717969L384180p27400k413462q03965N90044m2123q12629q0774
9710a338321J056989R54026k28673j179689j075623j17344P22747N71111p2463
9701g07240L66828K023050K502335J6349l271663l386220J4013K746418J516390
9692A820260j790938k846649o98332J282956L49735j710539j111438K302830M209112
9683A806997J495872l034060l945077m83196K370145R34055k070804j763717J717513
9674b972272L701201J927416o88913r74553J24128j4617j286983j510964k03577
$$ plain form
9738 -1764622 -930993 -1426240 -2037600 -1692577 -867302 -235260 46791 -232203 -1043963 -1692811
9728 -1692811 -1986981 -2845326 -4333509 -4652676 -3067464 -2094620 -3984097 -6413341 -5150161
9719 -5150161 -432192 2951988 2224588 -188874 -992839 -402795 -444918 -1257547 -1338321
9710 -1338321 -281332 672694 444021 -735668 -1811291 -1928635 -1205888 -634777 -707240
9701 -707240 -340412 1682638 4184973 4201322 929659 -2456561 -2442548 303870 1820260
9692 1820260 29322 -2817327 -3515659 -2232703 -1882968 -3593507 -4704945 -2402115 1806997
9683 1806997 3302869 268809 -3676268 -4159464 -1789319 -855264 -2926068 -4689785 -2972272
9674 -2972272 728929 2656345 1967432 992879 1117007 1102390 -184593 -1695557 -1899134
9665a899134R08487P73203J33937k91850p05591q91316J09048K103153L073594
9656C313531J653194p07543j412435j19086Q66685k39018k206125k309333l0457
9647a190587J909302R75807j570661k204762k02753J189016k64023k178548j333381
9638d870590J056664J393325j93955j19571K289376L310993R68460j684767j595216
9629E54719j54520J59839Q1420J090673J640194k08708k574398k244666J61016
9620a494431J397691O92455j82760p75296j887738k533038j093097J015848R71629
9611c888737n32538l03867J547931J484645j268565l068393j601965R73270K157446
9602d500773K396378K479070J424253q66838k095084r69503N38114L16637r30512
$$ plain form
9665 -1899134 -990647 -217444 -83507 -375357 -1080948 -1972264 -1863216 239937 3313531
9656 3313531 4966725 4259182 2846747 2727661 3594346 3355328 1149203 -1160130 -1190587
9647 -1190587 718715 1694522 123861 -2080901 -2283654 -1094638 -1358661 -3537209 -4870590
9638 -4870590 -3813926 -2420601 -2614556 -2734127 -444751 2866242 3834702 2149935 554719
9629 554719 400199 560038 641458 1732131 3372325 3163617 589219 -1655447 -1494431
9620 -1494431 -96740 595715 412955 -362341 -2250079 -4783117 -5876214 -4860366 -3888737
9611 -3888737 -4421275 -4725142 -3177211 -1692566 -2961131 -6029524 -7631489 -6658219 -4500773
9602 -4500773 -2104395 374675 1798928 932090 -1162994 -2132497 -1594383 -1277746 -2208258
9593b208258j518625j189752k84172J052137J701895L48100j591530r93209J865546
9584b817868K904154N69481j412334K181K320241J750529r90061k599039k316626
9575b589342j645883r76656K27579J381241J638600J420375J059174j71051j813129
9566a469092j521898J177513L079444J734221r45811k036199j689164j184305
9558b855291r0455J473254J084895j771618l072681q6044L381425K445240j098406
9549e89681k026094k51290P3385j555967j572557O39030J638290L00820m50840
9540c794904Q24769K003460J807004J465012J082401p88078k943705j960327J701504
9531f02864L037016j2331l149013k341760M81499J377020K76514m40995l58822
$$ plain form
9593 -2208258 -3726883 -4916635 -5200807 -4148670 -2446775 -2098675 -3690205 -4683414 -2817868
9584 -2817868 86286 655767 -756567 -754386 1565855 3316384 2326323 -272716 -2589342
9575 -2589342 -4235225 -5211881 -4984302 -3603061 -1964461 -544086 515088 344037 -1469092
9566 -1469092 -2990990 -1813477 1265967 3000188 2054377 18178 -1670986 -2855291
9558 -2855291 -2945746 -1472492 -387597 -2159215 -5231896 -5317940 -1936515 508725 -589681
9549 -589681 -2615775 -2867065 -2793680 -4349647 -5922204 -5283174 -3644884 -3344064 -3794904
9540 -3794904 -2970135 -966675 840329 2305341 3387742 2599664 -344041 -2304368 -602864
9531 -602864 2434152 2421821 -727192 -3068952 -2587453 -1210433 -933919 -1374914 -1733736
9522a733736n85447q80665k05316J107406J885743J739587P89552q17579k149310
9513h49765j978736p92965k75002k76404J031068L309570L614453J094306j209975
9504C666550j054304j84520o47818j185786r1946J251310Q60051k98669n15259
9495A799609p86771k420327l248173n29634L587079M084883L97626k638125j803133
9486a556966N71660J148534M41886O90469J507895Q03928j127804j567171L81306
9477A293737K004543O69532k294692l226598j088714J240839J092641n17986r76533
9468a803231j36948l1258j149757j651823n99684N38810N84519N36435J263464
9459b449473J409229k00109j624090j22052L174514L912838M10394l702922m155659
$$ plain form
9522 -1733736 -2319183 -3199848 -3405164 -2297758 -412015 1327572 2117124 1299545 -849765
9513 -849765 -2828501 -3621466 -3896468 -4172872 -3141804 167766 3782219 4876525 3666550
9504 3666550 2612246 2427726 1779908 594122 502176 1753486 2613537 2314868 1799609
9495 1799609 1012838 -1407489 -4655662 -5185296 -1598217 2486666 2884292 246167 -1556966
9486 -1556966 -985306 163228 605114 1295583 2803478 3607406 2479602 912431 1293737
9477 1293737 3298280 3967812 1673120 -1553478 -2642192 -1401353 -308712 -826698 -1803231
9468 -1803231 -1940179 -1971437 -3121194 -4773017 -5372701 -4833891 -4249372 -3712937 -2449473
9459 -2449473 -1040244 -1240353 -2864443 -2986495 188019 4100857 4511251 808329 -3347330
9450c347330j384604Q34234Q62585O27171J626829K367118J178040n98825n91578
9441A573640O67422N67879j190089k042432q88902P2498p42549j316200P54993
9432b543740M042338M956224K554515p00759k312266j845270k89737Q29999L20466
9423E011770j140056j253017N83246J671006k22273l101547l435006j267938M38460
9414b715355N66990N57452R49633P33025K6138K7542K34859r63317k788945k613702
9404e985680l32715J303766J237676J325620K223309J919107j80913j365711J58829
9395C03288K220730K050784K36744q06792m21104M8607p37349k836755m563974
9386d505821l463048L66211K870375J068775j749245m30791L351661L078845j596328
$$ plain form
9450 -3347330 -4731934 -3897700 -3035115 -2407944 -781115 1586003 2764043 2165218 1573640
9441 1573640 2241062 2808941 1618852 -423580 -1312482 -1239984 -1982533 -3298733 -2543740
9432 -2543740 1498598 6454822 9009337 8308578 5996312 4151042 3861305 4691304 5011770
9423 5011770 3871714 2618697 3201943 4872949 4650676 1549129 -1885877 -3153815 -2715355
9414 -2715355 -2148365 -1590913 -641280 91745 117883 145425 380284 -583033 -3371978 -5985680
9404 -5985680 -6318395 -5014629 -3776953 -2451333 -228024 1691083 1510170 144459 303288
9395 303288 2524018 4574802 4811546 4004754 3583650 3632257 2894908 58153 -4505821
9386 -4505821 -7968869 -7602658 -4732283 -3663508 -5412753 -5843544 -2491883 586962 -1009366
9377a009366l335729R75822M636530K003228k319424j641862J567630O56846l298657
9368a764982l485240R10954L748805K281803L36724M49280L02545j339926j838355
9359c98392j18484Q73002l68241j181740R889P30365m92383r64246R96549K333432
9349A419751O09416j116059O08039L199103K092094j337292j871843P08465J106107
9340E417781k678407n815640m027118K34241K142697J556216J820734L539272
9332B189776L757804J091381j968764k751425j734247q77463o54169l22505K70147
9323i99465P89892J315204J644040P23179j552463k990433j662961R26421J669681
9314a36905L79330l13727N14629R20221L8018l04727O72921Q07251r67978j900108
$$ plain form
9377 -1009366 -4345095 -3369273 1267257 3270485 951061 -690801 876829 1533675 -1764982
9368 -1764982 -5250222 -4339268 -590463 1691340 2028064 2477344 2779889 1439963 -398392
9359 -398392 -516876 356126 -12115 -1193855 -1183966 -453601 -945984 -1910230 -913681 1419751
9349 1419751 2029167 913108 1521147 4720250 6812344 5475052 3603209 4311674 5417781
9340 5417781 2739374 -3076266 -7103384 -6869143 -4726446 -3170230 -1349496 2189776
9332 2189776 5947580 7038961 5070197 2318772 584525 -292938 -947107 -1269612 -999465
9323 -999465 -209573 1105631 2749671 3472850 1920387 -1070046 -2733007 -1806586 -136905
9314 -136905 242425 -71302 443327 1363548 1401566 1096839 1769760 2577011 1609033 -291075
9304b91075K63825K942353K329427o64826k081591j210890r07892k041326k024564
9295c686559M19767K836733K723781O87720j360318k543763k327819j39722K704673
9286f85507L092320J40141k767456k146370Q28322K085855L09667j658603j074148
9277a875779J188236K199206Q08001j204188j514607M5718J567763J498290K73438
9268B986078p23547j049351j205276j244672o02528N99180J236904P24236M5928
9259G66952M60402J556268J529325l59121k351225k151929j69116O41760j016380
9250a093064k291583M3275M263454N169001J174666l271042l683573r90670J069769
9241C90233J261639P58090n502j016089q37642J296190K690392L98439l417729
$$ plain form
9304 -291075 -27250 2915103 5244530 4579704 2498113 1287223 379331 -1661995 -3686559
9295 -3686559 -3266792 -430059 2293722 2981442 1621124 -922639 -3250458 -3390180 -685507
9286 -685507 2406813 2546954 -220502 -2366872 -1538550 547305 856972 -801631 -1875779
9277 -1875779 -687543 1511663 2319664 1115476 -399131 -353413 1214350 2712640 2986078
9268 2986078 2262531 1213180 7904 -1236768 -1839296 -1240116 -3212 721024 766952
9259 766952 1227354 2783622 4312947 3953826 1602601 -549328 -718444 -76684 -1093064
9250 -1093064 -3384647 -3341372 922082 6091083 7265749 3994707 311134 -679536 390233
9241 390233 1651872 2409962 2404460 1388371 550729 1846919 4537311 4935750 1518021
9232A518021l583818N13524L772225K692059l30391j622371j212837q45464m39380
9223D61568N16134O91001p98345j847502l19831K003762J756939p66188k136764
9214d39226j148096j89862r23155j789328r36531R36721K093415K135803J424443
9205A164184j36627k067565k556002p47768J245599Q67906r76350j083266J041194
9196c248695K248570P43741r08034J44320K307084J910041j035368k859859j701850
9187b400050L62334J012851M02955n67876j665676j943952l9289K728199K771506
9178F61002l33365k238827k84853J939859K31869l140083k858371R85090L329784
9169a707895K199995P28073R01970P77520p61531j453813K1537J417494R98104
$$ plain form
9232 1518021 -2065797 -1552273 2219952 4912011 4581620 2959249 1746412 900948 461568
9223 461568 977702 1668703 870358 -977144 -1296975 706787 2463726 1697538 -439226
9214 -439226 -1587322 -1777184 -2700339 -4489667 -5426198 -4489477 -2396062 -260259 1164184
9205 1164184 1027557 -1040008 -3596010 -4343778 -3098179 -2230273 -3206623 -4289889 -3248695
9196 -3248695 -1000125 -256384 -1164418 -1020098 1286986 3197027 2161659 -698200 -2400050
9187 -2400050 -2037716 -1024865 -621910 -1189786 -2855462 -4799414 -4838703 -2110504 661002
9178 661002 327637 -1911190 -2196043 -256184 -24315 -3164398 -6022769 -5037679 -1707895
9169 -1707895 492100 1220173 2122143 2899663 2138132 684319 705856 2123350 3121454
9160C121454M50840J088286P43839k234765m857117l242971J307537L760191J982395
9151B119689j341246l021598k609493j159578O71223K356534K845797J314395
9143A175723j589517l604204k504056J341150M434989L591561j56864k778476
9135h9694k367139q35970j89013Q3104P50521Q54789j07558m98277O47143J306095
9125d45999l43508k287312j351848J723082L178655J648111m88609j131475q33144
9116c32047n93362L7250J442796K401837J470888r91016l114592l383664j834402
9107d896312J26912R18674K20670p10356m33104J104906K596863K699946J208129
9098B836328o83108j304864k85220Q66761Q19335M40836J146176J864567L09032
$$ plain form
9160 3121454 3572294 4660580 5404419 3169654 -1687463 -4930434 -3622897 137294 2119689
9151 2119689 778443 -2243155 -4852648 -6012226 -5341003 -2984469 -138672 1175723
9143 1175723 -413794 -4017998 -6522054 -5180904 -745915 2845646 2688782 -89694
9135 -89694 -2456833 -3292803 -3481816 -3398712 -2648191 -1793402 -1900960 -2399237 -1752094 -445999
9125 -445999 -789507 -3076819 -4428667 -2705585 473070 2121181 1632572 501097 -332047
9116 -332047 -925409 -888159 554637 2956474 4427362 3436346 321754 -3061910 -4896312
9107 -4896312 -4769400 -3850726 -3630056 -4340412 -4773516 -3668610 -1071747 1628199 2836328
9098 2836328 2153220 848356 563136 1429897 2249232 2690068 3836244 5700811 6009843
9089F009843k664594l267212m84010J759688K66798k548812k337204Q84018L345085
9080I63600K949544R12723j048114k197287k065385q61991j27660q26255j581513
9071c882338q17425O33411J307904J771012K657645K022988j524917m624174k795904
9062e251798K348617M539930J771112j235220o14983J483457J459541l22363j525958
9053B652335j888819k231236j952076m20690J033682J049559M78358M78742J36811
9044f63334j594292l110738j958328J432056M066701L949301J655041r65061k155388
9035F55958j136195R14285J524276j21515j830642j340616M99442J158014J15603
9026D38610q22842n25728L8378l73105j343933j322574L08992K089198J850952
$$ plain form
9089 6009843 3345249 78037 -405973 1353715 1620513 -928299 -3265503 -2381485 963600
9080 963600 3913144 4825867 3777753 1580466 -484919 -1346910 -1474570 -2300825 -3882338
9071 -3882338 -4699763 -4066352 -2758448 -987436 1670209 3693197 2168280 -2455894 -5251798
9062 -5251798 -2903181 1636749 3407861 2172641 1557658 3041115 4500656 4178293 2652335
9053 2652335 763516 -1467720 -3419796 -3840486 -2806804 -1757245 -1278887 -800145 -663334
9044 -663334 -2257626 -5368364 -7326692 -5894636 -1827935 2121366 3776407 2811346 655958
9035 655958 -480237 434048 1958324 1836809 6167 -1334449 -835007 323007 438610
9026 438610 -384232 -909960 -871582 -1244687 -2588620 -3911194 -3602202 -1513004 337948
9017C37948m04270j855678l73744K124964K054251m47960j509488N10002K385491
9008B821516J079646j609998k093797l90838O08622j18870q38052l49024M97066
8999c93729N91754k0048n77763l08582R00454J809095R10839j075003j608524
8990B28493k17704N15958n44304p29699J602517L181900Q45808k364109j436950
8981A081910K086816K090761j983819l727558M8201M111940K948069j203221k645925
8972B807174o42226J128022R36214J96758l10865j186026j892539j078048O29848
8963E88312J055528k25897j456096j531159r95070k43750R73448K097668J986247
8954B249231R62594O53105J297225J124369q46593l056717l441521j999188l78038
$$ plain form
9017 337948 -66322 -1922000 -2295744 -170780 1883471 1435511 -73977 436025 2821516
9008 2821516 3901162 2291164 197367 -193471 415151 296281 -541771 -890795 -393729
8999 -393729 198025 177977 -399786 -708368 192086 2001181 2912020 1837017 228493
8990 228493 10789 526747 -17557 -747256 855261 4037161 4882969 2518860 1081910
8981 1081910 3168726 5259487 3275668 -451890 -403689 3708251 6656320 5453099 2807174
8972 2807174 2164948 3292970 4229184 4425942 4115077 2929051 1036512 -41536 588312
8963 588312 1643840 1417943 -38153 -1569312 -2564382 -2808132 -1834684 262984 2249231
8954 2249231 3211825 3864930 5162155 6286524 5439931 2383214 -1058307 -3057495 -3435533
8945c435533K33034m699j99706L25140J283952J471337J88856j411874j445182
8936b994675R7605J128036L75927q09241o00209M79713M25989j024208j780533
8927d701596l69767J874958K524593J163046l51137n02952J75065L59441j17715
8918E3936m65007m91778p52745j137328o01856J059002K190202J164398j119671
8909a00847j878027J73009L005669L512174J144000j435456j512846M22049J326585
8900D656310m54850k912297k955356n77047J231896P81134j54673M68310J530088
8891A613515O28373j762995k706875j212543M62672N07881j8239K87928N95527
8882a604756k33467r94190O2447J930875K077669M28236o71640m17849m99950
$$ plain form
8945 -3435533 -3202499 -3207198 -3406904 -3081764 -1797812 -326475 -137619 -1549493 -2994675
8936 -2994675 -2897070 -1769034 -1393107 -2202348 -2802557 -2322844 -1896855 -2921063 -4701596
8927 -4701596 -5071363 -3196405 -671812 491234 140097 -362855 -187790 171651 53936
8918 53936 -411071 -902849 -1655594 -2792922 -3394778 -2335776 -145574 1018824 -100847
8909 -100847 -1978874 -1805865 1199804 4711978 5855978 4420522 2907676 3329725 4656310
8900 4656310 4201460 1289163 -1666193 -2243240 -1011344 -230210 -384883 83427 1613515
8891 1613515 2241888 478893 -2227982 -3440525 -2977853 -2469972 -2488211 -2200283 -1604756
8882 -1604756 -1838223 -2832413 -2769966 -839091 1238578 1666814 995174 577325 77375
8873G7375j528597j595676J89480J603448R27099J28936J446568K782236M84461
8864D515330m050193n075397p02070L761940L024081r45248k329656m1286J422489
8855d20010n79754k848944j501598K082824L423621J466555m06031J23101J007481
8846B347245m53365l015374l244946p78438J192640P97838j34020L51268J201700
8837a735452Q30102K79185J010945J406246p53872l296893j676617L608855O282066
8828E954565K841159k328115l374454r93202o450j449423j964828k06784J103791
8819d23741K43578o07441O81181K492092K057630k90545j901129j765611j433524
8810i47510k116909k715370j491674J125944K581828J438211k83037N44468L515138
$$ plain form
8873 77375 -1451222 -3046898 -2857418 -1253970 -326871 -197935 1248633 4030869 4515330
8864 4515330 465137 -4610260 -5312330 -1550390 1473691 528443 -1801213 -1842499 -420010
8855 -420010 -999764 -3848708 -5350306 -3267482 156139 1622694 1216663 1339764 2347245
8846 2347245 1893880 -1121494 -4366440 -5144878 -3952238 -3154400 -3288420 -2937152 -1735452
8837 -1735452 -905350 -626165 384780 1791026 1037154 -2259739 -3936356 -327501 5954565
8828 5954565 8795724 6467609 3093155 2099953 2093503 644080 -1320748 -1527532 -423741
8819 -423741 -180163 -787604 -106423 2385669 4443299 4152754 2251625 486014 -947510
8810 -947510 -3064419 -5779789 -7271463 -6145519 -3563691 -2125480 -2408517 -1864049 1651089
8801A651089M519709J322436k823706l405214r01416L14278j356523k788491j411907
8792d879745R96751J494216L09756k81214K34821L64699m82543r82350j7375J552246
8782a690738J885034M69779j144152j215055p9350M02276j91837k1310J848350
8773B62997L235698J860169q14099j483922M7227R08285j23774j241330j226601
8764A424650j111149j395512q23785Q30663J714072J038861M89690J002071R43154
8755D112715p72658k440593k312410j106035l1484J085891K001046J298154o15428
8746A219198r44039Q51832J387705r51320k594174p08163J476118O6151k379137
8737b575829j072348K407035K573372m04473r38146K211254L732572Q06950k393864
$$ plain form
8801 1651089 6170798 7493234 4669528 1264314 362898 677176 -679347 -3467838 -4879745
8792 -4879745 -3882994 -2388778 -2079022 -2360236 -2125415 -1760716 -2243259 -3225609 -3242984 -1690738
8782 -1690738 194296 664075 -480077 -1695132 -1774482 -1372206 -1564043 -1585353 262997
8773 262997 3498695 5358864 4544765 3060843 3108070 4016355 3892581 2651251 1424650
8764 1424650 313501 -1082011 -1905796 -1075133 638939 1677800 2167490 3169561 4112715
8755 4112715 3340057 899464 -1412946 -2518981 -2550465 -1464574 536472 1834626 1219198
8746 1219198 275159 1126991 2514696 1563376 -1030798 -1738961 -262843 -196692 -2575829
8737 -2575829 -3648177 -1241142 1332230 927757 -10389 2200865 5933437 6740387 4346523
8728D346523j912603P1885r8783j714578k160287j455864p69988M54962K453646
8719g85087K976231O32709j933202j636783K63666M27983j160104j691116m54636
8710c360339L44196m53515j296412o63616Q79420J944035J934953R70451m47007
8701a47834j309414p58629P31657J567874P67535q99764j674294o15423J337831
8692a000461K255572J334652k91824j210922j359769j193544l66598J214577K030043
8683A411726P45525j283945j640327m50077K40985J73952P27164J260048m46002
8674G39049l435788l537055K14996L185387J788332j089244p08021K357446L656189
8665C171291J695258p00184j235334q17824j095980j879571j730027J00781K542085
$$ plain form
8728 4346523 2433920 2505805 2407022 692444 -1467843 -2923707 -3693695 -3238733 -785087
8719 -785087 2191144 2823853 890651 -746132 -482466 -54483 -1214587 -2905703 -3360339
8710 -3360339 -3016143 -3469658 -4766070 -5429686 -4550266 -2606231 -671278 299173 -147834
8701 -147834 -1457248 -2215877 -1484220 83654 851189 -48575 -1722869 -2338292 -1000461
8692 -1000461 1255111 2589763 2297939 1087017 -272752 -1466296 -1832894 -618317 1411726
8683 1411726 2157251 873306 -767021 -1217098 -976113 -802161 -74997 1185051 739049
8674 739049 -2696739 -6233794 -6018798 -2833411 -1045079 -2134323 -2842344 -484898 3171291
8665 3171291 4866549 4166365 2931031 2113207 1017227 -862344 -2592371 -2491590 50495
8656E0495L199071P99410k618019l545391j442388P88574J257561J105068J058684
8647F53065l61645l075219l618285k86755L154703K683197R7023l40364J178134
8638H3854J270978k98944p60512K40735M88772q7853L80555J086933n49932l197800
8628a343214k451863J671974L747320J259459j587993j071779L04381r23944k667161
8619c062820r56054K837863L722021P36147j902824j279171N96724N83585j065039
8610B10432j531064N90151L431602L822233P97039l036157m090277j680484J490464
8601C939K626030J403352p55514k346648k296836m64034J667058K195279J216707
8592C249333M81110L54690o52925k595896l026872r14343Q89561l32047k529233
$$ plain form
8656 50495 3249566 4048976 1430957 -2114434 -3556822 -2768248 -1510687 -405619 653065
8647 653065 291420 -2783799 -6402084 -6688839 -3534136 -850939 -753916 -1094280 83854
8638 83854 1354832 1055888 295376 536111 1024883 937030 1317585 2404518 1854586 -1343214
8628 -1343214 -3795077 -2123103 1624217 2883676 1295683 223904 528285 -395659 -3062820
8619 -3062820 -4018874 -1181011 2541010 3277157 1374333 95162 691886 1275471 210432
8610 210432 -1320632 -730481 2701121 6523354 7320393 4284236 193959 -1486525 3939
8601 3939 2629969 4033321 3277807 931159 -1365677 -1829711 -162653 2032626 3249333
8592 3249333 3730443 4085133 3432208 836312 -2190560 -3104903 -2215342 -2547389 -5076622
8583e076622j470425K818767N498425L254021j462285l786876k297446J60461
8575b361980P76577O7630K08490J272028R77281j478830l293932j562148K242294
8566c152590L783254J610725j322589k315925k136500k194189j354272J760924
8558e321162N012965M500594p9292m357035m261274n22142K598046K231710k57465
8549d55055j292195N91591L126050L312349J096732j169647k233374k869459l319305
8540c212313k262056N99423K964349K559487L3448k184829k779753j995166m06143
8531f683553J183810J551563L81426q16746n17820O43784Q45204k62376j196331
8522d871039p00156R39460K474257K788854J643352r2391j231476j516006j459926
$$ plain form
8583 -5076622 -6547047 -3728280 1770145 5024166 3561881 -224995 -2522441 -2361980
8575 -2361980 -1585403 -1517773 -1309283 -37255 940026 -538804 -3832736 -5394884 -3152590
8566 -3152590 630664 2241389 918800 -1397125 -3533625 -5727814 -7082086 -5321162
8558 -5321162 -308197 4192397 4113105 -243930 -4505204 -5027346 -2429300 -197590 -455055
8549 -455055 -1747250 -1155659 1970391 5282740 6379472 5209825 2976451 106992 -3212313
8540 -3212313 -5474369 -4874946 -1910597 648890 682338 -1502491 -4282244 -6277410 -6683553
8531 -6683553 -5499743 -3948180 -3566754 -4383500 -4901320 -4257536 -3412332 -3674708 -4871039
8522 -4871039 -5571195 -4631735 -2157478 631376 2274728 2182337 950861 -565145 -2025071
8513b025071j032349J93637J435236J062936p76201j830649j042012j53055o97006
8504d864534j507825j001489J42117P29244J443661K878324L106841M67201k674648
8495a281108k605513J25152J592719O38335N0433J262871K046626P85799o92230
8486A923084m89137L02804J02700k89921K82108P64575o4714r30674j90074R88761
8476B399512N38714o72502k08316J426329J213592j261208k659817r91455J225278
8467A010127Q02370j485942k467248j197756M67100J073747R37607O19864K29322
8458a0809K44542J020297J398939o3829k265391k392053k28087J123683J12206
8449a060502o95468P94458K036300r4328l266200k432763K174374M816685K581028
$$ plain form
8513 -2025071 -3057420 -2863783 -1428547 -365611 -1141812 -2972461 -4014473 -4167528 -4864534
8504 -4864534 -6372359 -7373848 -7231731 -6502487 -5058826 -2180502 926339 1393540 -1281108
8495 -1281108 -3886621 -3761469 -2168750 -1530415 -1479982 -217111 1829515 2615314 1923084
8486 1923084 1433947 1736751 1839451 1549530 1831638 2596213 2531499 1600825 1410751 2399512
8476 2399512 2938226 2265724 2057408 3483737 4697329 3436121 776304 -215151 1010127
8467 1010127 1812497 326555 -2140693 -3338449 -2871349 -1797602 -859995 -240131 -10809
8458 -10809 233733 1254030 2652969 2589140 323749 -2068304 -2296391 -1172708 -1060502
8449 -1060502 -1755970 -961512 1074788 980460 -2285740 -4718503 -2544129 2272556 4853584
8440D853584q92985j635690p61464r88555j656262q14164N26964J22884j320568
8431b566256j379515j28804L45046j69582L8274J175801J597025P80000j18885
8422d26896o19721j251955j663565r51579K63097O60915Q66463K387368M042513
8413C306640K807695j198050l875475k554677N33164J687686L28651j417267j853341
8404b234974r23197L75505P36989j69339q13971K80734J817720J199834j185663
8395i16362k103725n15726Q55646L29032P8611J856561L198852J183335k429788
8386A536436l511986j572649K02533J92650N1616J067141J936474J061344j030442
8377f6883k430238j795581O77806L121530L023529k42606m017702m807439k091057
$$ plain form
8440 4853584 3960599 2324909 1563445 574890 -1081372 -1895536 -1368572 -1245688 -2566256
8431 -2566256 -3945771 -4074575 -3729529 -3899111 -3860837 -2685036 -1088011 -308011 -426896
8422 -426896 -1046617 -2298572 -3962137 -4913716 -4650619 -3989704 -3123241 -735873 3306640
8413 3306640 6114335 4916285 1040810 -1513867 -980703 706983 1035634 -381633 -2234974
8404 -2234974 -3158171 -2782666 -2045677 -2215016 -3028987 -2748253 -930533 269301 -916362
8395 -916362 -3020087 -3535813 -2680167 -2351135 -2272524 -415963 2782889 3966224 1536436
8386 1536436 -1975550 -3548199 -3345666 -3153016 -3101400 -2034259 -97785 963559 -66883
8377 -66883 -2497121 -4292702 -3614896 -493366 2530163 2287557 -1730145 -6537584 -8628641
8368h628641J440943L182156K849206J623213M93015k49620p26970r40652l84738
8359a342088J206190K555526J712609r66886k423613r56845J047169N69279j429670
8350b8329j674827J78364J297972M66852l00571M46915J319544Q34598j93539
8341B346979n14766m62672m96828K25771J899385K442681J69109l014253l563658
8332i68252j100338J075746N70469j076394r91435Q49159J734583K34197j613616
8323a285881j076139J307390K262888L70872j780941j213426J187874K035155
8315A807792L13909j496259j353856l99921p14093k037833k307456o59929J548628
8306e299018K624354K388176J808346J352800M75607r85467j731355o29408Q70170
$$ plain form
8368 -8628641 -7187698 -4005542 -1156336 466877 959892 710272 -16698 -957350 -1342088
8359 -1342088 -135898 2419628 4132237 3165351 741738 -215107 832062 1401341 -28329
8350 -28329 -1703156 -1524792 -226820 240032 -60539 386376 1705920 2540518 2346979
8341 2346979 1832213 1369541 872713 1098484 2997869 5440550 5609659 2595406 -968252
8332 -968252 -2068590 -992844 -422375 -1498769 -2490204 -1641045 93538 327735 -1285881
8323 -1285881 -2362020 -1054630 1208258 1579130 -201811 -1415237 -227363 1807792
8315 1807792 2121701 625442 -728414 -1128335 -1842428 -3880261 -6187717 -6847646 -5299018
8306 -5299018 -2674664 -286488 1521858 2874658 3350265 2364798 633443 4035 874205
8297H74205M6628k740820l560026n16042K723617J979303j016910j330201J346059
8288b194187K535055O07056q02259O13890J982932N94161j458341j354293l46418
8279A77596n81410o05410J395014K768565J37829l932588l747325P41576L672003
8270B5850K108904l89860m00043L47444q88209k846747k669295n59671J080264
8261d191363J398989J297117J138576O22153J44626L17662N76964j71519j718868
8252e85663k464143j180997J531694L481066K847090M63867o22230R39896K408975
8243F819555N99347k963949l684148o52852J874548Q50684j262285p24875J800867
8234B656892K673823O80549j762165k131233m74161J192759J012890q30750k024356
$$ plain form
8297 874205 920833 -1819987 -5380013 -5896055 -3172438 -1193135 -2210045 -3540246 -2194187
8288 -2194187 340868 947924 145665 759555 2742487 3336648 1878307 524014 177596
8279 177596 -403814 -1009224 385790 3154355 3292184 -640404 -4387729 -3646153 25850
8270 25850 2134754 1744894 1344851 1692295 804086 -2042661 -4711956 -5271627 -4191363
8261 -4191363 -2792374 -1495257 -356681 265472 410098 727760 1304724 1133205 -585663
8252 -585663 -3049806 -4230803 -2699109 781957 3629047 4092914 3470684 4410580 6819555
8243 6819555 7418902 4454953 770805 117953 1992501 2843185 1580900 856025 2656892
8234 2656892 5330715 6011264 4249099 2117866 1643705 2836464 3849354 3018604 994248
8225I94248q42304J209212J288784m53064j224625m53620o23545k180732j838665
8216d124311J662929M186161K092294j877053k747398o36287N91811n7012k76039
8207a184905N72263Q38591M19827P76834J336424J06529k111173k253063k092
8198a500765J668488J324279N88821M06266k71023j378577j246456j27557l69047
8189i05571j991164k013687M29065K232717J364838k9455K54325Q30648j55833
8180A5883j365899p34190P59990P85003n13219j022425N2786J468071J784167
8171A230167O97571p29749q02894O61525J349868k97903j769945J18761L210374
8162C667775K268630k428162m548961j475015J490687j53905l064646k294997
$$ plain form
8225 994248 151944 1361156 2649940 2196876 972251 518631 -104914 -2285646 -4124311
8216 -4124311 -2461382 1724779 3817073 1940020 -807378 -1443665 -851854 -908866 -1184905
8207 -1184905 -612642 225949 645776 1422610 2759034 2865563 754390 -1498673 -1500765
8198 -1500765 167723 1492002 2080823 2487089 2216066 837489 -408967 -536524 -905571
8189 -905571 -2896735 -4910422 -4481357 -2248640 -883802 -913257 -658932 171716 15883
8180 15883 -1350016 -2084206 -1324216 -539213 -1052432 -2074857 -2022071 -554000 1230167
8171 1230167 1927738 1197989 395095 1056620 2406488 2108585 338640 457401 3667775
8162 3667775 5936405 3508243 -1040718 -2515733 -1025046 -1178951 -4243597 -6538594
8154f538594N35399R15412o95072p08112P77241R95016K41220Q26843J970421
8145a680226J300879q898Q22285K465880J486605j058470j151971P75237M86142
8136C437463k100981k436254L48492J511410j068455l210206j663892Q32671R68328
8127c381424J16672N51967R71106k88460j386169k95928J169549M49736j294351
8118c387302j331488L13267J833330K691642K815147J212396j611914k441941
8110I3137J71994K723631J581449j409654k109424o73486m39803j762101j832489
8101c656746q5201R34677K95702j3760Q37363J060185p1361o14122N10297J441667
8091F38701N96075n94067j48144J181028J199881l16672j408377o55431J217757
$$ plain form
8154 -6538594 -6003195 -5087783 -5782855 -6490967 -5713726 -4718710 -4477490 -3650647 -1680226
8145 -1680226 -379347 -388245 434040 2899920 4386525 3328055 2176084 2951321 3437463
8136 3437463 1336482 -1099772 -751280 760130 -308325 -3518531 -5182423 -4349752 -3381424
8127 -3381424 -3264752 -2712785 -1741679 -2030139 -3416308 -3712236 -2542687 -2092951 -3387302
8118 -3387302 -4718790 -4405523 -2572193 119449 2934596 4146992 2535078 93137
8110 93137 265131 2988762 4570211 3160557 1051133 377647 -62156 -1824257 -3656746
8101 -3656746 -3741947 -2807270 -2511568 -2525328 -1687965 -627780 -699141 -1313263 -802966 638701
8091 638701 1234776 640709 492565 1673593 2873474 2556802 1148425 492994 1710751
8082A710751K325631J480423p48227k462129k194365l82113J240962J586665R81681
8073C539279K07389l79474p18119q02667p74575p85772p08169k87312N33201J582254
8063A406035K327557J770393m85067k774699k574913r7143J149445q72656l219156
8054c370204j966107J601552K543747j80546k011386j0837K392815R57992k271531
8045b314505j854540K516772N269249L111527o24948j668819q94070j493144k920458
8036h72936k012475J004429K248504L64608j277330j57672J386405L40992j869019
8027h44494j925622k13547J01138j350302j532284Q32331L103621K710097M47540
8018A328478j362136j684504o36374J363650L084211K826292M26137k311066l725282
$$ plain form
8082 1710751 4036382 5516805 4768578 2306449 112084 -270029 970933 2557598 3539279
8073 3539279 3746668 3367194 2649075 1846408 1071833 286061 -422108 -709420 -176219 1406035
8063 1406035 3733592 5503985 5018918 2244219 -330694 -427837 721608 -151048 -3370204
8054 -3370204 -5336311 -3734759 -1191012 -1371558 -3382944 -3393781 -1000966 -42974 -2314505
8045 -2314505 -4169045 -1652273 3616976 6728503 6103555 4434736 3540666 2047522 -872936
8036 -872936 -2885411 -1880982 367522 732130 -545200 -702872 683533 1024525 -844494
8027 -844494 -2770116 -2983663 -2882525 -4232827 -5765111 -4932780 -1829159 880938 1328478
8018 1328478 -33658 -1718162 -2354536 -990886 2093325 4919617 5345754 3034688 -690594
8009f90594l521800j852880Q81310L161531L467419K509783K105461J949078M40863
8000H450171j398549p83458J507093J249946k251715m218266j949054O70620j15122
7991A161666j536885M40453L581313L077774k04905j592460o62372p58485j726708
7982A779391k79676K535532J602456l287260n726026k403399J769239J562672
7974b447071j046811j320985P37600J831723J129599K63411k63651r69713j334514
7965c420412q29665m02257n20355K24680K184530K797348N14208j889347j248511
7956b589781R79576J355435K04480N39388K432851K824063O78870j554012j851124
7947C019746o92117Q97253K267017K035872p13945l801215l672449l61468K276149
$$ plain form
8009 -690594 -4212394 -6065274 -5183964 -2022433 1444986 3954769 6060230 8009308 8450171
8000 8450171 7051622 6268164 7775257 9025203 6773488 2555222 606168 1276788 1161666
7991 1161666 -375219 65234 3646547 6724321 6519416 4926956 4264584 3506099 1779391
7982 1779391 1499715 4035247 5637703 2350443 -3375583 -5778982 -4009743 -2447071
7974 -2447071 -3493882 -4814867 -4077267 -2245544 -1115945 -852534 -1116185 -2085898 -3420412
7965 -3420412 -4250077 -4652334 -5172689 -4948009 -2763479 33869 548077 -1341270 -2589781
7956 -2589781 -1610205 -254770 -50290 489098 2921949 5746012 6424882 4870870 3019746
7947 3019746 2327629 3224882 5491899 7527771 6813826 3012611 -659838 -1021306 1254843
7938A254843J972765O29751M88111Q09207K8784j321223j762204j119366o3310
7929I17358R63580J139805n05180k864426k822012N93614L954716L542855K82690
7920E203000j827759j174886K09724M32144J23838N63351J411077J268148m76056
7911E732581k866389l941594k279506J216670L522736K652231K09604o59152M70619
7902D057800J026182m13917j936495j315022O76298J633028R26812j44541q38574
7893C671571j552449k127589j618576j75180N91598r0987r16061n31305L94648
7884b354330L42922p40124j624883j634593r38134M23615K205267K982438J413644
7875G5822j307562k160362j86138K017095J775438j61098j060655m1583J278987
$$ plain form
7938 1254843 3227608 3857359 4345470 5154677 5183461 3862238 2100034 980668 917358
7929 917358 1880938 3020743 2515563 -348863 -3170875 -2577261 1377455 4920310 5203000
7920 5203000 3375241 2200355 2410079 2842223 2966061 3529412 4940489 6208637 5732581
7911 5732581 2866192 -1075402 -3354908 -2138238 1384498 4036729 4246333 3587181 4057800
7902 4057800 5083982 4670065 2733570 1418548 2094846 3727874 4654686 4510145 3671571
7893 3671571 2119122 -8467 -1627043 -1802223 -1210625 -1301612 -2217673 -2748978 -2354330
7884 -2354330 -2011408 -2751532 -4376415 -6011008 -6949142 -6525527 -4320260 -1337822 75822
7875 75822 -1231740 -3392102 -3578240 -1561145 214293 53195 -1007460 -1049043 229944
7866B29944J391729M14647q60595j861365j983437q16097R20077J655536O78722
7857b30839j068336k084212j555887M18769K844598L912442K270628j131424l346382
7848B9357k399474N18428K467433J953680P4622j194938j087551l35756P0492
7839I6293j894L094L17101M73377J23114k91119j95573J65118J11678l94220p68469
7828c61500o77760j84750O42079J410119J170626l03536j460774p60867P82044
7819B55681Q16715o19023j036936K86157Q15871j043048k882731j774881J172420
7810d009775K524045J461113J15664k13235k08399k29813K30585O97135K6580
7801C93900j128190p95032R23559J571303J31409j528615j875390j658562j476322
$$ plain form
7866 229944 1621673 2036320 1175725 -685640 -2669077 -3485174 -2565097 -909561 -230839
7857 -230839 -1299175 -3383387 -4939274 -4520505 -1675907 2236535 4507163 3375739 29357
7848 29357 -2370117 -1851689 615744 2569424 2644046 1449108 361557 25801 96293
7839 96293 94399 97493 414594 887971 1011085 719966 524393 689511 801189 406969 -361500
7828 -361500 -1039260 -1224010 -581931 828188 1998814 1695278 234504 -526363 255681
7819 255681 1072396 453373 -583563 -297406 518465 -524583 -3407314 -5182195 -4009775
7810 -4009775 -1485730 -24617 91047 -122188 -330587 -560400 -329815 367320 393900
7801 393900 -734290 -1529322 -605763 965540 1096949 -431666 -2307056 -3965618 -5441940
$$ [...]
##END NTUPLES=NMR SPECTRUM
##END=
